##TITLE=1H_TG-2412-X1
 200.13Hz, DMSO+CCl4.
 8 sc
11.8.2026
##JCAMPDX= 6.0         $$ Bruker NMR JCAMP-DX V2.0
##DATA TYPE= NMR SPECTRUM
##DATA CLASS= NTUPLES
##ORIGIN= UXNMR, Bruker Analytische Messtechnik GmbH
##OWNER= pz
$$ XWIN-NMR		Version 3.5
$$ Tue Aug 11 12:12:04 2026 Russian Standard Time (UT+4h)  she@DPX200
##.OBSERVE FREQUENCY= 200.1313
##.OBSERVE NUCLEUS= ^1H
##.ACQUISITION MODE= SIMULTANEOUS
##.ACQUISITION SCHEME= undefined
##.AVERAGES= 8
##.DIGITISER RES= 18
##SPECTROMETER/DATA SYSTEM= spect
##.PULSE SEQUENCE= zg30
##.SOLVENT NAME= DMSO
##.SHIFT REFERENCE= (INTERNAL, DMSO, 0, 15.51)
##AUDIT TRAIL= $$ (NUMBER, WHEN, WHO, WHERE, WHAT)
$$ ##TITLE= Audit trail, XWIN-NMR		Version 3.5
$$ ##JCAMPDX= 5.01
$$ ##ORIGIN= Bruker BioSpin GmbH
$$ ##OWNER= she
$$ F:/spectra/data/she/nmr/H-C/1/pdata/1/auditp.txt
$$ ##AUDIT TRAIL=  $$ (NUMBER, WHEN, WHO, WHERE, WHAT)
(   1,<2026-08-11 12:10:28.06 +0400>,<she>,<DPX200>,
      <created by zg, POWCHK disabled, PULCHK disabled
       configuration hash MD5:
       00 E9 B6 7A A2 85 ED C7 34 08 36 98 17 FE 4E 26
       data hash MD5: 16K
       A6 55 D3 1F AC 13 82 9F 0D 90 89 02 83 F5 9F 9A>)
(   2,<2026-08-11 12:10:30.37 +0400>,<she>,<DPX200>,
      <Start of raw data processing
       efp BC_mod = 2 LB = 0.25 FT_mod = 6 PKNL = 1 PHC0 = -4221.149 PHC1 = 13.5923 SI = 16K 
       data hash MD5: 16K
       BC 48 AF C8 33 4B D5 82 44 EA 19 C8 26 92 95 BD>)
(   3,<2026-08-11 12:11:02.62 +0400>,<she>,<DPX200>,
      <pk PHC0 = 2.61252 PHC1 = -5.799999 
       data hash MD5: 16K
       59 81 E5 EB 83 F4 81 86 57 88 4D A2 56 76 C3 92>)
(   4,<2026-08-11 12:11:07.04 +0400>,<she>,<DPX200>,
      <abs ABSG = 5 
       data hash MD5: 16K
       AA 6E 21 B8 77 5B DC F1 44 A1 D0 6E 84 16 2D 5B>)
$$ ##END=
$$ 
$$ hash MD5
$$ EB 0E 16 FA 37 B0 05 C4 DC 8C 38 D0 03 9A 35 E3
##$RELAX= 
##$RELAX= 
##$RELAX= 
##$RELAX= 
##$RELAX= 
##$RELAX= 
$$ Bruker specific parameters
$$ --------------------------
##$DU= <F:/spectra>
##$EXPNO= 1
##$NAME= <H-C>
##$PROCNO= 1
##$TYPE= <nmr>
##$USER= <she>
##$AMP= (0..31)
100 100 100 100 100 100 100 100 100 100 100 100 100 100 100 100 100 100 
100 100 100 100 100 100 100 100 100 100 100 100 100 100 
##$AQSEQ= 0
##$AQ_mod= 1
##$AUNM= <au_zg>
##$AUTOPOS= <>
##$BF1= 200.13
##$BF2= 200.13
##$BF3= 200.13
##$BF4= 200.13
##$BF5= 200.13
##$BF6= 200.13
##$BF7= 200.13
##$BF8= 200.13
##$BYTORDA= 1
##$CFDGTYP= 0
##$CFRGTYP= 5
##$CHEMSTR= <none>
##$CNST= (0..31)
1 1 145 1 1 1 1 1 1 1 1 1 1 1 1 1 1 1 1 1 1 1 1 1 1 1 1 1 1 1 1 1 
##$CPDPRG= <>
##$CPDPRG1= <>
##$CPDPRG2= <>
##$CPDPRG3= <>
##$CPDPRG4= <mlev>
##$CPDPRG5= <mlev>
##$CPDPRG6= <mlev>
##$CPDPRG7= <mlev>
##$CPDPRG8= <mlev>
##$CPDPRGB= <>
##$CPDPRGT= <>
##$D= (0..31)
0 0.7 0 0 0 0 0 0 0 0 0 0.03 0 0 0 0 0 0 0 0 0 0 0 0 0 0 0 0 0 0 0 0 
##$DATE= 1786435827
##$DBL= (0..7)
120 120 120 120 120 120 120 120 
##$DBP= (0..7)
150 150 150 150 150 150 150 150 
##$DBP07= 0
##$DBPNAM0= <>
##$DBPNAM1= <>
##$DBPNAM2= <>
##$DBPNAM3= <>
##$DBPNAM4= <>
$$ [...]
##$SUBNAM3= <"">
##$SUBNAM4= <"">
##$SUBNAM5= <"">
##$SUBNAM6= <"">
##$SUBNAM7= <"">
##$SUBNAM8= <"">
##$SUBNAM9= <"">
##$SW= 18.0517328524113
##$SWIBOX= (0..15)
0 0 2 0 0 0 0 0 0 0 0 0 0 0 0 0 
##$SW_h= 3612.71676300578
##$TD= 16384
##$TD0= 1
##$TE= 0
##$TE2= 300
##$TE3= 300
##$TEG= 300
##$TL= (0..7)
0 120 120 120 120 120 120 120 
##$TP= (0..7)
150 150 150 150 150 150 150 150 
##$TP07= 0
##$TPNAME0= <>
##$TPNAME1= <>
##$TPNAME2= <>
##$TPNAME3= <>
##$TPNAME4= <>
##$TPNAME5= <>
##$TPNAME6= <>
##$TPNAME7= <>
##$TPOAL= (0..7)
0.5 0.5 0.5 0.5 0.5 0.5 0.5 0.5 
##$TPOFFS= (0..7)
0 0 0 0 0 0 0 0 
##$TUNHIN= 0
##$TUNHOUT= 0
##$TUNXOUT= 0
##$USERA1= <user>
##$USERA2= <user>
##$USERA3= <user>
##$USERA4= <user>
##$USERA5= <user>
##$V9= 5
##$VALIST= <valist>
##$VCLIST= <CCCCCCCCCCCCCCC>
##$VD= 0
##$VDLIST= <DDDDDDDDDDDDDDD>
##$VPLIST= <PPPPPPPPPPPPPPP>
##$VTLIST= <TTTTTTTTTTTTTTT>
##$WBST= 1024
##$WBSW= 4
##$XGAIN= (0..3)
0 0 0 0 
##$XL= 0
##$YL= 0
##$YMAX_a= 170982
##$YMIN_a= -182595
##$ZGOPTNS= <>
##$ZL1= 120
##$ZL2= 120
##$ZL3= 120
##$ZL4= 120
##$ABSF1= 15.50669
##$ABSF2= -2.545159
##$ABSG= 5
##$ABSL= 3
##$ALPHA= 0
##$AQORDER= 0
##$ASSFAC= 0
##$ASSFACI= 0
##$ASSFACX= 0
##$ASSWID= 0
##$AUNMP= <proc_1d>
##$AZFE= 0.1
##$AZFW= 0.1
##$BCFW= 0
##$BC_mod= 2
##$BYTORDP= 0
##$COROFFS= 0
##$CY= -3
##$DATMOD= 1
##$DC= 0
##$DFILT= <>
##$DTYPP= 0
##$F1P= 0
##$F2P= 0
##$FCOR= 1
##$FTSIZE= 16384
##$FT_mod= 6
##$GAMMA= 0
##$GB= 0
##$INTBC= 1
##$INTSCL= 3.241238e-09
##$ISEN= 128
##$LB= 0.25
##$LEV0= 0
##$LPBIN= 0
##$MAXI= 10000
##$MC2= 0
##$MEAN= 0
##$ME_mod= 0
##$MI= 1.114404
##$NCOEF= 0
##$NC_proc= -7
##$NLEV= 6
##$NOISF1= 3.799351
##$NOISF2= 2.8
##$NSP= 0
##$NTH_PI= 0
##$NZP= 0
##$OFFSET= 15.51
##$PC= 1
##$PHC0= -4218.537
##$PHC1= 7.792301
##$PH_mod= 1
##$PKNL= yes
##$PPARMOD= 0
##$PSCAL= 0
##$PSIGN= 0
##$REVERSE= no
##$SF= 200.130002340577
##$SI= 16384
##$SIGF1= 3
##$SIGF2= 2
##$SINO= 0.751879
##$SIOLD= 32768
##$SREGLST= <19F.Aceton>
##$SSB= 0
##$STSI= 16384
##$STSR= 0
##$SW_p= 3612.71676300578
##$SYMM= 0
##$S_DEV= 0
##$TDeff= 16384
##$TDoff= 0
##$TI= <>
##$TILT= no
##$TM1= 0
##$TM2= 0
##$TOPLEV= 0
##$USERP1= <user>
##$USERP2= <user>
##$USERP3= <user>
##$USERP4= <user>
##$USERP5= <user>
##$WDW= 1
##$XDIM= 16384
##$YMAX_p= 407856258
##$YMIN_p= -1878212
$$ End of Bruker specific parameters
$$ ---------------------------------
##NTUPLES= NMR SPECTRUM
##VAR_NAME=  FREQUENCY,     SPECTRUM/REAL,   SPECTRUM/IMAG
##SYMBOL=    X,             R,               I
##VAR_TYPE=  INDEPENDENT,   DEPENDENT,       DEPENDENT
##VAR_FORM=  AFFN,          ASDF,            ASDF
##VAR_DIM=   16384,         16384,           16384
##UNITS=     HZ,            ARBITRARY UNITS, ARBITRARY UNITS
##FACTOR=    0.220516191357247, 1,           1
##FIRST=     3104.01638210847, 0,            0
##LAST=      -508.700380897309, 0,           0
##MIN=       -508.700380897309, -1878212,    0
##MAX=       3104.01638210847, 407856258,    0
$$ Real data points
##PAGE= N=1
##DATA TABLE= (X++(R..R)), XYDATA
$$ [...]
5948F50267n9565J89515j16693j37008N1689o0527R1204p6916r1722J25954J38414
$$ 650267 590702 780217 663524 526516 578205 517678 608882 531966 440244 566198 704612
5937G04612j73567l4490J81407j07600L83998j32010P6318n5734J30042j18725
$$ 704612 531045 496555 677962 570362 954360 822350 898668 842934 972976 854251
5927H54251l1935K1211Q7792r2300M3686k5460K74644m3207j14225J82857o4058
$$ 854251 822316 843527 931319 839019 882705 857245 1131889 1088682 974457 1157314 1093256
5916A093256L5176k38355j01293K87886J30415l32594o6622K39816K5900j9508
$$ 1093256 1128432 890077 788784 1076670 1207085 874491 807869 1047685 1073585 1054077
5906A054077J03626k62398n9130k28539J01635J88157J75179J31098k6629m898
$$ 1054077 1157703 895305 836175 607636 709271 897428 1072607 1203705 1177076 1172178
5896A172178K03351p8060j75907o2063J7139r3922L8886k1938j01107J29711R8869
$$ 1172178 1375529 1297469 1121562 1059499 1076638 982716 1021602 999664 898557 1028268 1127137
5885A127137k26328r299K38721Q1126j73200m7078J3841P5139J86602J17848J2183
$$ 1127137 900809 891510 1130231 1211357 1038157 991079 1004920 1080059 1266661 1384509 1396692
5874A396692m9792q1940R0658K17996K317j18006Q1841N753J37092L1623J82240
$$ 1396692 1346900 1264960 1355618 1573614 1575931 1457925 1539766 1545519 1682611 1714234 1896474
5863A896474n7591k77402K0289k3762K54501R6075p791K18724l8180p1967R2844
$$ 1896474 1838883 1561481 1581770 1558008 1812509 1908584 1900793 2119517 2081337 2009370 2102214
5852B102214j46988m9488K9934K09040L96167j02525k8899k55617k81826J53921
$$ 2102214 1955226 1905738 1935672 2144712 2540879 2438354 2409455 2153838 1872012 2025933
5842B025933K29848j20782J10289j6267k35072Q1981J67354k4751l40889J7689
$$ 2025933 2255781 2134999 2245288 2229021 1993949 2075930 2243284 2218533 1877644 1895333
5832A895333J21584L96199O3795l2947j00694k47262J26682n2582j95923M9072
$$ 1895333 2016917 2413116 2476911 2443964 2343270 2096008 2222690 2170108 1974185 2023257
5822B023257J09766L0353m0036J72674p7327K37890Q5712J02608J84013j34231
$$ 2023257 2133023 2163376 2123340 2296014 2218687 2456577 2542289 2644897 2828910 2694679
5812B694679l0692J19885j9670k57256J92448M3033j33682m1608M04834J19293
$$ 2694679 2663987 2783872 2764202 2506946 2699394 2742427 2608745 2567137 2971971 3091264
5802C091264j80408j43029L44396o4623l1374o6954M00007Q2183j59179K07198
$$ 3091264 2910856 2767827 3112223 3047600 3016226 2949272 3349279 3431462 3272283 3479481
5792C479481o240M41775K32029k17967k07444k2278L58225L5814k6170K98307
$$ 3479481 3473241 3915016 4147045 3929078 3721634 3699356 4057581 4093395 4067225 4365532
5782D365532J63562N6439J40916k1239J86802N24488M23397L72519M83703M30783
$$ 4365532 4529094 4585533 4726449 4705210 4892012 5416500 5839897 6212416 6696119 7126902
5772G126902K10251L51564M95305O24490M88776K41605O87693N37209Q27501J124078
$$ 7126902 7337153 7688717 8184022 8808512 9297288 9538893 10226586 10763795 11591296 12715374
5762A2715374J267791J945842K593290M939868O487424Q670080R992356J0292400
$$ 12715374 13983165 15929007 18522297 23462165 29949589 38619669 48612025 58904425
5754E8904425R393774N357826p42781l793418m108437n335060o404668o793826
$$ 58904425 68298199 73656025 72913244 69119826 65011389 59676329 53271661 46477835
5746D6477835o873091o203651n601623m683043l305709j889633j160457r21306
$$ 46477835 39604744 33401093 27799470 23116427 19810718 17921085 16760628 15839322
5738A5839322n39161o1527j41262j3879j95271M93492L13657M62943P59079P63443
$$ 15839322 15300161 15238634 15097372 15083493 14888222 15381714 15695371 16158314 16917393 17680836
5728A7680836R86166Q23365Q77132Q69168R22371R81838J233985J282383J241083
$$ 17680836 18667002 19490367 20367499 21236667 22159038 23140876 24374861 25657244 26898327
5719B6898327J186732J319242J635654J464266J224084J305927J469331J813876
$$ 26898327 28085059 29404301 31039955 32504221 33728305 35034232 36503563 38317439
5711C8317439J480252J627268J980444J382302J203605J549821J641363J599008
$$ 38317439 39797691 41424959 43405403 44787705 45991310 47541131 49182494 50781502
5703E0781502J292674J073079J058363J213345Q65287N03077L96013O06712K61114
$$ 50781502 52074176 53147255 54205618 55418963 56284250 56787327 57183340 57790052 58051166
5694E8051166L43856j22913o4160r7498n50458o76749o26931o56551p68007p93668
$$ 58051166 58395022 58272109 58207949 58110451 57559993 56883244 56256313 55599762 54831755 54038087
5684E4038087j018290j406263j559536j611031j315252j646391j863652j699286
$$ 54038087 53019797 51613534 50053998 48442967 47127715 45481324 43617672 41918386
5676D1918386j352894j406898j820412j526828j722132j577990j519874j497058
$$ 41918386 40565492 39158594 37338182 35811354 34089222 32511232 30991358 29494300
5668B9494300j438111j140653j632569j182469j062644j235254j105396r40495
$$ 29494300 28056189 26915536 25282967 24100498 23037854 21802600 20697204 19756709
5660A9756709j218843j038622j195590r04793o75247q89551p50426p49440n75805
$$ 19756709 18537866 17499244 16303654 15398861 14723614 13834063 13083637 12334197 11758392
5651A1758392r24635q27172p03156m89562l27129k95584k98457l06864l93007
$$ 11758392 10833757 10006585 9303429 8813867 8486738 8191154 7892697 7585833 7192826
5642G192826m06838l15358j25029n17376j59074k83211j96062l00714j79197k01088
$$ 7192826 6785988 6470630 6345601 5828225 5669151 5385940 5189878 4889164 4709967 4508879
5632D508879j6916q0644k04738j34313k39565j43753j7521m17044J21146K28319
$$ 4508879 4491963 4411319 4206581 4072268 3832703 3688950 3671429 3254385 3375531 3603850
5622C603850k67010m5516P6216P161P4907l58095l46860p464j13833J92061K06595
$$ 3603850 3336840 3291324 3367540 3374701 3449608 3091513 2744653 2737189 2623356 2815417 3022012
5611C022012K34780p0543l45624k54850r4523L17500K05460r4835Q6439n1571
$$ 3022012 3256792 3186249 2840625 2585775 2491252 2808752 3014212 2919377 3005816 2954245
5601B954245o3882n0858o5487M4127j78142k21808r3631J27026J43801j57718
$$ 2954245 2890363 2839505 2774018 2818145 2640003 2418195 2324564 2451590 2595391 2437673
5591B437673k38567J29481J25617J2230k0367l43173J17043o7810J57428K73951
$$ 2437673 2199106 2328587 2454204 2466434 2446067 2102894 2219937 2152127 2309555 2583506
5581B583506r4806m6010j33201k68256k31763j91406J31614q7874Q7270J98942
$$ 2583506 2488700 2442690 2309489 2041233 1809470 1618064 1749678 1661804 1749074 1948016
5571A948016J01658m9773K63522k60767j43347K7609j94382K1830m44q300N5697
$$ 1948016 2049674 1999901 2263423 2002656 1859309 1886918 1692536 1714366 1713922 1705622 1761319
5560A761319M8617r5864M2949o217j14343j43901K50594J08356n8075p6821R8197
$$ 1761319 1809936 1714072 1757021 1750804 1636461 1492560 1743154 1851510 1793435 1716614 1814811
5549A814811M1563Q4176j27224k87973j22575P090Q044M9865K51011J09915n3705
$$ 1814811 1856374 1940550 1813326 1525353 1402778 1409868 1417912 1467777 1718788 1828703 1774998
5538A774998j72779R7291n8981n5237J56238j92763R5592J81465K5507p4803k04545
$$ 1774998 1602219 1699510 1640529 1585292 1741530 1548767 1644359 1825824 1851331 1776528 1571983
5527A571983Q8344k0914J274j3407m275K7977K78777K04355k24483l6347j76129
$$ 1571983 1660327 1639413 1640687 1627280 1623005 1650982 1929759 2134114 1909631 1873284 1697155
5516A697155k37283j60125J36228J79314o230L10526K9241k64336J75784k20553
$$ 1697155 1459872 1299747 1435975 1615289 1609059 1919585 1948826 1684490 1860274 1639721
5506A639721J19307J36409J50906J13060p2462j5279p9730j40050J63290J73388
$$ 1639721 1759028 1895437 2046343 2159403 2086941 2071662 1991932 1851882 2015172 2188560
5496B188560j86040k12293k6725Q9714j05996o2357r4714J87103n4599K55392
$$ 2188560 2002520 1790227 1763502 1853216 1747220 1684863 1590149 1777252 1722653 1978045
5486A978045l0235J3121R6930j34363M4290Q7581j3015O698K56107L7865k00553
$$ 1978045 1947810 1960931 2057861 1923498 1967788 2055369 2042354 2049052 2305159 2343024 2142471
5475B142471P326K0154j40373J16185l425O2167n9543M5917J40964k71635K07057
$$ 2142471 2149797 2169951 2029578 2145763 2142338 2204505 2144962 2190879 2331843 2060208 2267265
5464B267265K6178L8173R467J12889k68972J90977J76817j29130p0707j07076
$$ 2267265 2293443 2331616 2341083 2453972 2185000 2375977 2552794 2423664 2352957 2245881
5454B245881O0114j60395K38263J13028j70640J45630J04768k88597L10935J40786
$$ 2245881 2305995 2145600 2383863 2496891 2326251 2471881 2576649 2288052 2598987 2739773
5444B739773o0593j4845j23159m5975J69119m2005j70201o5383J05753J26331
$$ 2739773 2679180 2664335 2541176 2495201 2664320 2622315 2452114 2386731 2492484 2618815
5434B618815J61297J58759J82058k48681n6100J2286J11863L31512k81641O7294
$$ 2618815 2780112 2938871 3120929 2872248 2816148 2828434 2940297 3271809 2990168 3057462
5424C057462K68486j13330k22618j87733N4548n2625K39877K78292P5902p1009
$$ 3057462 3325948 3212618 2990000 2802267 2856815 2804190 3044067 3322359 3398261 3327252
5414C327252L3975n2344J27480q5035O446p0690L3096L00814M573Q441L21956
$$ 3327252 3361227 3308883 3436363 3351328 3357774 3287084 3320180 3620994 3625567 3634008 3955964
5403C955964O7130J12661J16692q9384P9442j06539J47542j54622N0842J35745
$$ 3955964 4023094 4135755 4252447 4163063 4242505 4135966 4283508 4128886 4179728 4315473
5393D315473m5709N3818K95616J3870n333l9530r0802J4772O8981K32329l1512
$$ 4315473 4269764 4323582 4619198 4633068 4627735 4588205 4497403 4512175 4581156 4813485 4781973
5382D781973N3163L84270J1419k3618q0585J09508p0951j71230M15670K41323
$$ 4781973 4835136 5219406 5230825 5207207 5126622 5236130 5165179 4993949 5409619 5650942
5372E650942j17440o4556j98833J3842J7203L20094J54156K52204n460m3320j3240
$$ 5650942 5533502 5468946 5270113 5283955 5301158 5621252 5775408 6027612 6022152 5978832 5965592
5361E965592j44014J90661P4455J60341j16702J23263L41036J35585R2540J73598
$$ 5965592 5821578 6012239 6086694 6247035 6130333 6253596 6594632 6730217 6822757 6996355
5351F996355Q0430n0671K01410P3175o4922k1489J22460L27419K13745j67817
$$ 6996355 7076785 7026114 7227524 7300699 7235777 7214288 7336748 7664167 7877912 7710095
5341G710095J42800R9541n3052L84449J00957J28672J75594r6033k02629M7507
$$ 7710095 7852895 7952436 7899384 8283833 8384790 8513462 8689056 8593023 8390394 8437901
5331H437901N10169J34684j1297J25048Q2079K29759L18404K58330r217N06049
$$ 8437901 8948070 9082754 9071457 9196505 9278584 9508343 9826747 10085077 10075860 10581909
5321A0581909K61422O2884K04611L17044K79995M03741K71119N07252M65712O80003
$$ 10581909 10843331 10906215 11110826 11427870 11707865 12111606 12382725 12889977 13355689 14035692
5311A4035692N18297K66065O13061O31185Q08273J028394J143322J331376J826473
$$ 14035692 14553989 14820054 15433115 16064300 16872573 17900967 19044289 20375665 22202138
5302B2202138K049886K446209K992766L248840K960325K985808K546089J795514
$$ 22202138 24252024 26698233 29690999 32939839 35900164 38885972 41432061 43227575
5294D3227575J534224J550592J304172J383448K043566K838881L790735M023808
$$ 43227575 44761799 46312391 47616563 49000011 51043577 53882458 57673193 61697001
5286F1697001L498487K315577R78444k19373j396876k732565l006424k957022
$$ 61697001 65195488 67511065 68489509 68270136 66873260 64140695 61134271 58177249
5278E8177249k590615j907676j465855j134884j082820j245011j269819j720620
$$ 58177249 55586634 53678958 52213103 51078219 49995399 48750388 47480569 45759949
5270D5759949j834554j818654k323642k184743j791910j682374j167916o88217
$$ 45759949 43925395 42106741 39783099 37598356 35806446 34124072 32956156 32267939
5262C2267939n83427l25854k44365K01798K36362J88301M73206N57311O51510
$$ 32267939 31684512 31358658 31114293 31316091 31552453 31740754 32213960 32771271 33422781
5253C3422781P91547P56159P10768Q47404R41849R44891Q76114Q63595J166349
$$ 33422781 34214328 34970487 35681255 36528659 37470508 38415399 39291513 40155108 41321457
5244D1321457J442518J228032J283613J703478J721855J506870J679570J799947
$$ 41321457 42763975 43992007 45275620 46979098 48700953 50207823 51887393 53687340
5236E3687340J767359K207094K335745K500715K643401K382760K861137L053731
$$ 53687340 55454699 57661793 59997538 62498253 65141654 67524414 70385551 73439282
5228G3439282L034910L254719L502862L455045L624720M176455M365094M424374
$$ 73439282 76474192 79728911 83231773 86686818 90311538 94487993 98853087 103277461
5220A03277461M561979M580544M558536M762849M862712M945404M848679M696066
$$ 103277461 107839440 112419984 116978520 121741369 126604081 131549485 136398164 141094230
5212A41094230M349557M416496L699024L449168L195767K211704J733009J251482
$$ 141094230 145443787 149860283 153559307 157008475 160204242 162415946 164148955 165400437
5204A65400437Q86555R7970n65051j445272k115838k018795l032842l479489l788046
$$ 165400437 166286992 166384962 165819911 164374639 162258801 160240006 157207164 153727675 149939629
5195A49939629m036800m340524m450602m556663m395850m588796m578605m616759
$$ 149939629 145902829 141562305 137111703 132555040 128159190 123570394 118991789 114375030
5187A14375030m524774m653877m528768m244690l869743l651445l768796l399621
$$ 114375030 109850256 105196379 100667611 96422921 92553178 88901733 85132937 81733316
5179H1733316l474559k829159l074932l066144k708445k705799k347491k417806
$$ 81733316 78258757 75429598 72354666 69288522 66580077 63874278 61526787 59108981
5171E9108981k075831k191141j783623j882540k038653j888122j820962j583279
$$ 59108981 57033150 54842009 53058386 51175846 49137193 47249071 45428109 43844830
5163D3844830j624134j465293j143187j273984j286013j113207j278483j200366
$$ 43844830 42220696 40755403 39612216 38338232 37052219 35939012 34660529 33460163
5155C3460163r46307q67794j115797r80194j109583r38914p74752o27769p93848
$$ 33460163 32513856 31646062 30530265 29550071 28440488 27501574 26726822 26099053 25305205
5146B5305205p61519q20465m65383m77189n12429n28196o64985n34101o75902
$$ 25305205 24543686 23723221 23257838 22780649 22268220 21740024 21075039 20540938 19865036
5137A9865036n90533o31987n16310k50556k74103n09241n95849l19097n95286
$$ 19865036 19274503 18642516 18126206 17875650 17601547 17092306 16496457 16177360 15582074
5128A5582074j01448m63856m13732n04169l23365j05774l44059j34924j69044
$$ 15582074 15480626 15016770 14603038 14098869 13775504 13669730 13325671 13190747 13021703
5119A3021703k97515K369l5032n07970k02448k19771m37201j45647k40061l08326
$$ 13021703 12724188 12726557 12691525 12183555 11981107 11761336 11324135 11178488 10938427 10630101
5109A0630101k02351k93328j12266j99174l63246m2136j65754j46881o6979r9405
$$ 10630101 10427750 10134422 10022156 9822982 9459736 9417600 9251846 9104965 9037986 8938581
5099H938581m10967l00035K40584m6789l48139k13578m84423p0801M5910j29681
$$ 8938581 8527614 8227579 8468163 8421374 8073235 7859657 7375234 7304433 7350343 7220662
5089G220662n7080l24221J62122k11122J31720j76620k66513O8073k98508j18750
$$ 7220662 7163582 6839361 7001483 6790361 6922081 6745461 6478948 6547021 6248513 6129763
5079F129763j19038j99760k95820j59583O7358J30342J89843p4832n09370k27029
$$ 6129763 6010725 5810965 5515145 5355562 5422920 5553262 5743105 5668273 5158903 4931874
5069D931874J23123m2666j21993M5077p3245j56237J23368k57202j28226j5392
$$ 4931874 5054997 5012331 4890338 4935415 4862170 4705933 4829301 4572099 4443873 4428481
5059D428481l3021j85399l8766m0501J12799r2682l1952R9062k65513n7177l41317
$$ 4428481 4395460 4210061 4171295 4130794 4243593 4150911 4118959 4218021 3952508 3895331 3554014
5048C554014K42958n5999j83684l4041j26236n8459M3762m6317o7660Q014k94387
$$ 3554014 3796972 3740973 3557289 3523248 3397012 3338553 3382315 3335998 3268338 3276352 2981965
5037B981965n9501R9093k18015M7454R0659O6243r1838j93660q03L504l0129j23048
$$ 2981965 2922464 3021557 2803542 2850996 2941655 3007898 2916060 2722400 2721597 2725101 2694972 2571924
5025B571924k09485J0171R7091j61874m490k47305L5516L93966J23578k28583
$$ 2571924 2362439 2372610 2469701 2307827 2303337 2056032 2091548 2485514 2609092 2380509
5015B380509J38663J93904O1776j70597m4627k03040m1390M2386j33117J82753
$$ 2380509 2519172 2713076 2774852 2604255 2559628 2356588 2315198 2357584 2224467 2407220
5005B407220r9174r6657L95380J00825j76863O9095j77696J28247O8944M1137
$$ 2407220 2308046 2211389 2606769 2707594 2530731 2599826 2422130 2550377 2619321 2660458
4995B660458J7498L396M05356K65934K81905J62436J06784j23828L17218o0561
$$ 2660458 2677956 2681352 3086708 3352642 3634547 3796983 3903767 3779939 4097157 4036596
4985D036596M2617j30013l56586j31639m56812l80964j15003j41156K26603m67410
$$ 4036596 4079213 3949200 3592614 3460975 3004163 2623199 2508196 2367040 2593643 2126233
4975B126233m68386L0625J76842P1341j29680q6289k66306O6771o7401K07130
$$ 2126233 1657847 1688472 1865314 1936655 1806975 1720686 1454380 1521151 1453750 1660880
4965A660880J86714m5946k39837L0152j147j74193J85869j42238j52701K47272
$$ 1660880 1847594 1801648 1561811 1591963 1590816 1416623 1602492 1460254 1307553 1554825
4955A554825N0387N8559j37397j80858K9627j45136p6053J27851J01392k10737
$$ 1554825 1605212 1663771 1526374 1345516 1375143 1230007 1153954 1281805 1383197 1172460
4945A172460R3521L1274k2316k9138o6728L32135m6996n6848K9425j5537j99908
$$ 1172460 1265981 1297255 1274939 1245801 1179073 1511208 1464212 1407364 1436789 1421252 1221344
4934A221344J97939r4785k35328J86247J01207K29484k06291j07247j09612M7150
$$ 1221344 1419283 1324498 1089170 1275417 1376624 1606108 1399817 1292570 1182958 1230108
4924A230108K33344p4075j34117l06242L94683L88128n2742N366j07999k87254
$$ 1230108 1463452 1389377 1255260 949018 1343701 1731829 1679087 1684453 1576454 1289200
4914A289200j00387j48531K81089n0977J21446R360j97033k2500K4007p4323J31339
$$ 1289200 1188813 1040282 1321371 1270394 1391840 1401200 1204167 1181667 1205674 1131351 1262690
4903A262690K99163p5860j51462J25728K06857K8520j67582j35870k68103Q5570
$$ 1262690 1561853 1485993 1334531 1460259 1667116 1695636 1528054 1392184 1124081 1209651
4893A209651K58724j97294o359P636P393J36046J51365j9519k45589Q7656P6035
$$ 1209651 1468375 1271081 1264722 1272358 1279751 1415797 1567162 1547643 1302054 1389710 1465745
4882A465745j15846K14655n8829R4102K6702j35425Q4920Q823k16123J02353K2636
$$ 1465745 1349899 1564554 1505725 1599827 1626529 1491104 1576024 1584847 1368724 1471077 1493713
4871A493713k12591N7597L32752O7771K8589q5239k55184p2526K4181J80959j5667
$$ 1493713 1281122 1338719 1671471 1739242 1767831 1682592 1427408 1354882 1379063 1560022 1544355
4860A544355L28869l9217J0896J45511m6500j74466J23593Q1168P6480J53049
$$ 1544355 1873224 1834007 1844903 1990414 1943914 1769448 1893041 1974209 2050689 2203738
4850B203738K06639K50918N53997J41902R9551K67945J7436J97894K48941j07607
$$ 2203738 2410377 2661295 3215292 3357194 3456745 3724690 3742126 3940020 4188961 4081354
4840D081354K65288J71149P92k25072j56312K10645r3445K42764J19115L26622
$$ 4081354 4346642 4517791 4518583 4293511 4137199 4347844 4254399 4497163 4616278 4942900
4830D942900J63155O59691L84336O43187M16022P62027J125315J514827K603409
$$ 4942900 5106055 5765746 6150082 6793269 7209291 7971318 9096633 10611460 13214869
4821A3214869M085766N663906O314885O801283P130297N066672L70760k610109
$$ 13214869 17300635 22964541 29279426 36080709 43211006 48277678 48648438 46038329
4813D6038329k619844l090543m151798m761191m711179m638992m425053l812851
$$ 46038329 43418485 40327942 36176144 31414953 26703774 22064782 17639729 13826878
4805A3826878k884977j912108j324459j056395q46181p25711l52992l15642n25495
$$ 13826878 10941901 9029793 7705334 6648939 5802758 5077047 4724055 4408413 3882918
4796C882918k61891q7249k69207m33977j47546j25429j04123j00849K0110R4100
$$ 3882918 3621027 3533778 3264571 2830594 2683048 2557619 2453496 2352647 2372757 2466857
4786B466857M928k53952l03501K58280j3711l49353O0318Q2465p2121j24198q8896
$$ 2466857 2471785 2217833 1914332 2172612 2158901 1809548 1869866 1952331 1880210 1756012 1667116
4775A667116L505j19001K00312M9149j71770l6385L4699M754j76744k1993M7465
$$ 1667116 1670621 1551620 1751932 1801081 1629311 1592926 1627625 1632379 1455635 1433642 1481107
4764A481107J00684L7238k96976j04858r5741M2571N1595J4134J94418J28143
$$ 1481107 1581791 1619029 1322053 1217195 1121454 1164025 1215620 1229754 1424172 1552315
4754A552315j83827Q5346o8762k35836o1705j0671J01183r2389K36460l4794j26549
$$ 1552315 1368488 1453834 1385072 1149236 1087531 1076860 1178043 1085654 1322114 1287320 1160771
4743A160771J1065j18781J49268j23658Q4574K38436q5664J442q1616j33014o6816
$$ 1160771 1171836 1053055 1202323 1078665 1163239 1401675 1316011 1317453 1235837 1102823 1036007
4732A036007M5212m9434J09893j23781O2180K42177L1511j36930j28471J05718
$$ 1036007 1081219 1031785 1141678 1017897 1080077 1322254 1353765 1216835 1088364 1194082
4722A194082m7437J84890k702m7422l5931j48778K27655j61869R3023k27434j12494
$$ 1194082 1146645 1331535 1328833 1281411 1245480 1096702 1324357 1162488 1255511 1028077 915583
4711I15583j12664j4095K75582K03737M4675L11024k08032p5037K5713Q0496k1416
$$ 915583 802919 788824 1064406 1268143 1312818 1623842 1415810 1340773 1366486 1446982 1425566
4700A425566j58606l8633J15644N4734j98639R0499M74428N945j48839J01564
$$ 1425566 1266960 1228327 1343971 1398705 1200066 1290565 1764993 1770938 1622099 1723663
4690A723663k6837L0341k33634L6916p842O0679J13960j63088o1129J13581p0510
$$ 1723663 1696826 1727167 1493533 1530449 1522607 1583286 1697246 1534158 1473029 1586610 1516100
4679A516100K39807j96108j85817J48510p012J27133J58429J13569J11805j57511
$$ 1516100 1755907 1559799 1373982 1522492 1515480 1642613 1801042 1914611 2026416 1868905
4669A868905k33965J19079o5743p3009L79134N9910r5266m4517N8445K51746p982
$$ 1868905 1634940 1754019 1688276 1615267 1994401 2054311 1959045 1914528 1972973 2224719 2216737
4658B216737j46952J00633Q3858K55023j0156j03030M4465M9590K25543N8070
$$ 2216737 2069785 2170418 2254276 2509299 2499143 2396113 2440578 2490168 2715711 2773781
4648B773781j11185K010J76432L11993M7423j58625J4502J07622J21661K35248
$$ 2773781 2662596 2664606 2841038 3153031 3200454 3041829 3056331 3163953 3285614 3520862
4638C520862J91401J23881L1063J12307M03853O46873N49905M87950R98589J772088
$$ 3520862 3712263 3836144 3867207 3979514 4383367 5030240 5580145 6068095 7066684 8838772
4628H838772K420235K177960K260610K150489Q76982j58800q21743j343088j198242
$$ 8838772 11259007 13436967 15697577 17848066 18725048 18566248 17744505 16401417 15203175
4619A5203175j137992j187960j114909q76867l87201K4765J53596Q85563R90754
$$ 15203175 14065183 12877223 11762314 10885447 10498246 10523011 10676607 11562170 12552924
4610A2552924J399295J586892J337443J481552J241557J027180J337303K057840
$$ 12552924 13952219 15539111 16876554 18358106 19599663 20626843 21964146 24021986
4602B4021986J931282K283025K119206J859484J307317R40180J026722J188506
$$ 24021986 25953268 28236293 30355499 32214983 33522300 34462480 35489202 36677708
4594C6677708J677332J702042J715350R86183J11169l88930n41378j126429q68961
$$ 36677708 38355040 40057082 41772432 42758615 42869784 42480854 41939476 40813047 39944086
4585C9944086p66226n85801r09613j371526j836156k026280k154274j904491j700117
$$ 39944086 39177860 38592059 37682446 36310920 34474764 32448484 30294210 28389719 26689602
4576B6689602j751597j423524j557040k002819k303368j727581j457296j701754
$$ 26689602 24938005 23514481 21957441 19954622 17651254 15923673 14466377 12764623
4568A2764623j387950r32447j343520j232840j097273p11731r14144l94824k44678
$$ 12764623 11376673 10444226 9100706 7867866 6770593 6058862 5144718 4749894 4505216
4559D505216j92855l20598k14213m35472k92509K1173J75321l03043p5999j21926
$$ 4505216 4312361 3991763 3777550 3342078 3049569 3070742 3246063 2943020 2867021 2745095
4549B745095j34733L9084k15940m8930M3846J29280j96310l9167j16052l9554
$$ 2745095 2610362 2649446 2433506 2384576 2428422 2557702 2361392 2322225 2206173 2166619
4539B166619P5167q4602r7435O38j6829q396q9301j29745q2906J61400j41231
$$ 2166619 2241786 2157184 2059749 2060387 2043558 2035162 1945861 1816116 1733210 1894610 1753379
4528A753379q2469n6559l38461J30933q6408q0426j23001J22909o633m0652P7060
$$ 1753379 1670910 1614351 1275890 1406823 1320415 1239989 1116988 1239897 1233264 1192612 1269672
4517A269672K63873M9823p9193o8541J22324O4214l60753r2294K50204J26389
$$ 1269672 1533545 1583368 1504175 1435634 1557958 1622172 1261419 1169125 1419329 1545718
4507A545718j73810q8269K51043q8122k76665J45878j03271J26812o1515J1052
$$ 1545718 1371908 1283639 1534682 1446560 1169895 1315773 1212502 1339314 1277799 1288851
4497A288851J37231o1853l60035o6188K41332J47402j58974r3248p4510J65108
$$ 1288851 1426082 1364229 1004194 938006 1179338 1326740 1167766 1074518 1000008 1165116
4487A165116M3250P9186l27427o7467j57399K02471L9866j66206j7016J16132
$$ 1165116 1208366 1287552 960125 892658 735259 937730 977596 811390 794374 910506
4477I10506Q2850k08518N2937J35049j2647j79754K08293L6340p9462l2867J69002
$$ 910506 993356 784838 837775 972824 960177 780423 988716 1025056 945594 912727 1081729
4466A081729j94982p1971r2940n1237L13864J74125K23742j7066j95903k53757
$$ 1081729 886747 814776 721836 670599 984463 1158588 1382330 1365264 1169361 915604
4456I15604J12351m8404j71911J9714l0165K09845J94561j99908N2031j7014J87556
$$ 915604 1027955 979551 807640 827354 797189 1007034 1201595 1001687 1053718 1036704 1224260
4445A224260j19163N2923J00288k06184j66666l34305R4355L01372L7386k84824
$$ 1224260 1105097 1158020 1258308 1052124 885458 551153 645508 946880 984266 699442
4435F99442J72169J56363K54029j15011j62638K14112j53747m9366J35098j20888
$$ 699442 871611 1027974 1282003 1166992 1004354 1218466 1064719 1015353 1150451 1029563
4425A029563k05558J1662J57898K05825n8683J55535R1632q8123J40613J70500
$$ 1029563 824005 835667 993565 1199390 1140707 1296242 1387874 1299751 1440364 1610864
4415A610864J68166j44249N71j2519j61579k9038O0191M65325M7465J5049q6463
$$ 1610864 1779030 1634781 1635352 1622833 1461254 1432216 1492407 1957732 2005197 2020246 1933783
4404A933783j9376p4636q7355J04476O2544N4342k88M9322j77924l7079L78976
$$ 1933783 1914407 1839771 1752416 1856892 1919436 1973778 1973490 2022812 1844888 1807809 2186785
4393B186785Q3053j4607J20506j95839L37935J97520L8756J38952K930K25835
$$ 2186785 2269838 2255231 2375737 2179898 2517833 2715353 2754109 2893061 2895991 3121826
4383C121826J73241k4850J06672J92219L11531K38289J77494J23823J62069J09862
$$ 3121826 3295067 3270217 3376889 3569108 3880639 4118928 4296422 4420245 4582314 4692176
4373D692176K69509L61772O38232K74728M12506N49117N35808L66871J28031P76245
$$ 4692176 4961685 5323457 5961689 6236417 6648923 7198040 7733848 8100719 8228750 9004995
4363I004995N77298L97658Q71792M36894O68877O23314O65920O75644M90810P57478
$$ 9004995 9582293 9979951 10851743 11288637 11957514 12580828 13246748 13922392 14413202 15170680
4353A5170680R25022J031898O48855J125540R35452O95467R72042R79873N40966
$$ 15170680 16095702 17127600 17776455 18901995 19837447 20532914 21504956 22484829 23025795
4344B3025795N69461M31744M60325P19823N31721L67741L52638Q70005N57713
$$ 23025795 23595256 24027000 24487325 25207148 25738869 26106610 26459248 27329253 27886966
4335B7886966O78732M34187N20300J98261j0534j70939j07695j85417k30307l57566
$$ 27886966 28565698 28999885 29520185 29718446 29707912 29536973 29429278 29243861 29013554 28655988
4325B8655988m46228o46633k74848m50020l44849k46666o51362o66697k10982
$$ 28655988 28209760 27563127 27288279 26838259 26493410 26246744 25595382 24928685 24717703
4316B4717703m56441p91090q35651r27456r14699j231008j126068o90069n93800
$$ 24717703 24261262 23470172 22634521 21707065 20792366 19561358 18435290 17745221 17151421
4307A7151421r29393o23662m59763m97569q11155n87939o40822n73575n42584
$$ 17151421 16222028 15598366 15138603 14641034 13829879 13241940 12601118 12027543 11484959
4298A1484959p05912o53936n66534n48158n26421n67520n25809m43697K4644n20381
$$ 11484959 10779047 10125111 9558577 9010419 8483998 7916478 7390669 6946972 6971616 6451235
4288F451235l61181j33285m62568k64356j17436j85392j09958q9561m17993l07327
$$ 6451235 6090054 5956769 5494201 5229845 5112409 4927017 4817059 4727498 4309505 4002178
4278D002178l2613j46088o4604J27015n1620k84206j95809j20496J49898k46434
$$ 4002178 3969565 3823477 3758873 3885888 3834268 3550062 3354253 3233757 3383655 3137221
4268C137221r1784N8991J79159j33191J42917J4405J8128k60410j94297J08432
$$ 3137221 3045437 3104428 3283587 3150396 3293313 3307718 3325846 3065436 2871139 2979571
4258B979571m7000N1400n2790k23047j78118r0513o1078j61026Q8232p964n8501
$$ 2979571 2932571 2983971 2931181 2708134 2530016 2439503 2378425 2217399 2305631 2297667 2239166
4247B239166o4591j88365k24127J42377K68271O9294O2601j18596m6535J11344
$$ 2239166 2174575 1986210 1762083 1904460 2172731 2242025 2304626 2186030 2139495 2250839
4237B250839N3270j46146j15129r813k35768N0405J25260k61205J30472k35j09075
$$ 2250839 2304109 2157963 2042834 2033021 1797253 1847658 1972918 1711713 1842185 1841950 1732875
4226A732875p7020M3156J74922J17337L65360M79741R2341J04640L7251j2688
$$ 1732875 1655855 1699011 1873933 1991270 2356630 2836371 2928712 3033352 3070603 3057915
4216C057915J97648n3204j30527l26406k36562m8495j09558j42226l21474j8666
$$ 3057915 3255563 3202359 3071832 2745426 2508864 2460369 2350811 2208585 1887111 1868445
4206A868445r4121O0046J3609l02136N747J8216j99611J26400n6573l59k91219
$$ 1868445 1774324 1834370 1847979 1545843 1551590 1569806 1370195 1496595 1440022 1439663 1148444
4195A148444M41529K58201j12547o8910k33618J67116K6726r6384l07126J4510
$$ 1148444 1589973 1848174 1735627 1666717 1433099 1600215 1626941 1530557 1223431 1237941
4185A237941o1493q8247j11443J02888J85260J42615k01547j79322o559J40370
$$ 1237941 1176448 1088201 976758 1079646 1264906 1407521 1205974 1026652 1020093 1160463
4175A160463j2603j47624M01126J52192M6410j4388r1069K759k72178l3454j3852
$$ 1160463 1147860 1000236 1401362 1553554 1599964 1585576 1494507 1497266 1225088 1191634 1177782
4164A177782j49370J61046j44417K89572q9252p6513J9940j25442K67771P0560
$$ 1177782 1028412 1189458 1045041 1334613 1245361 1168848 1188788 1063346 1331117 1401677
4154A401677j5786m166J40606L7197J78218J14232m35544L6686J99901j04877
$$ 1401677 1385891 1381725 1522331 1559528 1737746 1851978 1416434 1453120 1653021 1548144
4144A548144j01650L08992k07060j19881L21723o9164k08427N8587m2822K4940
$$ 1548144 1446494 1755486 1548426 1428545 1750268 1681104 1472677 1531264 1488442 1513382
4134A513382k18818Q3894J7374J99184J12402O431k44182L7605p9235J52766J77975
$$ 1513382 1294564 1378458 1395832 1595016 1707418 1713849 1469667 1507272 1428037 1580803 1758778
4123A758778l195K4910J04502K26617k6975K87890J32274j14051m4373L094J51178
$$ 1758778 1755583 1780493 1884995 2111612 2084637 2372527 2504801 2390750 2346377 2349471 2500649
4112B500649L52634Q8735J71610J47123r4628J06576L01453O0699r7303J4268
$$ 2500649 2853283 2942018 3113628 3260751 3166123 3272699 3574152 3634851 3537548 3551816
4102C551816Q7480R3804p116Q4317j4790l9783K38096k99562j91477j34521j01120
$$ 3551816 3639296 3733100 3725984 3810301 3795511 3755728 3993824 3694262 3502785 3368264 3267144
4091C267144N1864J03839j18655K84561o0596j99191n8856m3189k64602l03270
$$ 3267144 3319008 3422847 3304192 3588753 3528157 3328966 3270110 3226921 2962319 2659049
4081B659049n968K56586k7213l2044l03454j05171J90869J47326n4892n2454K15006
$$ 2659049 2653081 2909667 2882454 2850410 2546956 2441785 2632654 2779980 2725088 2672634 2887640
4070B887640J75245j38692n3161K65274L65531k34509J67589m0046R6409O6178
$$ 2887640 3062885 2924193 2871032 3136306 3501837 3267328 3434917 3394871 3491280 3557458
4060C557458J7353L1842P1219J80906L00296J95221o4299J50291J70096N23498
$$ 3557458 3574811 3606653 3677872 3858778 4159074 4354295 4289996 4440287 4610383 5133881
4050E133881K73829L04446R00721J192247J436425J422310J234593R55093K58929
$$ 5133881 5407710 5712156 6612877 7805124 9241549 10663859 11898452 12853545 13112474
4041A3112474n69702m14869p16987o56125p11504q18175n04642o28850o19880
$$ 13112474 12542772 12127903 11410916 10754791 10043287 9225112 8720470 8091620 7471740
4032G471740m49938n65046m66904j10300K761K26160j0132o1719q308O7828K2144
$$ 7471740 7021802 6456756 5989852 5879552 5882313 6108473 6098341 6036622 6028314 6096142 6118286
4021F118286J60155j59524L8084L50087k7185K4202J93695n241m6200j06961j7390
$$ 6118286 6278441 6118917 6157001 6507088 6479903 6504105 6697800 6692559 6646359 6539398 6522008
4010F522008j45447N6231N9123K87627K76429L20793J51900k4601k2506J0377
$$ 6522008 6376561 6432792 6491915 6779542 7055971 7376764 7528664 7504063 7481557 7491934
4000G491934Q0279K20397J87314J68088J93856N04929K63559M46234L45047O06376
$$ 7491934 7572213 7792610 7979924 8148012 8341868 8846797 9110356 9556590 9901637 10508013
3990A0508013L12591J85741N74267M96227P82621P41892R50597J093256O55676
$$ 10508013 10820604 11006345 11580612 12076839 12859460 13601352 14551949 15645205 16300881
3981A6300881J290881J360416J396746J615333J733570K449330K649493K744528
$$ 16300881 17591762 18952178 20348924 21964257 23697827 26147157 28796650 31541178
3973C1541178L033556L620648L634211L740890M275912M260571M034006L992737
$$ 31541178 34574734 38195382 41829593 45570483 49846395 54106966 58140972 62133709
3965F2133709L815239L078577K484094K103919J561392J162870K28079K22486
$$ 62133709 65948948 69027525 71511619 73615538 75176930 76339800 76567879 76790365
3957G6790365r8199j24567N3192l15719j2692k56668k59283r65330j136730j134544
$$ 76790365 76692166 76567599 76620791 76305072 76292380 76035712 75776429 74811099 73674369 72539825
3947G2539825j710693k034489k580086k595274k508290k878696l027146k770746
$$ 72539825 70829132 68794643 66214557 63619283 61110993 58232297 55205151 52434405
3939E2434405l111729l533702m025086l609239l338903k942496k632724l050672
$$ 52434405 49322676 45788974 41763888 38154649 34815746 31873250 29240526 26189854
3931B6189854k634240k068381j740735j799822j469458q88950q52960p65512o85037
$$ 26189854 23555614 21487233 19746498 17946676 16477218 15588268 14735308 13969796 13284759
3922A3284759n11210l13708l61531n32066n87924m15602j60065L06324J73717
$$ 13284759 12773549 12459841 12098310 11566244 10978320 10562718 10402653 10708977 10882694
3913A0882694K62588Q74549J146514P03455P83168K89485j82198n66997n35059
$$ 10882694 11145282 12019831 13166345 13869800 14652968 14942453 14760255 14193258 13658199
3904A3658199o24338p52757r23012r38949m64744o61319o50627q85718l19872
$$ 13658199 13033861 12281104 11358092 10419143 9954399 9293080 8642453 7756735 7436863
3895G436863N6257l21295k49524n821k9858j49507j63183p8239k26101j0483J99938
$$ 7436863 7493120 7171825 6922301 6916480 6886622 6737115 6573932 6495693 6269592 6259109 6459047
3884F459047k12333l3262J7040o9129j89485j38946L54750k07722j15863m4481
$$ 6459047 6246714 6213452 6230492 6161363 5971878 5832932 6187682 5979960 5864097 5819616
3874E819616K56368p4917L69498M3388k37640L4687K16711m1949k5430J37310
$$ 5819616 6075984 6001067 6370565 6413953 6176313 6211000 6427711 6385762 6360332 6497642
3864F497642K08310L07923L12553P8974P011m4123J34092K19643R3900J84756
$$ 6497642 6705952 7013875 7326428 7405402 7412413 7368290 7502382 7722025 7815925 8000681
3854H000681L48056P2518K17999K56790K92986N1547Q3677L21809L05319L09920
$$ 8000681 8348737 8421255 8639254 8896044 9189030 9240577 9324254 9646063 9951382 10261302
3844A0261302O5900O68386L75688J69089K33508O11290O67410M06167O88121O95215
$$ 10261302 10327202 10995588 11371276 11540365 11773873 12385163 13052573 13458740 14146861 14842076
3834A4842076O96062R52745J086931Q93828J063847R33160R04340J107319P39615
$$ 14842076 15538138 16490883 17577814 18471642 19535489 20468649 21372989 22480308 23219923
3825B3219923M99335J50387L74376J99965j53048p79185o32295q06191j087933
$$ 23219923 23719258 23869645 24244021 24443986 24290938 23511753 22879458 22073267 20985334
3816B0985334p17459q82955p35637n21289p08466o60149l39697l03643l10038
$$ 20985334 20267875 19384920 18649283 18127994 17419528 16759379 16419682 16116039 15806001
3807A5806001L2702J01510K90084L15091M07049L63349M93806M50450M86394M54715
$$ 15806001 15838703 15940213 16230297 16545388 16952437 17315786 17809592 18260042 18746436 19201151
3797A9201151J018917P61282P63906J088433J383120J618952J752441J857349
$$ 19201151 20220068 20981350 21745256 22833689 24216809 25835761 27588202 29445551
3789B9445551K129302K017021K540363K922421L214863L878465M485641N119229
$$ 29445551 31574853 33591874 36132237 39054658 42269521 46147986 50633627 55752856
3781E5752856N607177O160371O438206O802534O903587O636899O356832O003930
$$ 55752856 61360033 67520404 73958610 80761144 87664731 94301630 100658462 106662392
3773A06662392N216446M454639K979370K200193J396178Q74066N834p23451p35407
$$ 106662392 111878838 116333477 119312847 121513040 122909218 123783284 123789118 123065667 122330260
3764A22330260j195766j441064j368437j211261q31928q93617p79368j242331
$$ 122330260 121134494 119693430 118324993 117113732 116281804 115388187 114608819 113366488
3756A13366488j570127j441853k211109k208704k767219l253807l668420m309563
$$ 113366488 111796361 110354508 108143399 105934695 103167476 99913669 96245249 91935686
3748I1935686m678253m979289m842992n192313n344557m969825m900473m904556
$$ 91935686 87257433 82278144 77435152 72242839 66898282 61928457 57027984 52123428
3740E2123428m155010m061969l677081l407320l116246k562188k593994k091189
$$ 52123428 47968418 43906449 40229368 36822048 33705802 31143614 28549620 26458431
3732B6458431j906633j650320j285553j340945j165713o77376q15650q85702q18964
$$ 26458431 24551798 22901478 21615925 20274980 19109267 18431891 17616241 16730539 15911575
3723A5911575m79478l86219n36259k66032k95330o4048q4783r9727j2105J26124
$$ 15911575 15432097 15045878 14509619 14243587 13948257 13884209 13799426 13699699 13687594 13813718
3713A3813718K24201K91767J76700O97431Q21965P91972O97376L75306L63426
$$ 13813718 14037919 14329686 14506386 15203817 16025782 16817754 17515130 17890436 18253862
3704A8253862N43961M55229K76697K30699M7615j69005j86667r4492m58667l88022
$$ 18253862 18797823 19253052 19529749 19760448 19808063 19639058 19452391 19357899 18899232 18511210
3694A8511210q62273q52699r27319r06293q54205p41790p40066q98562n93254
$$ 18511210 17648937 16796238 15868919 14962626 14108421 13366631 12626565 11728003 11134749
3685A1134749m33594n33179n06392m42624n69728k09667m41312j93959R9169m02048
$$ 11134749 10701155 10167976 9661584 9218960 8649232 8439565 7998253 7804294 7903463 7501415
3675G501415J4881K8050l84251m8464k29681j3887M4484j153J59180P3216j26531
$$ 7501415 7516296 7544346 7160095 7111631 6881950 6868063 6912547 6911394 7070574 7143790 7017259
3664G017259j16892K96260r0992j46374k73614j28697R6368J14291O6863m244
$$ 7017259 6900367 7196627 7105635 6959261 6685647 6556950 6653318 6767609 6834472 6830228
3654F830228k986l52294P5883O887K57326K03473J58578j15614M40231Q1868K70989
$$ 6830228 6827242 6474948 6550831 6557718 6815044 7018517 7177095 7061481 7501712 7583580 7854569
3643G854569J24643j1704J43389J59415L13100J17084N12379M53133M84250N76962
$$ 7854569 7979212 7967508 8110897 8270312 8583412 8700496 9212875 9666008 10150258 10727220
3633A0727220N88500P61217Q34570R14881R52950Q07492J280737R69678Q92332
$$ 10727220 11315720 12076937 12911507 13826388 14779338 15586830 16867567 17837245 18729577
3624A8729577R62567Q19007R02827N92768M44461O10515N62133J76511K16988
$$ 18729577 19692144 20511151 21413978 22006746 22451207 23061722 23623855 23800366 24017354
3615B4017354K76895Q9766J95641j7147K8145l9341k9134l5103n89461n22761
$$ 24017354 24294249 24384015 24579656 24562509 24590654 24551313 24522179 24487076 23897615 23374854
3605B3374854p3259m91628p68905o83293j066094p82506n40523r87240p60024
$$ 23374854 23301595 22809967 22041062 21357769 20291675 19509169 18968646 17981406 17221382
3596A7221382k10657m17893m56250l23687j71593O477j5917J78696R2014N09145
$$ 17221382 17010725 16592832 16136582 15812895 15641302 15647779 15631862 15810558 15902572 16411717
3586A6411717L04884O07293O60922O81401O85626J082149J053843J579807J585820
$$ 16411717 16716601 17323894 17984816 18666217 19351843 20433992 21487835 23067642 24653462
3577B4653462J914935K129232K400308K672002K625868K771384K802861K944023
$$ 24653462 26568397 28697629 31097937 33769939 36395807 39167191 41970052 44914075
3569D4914075L024913K746842K495477K316720K603167K212275J611567J473154
$$ 44914075 47938988 50685830 53181307 55498027 58101194 60313469 61925036 63398190
3561F3398190J359963P20918N05684N68425J06295k2800n11887n23169l09059
$$ 63398190 64758153 65479071 65984755 66553180 66659475 66636675 66124788 65601619 65292560
3552F5292560q97872r73512j429361j467046j535512k288314k049467k344588
$$ 65292560 64394688 63421176 61991815 60524769 58989257 56700943 54651476 52306888
3544E2306888k157250k500306k299231k216272j954713j856630j534962j567796
$$ 52306888 50149638 47649332 45350101 43133829 41179116 39322486 37787524 36219728
3536C6219728j095641o73158m16367k42379J87596O69757O78241J336712J504048
$$ 36219728 35124087 34450929 34034562 33792183 33979779 34649536 35327777 36664489 38168537
3527C8168537J585234K131247K168497K266528K539075K244946K371791K500428
$$ 38168537 39753771 41885018 44053515 46320043 48859118 51104064 53475855 55976283
3519E5976283K129404J860099J530250J187986J082754Q10067O32320N85428L06154
$$ 55976283 58105687 59965786 61496036 62684022 63766776 64576843 65209163 65794591 66100745
3510F6100745J26836j02020n35098o54980q85056j222487j100156j638410k076210
$$ 66100745 66227581 66125561 65590463 64935483 64050427 62827940 61727784 60089374 58013164
3501E8013164k287420k343314k621320k428402k985880k978193k802776k807345
$$ 58013164 55725744 53382430 50761110 48332708 45346828 42368635 39565859 36758514
3493C6758514k498101k464021k394022j901313j979943j549905j613927j374175
$$ 36758514 34260413 31796392 29402370 27501057 25521114 23971209 22357282 20983107
3485B0983107q96818p75437p44398p02399p27013l76921k03213j59701K0564k86231
$$ 20983107 20086289 19310852 18566454 17864055 17137042 16760121 16556908 16397207 16417771 16131540
3475A6131540K81811J65437K03975N03255P87082P47391Q24905O63750P37192
$$ 16131540 16413351 16578788 16782763 17286018 18073100 18820491 19645396 20309146 21046338
3466B1046338P09956P52008P91975J026833Q34912P62270P75102N13837N60786
$$ 21046338 21756294 22508302 23300277 24327110 25162022 25924292 26699394 27213231 27774017
3457B7774017N97954K00033L13107M69750M91325L51460p4449k9992n1156o3818
$$ 27774017 28371971 28572004 28885111 29354861 29846186 30197646 30123197 30093205 30042049 29978231
3447B9978231o9465n30278m78874n83974r57931q56736p69620r57268q24116o31724
$$ 29978231 29908766 29378488 28899614 28315640 27357709 26500973 25731353 24774085 23949969 23318245
3437B3318245r27718j302026o15523p28554p40436q17630o03414l61243m12664
$$ 23318245 22390527 21088501 20472978 19744424 19003988 18186358 17582944 17221701 16809037
3428A6809037j79869k71845j27059l19670o8629k19660n8739k04682Q22K80046
$$ 16809037 16629168 16357323 16230264 15910594 15841965 15622305 15563566 15358884 15359706 15639752
3418A5639752N9720j67341j52806k10779J04499N41832K97759J99048L26832M69725
$$ 15639752 15699472 15532131 15379325 15168546 15273045 15814877 16112636 16311684 16638516 17108241
3408A7108241M43548Q48237O77217Q32190J003845J135188J525208J550844J833147
$$ 17108241 17551789 18400026 19077243 19909433 20913278 22048466 23573674 25124518 26957665
3399B6957665K089018K142416K418781K747033K955437K541159K339094K808198
$$ 26957665 29046683 31189099 33607880 36354913 39310350 41851509 44190603 46998801
3391D6998801K956473K932093K640781K316925K290872K219680J648490J529841
$$ 46998801 49955274 52887367 55528148 57845073 60135945 62355625 64004115 65533956
3383F5533956J728082R77676J029786R15898Q02684O86531J23424r145k20062
$$ 65533956 67262038 68239714 69269500 70185398 70988082 71674613 71798037 71788892 71568830
3374G1568830n00881j212244j122202j927155k233963k617094k853262l108423
$$ 71568830 71067949 69855705 68733503 66806348 64572385 61955291 59102029 55993606
3366E5993606l507200l824349l689242l513466l727351l321662k922087k760683
$$ 55993606 52486406 48662057 44972815 41459349 37731998 34410336 31488249 28727566
3358B8727566k754315j978291j742902j667384j822217j409301j240747r61793
$$ 28727566 25973251 23994960 22252058 20584674 18762457 17353156 16112409 15150616
3350A5150616r66375r57716q57859p64689p87076p24434n73859m20844m56069
$$ 15150616 14184241 13226525 12368666 11603977 10816901 10092467 9518608 9097764 8641695
3341H641695m44252m12208j38644j96067j19087l05183o5201p032l8709L5343
$$ 8641695 8197443 7785235 7646591 7450524 7331437 7026254 6961053 6954021 6915312 6950655
3331F950655r4381L50K08428N2208k1339L71073K17858K26767K71262L61218L64211
$$ 6950655 6856274 6856624 7065052 7117260 7095921 7466994 7684852 7911619 8182881 8544099 8908310
3320H908310P14396p8279L58623J97407j3593l633J42899K22642l28698m27258
$$ 8908310 9622706 9544427 9903050 10100457 10086864 10083231 10226130 10448772 10120074 9692816
3310I692816j99829p8135l67702n48247n38166l22028m44738o01168l96450l03164
$$ 9692816 9492987 9414852 9047150 8498903 7960737 7638709 7193971 6592803 6196353 5893189
3300E893189j84847k07988k66459j0851j8750l59890r3205k50025J77291J0406
$$ 5893189 5708342 5500354 5233895 5223044 5204294 4844404 4751199 4501174 4678465 4688871
3290D688871q6914J33016J11285P228K1121R4896k35615p3875j84049L18328J58254
$$ 4688871 4601957 4734973 4846258 4853486 4874607 4969503 4733888 4660013 4475964 4794292 4952546
3279D952546K12400j16891k81910K51523Q0020J24639j27844K9368j32656l19224
$$ 4952546 5164946 5048055 4766145 5017668 5097688 5222327 5094483 5123851 4991195 4671971
3269D671971M3722N3283Q7523j45883k11173R3052J70919l2358K3456K32235j23879
$$ 4671971 4715693 4768976 4856499 4710616 4499443 4592495 4763414 4731056 4754512 4986747 4862868
3258D862868J39998J65847o0051j79226m9768K61283J12103n8634J78381L15418
$$ 4862868 5002866 5168713 5108662 4929436 4879668 5140951 5253054 5194420 5372801 5688219
3248E688219k16787k82118P6350o8059j13187j72833m6689j45272o4375J48958
$$ 5688219 5471432 5189314 5265664 5197605 5084418 4911585 4864896 4719624 4655249 4804207
3238D804207J53129J95172o5801j3482N9985R0243J70862J88907p9068K72028
$$ 4804207 4957336 5152508 5086707 5073225 5133210 5223453 5394315 5583222 5504154 5776182
3228E776182R3923q5937O3689K50216N076n123k1024j47511K80680M54022K92734
$$ 5776182 5870105 5784168 5847857 6098073 6103149 6098026 6077002 5929491 6210171 6664193 6956927
3217F956927l265J77976J55479p291K53118J61360J42856J3346L57274L37887
$$ 6956927 6953662 7131638 7287117 7279826 7532944 7694304 7837160 7850506 8207780 8545667
3207H545667K19131K9040J15146J7567K23514L32130L28292K84830L28966J20123
$$ 8545667 8764798 8793838 8908984 8926551 9150065 9482195 9810487 10095317 10424283 10544406
3197A0544406R9765J48261N22602L81623R3504L50181K59453J86407K43638J50810
$$ 10544406 10644171 10792432 11315034 11696657 11790161 12140342 12399795 12586202 12829840 12980650
3187A2980650K64845L75138P3837M21426P37380N63481J37542P87554M34800N29930
$$ 12980650 13245495 13620633 13694470 14115896 14853276 15416757 15554299 16341853 16776653 17306583
3177A7306583P47363O74585P35006Q64020O27875P71572R90070J138263J123702
$$ 17306583 18053946 18728531 19463537 20327557 20955432 21727004 22717074 23855337 24979039
3168B4979039J025151J730617J757334J407240K061129K572180K737856K373051
$$ 24979039 26004190 27734807 29492141 30899381 32960510 35532690 38270546 40643597
3160D0643597K946727L530791L339295M037667M065813M712761N430708O141447
$$ 40643597 43590324 47121115 50460410 54498077 58563890 63276651 68707359 74848806
3152G4848806P078596Q051759R150898J0971225J3391754J6023516J9502765K3498577
$$ 74848806 81927402 89979161 99130059 110101284 123493038 139516554 159019319 182517896
3144A82517896K8227111L2553959L5648518L6924249L4449902K8961815J9740135
$$ 182517896 210745007 243298966 278947484 315871733 350321635 379283450 399023585
3137C99023585Q832673k080548j1769678j9404961k5502291k9942864l2676905
$$ 399023585 407856258 405775710 394006032 374601071 349098780 319155916 286479011
3130B86479011l3007879l1690156k9484432k6338514k1830853j8700669j5586428
$$ 286479011 253471132 221780976 192296544 165958030 144127177 125426508 109840080
3123A09840080j2958568j0947084r442390q300904o935727o008423m895264m309128
$$ 109840080 96881512 85934428 76492038 68191134 61255407 55246984 50351720 46042592
3115D6042592l806427l186176k593047k252754k043419j926005j847525j476287
$$ 46042592 42236165 39049989 36456942 34204188 32160769 30234764 28387239 26910952
3107B6910952j614206j269642r67786j068676j073805r58003r16065o94849q46867
$$ 26910952 25296746 24027104 23059318 21990642 20916837 19958834 19042769 18347920 17501053
3098A7501053q15796n30450n06124n26476q34002m24759l66804l62401n06334
$$ 17501053 16685257 16154807 15648683 15122207 14288205 13863446 13496642 13134241 12627907
3089A2627907n87942k51293k21381j47616l84085l87616k59930l85156k56073
$$ 12627907 12039965 11788672 11567291 11419675 11035590 10647974 10388044 10002888 9746815
3080I746815n80160k69388l06216o22099n43003k53123j23311j8319j41423k15141
$$ 9746815 9166655 8897267 8591051 7968952 7425949 7172826 7049515 7031196 6889773 6674632
3070F674632j36981K877j28481m9850J92582M18381M97076M7931K80830K44870
$$ 6674632 6537651 6540528 6412047 6362197 6554779 6973160 7470236 7518167 7798997 8043867
3060H043867N5884J42063Q3399k76894j35351o51427p12104l18584l35738k93716
$$ 8043867 8099751 8241814 8325213 8048319 7912968 7261541 6549437 6230853 5895115 5601399
3050E601399j46357n98067m07647m016k16951k94738k02155q1241j2936K4705
$$ 5601399 5455042 4856975 4449328 4445312 4228361 3933623 3731468 3650227 3637291 3661996
3040C661996l10656k92406J92047q1883k40692l67055K1035n9303j31099K42097
$$ 3661996 3351340 3058934 3250981 3169098 2928406 2561351 2582386 2523083 2391984 2634081
3030B634081k3317K4876q3890k3738l34516k25342O8801K31646j98822n1457j2245
$$ 2634081 2610764 2635640 2551750 2528012 2193496 1968154 2036955 2268601 2069779 2018322 2006077
3019B006077k93536k76982j50929K83633J42531j96110J45245J58512k8328J41080
$$ 2006077 1712541 1435559 1284630 1568263 1710794 1514684 1659929 1818441 1790113 1931193
3009A931193r566n9542L0126r8469m1122j50457l4647q9351J51188N1422l34420
$$ 1931193 1921627 1862085 1892211 1793742 1752620 1602163 1567516 1478165 1629353 1680775 1346355
2998A346355q6977K9244j74670j71873R305k08350j25204Q5840K8831j86240J81395
$$ 1346355 1259378 1288622 1113952 942079 951384 743034 617830 703670 732501 546261 727656
2987G27656l1005n2739p5312r1679k7897K13422P0929l8709l3475l47230J03070
$$ 727656 696651 643912 568600 476921 449024 662446 733375 694666 661191 313961 417031
2976D17031J92244J2799o7257j37423J03448k0079j8210K64645r5263K5370k86049
$$ 417031 609275 622074 554817 417394 520842 500763 482553 747198 651935 677305 391256
2965C91256j02736j8574j6127K11484J5780j89130J89669q1550O30O1231J4062
$$ 391256 288520 269946 253819 465303 481083 291953 481622 400072 400702 461933 475995
2954D75995k14520k4900K75897R6599k1343J280j9301k02309j83518K9273J82379
$$ 475995 261475 236575 512472 609071 587728 589008 569707 367398 183880 213153 395532
2943C95532P137j47784J86931L8584j30841N1481o9672J72039j86790o240j09562
$$ 395532 402669 254885 441816 480400 349559 401040 331368 503407 316617 310377 200815
2932B00815l6857p1089K9481j08611N8824q590n7487R6541j1506R525j22056P6093
$$ 200815 163958 92869 122350 13739 72563 63973 6486 103027 91521 101046 -21010 55083
2920E5083J74019J1145N1218J32136P150r0442p1372Q876j59833o8674P479Q0755
$$ 55083 229102 240247 291465 423601 430751 340309 268937 277813 117980 49306 56785 137540
2908A37540M92310j25989j37484k67959k5492O3172k6998n4447j60039J0190O9191
$$ 137540 629850 503861 366377 98418 72926 136098 109100 54653 -105386 -95196 -26005
2897b6005m4479K04016n3556j14585r0493j82515L60981Q050r3595K27239J41966
$$ -26005 -70484 133532 79976 -34609 -125102 -307617 53364 61414 -32181 195058 337024
2886C37024j64966j08330k85942o7937L06728r2281Q3963K29270k8021J81316
$$ 337024 172058 63728 -222214 -290151 16577 -75704 8259 237529 209508 390824
2876C90824o411p7430k01191K91304k2689O5018N7465O4644J65362k73348P9868
$$ 390824 384413 306983 105792 397096 374407 439425 496890 561534 726896 453548 533416
2865E33416j21743k06367M3044J57605J39379J54644K40463L17999N2862M82125
$$ 533416 411673 205306 248350 405955 545334 699978 940441 1258440 1311302 1793427
2855A793427K9967j54283L35609j03729j00574k68995j12039j53519r6266k00774
$$ 1793427 1823394 1669111 2004720 1900991 1800417 1531422 1419383 1265864 1169598 968824
2845I68824q5799j9764j75389J3057k5700l17075J64593p3243j14576J82643l9568
$$ 968824 883025 863261 687872 700929 675229 358154 522747 449504 334928 517571 478003
2834D78003m8490K00855J52576m22144k33245l8676J4391p5176o1763J16983K42333
$$ 478003 429513 630368 782944 360800 127555 88879 103270 28094 -33669 83314 325647
2823C25647k44398k2270o644k39148r4251K14383q5468j04979M4326J71306M5964
$$ 325647 81249 58979 52335 -186813 -281064 -66681 -152149 -257128 -212802 -41496 4468
2812D468j80972J811j01795J87205k6668m6813N9177J8560K28442J16727O8434
$$ 4468 -176504 -174693 -276488 -89283 -115951 -162764 -103587 -85027 143415 260142 328576
2801C28576J3896j71306n2859M0868O2783k92926j31894k94420J02019K86304
$$ 328576 342472 171166 118307 159175 221958 -70968 -202862 -497282 -395263 -108959
2791a08959J58128J67616p9730j40641q9883K05466L47128J5426j12038k19475
$$ -108959 49169 216785 137055 -3586 -93469 111997 459125 474551 362513 143038
2781A43038j40844j62712n9507J07900j17731J21974K49728k1481j51897m8770
$$ 143038 2194 -160518 -220025 -112125 -229856 -107882 141846 120365 -31532 -80302
2771h0302l3547n6483q6215P2084J72912J41858K09511J89821k57467j2151R0120
$$ -80302 -113849 -170332 -256547 -184463 -11551 130307 339818 529639 272172 260021 350141
2760C50141q9734q1488j65974r3615k97528J53785L58760j00879J25547J0366
$$ 350141 260407 178919 12945 -80670 -378198 -224413 134347 33468 159015 169381
2750A69381O8440j37551k710j7552J8895K3443j95974o746P442J10596r5097p0648
$$ 169381 237821 100270 97560 80008 98903 122346 -73628 -80374 -72932 37664 -57433 -128081
2738a28081Q171N0990O372J69764L2406K3631j54113R6250k1999j6042K91259
$$ -128081 -119910 -68920 -62548 107216 139622 163253 9140 105390 83391 67349 358608
2727C58608r3289j86017j27824N4159J83331k9399L8875j60582j46392L3969K9044
$$ 358608 265319 79302 -48522 5637 188968 159569 198444 37862 -108530 -74561 -45517
2716d5517p6898j00551L42876K35773k64676j08334J30387j79402K9609k86324
$$ -45517 -122415 -222966 119910 355683 91007 -17327 113060 -66342 -36733 -323057
2706c23057Q4382m4185J34532K0431J47447k46143J27866J71110N445r4214j56083
$$ -323057 -238675 -282860 -148328 -127897 19550 -226593 -98727 72383 77828 -16386 -172469
2695a72469K9582r4737J15713j40930k4689J85279K98011P6620j38922J14238
$$ -172469 -142887 -237624 -121911 -262841 -287530 -102251 195760 272380 133458 247696
2685B47696r1170n799P2756k30305P1573j22445N5396P5620k0027J4613J33645
$$ 247696 156526 150727 223483 -6822 64751 -57694 -2298 73322 53295 67908 201553
2674B01553J30900l28392n3450J08392L8926P5493k83471J55513j64330m9102
$$ 201553 332453 4061 -49389 59003 97929 173422 -110049 45464 -118866 -167968
2664a67968j21047K2624L80887j42706m7022J34757k7013l35341J56802N6587
$$ -167968 -289015 -266391 114496 -28210 -75232 59525 32512 -302829 -146027 -89440
2654h9440n3125J21155j7901O4648p2689J30523P5435o3353k97648J6708J55944
$$ -89440 -142565 -21410 -39311 25337 -47352 83171 158606 95253 -202395 -185687 -29743
2643b9743k5750j7994L082n3152O9589J62222J02039k04863J24302P7603j03706
$$ -29743 -55493 -73487 -70405 -123557 -53968 108254 210293 5430 129732 207335 103629
2632A03629j55753L7482j32494O0931J28605l2384n7531q9768J43826Q2869o3138
$$ 103629 -52124 -14642 -147136 -86205 42400 10016 -47515 -137283 6543 89412 26274
2621B6274J74313J15774k2099j96050K3225K24463j6865j30033j0257J17629k99716
$$ 26274 200587 316361 294262 98212 121437 345900 329035 199002 188745 306374 6658
2610F658j31133J00055R9905q139k28372m3069k5334O0289J20122J50939j3088
$$ 6658 -124475 -24420 75485 67346 -161026 -204095 -229429 -169140 -49018 101921 88833
2599H8833m259L96986k34337l16319n9382R5955L51219J68090j01500n2391j69236
$$ 88833 84574 481560 247223 -69096 -128478 -32523 318696 486786 385286 332895 163659
2588A63659K851J09503n1450p3430N0589J48915L97927l39682J47120J18643Q4383
$$ 163659 166510 276013 224563 151133 201722 350637 748564 408882 556002 674645 759028
2577G59028K36348J92509P6343P9108K92598j43965o7421q0709j08500q6467j92938
$$ 759028 995376 1187885 1264228 1343336 1635934 1491969 1424548 1343839 1235339 1148872 955934
2566I55934j4029j56682m03492M2207K8873J40737q6140k80942M3518j85519K9706
$$ 955934 941905 785223 381731 423938 452811 593548 507408 226466 269984 84465 114171
2555A14171L47860o7323j92844k75648J25906L27058k06043Q6086J13705p849
$$ 114171 462031 394708 201864 -73784 52122 379180 173137 259223 372928 365079
2545C65079j25202q9315J13732j77948J91658j43228p7592J2859M3772J93642
$$ 365079 239877 150562 264294 86346 278004 134776 57184 70043 113815 307457
2535C07457n1370l49151Q3939J56263k17472J38472J9942o864m6206k34231o7493
$$ 307457 256087 -93064 -9125 147138 -70334 68138 88080 81216 35010 -199221 -266714
2524b66714K72274K55566k20710j50318J00118O4030K91398l1819m996j7424j24420
$$ -266714 5560 261126 40416 -109902 -9784 54246 345644 313825 308829 291405 166985
2513A66985j08489J4211R2038J32884J21470p9140R2934j83205Q5625J04783J15314
$$ 166985 58496 72707 164745 297629 419099 339959 432893 249688 335313 440096 555410
2502E55410q3195k11422J21185J22756q2813k91238J4267K31620K93477j19164
$$ 555410 472215 260793 381978 504734 421921 130683 144950 376570 670047 550883
2492E50883j45551k15433K71852K19559k20314n3133m389N2029L96896p5497q5574
$$ 550883 405332 189899 461751 681310 460996 407863 403474 455503 852399 776902 691328
2481F91328l88292j7209O1131O7625P371R1132j1793l19411J02316M2133J21775
$$ 691328 303036 285827 346958 414583 421954 513086 501293 181882 284198 326331 448106
2470D48106K71677r9495o2410o094j12410J31686j82796q7228K95010J80334J8446
$$ 448106 719783 620288 557878 551784 439374 571060 388264 301036 596046 776380 794826
2459G94826O5356l6765L3432j3344k3503k07907K02704M3632k00622l6298J97854
$$ 794826 860182 823417 856849 843505 820002 612095 814799 858431 657809 621511 819365
2448H19365K96580Q0232j76974L4419k02250q4219M4050K24968j87878k7981l51155
$$ 819365 1115945 1196177 1019203 1053622 851372 767153 811203 1036171 848293 820312 469157
2437D69157l2501J28427j02611J09277k4086P5862K67357p3391p5731P4352p89
$$ 469157 436656 565083 462472 571749 547663 623525 890882 817491 741760 816112 815323
2426H15323J60174O3526R642j80160j6152K03716L77889N3740o9923M2632m3424
$$ 815323 975497 1039023 1048665 868505 852353 1056069 1433958 1487698 1417775 1460407 1416983
2415A416983k47426Q8627J07837j6924K26588j49366m0646o3012J36251j14386
$$ 1416983 1169557 1258184 1366021 1349097 1575685 1426319 1385673 1322661 1458912 1344526
2405A344526p4045K58919J39924n8553k70280M1619N2383J06479j15918J16472
$$ 1344526 1270481 1529400 1669324 1610771 1340491 1382110 1434493 1540972 1425054 1541526
2395A541526L26335M1100j96512q2595J87531j22650J30407K47471M343K68597
$$ 1541526 1867861 1908961 1712449 1629854 1817385 1694735 1825142 2072613 2076956 2345553
2385B345553k2955k76102R8413M5323J34428M23920L8047l31211J84023L55890
$$ 2345553 2322598 2046496 2144909 2190232 2324660 2748580 2786627 2455416 2639439 2995329
2375B995329r2475k5205J46484K23221K93872M3706Q2871K44272J5221m5465R9500
$$ 2995329 2902854 2877649 3024133 3247354 3541226 3584932 3667803 3912075 3927296 3881831 3981331
2364C981331J09896L4492L0982J05451k36655Q5111j5215j37164o3133R1134L32362
$$ 3981331 4091227 4125719 4156701 4262152 4025497 4110608 4095393 3958229 3895096 3986230 4318592
2353D318592P2141K64022K03965R4152P4330J68745m0084K44515K30162L83113
$$ 4318592 4390733 4654755 4858720 4952872 5027202 5195947 5155863 5400378 5630540 6013653
2343F013653L40294K98704J13296L60087K23924K12578M50291P35430K13036N27993
$$ 6013653 6353947 6652651 6765947 7126034 7349958 7562536 8012827 8748257 8961293 9489286
2333I489286Q84145J046272J324857J155625J546675J776916J748048K348746
$$ 9489286 10373431 11419703 12744560 13900185 15446860 17223776 18971824 21320570
2325B1320570K315225K590498K215545K039433J632932K162784K809530L603526
$$ 21320570 23635795 26226293 28441838 30481271 32114203 34276987 37086517 40690043
2317D0690043L798575N540116Q147162J3787173K1026272K9972315L5953206L6673259
$$ 40690043 44488618 50028734 58175896 71963069 92989341 122961656 158914862 195588121
2309A95588121L9526124L3613233J0439042j2647850j4433834j4555240k1389948
$$ 195588121 235114245 268727478 279166520 266518670 252084836 237529596 216139648
2302B16139648k6245149k8587685k8372112k6394294k3463062j8726578j2414500
$$ 216139648 189894499 161306814 132934702 106540408 83077346 64350768 51936268
2295E1936268p474778m931716l800809l850085l542933l189009k526608k408169
$$ 51936268 44461490 39529774 35728965 31878880 28335947 25146938 22620330 20212161
2287B0212161k196862k070439j439420j218762r55025p74559o62089p37425o33613
$$ 20212161 18015299 15944860 14505440 13286678 12331653 11557094 10895005 10157580 9523967
2278I523967l98138m91547m79839m55509k14792k74891l21602k60256n96650k32673
$$ 9523967 9125829 8634282 8154443 7698934 7484142 7209251 6887649 6627393 6030743 5798070
2268E798070j41599l84951l31221k63538k52327J35872j11026j49399k7637l028
$$ 5798070 5656471 5271520 4940299 4676761 4424434 4560306 4449280 4299881 4272244 4269216
2258D269216j27822k67109k72758k82997k76060j35599j49481j79306N6144o9022
$$ 4269216 4141394 3874285 3601527 3318530 3042470 2906871 2757390 2578084 2634228 2565206
2248B565206j06488j14502o5444l90328M9293m4540l01562k10591J34512J26594
$$ 2565206 2458718 2344216 2278772 1888444 1937737 1893197 1591635 1381044 1515556 1642150
2238A642150j21397P6540j4167l5776N7757j63415N9008J47094j16695j15100
$$ 1642150 1520753 1597293 1583126 1547350 1605107 1441692 1500700 1647794 1531099 1415999
2228A415999L8155p3575n5250j1868J51091J8061M7983J38072k34211l09161J19477
$$ 1415999 1454154 1380579 1325329 1313461 1464552 1482613 1530596 1668668 1434457 1125296 1244773
2217A244773K29441L4202m17016o9346j72795k3346R1323j16814L9268K0339J41946
$$ 1244773 1474214 1508416 1091400 1022054 849259 825913 917236 800422 839690 860029 1001975
2206A001975J92896O8175n9959r9820l18288j13559J83240J1876L2071n4052k92682
$$ 1001975 1194871 1263046 1203087 1103267 784979 671420 854660 866536 898607 844555 551873
2195E51873j67066k4539L2620k7933o1033l92172L9784J88896J26759O6752J325
$$ 551873 384807 360268 392888 364955 303922 -88250 -48466 140430 267189 333941 335266
2184C35266J37066O5081j25655Q0968K69942N9944J49744k65283k88948j46050
$$ 335266 472332 537413 411758 492726 762668 822612 972356 707073 418125 272075
2174B72075K672n6883R2459o1204K6770n1681J04828j71333L6078J66505m103
$$ 272075 274747 217864 310323 249119 275889 224208 329036 157703 193781 360286 356183
2163C56183l17589J62097J86746l39384j36160J05401L02775l4485m7961l28477
$$ 356183 38594 200691 387437 48053 -88107 17294 320069 285584 237623 -90854
2153i0854K7842q4698J18347L6205m6544p9081J87832k4884K96467n2303p7414
$$ -90854 -63012 -147710 -29363 6842 -39702 -118783 69049 44165 340632 288329 210915
2142B10915Q150p2334J27220K09280k65897j03104N9436j44205j55613k98783
$$ 210915 219065 146731 273951 483231 217334 114230 173666 29461 -126152 -424935
2132d24935J34076j24099J38232K89719J93129J11347k68118q1338J38582k5277
$$ -424935 -290859 -414958 -276726 12993 206122 317469 49351 -31987 106595 81318
2122H1318j31731l68777J441P3970J70318J10394N3341p0070P7468l9241j02490
$$ 81318 -50413 -419190 -417749 -343779 -173461 -63067 -9726 -79796 -2328 -41569 -144059
2111a44059P0443j2380R3842K2415j35861P7150p2734j60566k8965K07278M4740
$$ -144059 -73616 -85996 7846 30261 -105600 -28450 -101184 -261750 -290715 -83437 -38697
2100c8697j16606J2265k0505r1100J18338K97291L6824j67250J69428m8951j87085
$$ -38697 -155303 -143038 -163543 -254643 -136305 160986 197810 30560 199988 151037 -36048
2089c6048j47053P9191L41749j06626l6773r0697n6681r0478K7369P8867n6374
$$ -36048 -183101 -103910 237839 131213 94440 3743 -52938 -143416 -116047 -37180 -93554
2078i3554K3781J40888j49055l043j1807J41307l8847k89181n0614P0648Q0479
$$ -93554 -69773 71115 -77940 -80983 -92790 48517 9670 -279511 -330125 -259477 -178998
2067a78998J10367O2882j39395N0474J4294l99073L05752K96787p4613k8228r9436
$$ -178998 -68631 -5749 -145144 -94670 -80376 -479449 -173697 123090 48477 20249 -79187
2056g9187J32523m6706p4739J7394M3092q1063J37465Q0363P5903K83050n0587
$$ -79187 53336 6630 -68109 -50715 -7623 -88686 48779 129142 205045 488095 437508
2045D37508p5110O8718J22965J59869J4864L6469K52375J78098l3277J04013l1688
$$ 437508 362398 431116 554081 713950 728814 765283 1017658 1195756 1162479 1266492 1234804
2034A234804r2674l02485l58050J4549j33479l14184m4234p0148j57649O4998
$$ 1234804 1142130 839645 481595 496144 362665 48481 4247 -65901 -223550 -158552
2024a58552j48320p180K19452p0492n4379M4398k6422m8540P501p1307J21024
$$ -158552 -306872 -314052 -94600 -165092 -219471 -175073 -201495 -250035 -242534 -313841 -192817
2013a92817J27741J02701k06515Q793m33872K12018K84919j29408j99230J76898
$$ -192817 -65076 37625 -168890 -160097 -593969 -381951 -97032 -226440 -425670 -248772
2003b48772J40676j79715O9625J04219J02414j21679J53242j23392L4477J70224
$$ -248772 -108096 -287811 -218186 -113967 -11553 -133232 20010 -103382 -68905 101319
1993A01319L4040l97100Q7737n6594j0201J92793K8505p995k6444j42209N1988
$$ 101319 135359 -261741 -174004 -230598 -240799 -48006 -19501 -27496 -53940 -196149 -144161
1982a44161J9639J5751J57069l1316q0850k01294J12987J69684m37043l61594
$$ -144161 -124522 -108771 48298 16982 -63868 -265162 -152175 17509 -419534 -781128
1972g81128J39248R3181L04339K8241j61529O410J34618J37846k40239J48548
$$ -781128 -641880 -548699 -244360 -216119 -377648 -371238 -236620 -98774 -339013 -190465
1962a90465K76582m8595m01067J54915J95741j09130J54113j70502k36720Q1870
$$ -190465 86117 37522 -363545 -208630 -12889 -122019 32094 -138408 -375128 -293258
1952b93258J62437R2982k4555P0105j42714j13922L9309J0780J10890n5686j52213
$$ -293258 -130821 -37839 -62394 7711 -135003 -248925 -209616 -198836 -87946 -143632 -295845
1941b95845O3778K90868l0543k7563K03786o0555m38716j86119n248L7951J37057
$$ -295845 -232067 58801 28258 695 204481 143926 -294790 -480909 -486157 -448206 -311149
1930c11149k3104J31432L21062N0802j22547j34631j00942P0670j77942J81347
$$ -311149 -334253 -202821 118241 169043 46496 -88135 -189077 -118407 -296349 -115002
1920a15002J70796p6972k5864O0500k06293m3411J15789j22535j09864j29348
$$ -115002 55794 -21178 -47042 13458 -192835 -236246 -120457 -242992 -352856 -482204
1910d82204J07567K25725K24292P2387l12577j45031L16745k77908j32609N7127
$$ -482204 -374637 -148912 75380 147767 -164810 -309841 6904 -271004 -403613 -346486
1900c46486l0575L74889J35104j9896j25320O2095O6619j53614j16603l6962J26176
$$ -346486 -377061 -2172 132932 113036 -12284 49811 116430 -37184 -153787 -190749 -64573
1889f4573p1487r8946K32998L29636j70308r8318k10029M3861J52593r1988P2468
$$ -64573 -136060 -235006 -2008 327628 157320 59002 -151027 -107166 45427 -46561 25907
1878B5907K63396k65603o526j73631Q8923j00322j63197K60410j4196q1537J6589
$$ 25907 289303 23700 17174 -156457 -67534 -167856 -331053 -70643 -84839 -166376 -149787
1867a49787J09255k41325k19588J07133P5599J00692J7642J35493J61547R6557
$$ -149787 -40532 -281857 -501445 -394312 -318713 -218021 -200379 -64886 96661 193218
1857A93218L59267k56808j89903j25166r2472K787j7637n9149j67530M85P7972
$$ 193218 552485 295677 105774 -19392 -111864 -109077 -126714 -185863 -353393 -352908 -274936
1846b74936L8361r6099P0203O7807J16863j69677j7735J29393q1339o5507K33019
$$ -274936 -236575 -332674 -262471 -194664 -77801 -247478 -265213 -135820 -217159 -282666 -49647
1835d9647J99192q0751j02382O2590J4394j08328J22920j04871q015k8557L2444
$$ -49647 149545 68794 -33588 29002 43396 -64932 57988 -46883 -54898 -83455 -51011
1824e1011j39401P5493n9607J88538j22298r7041O3673M2612r472j6408L20574
$$ -51011 -190412 -114919 -174526 14012 -108286 -205327 -141654 -99042 -108514 -124922 195652
1813A95652Q0883j23163J33866n2691m34892M6669J88548M2741M731K73523k34859
$$ 195652 276535 153372 287238 234547 -200345 -153676 34872 77613 82344 355867 121008
1802A21008k52727l38529J58886K75022o1739P0450K40767j31076j36564n6067
$$ 121008 -131719 -470248 -311362 -36340 -98079 -27629 213138 82062 -54502 -110569
1792a10569k6562J20860L5111M450m1482O5094N8554J31259K39273j71056l11934
$$ -110569 -137131 -16271 18840 23290 -18192 46902 105456 236715 475988 304932 -7002
1781g002J61563j74306j67426J0275J83002k65239J20285m3326N250J19216k47802
$$ -7002 154561 -19745 -187171 -176896 6106 -259133 -138848 -182174 -176924 -57708 -305510
1770c05510k8271n8112k52780M370J86466M45178J10018J02969k1556k33135J42579
$$ -305510 -333781 -391893 -644673 -640303 -453837 -8659 101359 204328 182772 -50363 92216
1759I2216n055L740j45470m3171J15626Q9425j59884Q8030K32410q5094R7439
$$ 92216 87161 90901 -54569 -97740 17886 107311 -52573 35457 267867 182773 280212
1748B80212m19408k87334J71847Q3936J22616L63602k90101j45487k5052o2450
$$ 280212 -139196 -426530 -254683 -170747 -48131 315471 25370 -120117 -145169 -207619
1738b07619Q6450k65926j53340J61027M15124R419k87902L9608J64817p1926j90165
$$ -207619 -121169 -387095 -540435 -379408 35716 45135 -242767 -203159 -38342 -110268 -300433
1727c00433L860m9985O8992L28514J8758j13355j60471L6568n7095r7497k22839
$$ -300433 -296573 -346558 -277566 50948 69706 -43649 -204120 -167552 -224647 -322144 -544983
1716e44983L31924j99J66629m3763j8178N7874K05639j1714k38404m9698r5856
$$ -544983 -213059 -213258 -46629 -90392 -108570 -50696 154943 143229 -95175 -144873 -240729
1705b40729r5015J55899J18685q4865K70277j94713q9506J56943M179q6208o0831
$$ -240729 -335744 -179845 -61160 -146025 124252 -70461 -159967 -3024 1155 -85053 -145884
1694a45884J23414k07623J58903K24457m439j54562n2381M5496o9728J38949K00462
$$ -145884 -22470 -230093 -71190 153267 148828 -5734 -58115 -12619 -82347 56602 257064
1683B57064P5609j39166j42420j12040J99584L0102j91319j09742j47017K6321
$$ 257064 332673 193507 51087 -60953 138631 168733 -22586 -132328 -279345 -253024
1673b53024J48882J66745j72486j06454l8568k70999K10954N667K42906M3114
$$ -253024 -104142 62603 -109883 -216337 -254905 -525904 -314950 -309283 -66377 -23263
1663b3263P2911n1826j38037m7428M1462k01725j30353J26077P6402J08003J71285
$$ -23263 49648 -2178 -140215 -187643 -146181 -347906 -478259 -352182 -275780 -167777 3508
1652C508R4080Q132R231p7957k56750J32156Q2807P306r7434P2218N8370j17001
$$ 3508 97588 105720 114951 36994 -219756 -87600 -4793 2513 -94921 -22703 35667 -81334
1640h1334o7468j15058M5067p5615K83942r7161J06641k1746k38736J145K36699
$$ -81334 -148802 -263860 -218793 -294408 -10466 -107627 -986 -22732 -261468 -260323 -23624
1629b3624M2649p1231j21926N5163Q1704j49932N8162k2965j94905j23654j8675
$$ -23624 19025 -52206 -174132 -118969 -37265 -187197 -129035 -152000 -346905 -470559 -489234
1618d89234J84467O7300J63644j59601J38538K21263Q9925q3388l77240o5124
$$ -489234 -304767 -237467 -73823 -233424 -94886 126377 216302 132914 -244326 -309450
1608c09450O5434R8194J25643Q8209k31677M194J94904P1356j35030k26547L5559
$$ -309450 -244016 -145822 -20179 68030 -163647 -159453 35451 106807 -28223 -254770 -219211
1597b19211P9305J11171n1424O0371j32244k3041P9571j15809J23567j30948l2418
$$ -219211 -139906 -28735 -80159 -19788 -152032 -175073 -95502 -211311 -87744 -218692 -251110
1586b51110J94959L4414k02904p1772K08658j30675k09963L18947J16746J28185
$$ -251110 -56151 -21737 -224641 -296413 -87755 -218430 -428393 -109446 7300 135485
1576A35485j3820J16348k19669j95989J43394k05973P0827n7166J94758j0663
$$ 135485 121665 238013 18344 -177645 -34251 -240224 -169397 -226563 -31805 -42468
1566d2468P0165J37365j07299N657n3739J32653j68982k09482q204k25567O4780
$$ -42468 27697 165062 57763 63420 9681 142334 -26648 -236130 -244334 -469901 -405121
1555d05121K51082K2720J96405L0538k57994J63844p9648P8265o9198k18955J69295
$$ -405121 -154039 -131319 65086 95624 -162370 1474 -78174 91 -69107 -288062 -118767
1544a18767L26563J41319k61828O9386k67342O4099j11551k73480Q016J42145
$$ -118767 207796 349115 87287 156673 -110669 -46570 -158121 -431601 -423585 -281440
1534b81440R2266J68658J27499K7372j89730J38330q9736l49932J62357L9129
$$ -281440 -189174 -20516 106983 134355 -55375 82955 -6781 -356713 -194356 -155227
1524a55227q1951n699M8343K01671q7260l6996J15886R2657k5210M7232K628o0147
$$ -155227 -237178 -242877 -194534 7137 -80123 -117119 -1233 91424 66214 113446 116074 55927
1512E5927J25663j96160M3785R678l9726P8542l184p5295n1861J6415K49088j68683
$$ 55927 181590 -14570 29215 38893 -833 77709 74525 -770 -52631 -36216 212872 44189
1500D4189O3735k3288O5462q330j72887L6763l1406J79183p199J3037j15040K6079
$$ 44189 107924 84636 150098 141768 -31119 5644 -25762 153421 146222 159259 44219 70298
1488G0298k13028j20755q761J25493k8806J36662R7159K04795M2247n1657P8089
$$ 70298 -142730 -263485 -272246 -146753 -175559 -38897 58262 263057 305304 253647 331736
1477C31736j65362l9832k06678k22018K26663r2463J82214R4112q8810K41495
$$ 331736 166374 126542 -80136 -302154 -75491 -167954 14260 108372 19562 261057
1467B61057N6175k98377j52653M4018j38648L1827q4063N669k7747L52725j834
$$ 261057 317232 18855 -133798 -89780 -228428 -196601 -280664 -274995 -302742 49983 48149
1456D8149k90752J84752O5151m1579Q0204j30179j13101q4134j69088K47547K65113
$$ 48149 -242603 -57851 7300 -34279 45925 -84254 -197355 -281489 -450577 -203030 62083
1445F2083j69272J68308j5176k28794J00931J90176j15763r1489J85852j38747
$$ 62083 -107189 61119 45943 -182851 -81920 108256 -7507 -98996 86856 -51891
1435e1891l8861L1940M6053K85426O7797k51709O1558J58449k41748k7276K4887
$$ -51891 -90752 -58812 -12759 272667 340464 88755 150313 308762 67014 39738 64625
1424F4625P3475j71610l33609k05561M94919K98453K7214r836j85734j25978P3316
$$ 64625 138100 -33510 -367119 -572680 -77761 220692 247906 238070 52336 -73642 -326
1413c26k09093J2669R3039J68186j4088n0328N2904M4684k05056N8794j65969
$$ -326 -209419 -196750 -103711 64475 50387 59 52963 97647 -107409 -48615 -214584
1402b14584K4724J15113K6544J9999j49070J53857J60001j11251R341j05511p4994
$$ -214584 -189860 -74747 -48203 -28204 -177274 -23417 136584 25333 34674 -70837 -145831
1391a45831j68275J26082j33016n3436L22228J19727K99651k68295Q0435o7514
$$ -145831 -314106 -188024 -321040 -374476 -52248 67479 367130 98835 179270 111756
1381A11756l83716K87850J79057j52278r4625J2535J7582q1545j88849N5255K49265
$$ 111756 -271960 15890 194947 42669 -51956 -39421 -21839 -103384 -292233 -236978 12287
1370A2287L0613J57691p9384j40640k62434J24882J56631j7654j2286J78986L0991
$$ 12287 42900 200591 121207 -19433 -281867 -156985 -354 -18008 -30294 148692 179683
1359A79683j58184l35548J63123J64959J26453J57176L9784j88771n8011K7811
$$ 179683 21499 -314049 -150926 14033 140486 297662 337446 148675 90664 118475
1349A18475j36138o8194K89479o7012j13434q4038m7563J66489k02932o060K53781
$$ 118475 -17663 -85857 203622 136610 23176 -60862 -108425 58064 -144868 -150928 102853
1338A02853N2147J6269k60015J10553o6628o5597K48336j59977j46974J33167
$$ 102853 155000 171269 -88746 21807 -44821 -110418 137918 -22059 -169033 -35866
1328c5866J03427J61675k01474J32053N6864n1791r8238j2822k746R7261l34859
$$ -35866 67561 229236 27762 159815 216679 164888 66650 53828 51082 148343 -186516
1317a86516k740J19378M2989J50813m7525j74930k85880K00861J54873n5254J02844
$$ -186516 -189256 -69878 -26889 123924 76399 -98531 -384411 -183550 -28677 -83931 18913
1306A8913o5246p9310J29154j57667j09255k8114J18604r9751k7016K30975P1257
$$ 18913 -46333 -125643 3511 -154156 -263411 -291525 -172921 -272672 -299688 -68713 2544
1295B544r6453j24449J98871J28893j38483j75629L0004J41485J067P8246j1736
$$ 2544 -93909 -218358 -19487 109406 -29077 -204706 -174702 -33217 -32150 46096 34360
1284C4360J84260m39392P9732Q5326J22242K5744k05498J31596l0086k08921o794
$$ 34360 218620 -220772 -141040 -55714 66528 92272 -113226 18370 -11716 -220637 -227431
1273b27431J97774J8059R9043K73693m3881q5763R8484r0944N188O2232K7417
$$ -227431 -29657 -11598 87445 361138 317257 231494 329978 239034 244222 306454 333871
1262C33871j00060l01635M5989l0397q7923k08945K89527p536Q9120l687N3970
$$ 333871 233811 -67824 -21835 -52232 -140155 -349100 -59573 -67109 22011 18324 72294
1251G2294j86760j07296j45638J70575M89279J32909k66969j96762j65698p9999
$$ 72294 -114466 -221762 -367400 -196825 292454 425363 158394 -38368 -204066 -284065
1241b84065K79468l52198J94230J75434j51664R6022r4811R0204L53836j95459
$$ -284065 -4597 -356795 -162565 12869 -138795 -42773 -137584 -47380 306456 110997
1231A10997P214N3301k57764m3233K36398p5661n7383J37259j27874j06172P2422
$$ 110997 118211 171512 -86252 -129485 106913 31252 -26131 111128 -16746 -122918 -50496
1220e0496J88443j738L2002j29958n113j82936p9625J99196K20974j82567K272
$$ -50496 137947 136209 168211 38253 33140 -149796 -229421 -30225 190749 8182 10454
1209A0454M21K5646Q1944k47412N3949J78097j30089n1679K5560m5683J85660
$$ 10454 10875 36521 118465 -128947 -74998 103099 -26990 -78669 -53109 -98792 86868
1198H6868k00159J99018J98743L9514l7466l9381j64985j9316j67211j45006K87289
$$ 86868 -113291 85727 284470 323984 286518 247137 82152 62836 -104375 -249381 37908
1187C7908J72688j13982J58260k63556j10302o8251j11951K62832J92250L34784
$$ 37908 210596 96614 254874 -8682 -118984 -187235 -299186 -36354 155896 490680
1177D90680l80197l4591n7701k07715l8174k2159K02054n8513J15734j89489J50638
$$ 490680 110483 75892 18191 -189524 -227698 -249857 -47803 -106316 9418 -180071 -29433
1166b9433M08584o3597k01406k03957N7235k9507j87557R7228M074r9639J11452
$$ -29433 379151 315554 114148 -89809 -32574 -62081 -249638 -152410 -148336 -247975 -136523
1155a36523J70814k60674J25825k4874N1951J19923m4248K07641P7901j32930
$$ -136523 34291 -226383 -100558 -125432 -73481 46442 2194 209835 287736 154806
1145A54806L1851p1256j69722l5916k32953O5939J96547o148K94555O0991k69400
$$ 154806 186657 115401 -54321 -90237 -323190 -257251 -60704 -66852 227703 288694 19294
1134A9294k18218J13906J5919l58j76400l2809K03635K20725L05500k24977k13732
$$ 19294 -198924 -85018 -69099 -69457 -245857 -278666 -75031 145694 451194 226217 12485
1123A2485J20152j47192k24049J09466p3291L55600R2807J44933K96443k53321
$$ 12485 132637 -14555 -238604 -129138 -202429 153171 245978 390911 687354 434033
1113D34033j97738k54797k54103k69632l0413O63839J28133J81473k7882j42411
$$ 434033 236295 -18502 -272605 -542237 -572650 91189 219322 400795 372913 230502
1103B30502k49181j26465m7319N770M10601o9600J5098j38347P2560p4568L1947
$$ 230502 -18679 -145144 -192463 -186693 223908 154308 169406 31059 103619 29051 60998
1092F0998j71975j43516J3684J35950J17665J12450M01534j88054l92642o4200
$$ 60998 -110977 -254493 -240809 -104859 12806 125256 526790 338736 -53906 -118106
1082a18106r2055o3320J26680M6411J71474J52575L9662j81445p966L49233j95129
$$ -118106 -210161 -273481 -146801 -100390 71084 223659 263321 81876 73910 423143 228014
1071B28014j83872j73188K14265J33207j68491Q9116Q0030J99195m40808O7976
$$ 228014 44142 -129046 85219 218426 49935 139051 219081 418276 -22532 45444
1061D5444N334j9773M3424k23072R0104J39729j95733Q6257K9305j03745K6342
$$ 45444 50778 31005 74429 -148643 -58539 81190 -114543 -28286 1019 -102726 -76384
1050g6384j38062r8247L39897k7388o0807J13794R5582M2173p256j1110n0047
$$ -76384 -214446 -312693 27204 -184 -60991 52803 148385 190558 183302 172192 122145
1039A22145j72830K38042l8373J14756J32403j86267j58188j22624k6687J47253
$$ 122145 -50685 187357 148984 263740 396143 209876 51688 -70936 -97623 49630
1029D9630k5483j5898J10131k21672J33506Q3570m0018q2860j44493r8462K51724
$$ 49630 24147 8249 118380 -103292 30214 113784 73766 -9094 -153587 -252049 -325
1018c25r259j51148k5539L27668K6343J52194q4600l02764J105J85932P9419J55854
$$ -325 -9584 -160732 -186271 141397 167740 319934 235334 -67430 -66325 119607 199026 354880
1006C54880J7292q9437m10442R3488J15302J01524j2832n6009J74596j0216N1083
$$ 354880 372172 282735 -127707 -34219 81083 182607 169775 113766 288362 278146 329229
995C29229l50269k5847J60036O3344M3673j56113k372j77641j40801K54969n0642
$$ 329229 -21040 -46887 113149 176493 220166 64053 61681 -115960 -256761 -1792 -52434
984e2434R0242J5731q5673l58750J30726L75453L0169j3138l10056k43346Q4522
$$ -52434 37808 53539 -32134 -390884 -260158 115295 145464 132326 -177730 -421076 -336554
973c36554K01038J5785m1067K77232O3779k95461O1535j18107M0124K04844k78677
$$ -336554 -135516 -119731 -160798 116434 180213 -115248 -53713 -171820 -131696 73148 -205529
962b05529L69487j063r6827J44821R8405j46526q2518K24318Q2198m7503j48555
$$ -205529 163958 162895 66068 210889 309294 162768 80250 304568 386766 339263 190708
951A90708j46190r489J19119l13038j42195Q0717J29852J71026J7103J3696K5548
$$ 190708 44518 35029 154148 -158890 -301085 -220368 -90516 80510 97613 111309 136857
940A36857n2829K75082K1896j45357O1k829l03879n9229J97242J14576m2001R525
$$ 136857 84028 359110 381006 235649 235710 232881 -70998 -130227 67015 181591 139590 149115
928A49115j91042k11309J2361q2425J76811J47630o7420p2528j67207O8316J51180
$$ 149115 -41927 -253236 -240875 -323300 -146489 1141 -66279 -138807 -306014 -237698 -86518
917h6518j46728L2589M1566J11149J8495J05962Q1824J0957m1072j26401J28109
$$ -86518 -233246 -200657 -159091 -47942 -29447 76515 158339 169296 128224 1823 129932
906A29932O381l28176L8770Q5285j63075K50913J69042J08689p4415J63664J26727
$$ 129932 136313 -191863 -153093 -67808 -230883 20030 189072 297761 223346 387010 513737
895E13737k39141j51161k53114j27191K05962L4352j8824Q8461r812j24943j52446
$$ 513737 274596 123435 -129679 -256870 -50908 -16556 -35380 53081 43269 -81674 -234120
884b34120J47099R9690P8410r6768j31504j05107J49019J72117k63008M1990J83376
$$ -234120 -87021 12669 91079 -5689 -137193 -242300 -93281 78836 -184172 -142182 41194
873D1194K48627J05139l71013k58109J16467K0296j92468j03507Q4030J90872
$$ 41194 289821 394960 23947 -234162 -117695 -97399 -289867 -393374 -309344 -118472
863a18472K41029R9246j9642r2659j01432j3123J84105j51578R296R2300l89644
$$ -118472 122557 221803 202161 109502 8070 -5053 179052 27474 36770 129070 -260574
852b60574j34164O5590K00526R7754p1325J97165O5020j95492R0819j38393J25909
$$ -260574 -394738 -329148 -128622 -30868 -102193 94972 159992 -35500 55319 -83074 42835
841D2835N1862K65288l37782J32706O7218j04625n1886k35536K02133p2392p1461
$$ 42835 94697 359985 22203 154909 222127 117502 65616 -169920 32213 -40179 -111640
830a11640r5352P9829M915P203o4957L6853p3235K29568Q2055j7540m7757j8730
$$ -111640 -206992 -127163 -122248 -115045 -180002 -143149 -216384 13184 95239 77699 29942 11212
818A1212M3170j0881o6406j66953K08113j71255P3868r3103R7944K4546k14665
$$ 11212 54382 43501 -22905 -189858 18255 -153000 -79132 -172235 -74291 -49745 -264410
807b64410J68137m3029L4678j0872M1481N0957l4632q5514K54788p9345j83341
$$ -264410 -96273 -139302 -104624 -115496 -74015 -23058 -57690 -143204 111584 32239 -151102
796a51102p3637J54662j30336J30835J89096K04624K3196N500r9204k98553J09218
$$ -151102 -224739 -70077 -200413 -69578 119518 324142 347338 352838 253634 -44919 64299
785F4299M7724k71071j23980M20359K19845j44039N6532q6333o3179k82393K2142
$$ 64299 112023 -159048 -283028 137331 357176 213137 269669 183336 120157 -162236 -140094
774a40094K06622O8236L7259p1543q5669k35088J68908P0955j02636K7141J27903
$$ -140094 66528 134764 172023 100480 14811 -220277 -51369 19586 -83050 -55909 71994
763G1994L0403J59557m5323j44167L8091l0831j87839p5384K93267N7687K02797
$$ 71994 102397 261954 216631 72464 110555 79724 -108115 -183499 109768 167455 370252
752C70252j14165r9875J68173k21756L8738j75333J18009o8179j13779L46160
$$ 370252 256087 156212 324385 102629 141367 -33966 84043 15864 -97915 248245
742B48245j59861J26655J0783k41098J78449j44163r5369q9538J63461q0294K5427
$$ 248245 88384 215039 225822 -15276 163173 19010 -76359 -165897 -2436 -82730 -57303
731e7303j49107L38602J80576j51335k48096j27184J29098k3475L635J10282J84620
$$ -57303 -206410 132192 312768 161433 -86663 -213847 -84749 -108224 -104589 5693 190313
720A90313J4072r5007j50017j8996J06152k31171O902J79004Q5920n2770j6359
$$ 190313 204385 109378 -40639 -59635 46517 -184654 -177752 1252 87172 34402 18043
709A8043N6630k59049j28276L0083l4808N6429J76225O338L3259J36347q3400
$$ 18043 74673 -184376 -312652 -282569 -317377 -260948 -84723 -78385 -45126 91221 7821
698G821m9957j09946J01847K39579O9267P6599q3106P8996l7308K2054k27274
$$ 7821 -42136 -152082 -50235 189344 258611 335210 252104 331100 293792 315846 88572
687H8572k40956L16671J13374j89600J47260k02801q1013k58545r7244K59575
$$ 88572 -152384 164287 277661 88061 235321 32520 -48493 -307038 -404282 -144707
677a44707L7786p9420J23864J65063J52584k35177O7231n0991J06035q5987j26055
$$ -144707 -106921 -186341 -62477 102586 255170 19993 87224 36233 142268 56281 -69774
666f9774k9431m524J5230J06498K58733L1942l0819j67831O9512j92110j9250
$$ -69774 -99205 -103729 -88499 17999 276732 308674 277855 110024 179536 -12574 -31824
655c1824k0739m0306J50410M8224j37032M2578J83056l1841j62050j57318J19786
$$ -31824 -52563 -92869 57541 105765 -31267 11311 194367 162526 476 -156842 -37056
644c7056q6656j57922J15649R8341J28306j33725J29764Q639k16714J35770J51840
$$ -37056 -123712 -281634 -165985 -67644 60662 -73063 56701 65340 -151374 -15604 136236
633A36236O4439j33069j3373J69029L6967m6620p8676Q8441r0665k84384j24273
$$ 136236 200675 67606 54233 223262 260229 213609 134933 223374 132709 -151675 -275948
622b75948l3887J58350L1586j3985O8271O0315K52902m2200j95637K4965J09022
$$ -275948 -309835 -151485 -119899 -133884 -65613 -5298 247604 205404 9767 34732 143754
611A43754j21354k28703N1820n0212J37329P4234J5262K8337j74288K09790K98137
$$ 143754 22400 -206303 -154483 -204695 -67366 6868 22130 50467 -123821 85969 384106
600C84106m4823r6562j66389M8939j35360j2811J88417k44196o8066N0083j9480
$$ 384106 339283 242721 76332 125271 -10089 -22900 165517 -78679 -146745 -96662 -116142
589a16142K088q4248O8562q2306J35062J24242p4547L1314l38239q7170K79807
$$ -116142 -114054 -198302 -129740 -212046 -76984 47258 -27289 4025 -334214 -421384 -141577
578a41577J90437k89670Q0043L37811N8159r8303m3166K0884j8426K7181j03417
$$ -141577 48860 -240810 -160767 177044 235203 136900 93734 114618 96192 123373 19956
567A9956q1389Q1092r4468R421j4166J37724K911j263j79280j10595J80300O8055
$$ 19956 -61433 19659 -74809 -65388 -79554 58170 61081 59818 -119462 -230057 -49757 18298
555A8298L0893m8866j83013L34573Q0735q4908k12583j83106R3127J85062o4613
$$ 18298 49191 325 -182688 151885 232620 147712 -64871 -247977 -154850 30212 -34401
544c4401J00586K26871m7431Q3289j89702j3760n1582J8832j02325j83590J48997
$$ -34401 66185 293056 245625 328914 139212 125452 73870 92702 -9623 -193213 -44216
533d4216K12125k42347J52312k03949o9939J32430n825L2489j21500l01437K13030
$$ -44216 167909 -74438 77874 -126075 -196014 -63584 -69409 -36920 -158420 -459857 -246827
522b46827N23776J22118J36579l35255l14966j37946K13291O3738j9111K84457
$$ -246827 276949 399067 535646 200391 -114575 -252521 -39230 24508 5397 289854
512B89854j06841l2217o2526k11927R4903q5298J13318m8844M0751K02289j37833
$$ 289854 183013 150796 88270 -123657 -28754 -114052 -734 -49578 -8827 193462 55629
501E5629J30209M0348J5191q6212j74630k3877o7919R8563P0298j05242P7250
$$ 55629 185838 226186 241377 155165 -19465 -43342 -111261 -12698 57600 -47642 29608
490B9608K62991j83556j44481j2113N2911J61489J786p5950J16109k16298k6287
$$ 29608 292599 109043 -35438 -47551 5360 166849 168635 92685 208794 -7504 -33791
479c3791l9204K8294M8924K8206N4292l62726j6142J62466L25250k31450j10866
$$ -33791 -72995 -44701 4223 32429 86721 -276005 -292147 -129681 195569 -35881 -146747
468a46747j7582J9258J09619j36610m6500M5362K71811K32145k04171j51961L1471
$$ -146747 -164329 -145071 -35452 -172062 -218562 -173200 98611 330756 126585 -25376 6095
457F095O4592J50270J51574O6494j70106j75569L08637j55483L4165K2294j86960
$$ 6095 70687 220957 372531 439025 268919 93350 401987 246504 280669 302963 116003
446A16003r4451K416K72111k32090j37362J47071J63550j22726k46513K7462J49644
$$ 116003 21552 23968 296079 63989 -73373 73698 237248 114522 -131991 -104529 45115
435D5115J426j56780K12853K839R7579p2870r2391j69497J29425l5206M5094J96897
$$ 45115 46541 -110239 102614 105453 203032 130162 37771 -131726 -2301 -37507 7587 204484
423B04484l9657J74237r9237j06303j38503J63301R9217k26576J17542K02074
$$ 204484 164827 339064 239827 133524 -4979 158322 257539 30963 148505 350579
413C50579j784r2417j22982j4096j00646J50606o806l42657n52Q1936O2154J90031
$$ 350579 348795 256378 133396 119300 18654 169260 162454 -180203 -180755 -98819 -36665 153366
401A53366P0205j04745R4131k4381j45553J56225j83672Q6427K25167j81815j00312
$$ 153366 223571 118826 212957 188576 43023 199248 15576 102003 327170 145355 45043
390D5043N5962j03033q9724J44480M1441k13097j34847J56754R9550J2469j39685
$$ 45043 101005 -2028 -91752 52728 94169 -118928 -253775 -97021 2529 14998 -124687
379a24687q5961K66406n8801J32590n9890l6556K74260j42333j19971J68400J04362
$$ -124687 -210648 55758 -3043 129547 69657 33101 307361 165028 45057 213457 317819
368C17819j16015j23081j61830m7954J66662J41072L56250k64538j05769J47698
$$ 317819 201804 78723 -83107 -131061 35601 176673 532923 268385 162616 310314
358C10314J97472o3155j09605m06455n0403J1777Q451J39601P2592q5702m9612
$$ 310314 507786 444631 335026 -71429 -121832 -110055 -101604 37997 110589 24887 -24725
347b4725J04990k40198J23227M0872j24274r2532O7143K0583o152J36213p2701
$$ -24725 80265 -159933 -36706 4166 -120108 -212640 -145497 -124914 -131066 5147 -67554
336f7554L44195L1968k61221J48065m931j31544r3091J19633K59759N9986k32804
$$ -67554 276641 308609 47388 195453 190522 58978 -34113 85520 345279 405265 172461
325A72461j57565r5460M1851n0507L8805N7356K03537J1859N5512j52663m2965
$$ 172461 14896 -80564 -38713 -89220 -50415 6941 210478 222337 277849 125186 82221
314H2221J6604j48243o9126K88659J00516r5455J55986r7075k87262l50539K2518
$$ 82221 98825 -49418 -118544 170115 270631 175176 331162 234087 -53175 -403714 -381196
303c81196J72608O3662o1188K85183M842j35383J65175k95465J88361N1983k40688
$$ -381196 -208588 -144926 -206114 79069 83911 -51472 113703 -181762 6599 58582 -182106
292a82106K04468n2055k5650J59906n6922R2396r647R4046o6614L4154P7959J34812
$$ -182106 22362 -29693 -55343 104563 47641 140037 130390 224436 157822 191976 269935 404747
280D04747o9541J30751j53757l19319P3758K05657r715m82351k8737L9323J47137
$$ 404747 335206 465957 312200 -7119 66639 272296 262581 -219770 -248507 -209184 -62047
269f2047J67703P5608O5667o941j14867M1355j0956j21904o2594L942J29102K3570
$$ -62047 105656 181264 246931 239990 125123 166478 155522 33618 -28976 -25034 104068 127638
257A27638J92845K8921l7966j17815q356k25878k44948N0935J86631n0191K3643
$$ 127638 320483 349404 311438 193623 185267 -40611 -285559 -234624 -47993 -98184 -74541
246g4541K31827N1913j34821o0982M3370j46505O8944j44863K3072J13343K71108
$$ -74541 157286 209199 74378 13396 56766 -89739 -20795 -165658 -142586 -29243 241865
235B41865p4295k20816J91178j32127j12936L5905R6604K05641m1007j25980J47246
$$ 241865 167570 -53246 137932 5805 -107131 -71226 25378 231019 190012 64032 211278
224B11278K12864k12699n0907J61697K4130o8876q9842N6112J06045N0845k1135
$$ 211278 424142 211443 160536 322233 346363 277487 187645 243757 349802 400647 379512
213C79512L3740k75178j17054K5320P0931K18648K0414l82189q7708P3484J57626
$$ 379512 413252 138074 21020 46340 117271 335919 356333 -25856 -113564 -40080 117546
202A17546J12712j56850n9988j33J13778o063O0865j05723k39675j78958J25389
$$ 117546 230258 73408 13420 13287 127065 121002 181867 76144 -163531 -342489 -217100
191b17100L7584M605L17109J04595j74925j2806l44287Q7499k6883m939J61950
$$ -217100 -179516 -174911 142198 246793 71868 59062 -285225 -197726 -224609 -229548 -67598
180f7598K31746p1868j89764M7390N0321j2006J91306j57447J84809j22223q8225
$$ -67598 164148 92280 -97484 -50094 227 -11779 179527 22080 206889 84666 -3559
169c559l8621J082J271J2928O4657J32255K90027j09750q8012k6996N2279k32942
$$ -3559 -42180 -41098 -39827 -26899 37758 170013 460040 350290 262278 235282 287561 54619
157E4619j7302o5185J23202o9359O7902J16602j48774k14291P9837J33615J79952
$$ 54619 37317 -27868 95334 25975 93877 210479 61705 -152586 -72749 60866 240818
146B40818m8653k2938K065P474j39110j84214J56885J88389J7802J23206j51956
$$ 240818 192165 169227 171292 178766 39656 -144558 12327 200716 218518 341724 189768
135A89768j63863J07564n1468R0409Q3568o7798J12233r1898k47004L06695j22250
$$ 189768 25905 133469 82001 172410 255978 188180 300413 208515 -38489 268206 145956
124A45956k21833J71543q148O375n1560R5487M2874k5733J09110l7218l00641
$$ 145956 -75877 95666 87518 93893 42333 137820 180694 154961 264071 226853 -73788
113g3788J3949j02659r304K36968K50666r5736k30587R1745n2501l4562J7535
$$ -73788 -59839 -162498 -171802 65166 315832 220096 -10491 81254 28753 -5809 11726
102A1726L5884K2007n266P0460o0096j817K5694J36925J6126k21393r2148J89802
$$ 11726 47610 69617 64351 134811 74715 72898 98592 235517 251643 30250 -61898 127904
90A27904j5113R7150j27108Q0343r8996m1235L05793j82506n9175k1210r6348
$$ 127904 112791 209941 82833 163176 64180 22945 328738 146232 87057 65847 -30501
79c0501K27116m7551r8802m7893J61367J8066q4376J80787r0707j51102K6264
$$ -30501 196615 149064 50262 2369 163736 181802 97426 278213 187506 36404 62668
68F2668j6754J14904J68533k5888j31117r42j42865k14399K35326J08599q9651
$$ 62668 45914 160818 329351 303463 172346 171404 28539 -185860 49466 158065 68414
57F8414O3815J20931p2736J38271N3340k26733p7034K46782k7665r2701l05855
$$ 68414 132229 253160 180424 318695 372035 145302 68268 315050 287385 194684 -111171
46a11171k24028R3465L77185L6949r9217N0264P6404K3982M2611p5890j654j50693
$$ -111171 -335199 -241734 135451 172400 73183 123447 199851 223833 266444 190554 188900 38207
34C8207q3797J35820j5545p1993J1044n3790N0917j87524K765J72976J4089j18034
$$ 38207 -45590 90230 74685 2692 13736 -40054 10863 -176661 -173896 -920 13169 -104865
22a04865N263K18897K84396k04101q3587j11784p0930J27345r951n5012J17221
$$ -104865 -99602 119295 403691 199590 116003 4219 -66711 60634 50683 -4329 112892
11A12892J67609L9894j19935J894k1313N6566N1105p8537j38322p3028K30098
$$ 112892 280501 320395 200460 202354 181041 237607 288712 210175 71853 -1175 228923
$$ [...]
##END NTUPLES=NMR SPECTRUM
##END=
