##TITLE=1H_TG-2412-X
 200.13Hz, DMSO+CCl4.
 8 sc
4.8.2026
##JCAMPDX= 6.0         $$ Bruker NMR JCAMP-DX V2.0
##DATA TYPE= NMR SPECTRUM
##DATA CLASS= NTUPLES
##ORIGIN= UXNMR, Bruker Analytische Messtechnik GmbH
##OWNER= pz
$$ XWIN-NMR		Version 3.5
$$ Tue Aug  4 13:18:17 2026 Russian Standard Time (UT+4h)  she@DPX200
##.OBSERVE FREQUENCY= 200.1313
##.OBSERVE NUCLEUS= ^1H
##.ACQUISITION MODE= SIMULTANEOUS
##.ACQUISITION SCHEME= undefined
##.AVERAGES= 8
##.DIGITISER RES= 18
##SPECTROMETER/DATA SYSTEM= spect
##.PULSE SEQUENCE= zg30
##.SOLVENT NAME= DMSO
##.SHIFT REFERENCE= (INTERNAL, DMSO, 0, 15.5034)
##AUDIT TRAIL= $$ (NUMBER, WHEN, WHO, WHERE, WHAT)
$$ ##TITLE= Audit trail, XWIN-NMR		Version 3.5
$$ ##JCAMPDX= 5.01
$$ ##ORIGIN= Bruker BioSpin GmbH
$$ ##OWNER= she
$$ F:/spectra/data/she/nmr/H-C/1/pdata/1/auditp.txt
$$ ##AUDIT TRAIL=  $$ (NUMBER, WHEN, WHO, WHERE, WHAT)
(   1,<2026-08-04 13:17:00.43 +0400>,<she>,<DPX200>,
      <created by zg, POWCHK disabled, PULCHK disabled
       configuration hash MD5:
       00 E9 B6 7A A2 85 ED C7 34 08 36 98 17 FE 4E 26
       data hash MD5: 16K
       45 86 4A 27 13 26 A1 FE 8C F9 5D 8E 2D 1B C4 B2>)
(   2,<2026-08-04 13:17:02.78 +0400>,<she>,<DPX200>,
      <Start of raw data processing
       efp BC_mod = 2 LB = 0.25 FT_mod = 6 PKNL = 1 PHC0 = -4226.115 PHC1 = 18.7923 SI = 16K 
       data hash MD5: 16K
       F0 29 F2 DB D9 EB 3A D8 F8 D1 9D 70 09 0B A1 4E>)
(   3,<2026-08-04 13:17:33.17 +0400>,<she>,<DPX200>,
      <pk PHC0 = 11.27488 PHC1 = -14.2 
       data hash MD5: 16K
       DD 32 02 F0 4A 82 50 03 36 B6 7F EF B8 4B 30 BA>)
(   4,<2026-08-04 13:17:36.42 +0400>,<she>,<DPX200>,
      <abs ABSG = 5 
       data hash MD5: 16K
       85 72 59 B2 68 66 FF 1D A5 35 D4 DC 04 F7 76 8F>)
$$ ##END=
$$ 
$$ hash MD5
$$ B9 C0 37 79 F1 04 FE 75 B5 E5 14 01 91 9D 3A 22
##$RELAX= 
##$RELAX= 
##$RELAX= 
##$RELAX= 
##$RELAX= 
##$RELAX= 
$$ Bruker specific parameters
$$ --------------------------
##$DU= <F:/spectra>
##$EXPNO= 1
##$NAME= <H-C>
##$PROCNO= 1
##$TYPE= <nmr>
##$USER= <she>
##$AMP= (0..31)
100 100 100 100 100 100 100 100 100 100 100 100 100 100 100 100 100 100 
100 100 100 100 100 100 100 100 100 100 100 100 100 100 
##$AQSEQ= 0
##$AQ_mod= 1
##$AUNM= <au_zg>
##$AUTOPOS= <>
##$BF1= 200.13
##$BF2= 200.13
##$BF3= 200.13
##$BF4= 200.13
##$BF5= 200.13
##$BF6= 200.13
##$BF7= 200.13
##$BF8= 200.13
##$BYTORDA= 1
##$CFDGTYP= 0
##$CFRGTYP= 5
##$CHEMSTR= <none>
##$CNST= (0..31)
1 1 145 1 1 1 1 1 1 1 1 1 1 1 1 1 1 1 1 1 1 1 1 1 1 1 1 1 1 1 1 1 
##$CPDPRG= <>
##$CPDPRG1= <>
##$CPDPRG2= <>
##$CPDPRG3= <>
##$CPDPRG4= <mlev>
##$CPDPRG5= <mlev>
##$CPDPRG6= <mlev>
##$CPDPRG7= <mlev>
##$CPDPRG8= <mlev>
##$CPDPRGB= <>
##$CPDPRGT= <>
##$D= (0..31)
0 0.7 0 0 0 0 0 0 0 0 0 0.03 0 0 0 0 0 0 0 0 0 0 0 0 0 0 0 0 0 0 0 0 
##$DATE= 1785835019
##$DBL= (0..7)
120 120 120 120 120 120 120 120 
##$DBP= (0..7)
150 150 150 150 150 150 150 150 
##$DBP07= 0
##$DBPNAM0= <>
##$DBPNAM1= <>
##$DBPNAM2= <>
##$DBPNAM3= <>
##$DBPNAM4= <>
##$DBPNAM5= <>
$$ [...]
##$SUBNAM3= <"">
##$SUBNAM4= <"">
##$SUBNAM5= <"">
##$SUBNAM6= <"">
##$SUBNAM7= <"">
##$SUBNAM8= <"">
##$SUBNAM9= <"">
##$SW= 18.0517328524113
##$SWIBOX= (0..15)
0 0 2 0 0 0 0 0 0 0 0 0 0 0 0 0 
##$SW_h= 3612.71676300578
##$TD= 16384
##$TD0= 1
##$TE= 0
##$TE2= 300
##$TE3= 300
##$TEG= 300
##$TL= (0..7)
0 120 120 120 120 120 120 120 
##$TP= (0..7)
150 150 150 150 150 150 150 150 
##$TP07= 0
##$TPNAME0= <>
##$TPNAME1= <>
##$TPNAME2= <>
##$TPNAME3= <>
##$TPNAME4= <>
##$TPNAME5= <>
##$TPNAME6= <>
##$TPNAME7= <>
##$TPOAL= (0..7)
0.5 0.5 0.5 0.5 0.5 0.5 0.5 0.5 
##$TPOFFS= (0..7)
0 0 0 0 0 0 0 0 
##$TUNHIN= 0
##$TUNHOUT= 0
##$TUNXOUT= 0
##$USERA1= <user>
##$USERA2= <user>
##$USERA3= <user>
##$USERA4= <user>
##$USERA5= <user>
##$V9= 5
##$VALIST= <valist>
##$VCLIST= <CCCCCCCCCCCCCCC>
##$VD= 0
##$VDLIST= <DDDDDDDDDDDDDDD>
##$VPLIST= <PPPPPPPPPPPPPPP>
##$VTLIST= <TTTTTTTTTTTTTTT>
##$WBST= 1024
##$WBSW= 4
##$XGAIN= (0..3)
0 0 0 0 
##$XL= 0
##$YL= 0
##$YMAX_a= 168334
##$YMIN_a= -168592
##$ZGOPTNS= <>
##$ZL1= 120
##$ZL2= 120
##$ZL3= 120
##$ZL4= 120
##$ABSF1= 15.50229
##$ABSF2= -2.54956
##$ABSG= 5
##$ABSL= 3
##$ALPHA= 0
##$AQORDER= 0
##$ASSFAC= 0
##$ASSFACI= 0
##$ASSFACX= 0
##$ASSWID= 0
##$AUNMP= <proc_1d>
##$AZFE= 0.1
##$AZFW= 0.1
##$BCFW= 0
##$BC_mod= 2
##$BYTORDP= 0
##$COROFFS= 0
##$CY= -3
##$DATMOD= 1
##$DC= 0
##$DFILT= <>
##$DTYPP= 0
##$F1P= 0
##$F2P= 0
##$FCOR= 1
##$FTSIZE= 16384
##$FT_mod= 6
##$GAMMA= 0
##$GB= 0
##$INTBC= 1
##$INTSCL= 3.241238e-09
##$ISEN= 128
##$LB= 0.25
##$LEV0= 0
##$LPBIN= 0
##$MAXI= 10000
##$MC2= 0
##$MEAN= 0
##$ME_mod= 0
##$MI= 1.114404
##$NCOEF= 0
##$NC_proc= -8
##$NLEV= 6
##$NOISF1= 3.799351
##$NOISF2= 2.8
##$NSP= 0
##$NTH_PI= 0
##$NZP= 0
##$OFFSET= 15.50339
##$PC= 1
##$PHC0= -4214.84
##$PHC1= 4.592299
##$PH_mod= 1
##$PKNL= yes
##$PPARMOD= 0
##$PSCAL= 0
##$PSIGN= 0
##$REVERSE= no
##$SF= 200.130003664531
##$SI= 16384
##$SIGF1= 3
##$SIGF2= 2
##$SINO= 0.751879
##$SIOLD= 32768
##$SREGLST= <19F.Aceton>
##$SSB= 0
##$STSI= 16384
##$STSR= 0
##$SW_p= 3612.71676300578
##$SYMM= 0
##$S_DEV= 0
##$TDeff= 16384
##$TDoff= 0
##$TI= <>
##$TILT= no
##$TM1= 0
##$TM2= 0
##$TOPLEV= 0
##$USERP1= <user>
##$USERP2= <user>
##$USERP3= <user>
##$USERP4= <user>
##$USERP5= <user>
##$WDW= 1
##$XDIM= 16384
##$YMAX_p= 498065383
##$YMIN_p= -1616340
$$ End of Bruker specific parameters
$$ ---------------------------------
##NTUPLES= NMR SPECTRUM
##VAR_NAME=  FREQUENCY,     SPECTRUM/REAL,   SPECTRUM/IMAG
##SYMBOL=    X,             R,               I
##VAR_TYPE=  INDEPENDENT,   DEPENDENT,       DEPENDENT
##VAR_FORM=  AFFN,          ASDF,            ASDF
##VAR_DIM=   16384,         16384,           16384
##UNITS=     HZ,            ARBITRARY UNITS, ARBITRARY UNITS
##FACTOR=    0.220516191357247, 1,           1
##FIRST=     3102.6935599922, 0,             0
##LAST=      -510.023203013576, 0,           0
##MIN=       -510.023203013576, -1616340,    0
##MAX=       3102.6935599922, 498065383,     0
$$ Real data points
##PAGE= N=1
##DATA TABLE= (X++(R..R)), XYDATA
$$ [...]
5078A2752771J7405l69446n2122m29132k82282J74341N91936n87166n92303J00316
5068A1324318j23777P6301K92561n0724l84440m8168J27768J85694o13976J47763
5058A0933320l26894J14596k76598q6410j92795m79034r0794L49645N178k99914
5048I650300m00937j02488K36207l45682j16493L44649J39376n35404l93878K83781
5038H759431L47702m52942k23384l52274l82208M51435q8288j33189P4479j98858
5028G801904K41351m11193j81276m78561j0155Q3282L45537Q7701k83949j17007
5018G077634O023L63677p8226k83908l30976k63512N16598p5754L12353L60383
5008G604292k18553l15864j71428J58258J44009j43956l62682R0367O30223N03381
$$ y = [12752771, 12770176, 12400730, 12348608, 11919476, 11637194, 11811535, 12403471, 11816305, 11224002, 11324318, 11200541, 11276842, 11569403, 11518679, 11134239, 11086071, 11213839, 11399533, 10785557, 10933320, 10606426, 10721022, 10444424, 10358014, 10165219, 9686185, 9595391, 9945036, 9950214, 9650300, 9249363, 9146875, 9383082, 9037400, 8920907, 9265556, 9404932, 8869528, 8475650, 8759431, 9107133, 8654191, 8430807, 8078533, 7696325, 8147760, 8059472, 7926283, 8000762, 7801904, 8043255, 7632062, 7450786, 6972225, 6962070, 7045352, 7390889, 7478590, 7194641, 7077634, 7083657, 7447334, 7369108, 7085200, 6754224, 6490712, 7007310, 6931556, 7243909, 7604292, 7385739, 7069875, 6898447, 7056705, 7200714, 7056758, 6694076, 6784443, 7414666, 7918047]
4998G918047m78276K79210P39525L42193J56147N45102R12257k75720k29917j23677
4988I784891M23792M30065j62166n97835m41390r7580m49643p04612q54374k64802
4978G066346M81480j47196q50037l6201r6888K43264m00368l68194j51835j96592
4968E543779O6649j51962R8201j37670K05110l87266J86044M79871o3100m61686
4958E377970j79856K46247J96134j95344k40001k74072M2482P32758p04854p4275
4948D927189l5482k45344L9862q6414j26776k73865J11876K46306N17485K76722
4938E351559m99985k20896p0381r01490N41295L97567n49559N50651J20655L04940
4928E024356l54228m2868j52065l99148J22589K5131j76769J01053J97772O08892
$$ y = [7918047, 7439771, 7718981, 8458506, 8800699, 8956846, 9501948, 10414205, 10138485, 9908568, 9784891, 10208683, 10638748, 10476582, 9878747, 9437357, 9339777, 8890134, 8185522, 7331148, 7066346, 7547826, 7400630, 6550593, 6514392, 6417504, 6660768, 6260400, 5892206, 5740371, 5543779, 5610428, 5458466, 5556667, 5418997, 5624107, 5236841, 5422885, 5902756, 5839656, 5377970, 5198114, 5444361, 5640495, 5445151, 5205150, 4931078, 4973560, 5706318, 5001464, 4927189, 4891707, 4646363, 4686225, 4599811, 4473035, 4199170, 4311046, 4557352, 5074837, 5351559, 4851574, 4630678, 4560297, 3658807, 4200102, 4597669, 4048110, 4598761, 4719416, 5024356, 4670128, 4627260, 4475195, 4076047, 4198636, 4223767, 4046998, 4148051, 4345823, 4954715]
4918D954715N73707o36020r4259J03738l03712K19450l34193L23274M02041J316
4908E210057j35909M5127l8982k24269M32218p2818j2718O29826l33734j15868
4898E382930L89385k73P00838L37391m31694k34085k64525M9644N48435m13015
4888F065031j14715r1724n32288M36819J36619R3853L21330J57407q0877q9325
4878F302130J94882K1739J40484P0444O90445j36704n13185K2861K73011P69712
4868G835819R5605o58438l8346j72982p7129P78142N37348M01994K15524K40929
4858I158466M66275n2331M4558K80026M37067M02672R90135Q98622P52794M76899
4848A3855183L50145N87294J13100L18940P68903O59520L9013j33327J74716P77580
$$ y = [4954715, 5528422, 4892402, 4798143, 4901881, 4598169, 4817619, 4483426, 4806700, 5208741, 5210057, 5074148, 5119275, 5080293, 4856024, 5288242, 5215424, 5202706, 5832532, 5498798, 5382930, 5772315, 5772042, 6472880, 6810271, 6378577, 6144492, 5879967, 5929611, 6478046, 6065031, 5950316, 5858592, 5326304, 5763123, 5899742, 5993595, 6314925, 6472332, 6391455, 6302130, 6497012, 6518751, 6659235, 6729679, 7420124, 7283420, 6770235, 6793096, 7066107, 7835819, 7931424, 7272986, 7234640, 7061658, 6984529, 7762671, 8300019, 8702013, 8917537, 9158466, 9624741, 9572410, 9616968, 9896994, 10334061, 10736733, 11726868, 12625490, 13378284, 13855183, 14205328, 14792622, 14905722, 15224662, 15993565, 16653085, 16692098, 16558771, 16733487, 17511067]
4838A7511067M03405O05707K92172N94025J136813J708794J640622J558258K375630
4829B7826493L340219L989287O685645J0015149J2465633J6955013J4438598P682279
4821A03398316L092383K070296M09261q22743k13286l297312n629281p197213
4813I1810421q498510p317318n093056l518732k516307j770950j588960j273657
4805F0232931j280675j50888M58344P16603O97554N92552O25814O28278J362597
4796F3883110O20996J236305J645647J398767J177306J580403R36510Q80860J259673
4787G4619577N75763J186471O58698o2528L2028M54854o15832n34721m25466p29311
4777G5159533m05933p02419r29413j085566p28618p19441j640308j215577p83935
$$ y = [17511067, 17914472, 18520179, 18812351, 19406376, 20543189, 22251983, 23892605, 25450863, 27826493, 31166712, 35155999, 41841644, 51856793, 64322426, 81277439, 95716037, 103398316, 106490699, 108560995, 108970256, 108147513, 107934227, 104636915, 99007634, 91810421, 83311911, 75994593, 70901537, 67382805, 64866498, 63095548, 61506588, 60232931, 58952256, 58801368, 59259712, 59976315, 60673869, 61266421, 61892235, 62520513, 63883110, 64504106, 65740411, 67386058, 68784825, 69962131, 71542534, 72479044, 73359904, 74619577, 75195340, 76381811, 77040509, 76977981, 77010009, 77464863, 76849031, 76314310, 75888844, 75159533, 74753600, 74051181, 73121768, 72036202, 71307584, 70588143, 68947835, 67732258, 66948323]
4768F6948323r72225j331750j420839j425622j125104p56772j551434j922867
4760E6441710r51429j400468j488244r54288j734559j463427j165863j273290
4752D6010142p67529j729791j799844j099444j506960n5509r50107j045387m74893
4743C6580678o85677q78555p81235l39292n42622p11670j33254K78192m03058
4734C2383507J14209L50859j15209K98654O05687K54713M83442P43343N54346
4725C5673551R46565Q35810M11706R15704J451731J368258J376145J657301N27312
4716D5164083P25207J296129J312954J086743J983446Q45614J160541J470138
4708E5044855J060453J818362J449411J115990J235444J358949J619123J220421
$$ y = [66948323, 65976098, 64644348, 63223509, 61797887, 60672783, 59916011, 58364577, 56441710, 55490281, 54089813, 52601569, 51647281, 49912722, 48449295, 47283432, 46010142, 45242613, 43512822, 41712978, 40613534, 39106574, 39051065, 38100958, 37055571, 36580678, 35895001, 35016446, 34235211, 33895919, 33353297, 32641627, 32508373, 32786565, 32383507, 32497716, 32848575, 32733366, 33032020, 33637707, 33892420, 34375862, 35119205, 35673551, 36620116, 37455926, 37867632, 38783336, 40235067, 41603325, 42979470, 44636771, 45164083, 45889290, 47185419, 48498373, 49585116, 51568562, 52414176, 53574717, 55044855, 56105308, 57923670, 59373081, 60489071, 61724515, 63083464, 64702587, 65923008]
4700F5923008Q96636J435908J377462J609194J369843J123762J312409J369927
4692G6418149M61748O41985J49129M33091n81567M13989j33874m83050q32769
4683G6486831p82011o85662j171707j239410k043768j481439j119402k164361
4675F5799071j433508j594637j313219j104732j342923j543857j499382j213816
4667E4752997j179769j580301j896631r78405j270451j415432j171258j103359
4659D4157391j330888j381491j380927q85333j577402j488393q72673j119720
4651C4120564j675679o03452j119765q75901j500862j342125r01615j097788n53853
4642B4449524N1685q85169m86560o41046o87013r4349j16458j16300L42148N52857
$$ y = [65923008, 66819644, 68255552, 69633014, 71242208, 72612051, 73735813, 75048222, 76418149, 76879897, 77521882, 77671011, 78104102, 77522535, 77936524, 77802650, 77319600, 76486831, 75704820, 75019158, 73847451, 72608041, 70564273, 69082834, 67963432, 65799071, 64365563, 62770926, 61457707, 60352975, 59010052, 57466195, 55966813, 54752997, 53573228, 51992927, 50096296, 49117891, 47847440, 46432008, 45260750, 44157391, 42826503, 41445012, 40064085, 39178752, 37601350, 36112957, 35240284, 34120564, 32444885, 31841433, 30721668, 29845767, 28344905, 27002780, 26101165, 25003377, 24449524, 24501209, 23616040, 23129480, 22488434, 21801421, 21707072, 21590614, 21474314, 21816462, 22369319]
4632B2369319Q5131J900246L182854M913859M137778K909560J879560O15021M72982
4623D2466310k2848r04808j272077k139294k028606k542328k260049j361985j052283
4614B8882032K48673P46156J385707J832746K574895J890455J908343K331047
4606D1800054K610873K998354L775807M636302M622580L447603K565861K908692
4598F9366126K790040K696921L180218M481074L961966L057348J912837Q6736
4590I1533266j68033K68303j02526l52161m55818j145260j869988l673517l416780
4581H0617486l102137k565294l122628l158206l151416m000046l884270l698232
4573E3935257m158522l686004l309153l736720l193577l077635l070506l006467
$$ y = [22369319, 22454450, 24354696, 27537550, 32451409, 36589187, 39498747, 41378307, 41993328, 42466310, 42443462, 41538654, 40266577, 38127283, 36098677, 33556349, 31296300, 29934315, 28882032, 29130705, 29876861, 31262568, 33095314, 35670209, 37560664, 39469007, 41800054, 44410927, 47409281, 51185088, 55821390, 60443970, 63891573, 66457434, 69366126, 72156166, 74853087, 78033305, 82514379, 86476345, 89533693, 91446530, 91533266, 91365233, 91633536, 91531010, 91178849, 90723031, 89577771, 87707783, 84034266, 80617486, 77515349, 74950055, 71827427, 68669221, 65517805, 61517759, 57633489, 53935257, 49776735, 46090731, 42781578, 39044858, 35851281, 32773646, 29703140, 26696673]
4565B6696673k893291k428665j240295j348233j507851j258655o97425m32947
4557A4889311n77206q52541q42077n70654l96758r3310K6984j94108j5693k10431
4547A1163517J6372j56587j75101l95914k24220o20130n30922j4803j0151j89978
4537H862083l03510q2974M14556n16970q93787l27139K74349L25526m74507p11401
4527F566226j73396K03534n78282L27544L87657j31462m59321m90579J18048N14290
4517F284259K34710l31898j69021P07888j88669n23084m25016J27237j46138k18035
4507E352233L2092j55000K35617K85071m13284l10413P1541j8479L7180R9802
4497E216360l38610o1436j02103q6234k88296K92375P54101K74476N3508o06629
$$ y = [26696673, 23803382, 21374717, 20134422, 18786189, 17278338, 16019683, 15322258, 14889311, 14312105, 13459564, 12617487, 12046833, 11650075, 11556765, 11583749, 11389641, 11373948, 11163517, 11179889, 11023302, 10848201, 10452287, 10228067, 9607937, 9077015, 9062212, 9052061, 8862083, 8558573, 8475599, 8890155, 8373185, 7479398, 7152259, 7426608, 7752134, 7277627, 6566226, 6392830, 6596364, 6018082, 6345626, 6733283, 6601821, 6142500, 5651921, 5769969, 6284259, 6518969, 6187071, 6018050, 6725938, 6537269, 6014185, 5589169, 5716406, 5570268, 5352233, 5384325, 5229325, 5464942, 5750013, 5336729, 5026316, 5097857, 5079378, 5116558, 5216360, 4877750, 4816314, 4714211, 4627977, 4339681, 4632056, 5386157, 5660633, 5714141, 5107512]
4487E107512m47844n03228K23096k0946K98827j4449J3839n8726K35285n99597
4477D233769K62767O57523j12358j13583k53006n99178J56939L65793J6711j62258
4467D453119K09184O41300Q2168j7643n75052l7123M87454k65821M3506M03297
4457E424389j23691L3432k60018o5746n3258K02722K70749p01733o66867K47694
4447D307673N73153L14900L00748P9087M5929J83766N66916M60557L16961P14525
4437G864215Q31996J057088N88297P16642K37675K38595N91829k67234l04843
4428A1554260l3913m66644m08294l78800n40019p21304q20731J82171j33186m79555
4418G753985J81094J23075m97449l29795Q33521m13621m15311L10652M12576L24575
$$ y = [5107512, 4659668, 4156440, 4379536, 4358590, 4657417, 4642968, 4656807, 4598081, 4833366, 4233769, 4496536, 5154059, 5041701, 4928118, 4675112, 4075934, 4232873, 4598666, 4615377, 4453119, 4662303, 5303603, 5385771, 5368128, 4793076, 4755953, 5243407, 4977586, 5021092, 5424389, 5300698, 5334130, 5074112, 5008366, 4955108, 5157830, 5428579, 4726846, 4059979, 4307673, 4880826, 5195726, 5496474, 5575561, 5621490, 5805256, 6372172, 6832729, 7149690, 7864215, 8696211, 9753299, 10341596, 11058238, 11295913, 11534508, 12126337, 11859103, 11554260, 11520347, 11053703, 10645409, 10266609, 9726590, 9005286, 8184555, 8366726, 8233540, 7753985, 7935079, 8058154, 7560705, 7230910, 8064431, 7650810, 7235499, 7546151, 7958727, 8283302]
4408H283302J74307M86947M28390N5143j34759Q6090O11499K78237K18590P62187
4398A1249933L53431J30364j7018J127497J130541P90062J12566J77234R25832
4389A5980442Q19106N65736J201580J037520J74238R05113J188888P10517P93411
4380B3376551N42979R41422Q23058P16580J052806L64573P77937R79014Q02767
4371C0377687Q73143P15849Q290M41001O85158M52334J77914p3804M53214K94591
4361C4405377o28782M91303M10538K09866p49227l21123q5691O402m69626l96310
4351C2872727m41460j86516q87644q11581m75367p56437j5307j206840r10660
4342B7180915o34760p60480q72614j034787m38768q15410j074346j010278r49511
$$ y = [8283302, 8457609, 8944556, 9372946, 9428089, 9293330, 9379420, 9990919, 10269156, 10487746, 11249933, 11603364, 11733728, 11716710, 12844207, 13974748, 14764810, 14877376, 15054610, 15980442, 16799548, 17365284, 18566864, 19604384, 19778622, 20683735, 21872623, 22583140, 23376551, 23919530, 24860952, 25684010, 26400590, 27453396, 27817969, 28595906, 29574920, 30377687, 31250830, 31966679, 31974969, 32415970, 33101128, 33553462, 33731376, 33657572, 34110786, 34405377, 33776595, 34267898, 34678436, 34888302, 34139075, 33817952, 33732261, 33738663, 33269037, 32872727, 32431267, 32244751, 31357107, 30545526, 30070159, 29313722, 29298415, 28091575, 27180915, 26546155, 25785675, 24913061, 23878274, 23439506, 22624096, 21549750, 20539472, 19589961]
4333A9589961n64065o83129n39681r37434j024421m22762j63954q23235o30816
4324A3800464m98705o71252p02495q5310l89930Q2523m04740j004085M332L95912
4314A0526714n65074j0569j46924O7209l27338p78651n33689l73138j23673j47638
4304G587229P48064K71357l60095K23001K9110l46806k671l8435j27795m32466
4294G550493N6229k79633l37673o0072N96668m77301j87035l27278o8818O1367
4284F526947L68422k35757k47921K26477j16494N96277j97789k56563j93159p1328
4274F399112j81417N29710K97417k47018L43813K08399n42492K34001k25838k2490
4264F793197l05393K24569Q9840L03728l22327N7232L94327l09463m61407L9242
$$ y = [19589961, 19025896, 18342767, 17803086, 16865652, 15841231, 15418469, 15254515, 14431280, 13800464, 13301759, 12630507, 11928012, 11842702, 11452772, 11535295, 11130555, 10126470, 10130802, 10526714, 9961640, 9951071, 9804147, 9871356, 9544018, 8765367, 8231678, 7858540, 7734867, 7587229, 8335293, 8606650, 8246555, 8469556, 8498666, 8151860, 8149189, 8110754, 7982959, 7550493, 7606722, 7327089, 6989416, 6929344, 7526012, 7048711, 6861676, 6534398, 6465580, 6526947, 6895369, 6659612, 6411691, 6638168, 6521674, 7117951, 6920162, 6663599, 6470440, 6399112, 6217695, 6747405, 7044822, 6797804, 7141617, 7350016, 6807524, 7041525, 6815687, 6793197, 6487804, 6712373, 6802213, 7105941, 6783614, 6840846, 7235173, 6925710, 6464303, 6503545]
4254F503545J35029o2190j90233j7977L48394K28770K30263m00889K34248K92897
4244G301857K16963K71505l48341o4498m61332m6923J98729k56979j15327L36322
4234G031976P6125J92528J89440M60459j43577m6157j6495J58583M76717M86315
4224H865914M81821K85691O30791o2807j55834N94393k52176j45927L90610R3422
4214A0725898K8471J586N52093L85505O03471K13580q7768m01968P31853K18913
4204A2971634N64841L24067r88439p12668k95010J7701N82190K65456m63858m13738
4194A1852176K19919o78136q24332j11213l22489p49934N42291k14145m29525
4185I284612m56526l48072p0065j47149j72663j94412k15804L04217L3730p31596
$$ y = [6503545, 6638574, 6576384, 6386151, 6368174, 6716568, 6945338, 7175601, 6774712, 7008960, 7301857, 7518820, 7790325, 7441984, 7377486, 6916154, 6869231, 7067960, 6810981, 6695654, 7031976, 7108101, 7300629, 7490069, 7950528, 7806951, 7760794, 7744299, 7902882, 8379599, 8865914, 9347735, 9633426, 10264217, 10201410, 10045576, 10639969, 10387793, 10241866, 10632476, 10725898, 10754369, 10755955, 11308048, 11693553, 12297024, 12510604, 12422836, 12020868, 12752721, 12971634, 13536475, 13860542, 12872103, 12159435, 11864425, 11882126, 12464316, 12729772, 12265914, 11852176, 12072095, 11393959, 10569627, 10458414, 10135925, 9385991, 9928282, 9714137, 9284612, 8828086, 8480014, 8409949, 8262800, 8090137, 7895725, 7679921, 7984138, 8017868, 7286272]
4175G286272p05981J85831L06152j09437r10173J35252K83819l96750l09131P49293
4165F515147P3934L5653j08441J18484K79467p3536o5026n68366o377L02035L74050
4154F877024m7404M82013q5305r1657j07623j19671l00115K9667L42156J06608
4144G085693K05612L05359l19314o0753L61918j83026J80098P43700m81112k11097
4134G627078Q6925J3090n0081M0341P28381k62818n166j63812o40198Q35491R40933
4123I150164J18985m44196j90325m83615P4030J63354J42617J6292l50394M262
4113H201174L11783J27011J73585j86300K68673L6431M39377Q5858k1743L36569
4103I772418k11343l12113L25622L53031k1282J54757l90765l494Q38779N8366
$$ y = [7286272, 6580291, 6766122, 7072274, 6962837, 6052664, 6187916, 6471735, 6074985, 5765854, 6515147, 6589081, 6624734, 6516293, 6634777, 6914244, 6840708, 6775682, 6207316, 6200939, 6502974, 6877024, 6829620, 7311633, 7226328, 7134671, 7027048, 6907377, 6607262, 6636929, 6979085, 7085693, 7291305, 7596664, 7277350, 7216597, 7578515, 7395489, 7575587, 8319287, 7838175, 7627078, 7714003, 7727093, 7677012, 7717353, 8445734, 8182916, 8177750, 8013938, 7373740, 8209231, 9150164, 9269149, 8824953, 8634628, 8151013, 8225043, 8388397, 8531014, 8547306, 8196912, 8201174, 8512957, 8639968, 8813553, 8627253, 8895926, 8932357, 9371734, 9457592, 9435849, 9772418, 9561075, 9248962, 9574584, 9927615, 9906333, 10061090, 9670325, 9666831, 10505610, 10563976]
4093A0563976L96900j82780l98106M28184O70428K19315J54787l5416j76217K6226
4083A1667297K71408L54578P48184O95541K08402k09548l12339r9531N71625Q33379
4073A4728996M85553J05370L40351Q00087N68076R03016L50094O04781K25510
4064A9111834J71426P71737J112066J095546P69212P39109Q03543J410425J620154
4055B7605052J031454K033806K517038L599972M442594M591671M587147M141578
4047E4550312K762107K765832K676507K654326L045302K233897K125852J431554
4039G4245689R64069J589894K173319J272594J770942J253617R58764J152129
4031H5381017O43767P04025J82466O9447K99407k91926j3212M22463m93542q09222
$$ y = [10563976, 10960876, 10778096, 10379990, 10808174, 11478602, 11697917, 11852704, 11817288, 11641071, 11667297, 11938705, 12293283, 13041467, 13737008, 13945410, 13735862, 13423523, 13323992, 13895617, 14728996, 15214549, 15319919, 15660270, 16460357, 17028433, 17931449, 18281543, 18886324, 19111834, 19283260, 20054997, 21167063, 22262609, 23031821, 23770930, 24574473, 25984898, 27605052, 28636506, 30670312, 33187350, 36787322, 41229916, 45821587, 50408734, 54550312, 57312419, 60078251, 62754758, 65409084, 68454386, 70688283, 72814135, 74245689, 75209758, 76799652, 78972971, 80245565, 82016507, 83270124, 84228888, 85381017, 86024784, 86728809, 86911275, 86980722, 87280129, 86988203, 86974991, 87397454, 86903912, 86094690]
4021H6094690j158294j676892j835194j911738k490320k137916k163965j864744
4013G0855627k536948k676065k819255l149719k664095k204800k353878k084073
4005E0366794k211378j951080j378542j505816r28200r15596j231670m94358k28253
3996C9521901o31131j49808o39112n01497l35378l69533l61393j01310O25554
3987C7058293L0222J15249J14870J17572L33734J05505Q63934L91831J1921M69260
3977C9612391N30337Q52842Q65011J098909J007407O17023R04480J104779J620515
3968D8213694J712003J242689J476140J926571J621914K090454K126132K415730
3960F2825327K306648K569745K626916J799666K370949K445755K313052K241932
$$ y = [86094690, 84936396, 83259504, 81424310, 79512572, 77022252, 74884336, 72720371, 70855627, 68318679, 65642614, 62823359, 59673640, 57009545, 54804745, 52450867, 50366794, 48155416, 46204336, 44825794, 43319978, 42391778, 41476182, 40244512, 39750154, 39521901, 38890770, 38740962, 38101850, 37600353, 37264975, 36895442, 36534049, 36432739, 37058293, 37088515, 37203764, 37318634, 37436206, 37769940, 37875445, 38739379, 39131210, 39143131, 39612391, 40142728, 40995570, 41860581, 42959490, 43966897, 44583920, 45488400, 46593179, 48213694, 49925697, 51168386, 52644526, 54571097, 56193011, 58283465, 60409597, 62825327, 65131975, 67701720, 70328636, 72128302, 74499251, 76945006, 79258058, 81499990]
3952H1499990K945186L198202L763193M491055M448087N127574N207222M092333
3944A14772842L298277K814146K848790K752829K805658K333620K051562K015065
3936A35692789J296456P65078J585398J934297J436072K221470K107413J612670
3928A48651643P91206R18960J225337P31611K67152q4568j20899k64316Q3621
3919A52199747j98869N49532P97188J106375P87225j91333j196641j791308j840204
3910A50221712j903176k529224k483371l108249l254246l675522l535016l258021
3902A26474887l336294k363721k857217l210851l441781l164232l014033l091936
3894A01994822k561064l000309k938455k265794l136853k877898k348857j844533
$$ y = [81499990, 84445176, 87643378, 91406571, 95897626, 100345713, 105473287, 110680509, 114772842, 118071119, 120885265, 123734055, 126486884, 129292542, 131626162, 133677724, 135692789, 136989245, 137754323, 139339721, 141274018, 142710090, 144931560, 147038973, 148651643, 149442849, 150361809, 151587146, 152318757, 152585909, 152501341, 152380442, 152116126, 152199747, 152000878, 152550410, 153347598, 154453973, 155241198, 155049865, 153853224, 152061916, 150221712, 148318536, 145789312, 143305941, 140197692, 136943446, 133267924, 129732908, 126474887, 123138593, 120774872, 117917655, 114706804, 111265023, 108100791, 105086758, 101994822, 99433758, 96433449, 93494994, 91229200, 88092347, 85214449, 82865592, 81021059]
3886H1021059k244707j927816j632203j466794j394831j190214j324409j522153
3878F8317932n41415k99929p00972N2470p53182o010O23164N00120L77251P56465
3868F8325894J580543J208055J181917J950508K475093K505079K909560L733202
3860H5869851L109301L602690M413851L618247M571391M587066M322161M825397
3852A18919955M174630L612933L416728K720919K613102K113700J212455P21668
3844A39506090M83944L07815j08900j68994O6527j178600j292758j426145j788635
3835A34400344j907805j761048j587814k817316k614472l325285l137688l421502
3827A13827414m257255m045525m315285m347262m672185m380631l854402l949655
$$ y = [81021059, 78776352, 76848536, 75216333, 73749539, 72354708, 71164494, 69840085, 68317932, 67776517, 67476588, 66775616, 66828086, 66074904, 66068894, 66692058, 67192178, 67569429, 68325894, 69906437, 71114492, 72296409, 74246917, 76722010, 79227089, 82136649, 85869851, 88979152, 92581842, 96995693, 100613940, 105185331, 109772397, 114094558, 118919955, 123094585, 126707518, 130124246, 132845165, 135458267, 137571967, 138784422, 139506090, 139990034, 140297849, 140188949, 140019955, 140086482, 138907882, 137615124, 136188979, 134400344, 132492539, 130731491, 129143677, 126326361, 123711889, 120386604, 117248916, 113827414, 109570159, 105524634, 101209349, 96862087, 92189902, 87809271, 83954869, 80005214]
3819H0005214m225154m022475l336216l880622m088728l585235k550836k359180
3811E1956768k667001k221083k085422j857621j578207j869979k285765q88537
3803C6503153j007014j539230o95791p56389j057806j167002l91534O589k76110
3794B9618866o2474j80796n41725n81811N90590M07324K11913m15245L45512N09889
3784B9902043m9026N53388j2760j78639O02232j28926n70653k14168n72221j28744
3774B9202526j99210q47124p97350o45369p61495o48984p51470j033533n05250
3765B3012741l55352j369853q44508k83265p14856p9321m65237m71518j37549
3756A8291282j46082l36294j17163o58951l71393n6412m52844k76178J23840k61233
$$ y = [80005214, 75780060, 71757585, 68421369, 64540747, 60452019, 56866784, 54315948, 51956768, 49289767, 47068684, 44983262, 43125641, 41547434, 39677455, 37391690, 36503153, 35496139, 33956909, 33261118, 32504729, 31446923, 30279921, 29888387, 29894976, 29618866, 29556392, 29375596, 28833871, 28252060, 28842650, 29249974, 29461887, 29046642, 29392154, 29902043, 29853017, 30406405, 30393645, 30215006, 30817238, 30688312, 30117659, 29903491, 29331270, 29202526, 29003316, 28156192, 27358842, 26713473, 25951978, 25302994, 24551524, 23517991, 23012741, 22657389, 21287536, 20443028, 20159763, 19444907, 19365586, 18900349, 18428831, 18291282, 18145200, 17808906, 17691743, 17032792, 16661399, 16604987, 16152143, 15875965, 15999805, 15738572]
3746A5738572m76247j75862j78944l78085n35060J1337l46282j70940k78109M60754
3736A3671134J19752N0049k06990m72454r3932k8477K3733O6592J6616j70539
3726A2975484m50298N7715J61114j3509j52625k08989p983k84320k54203M95437
3716A2317823m190j16918M82002j03853n88236m2976J68560K96507L44564k42734
3706A2510549r3113P0155M01884J17312J98749k35590J22569j47212L04876J3267
3696A3263446J81043L77423j92555J33580L78636k65101J76441k37499L15225
3687A4130639M86156L35072N56173j39704L95048N78822P84273J81785k63265
3678A7044999M23986P28671M89590J95629N44776J150921N74578J061147Q46596
$$ y = [15738572, 15262325, 15086463, 14907519, 14529434, 13994374, 14005711, 13659429, 13488489, 13210380, 13671134, 13790886, 13840935, 13633945, 13161491, 13067559, 13039082, 13062815, 13129407, 13146023, 12975484, 12525186, 12582901, 12744015, 12730506, 12577881, 12368892, 12360909, 12076589, 11822386, 12317823, 12313633, 12196715, 12678717, 12574864, 11986628, 11943652, 12112212, 12408719, 12753283, 12510549, 12417436, 12487591, 12889475, 13006787, 13205536, 12969946, 13092515, 12945303, 13250179, 13263446, 13444489, 13821912, 13629357, 13762937, 14141573, 13876472, 14052913, 13815414, 14130639, 14616795, 14951867, 15508040, 15368336, 15763384, 16342206, 17126479, 17308264, 17044999, 17468985, 18197656, 18687246, 18882875, 19427651, 20578572, 21153150, 22214297, 23060893]
3669B3060893R34218N27166P68708Q73355J050313J008206P98357O43787N35391
3660C0200394J005105M21122P09217N96136M96394J12349o0745O25963M92954
3651C4598889N28857l7129l14970J1250K55737J5536m93173q213M71396r66129
3641C4062051p37102l36470n28870o61367j201712j57446p49806n32581m76919
3632B8679778n32433o23624m60328p6739l89343K38702k42313K9868O6053N32229
3622B7221850N51019M92231P60748Q19447O00085J506491J292293J045083J374183
3613C5663430K091125K229185K222061K457514K297236K398031L116933K705207
3605E5180722K672527K443167K570063K261297K055576K067516J068019J696448
$$ y = [23060893, 23995111, 24522277, 25290985, 26164340, 27214653, 28222859, 29021216, 29665003, 30200394, 31205499, 31626621, 32335838, 32931974, 33428368, 33540717, 33479972, 34105935, 34598889, 35127746, 35090617, 34775647, 34786897, 35042634, 35058170, 34564997, 34556784, 35028180, 34062051, 33324949, 32988479, 32459609, 31798242, 30596530, 30439084, 29689278, 29156697, 28679778, 28147345, 27523721, 27063393, 26986654, 26597311, 26836013, 26593700, 26623568, 26689621, 27221850, 27772869, 28265100, 29025848, 29845295, 30445380, 31951871, 33244164, 34289247, 35663430, 37754555, 39983740, 42205801, 44663315, 46960551, 49358582, 52475515, 55180722, 57853249, 60296416, 62866479, 65127776, 67183352, 69250868, 70318887, 72015335]
3597G2015335J077154J546586N39716J27055j24383l54283L15782l62061l34577
3588G4446324j130250j173228j126991j597755j136768j116091j438242j676893
3580F4050106k019521k039316j384302j181823j512369j340992p53483m06564
3572E3411736J66267n64156K41384k77023m24707l49057p4345j55778j76801M9719
3562E1847239K06884K39849K48853J322768Q57411J608282K115330J055350K126595
3553F1628561J766973J596948J776856J878773J681098J511952J258180Q27805
3545G3927146J678743J102486J362378R59124O74722N06961L66892l39811p41312
3536G9497329J1028j036963j500255j499179j815166j556920j753358k230805
$$ y = [72015335, 73092489, 74639075, 75178791, 75305846, 75181463, 74827180, 75142962, 74780901, 74446324, 73316074, 72142846, 71015855, 69418100, 68281332, 67165241, 65726999, 64050106, 62030585, 59991269, 58606967, 57425144, 55912775, 54571783, 53818300, 53411736, 53578003, 53013847, 53255231, 52978208, 52553501, 52204444, 52130099, 51974321, 51797520, 51847239, 52054123, 52293972, 52542825, 53865593, 54723004, 56331286, 58446616, 59501966, 61628561, 63395534, 64992482, 66769338, 68648111, 70329209, 71841161, 73099341, 73927146, 75605889, 76708375, 78070753, 79029877, 79704599, 80211560, 80578452, 80238641, 79497329, 79508357, 78471394, 76971139, 75471960, 73656794, 72099874, 70346516, 68115711]
3528F8115711j990588k200684k109706k751089k527586j605576k199720k013755
3520E0717007j947059j306977j701196j734899j760471j367221m40338o86694
3512C9772152j236498m50309o92653k53620j23756n42194j98120K78753l17743
3503C6236012P6541N66586P17390M70943N94736R87302J107844P62748R09816
3494D2429918J221733P26806N69752Q38541J088236O95716J351188N41986O95396
3485E0159272N19255K26935N03001l65170K32717L3799p3746K33315l19646o89184
3475E0460548J12223m11127r01710m27902j502489o42165j023563m52873r03950
3466D4306992p02874j15124j47772j80418K69183l12866m45636N23053N72218
$$ y = [68115711, 66125123, 63924439, 61814733, 59063644, 56536058, 54930482, 52730762, 50717007, 48769948, 47462971, 45761775, 44026876, 42266405, 40899184, 40458846, 39772152, 38535654, 38085345, 37392692, 37139072, 37015316, 36473122, 36275002, 36553755, 36236012, 36312553, 36879139, 37596529, 38067472, 38662208, 39649510, 40757354, 41520102, 42429918, 43651651, 44378457, 44948209, 45786750, 46874986, 47570702, 48921890, 49463876, 50159272, 50678527, 50905462, 51408463, 51043293, 51276010, 51309809, 51236063, 51469378, 51149732, 50460548, 50572771, 50161644, 49259934, 48832032, 47329543, 46687378, 45663815, 45210942, 44306992, 43604118, 43488994, 43341222, 43160804, 43429987, 43117121, 42671485, 43194538, 43766756]
3457D3766756K84256P64419O39453P91108J071859R20826J487341J456704J175142
3448E2357864K225005K051774K631469K048757K159010K274860J661789J373197
3440F8783725J009089J079554N04085K13513j00436n80038n27712J69516j25907
3431G0425389k17533m90437N79763N11952N26592O48780L81320K6400N44290O00939
3421G3537455L11794J41564P83952Q5877N1999O29924l61114K77638N69083k51248
3411G5776924R771J45721m15701N0453l79989l45041l65195j143362q13948j447835
3401G1071798j512231j555120j526068k187837k545943k006578k334179k409902
3393E4993940k337181k571802k699695k097163j714967k024423k126434j817975
$$ y = [43766756, 44051012, 44815431, 45454884, 46245992, 47317851, 48238677, 49726018, 51182722, 52357864, 54582869, 56634643, 59266112, 61314869, 63473879, 65748739, 67410528, 68783725, 69792814, 70872368, 71376453, 71589966, 71489530, 70909492, 70381780, 70551296, 70425389, 70207856, 69717419, 70297182, 70809134, 71335726, 71984506, 72365826, 72392226, 72936516, 73537455, 73849249, 73990813, 74774765, 74860642, 74912641, 75542565, 75181451, 75459089, 76028172, 75776924, 75786695, 75932416, 75516715, 75567168, 75187179, 74842138, 74476943, 73333581, 72519633, 71071798, 69559567, 68004447, 66478379, 64290542, 61744599, 59738021, 57403842, 54993940, 52656759, 50084957, 47385262, 45288099, 43573132, 41548709, 39422275, 37604300]
3385C7604300j480247j711540j193168j574786j314892j242634p82744j39719
3377B8164570j020906j400002q62077q16172j46483p81467p74983n48703m12481
3368B1401296o3606J68009n6690M45753p7399P1070O69955L81836N7107k08154
3358B2789177L04380n77696o7935O9908m68437m21238m30355K10051o75164m60924
3348B0271767r5436J70079K29061j43271n45939l02939j71982m47648k67827k54694
3338A8441171m70902m98187l65689k29412N4123j29385l46657l25833J0762n03296
3328A5636695K11039l3491l8286l00298n4468J05562j34493j73112k19134m19472
3318A4580542n14990L0799k7240p9451K62319J09995j13482n64399M04862o97061
$$ y = [37604300, 36124053, 34412513, 33219345, 31644559, 30329667, 29087033, 28304289, 28164570, 27143664, 25743662, 24881585, 24065413, 23918930, 23137463, 22362480, 21813777, 21401296, 21337690, 21505699, 21449009, 21894762, 21817363, 21888433, 22558388, 22940224, 22997331, 22789177, 23093557, 22515861, 22447926, 22517834, 22049397, 21628159, 21197804, 21407855, 20732691, 20271767, 20176331, 20346410, 20575471, 20432200, 19886261, 19583322, 19411340, 18963692, 18695865, 18441171, 17970269, 17472082, 17106393, 16876981, 16931104, 16801719, 16455062, 16129229, 16139991, 15636695, 15847734, 15814243, 15775957, 15475659, 15421191, 15526753, 15392260, 15219148, 15000014, 14580542, 14065552, 14096351, 14069111, 13989660, 14251979, 14361974, 14248492, 13684093, 14088955, 13391894]
3308A3391894K94808K78864l09852R52L42575N43065J79491p7544R1945M6978
3298A4783176J20627L9268m00355j09953k60117n93770o3158j4013m50276l01428
3288A2750001n2967l21158J20673o4187l23071m32581j42787j09293K39148J06518
3278A1770296m453K18961o69706J10303J74667l8575K03778K88600J432L1718
3268A2087021N23058j30516J07671r4209J5759o4825n0200M47434J1895j26539
3258A2726549l62400K37379k17443N96930k71731p96233M95008K69900K14324
3249A2892283L99742J29891k94413j24919m19932K44535N13400N41944L20576
3240A4203107l54992L00976N63734j77112M31292P22559L75401M11758P7852N39803
$$ y = [13391894, 13686702, 13965566, 13655714, 13656666, 13999241, 14542306, 14721797, 14644253, 14736198, 14783176, 14903803, 14943071, 14542716, 14432763, 14172646, 13578876, 13515718, 13501705, 13051429, 12750001, 12697034, 12375876, 12496549, 12432362, 12109291, 11676710, 11533923, 11424630, 11663778, 11770296, 11765843, 11984804, 11315098, 11425401, 11600068, 11561493, 11765271, 12053871, 12055303, 12087021, 12610079, 12479563, 12587234, 12493025, 12508784, 12443959, 12393759, 12841193, 12853088, 12726549, 12364149, 12601528, 12384085, 12981015, 12709284, 11913051, 12408059, 12677959, 12892283, 13292025, 13421916, 13127503, 13002584, 12582652, 12827187, 13340587, 13882531, 14203107, 13848115, 14149091, 14712825, 14535713, 14967005, 15689564, 16064965, 16476723, 16554575, 17094378]
3230A7094378J97464L10657J11631M68018P25556K97470J58640M50883J77055
3221A9991752J76546L94239M33995R7010J30820K80975K88669L57106L36944O13166
3211B3101222R24767L56146P67076M41258O55740P44917J145322O22955R12039
3202B9671442O38504J288979K037902J042987J588061K343110J415225J233594
3194D1259804J675093K258517K305888K053829K589444L146670K744053L339977
3186F1373275M380204M181255M929641N533052O219158P480150Q078284R525433
3178A11700452J0612466J2636749J4546892J6049932J9150782K0827414K3272364
3171B28797051K4833119K5867785K4705602K1400816J7229341J3202952Q921537
$$ y = [17094378, 17291842, 17602499, 17714130, 18182148, 18907704, 19205174, 19363814, 19814697, 19991752, 20168298, 20562537, 20996532, 21093542, 21224362, 21505337, 21794006, 22151112, 22488056, 23101222, 24025989, 24382135, 25149211, 25590469, 26246209, 26991126, 28136448, 28759403, 29671442, 30309946, 31598925, 33636827, 34679814, 36267875, 38610985, 40026210, 41259804, 42934897, 45193414, 47499302, 49553131, 52142575, 55289245, 58033298, 61373275, 65753479, 69934734, 74864375, 80397427, 86616585, 94096735, 102175019, 111700452, 122312918, 134949667, 149496559, 165546491, 184697273, 205524687, 228797051, 253630170, 279497955, 304203557, 325604373, 342833714, 356036666, 364958203]
3164C64958203L527768j411334n932497r695943j3135336j7069552j9135316j9984043
3156B82121950k0760614k0131126j9362832j7880604j6153881j5568293j4124990
3149A58139610j3409147j1912285j0114769r013093q389814p670757o726118n316803
3141H5586824n289282m733479m540927l582891l249371l097726k332833k475608
3133E6284707j926749j339015j573180j605667j782403j725404j298075r84653
3125D4049561r95209p68552j240945j022116k27951M7370j57753q0043l56804
3116C9247558m85356r13118o25532k95347q12263o03650j489132j057405j371142
3107C1594613j417812j144214p93330j120615p52948J26978m48237m78652j212157
$$ y = [364958203, 368485971, 367074637, 361142140, 351446197, 338310861, 321241309, 302105993, 282121950, 261361336, 241230210, 221867378, 203986774, 187832893, 172264600, 158139610, 144730463, 132818178, 122703409, 113690316, 105300502, 97629745, 90903627, 85586824, 80297542, 75564063, 71023136, 67440245, 64190874, 61093148, 58760315, 56284707, 54357958, 53018943, 51445763, 49840096, 48057693, 46332289, 45034214, 44049561, 43054352, 42285800, 41044855, 40022739, 39794788, 39842158, 39684405, 39604362, 39247558, 38762202, 37849084, 37223552, 36928205, 36115942, 35512292, 34023160, 32965755, 31594613, 30176801, 29032587, 28239257, 27118642, 26365694, 26492672, 26044435, 25565783, 24353626]
3098B4353626n90340k48951m37227j62755l00022j36751r55562N2803P56657m00897
3088B1930581n90018k64447M56908N87968k5726J00556m0843N14871L78735M95887
3078B3544472l52565k02839P38594J092660j13097k16790Q43211J97208j70829
3069B5360025P29639N8740n12216j64766K02541L32456k98917j04320k70507k87925
3059B5044750n86860l62164l17528k77979j160559j201372o78225j150645j071377
3050A8238041m51592q79622n53719m13064p70366l62121p24902q50310p89091
3041A2443254j70054l82854k71474n39310n64033l40679r6163n2562q49832N62731
3031I739024n7280l05495M0433l74585p67358n01766K35782k52304J10419R7016
$$ y = [24353626, 23763286, 23514335, 23077108, 22914353, 22614331, 22477580, 21522018, 21574821, 22331478, 21930581, 21340563, 21076116, 21533024, 22120992, 22095266, 22195822, 22154979, 22669850, 23048585, 23544472, 23191907, 22989068, 23727662, 24820322, 24707225, 24490435, 25333646, 25530854, 25360025, 26089664, 26148404, 25636188, 25471422, 25673963, 26006419, 25707502, 25603182, 25332675, 25044750, 24457890, 24095726, 23778198, 23500219, 22339660, 21138288, 20460063, 19309418, 18238041, 17786449, 16906827, 16353108, 15940044, 15169678, 14807557, 14082655, 13232345, 12443254, 12273200, 11890346, 11618872, 11079562, 10515529, 10174850, 10078687, 10026125, 9176293, 9739024, 9681744, 9376249, 9416682, 9042097, 8274739, 7772973, 8008755, 7756451, 7866870, 7963886]
3021G963886m64093J82556l70423m54277k20737n53857P9309L98507o80632j92472
3011E687767J83910n5596j17793n52348L61872K46776k41730J89695N254m91220
3001E216587p8537l18324N3118l82949j59552J58192J37883j13012L10354k41869
2991D581891K4361l45821r3093M65296k34480m87077O5211K25594K4697K71482
2981D498061o99187l7613o18297K37242P64453R4749m68322m6762K08828O6587
2971C999739k13712n25715J85077j43683R0410K62306k54676q2646J26386j48606
2961C294880j60920p7534J03662O1370J30251n16209n02444L28571j90277J7670
2951B489020J85971l25633k33654J33621L5577M0346n42406M22994M68107J98121
$$ y = [7963886, 7499793, 7682349, 7311926, 6857649, 6636912, 6083055, 6162364, 6560871, 5880239, 5687767, 5871677, 5816081, 5698288, 5145940, 5507812, 5754588, 5512858, 5702553, 5707807, 5216587, 5138050, 4819726, 4872844, 4489895, 4330343, 4488535, 4626418, 4513406, 4823760, 4581891, 4606252, 4260431, 4167338, 4632634, 4398154, 3911077, 3976288, 4201882, 4226579, 4498061, 3798874, 3761261, 3142964, 3380206, 4144659, 4239408, 3771086, 3724324, 3933152, 3999739, 3786027, 3260312, 3445389, 3301706, 3392116, 3654422, 3399746, 3317100, 3443486, 3294880, 3133960, 3056426, 3160088, 3221458, 3351709, 2835500, 2333056, 2661627, 2471350, 2489020, 2674991, 2349358, 2115704, 2249325, 2284902, 2325248, 1782842, 2205836, 2673943, 2872064]
2941B872064m99372l81176o8389l3433J80992p0622j87825J06885R2468l38558
2931A673034m9026p2310L02618O57954k25165l86668J85684J64854o4788j36617
2921B049570o5532r6684M01635k04681K4941k85315M34435l75511q07337J90097
2911A265618R1369l04078P24429p0609n54481K78279M72113K69113l88828j52143
2901A630782J45930K8867p01029n18887K48977M73711N09310K83584n09284M62991
2891B054952L54170m72938j56600o0475M2549M06954J31345L7627l33696k44735
2881A759153K82888M36753M74953K911p07841j29440k3067k76918K27518R224
2871B056134j1244k33185N4310j64336j81513j19193K54354j44776l71185K73201
$$ y = [2872064, 2372692, 1991516, 1923127, 1889694, 2070686, 2000064, 1812239, 1919124, 2011592, 1673034, 1624008, 1551698, 1854316, 2512270, 2287105, 1900437, 2086121, 2250975, 2186187, 2049570, 1984038, 1887354, 2288989, 2084308, 2109249, 1823934, 2258369, 1882858, 1075521, 1265618, 1356987, 1052909, 1777338, 1706729, 1152248, 1430527, 1902640, 2171753, 1782925, 1630782, 1776712, 1805579, 1104550, 585663, 834640, 1308351, 1817661, 2101245, 1591961, 2054952, 2409122, 1936184, 1779584, 1719109, 1761658, 2168612, 2299957, 2337584, 2003888, 1759153, 2042041, 2478794, 2953747, 2956658, 2248817, 2119377, 2096310, 1819392, 2046910, 2056134, 2044890, 1811705, 1866015, 1701679, 1520166, 1400973, 1655327, 1510551, 1139366, 1412567]
2861A412567M1061P3717K4589j59924m6363J0656J89849j79129j02234j82261
2851A082528k15627O2304J77879Q759j60787j35722J41692J94312l19534n49634
2841B86170M17022J02682J72882k25473O5544Q4543k03945L93913o3026Q3292
2831A113604o01363n6839N8175K59748l75299M50018O52623k7213J49926l99060
2821A224320O6475l50647l92954R5899O74910j39831q62410K19449N40787k77743
2811G98255m91988L44526n5923O8539m32901J317674M55195p56004l41837p23820
2801A81716L52570K85500n2367N1201J71178N3483r8810o56152J09240K89175
2791F86734K17847j30655l66140L75317l7459k20660J79272j1518j51710J86690
$$ y = [1412567, 1453628, 1527345, 1551934, 1392010, 1345647, 1356303, 1546152, 1367023, 1264789, 1082528, 866901, 929205, 1107084, 1115843, 955056, 819334, 961026, 1155338, 835804, 286170, 703192, 805874, 978756, 753283, 818827, 903370, 699425, 1093338, 1030312, 1113604, 512241, 455402, 513577, 773325, 398026, 848044, 1500667, 1473454, 1623380, 1224320, 1290795, 940148, 547194, 643093, 1318003, 1178172, 315762, 535211, 1075998, 798255, 306267, 650793, 594870, 663409, 230508, 1548182, 2003377, 1247373, 905536, 181716, 534286, 819786, 767419, 818620, 989798, 1043281, 944471, 288319, 397559, 686734, 904581, 773926, 407786, 783103, 745644, 524984, 704256, 692738, 541028, 727718]
2781G27718j1143j19504J54907L73787L27574L95401m63829j45338n5455l22288
2771H61830j63933K6804o3054L32346j87919l81372L19847N29518n5363m09372
2761H09332k27972j04491J9845j33483J21132k0398k24428O5829M8159k52190
2751A01335L26563L04656j72220O0281l21559R0896k1110l98414J55409J75764
2741C01601m53484j44544j2258M44151M87327m31654j28681K48243j45837K73351
2731D38215J29295n77559k31444P5774K84569l7625K96514K50479Q2037p36699
2721b6444O8419M41244N22733n43991m12649J59247K41940j82055k18773N68753
2711F18424l6844m49845k6049l82583K24594l6126K11626M53147K00381L087K36734
$$ y = [727718, 716575, 597071, 751978, 1125765, 1453339, 1848740, 1384911, 1239573, 1184118, 861830, 697897, 724701, 661647, 993993, 806074, 424702, 744549, 1274067, 1218704, 809332, 581360, 476869, 496714, 363231, 484363, 463965, 239537, 305366, 353525, 101335, 427898, 732554, 560334, 620615, 299056, 389952, 368842, -29572, 125837, 301601, -151883, -296427, -308685, 135466, 622793, 191139, 62458, 310701, 164864, 438215, 567510, -10049, -241493, -165719, 118850, 81225, 377739, 628218, 710255, -26444, 41975, 483219, 1005952, 461961, 49312, 208559, 450499, 268444, 49671, 618424, 581580, 131735, 105686, -276897, -52303, -88429, 123197, 576344, 776725, 779812, 1016546]
2700A016546j79970o48629J1595J70620J28840J70206j84272J84767o7862r8859
2690E02982p4466j73185l93863n6032L50117j24883M04213J50789p9943m4094
2680D61635j81032m06853M11524j20067M69621j94158l75119N5525K28772j23621
2670B26227K63050L37359m60L19617k91476k78206k07184L01063L30277p4162
2660I26105l2493k01321J18188l7238j57967o2345m9768K74041K68636p6148o02716
2649C66974K07944m46142L14417K45290m14028k45924O76368P9406k80459l61534
2639A42312n109l34347L69652j53826n3874O47671k45050K84717j97603L19015
2629G73558l66064k0288J59300J0169l8252j78265m26971M89933L41530k68092
$$ y = [1016546, 836576, 187947, 199542, 370162, 499002, 669208, 484936, 669703, 601841, 502982, 428516, 255331, -138532, -194564, 155553, 30670, 434883, 585672, 505729, 461635, 280603, -126250, 285274, 165207, 634828, 440670, 65551, 121076, 349848, 226227, 489277, 826636, 826176, 1145793, 854317, 576111, 368927, 669990, 1000267, 926105, 893612, 692291, 810479, 773241, 615274, 552929, 503161, 777202, 1045838, 969690, 366974, 574918, 128776, 443193, 688483, 274455, 28531, 704899, 784305, 503846, 142312, 137203, -197144, 172508, 18682, -35192, 612479, 367429, 652146, 454543, 773558, 407494, 387206, 546506, 556675, 518423, 340158, -86813, 403120, 744650, 476558]
2619D76558l07444K50178J21438k03726k951J06344k6012M5860R2231l59607J38554
2608C31423K89164K74734N65356j10458Q0253o1054m79718n66936K0117j07832
2598B35049J80472P24769n81991j92721k9936j20524J25686J41069M10225j64417
2588G27681L42876K16126J59596j31560K86430R88539N34669L49382j69397J23206
2578C427548K55546n55898k40326k95564j3212j90968m30117m9089o19298N0309
2568A338931l90712l01187K0027J74722M47512j09576L05616n29098n42984k608
2558D10643M84811J35325j27753p6605R9410O322j64265n06512l37432M89252
2548D13196L38256k51594R644K25319O5058o1678j31487M53293K1050j37318o2869
$$ y = [476558, 169114, 419292, 540730, 337004, 334053, 440397, 414385, 460245, 552476, 192869, 331423, 620587, 895321, 1460677, 1350219, 1430472, 1369418, 889700, 322764, 342881, 235049, 415521, 1140290, 558299, 365578, 335642, 215118, 340804, 481873, 892098, 727681, 1070557, 1286683, 1446279, 1314719, 1601149, 2589688, 3124357, 3473739, 3304342, 3427548, 3683094, 3127196, 2886870, 2591306, 2578094, 2387126, 1957009, 1907920, 1288622, 1338931, 948219, 647032, 667059, 841781, 1289293, 1179717, 1485333, 956235, 413251, 410643, 895454, 1030779, 903026, 826421, 925831, 932153, 767888, 261376, -76056, 413196, 751452, 499858, 509502, 734821, 799879, 738201, 606714, 1060007, 1081057, 943739, 880870]
2537H80870m11280q4646l30054j47414q6925K60443j69588J46159P1638l31313
2527b02110J70282J97141J07115L8002j35312k39151O5974q02M30633k8387L92242
2516G95627J00646k73683L42059j30445o36291J64918m45165j21955P50871N7688
2506F04270j43786j45379L26580k2563l80828N0213M08278j62506O455L01628
2496H42362J79151P5597o35982N97627p6523n20480m02967N54012k78022j27387
2486B07388L30068J78355l04802K1901J48954j11669K8546j04135m14737K66066
2476B45935O57071K59003J05748J17646l34564l15470N74468L08037m44654n24694
2466F48526K40319Q96275j37092m14682p52389R1940K77884Q7719Q4157q57520
$$ y = [880870, 469590, 384944, 54890, -92524, -179449, 80994, -88594, 57565, 129203, -202110, -31828, 165313, 272428, 310430, 175118, -64033, 1941, 1139, 431772, 403385, 795627, 896273, 622590, 964649, 834204, 197913, 362831, -82334, -204289, 546582, 604270, 460484, 315105, 641685, 619122, 238294, 288507, 696785, 534279, 540734, 842362, 1021513, 1097110, 461128, 1058755, 982232, 461752, 58785, 612797, 334775, 207388, 537456, 715811, 411009, 432910, 581864, 470195, 498741, 394606, -20131, 245935, 903006, 1162009, 1267757, 1385403, 1050839, 735369, 1309837, 1617874, 1173220, 648526, 888845, 1785120, 1648028, 1233346, 480957, 572897, 850781, 938500, 1022657, 165137]
2456A65137k0435K06370k91134K59268N12735J50993n12737k15218M08981P3502
2446G37462M34379J56521l20703l00083M47381j49317P6981N00752l44213k17537
2436A021623J69053J38857m328k69467k76034J44559O48114N53029l57115m18551
2426A349740L50060j81068L4887M91808N50722l24158J69774j57050l64036M48194
2416B368873k56334K07676k98554j91134M37430L33685p533k88765K28170l9457
2406B494057K01723L0512j29478N4954M40354J14065k18025n32057l02251p8298
2396B075556O85831K6791r2401O6343O01006K07971K48575P1578m87006k991J2507
2385C413760L4681L58730K19289j0598M95880n52208k68067M90883P29155M48742
$$ y = [165137, 144702, 351072, 59938, 319206, 831941, 982934, 470197, 254979, 663960, 737462, 1171841, 1328362, 1007659, 707576, 1154957, 1005640, 1082621, 1583373, 1239160, 1021623, 1190676, 1329533, 1325205, 1055738, 779704, 924263, 1572377, 2125406, 1768291, 1349740, 1699800, 1518732, 1553619, 2045427, 2596149, 2271991, 2441765, 2284715, 1920679, 2368873, 2112539, 2320215, 2021661, 1830527, 2267957, 2601642, 2594109, 2305344, 2533514, 2494057, 2695780, 2726292, 2596814, 2651768, 3092122, 3206187, 2988162, 2456105, 2153854, 2075556, 2761387, 2788178, 2695777, 2762120, 3363126, 3571097, 3819672, 3891250, 3404244, 3401253, 3413760, 3448441, 3807171, 4026460, 4015862, 4511742, 3959534, 3691467, 4182350, 4911505, 5360247]
2375E360247l40023L00753R7112J08018q6500R4078l3060k20991L27217J39668
2365E746519L91498k41961J28569j02827l79012M50070K63039j0764k5918P34371
2355F953584O28503L78568O6299k52632J45064O55135L35965L53975M07853Q62586
2345A0534900N29760O89446k3246Q46712O55613M43502P50729R71655J435248
2336A6834319J938094J401151J975331K787876L941948L640646L626663L388645
2328C9534673L476637M502531N060398O386725P846646R696480J4408272K0191202
2320A11103564L7015830N7264411P6468158R3507721P5603680L6982760O790040
2313D94736164L329219l719901j0419126k0972533l2790228m4812175n7683564
$$ y = [5360247, 5020224, 5320977, 5418089, 5526107, 5439607, 5533685, 5500625, 5279634, 5606851, 5746519, 6138017, 5896056, 6024625, 5921798, 5542786, 5992856, 6255895, 6245131, 6219213, 6953584, 7582087, 7960655, 8026954, 7774322, 7919386, 8574521, 8910486, 9264461, 9672314, 10534900, 11064660, 11754106, 11730860, 12577572, 13233185, 13676687, 14427416, 15399071, 16834319, 18772413, 20173564, 22148895, 24936771, 28878719, 32519365, 36146028, 39534673, 43011310, 47513841, 52574239, 58960964, 66807610, 76504090, 90912362, 111103564, 148119394, 205383805, 281851963, 375359684, 450963364, 487946124, 494736164, 498065383, 494345482, 483926356, 462953823, 430163595, 385351420, 327667856]
2306C27667856n6892163m8870190l3883975k3304814j8489318j7248703j6267694
2299A12710999j4140795j1125834q522140p372998o524189o628593n590583n742048
2291D7063819n162454m129456l431068l158323k518813j884038j266532q89893
2283B4623242j430438j160957j811338o22291p05150j033975j169111r27538p078
2274A5755366l78804l53803R0901j319451J2012l45222l65917m45345q07460L23079
2264A2165356p14869l65210j67267R5490n79425o86331o5734m60533l56453p7977
2254H787047j59310l87578p76756r3875r8865o56277l01736J31270N69536k11232
2244F802224n94814p6861M68406m21662k27596n18468P6189k30312l98489O521
$$ y = [327667856, 270775693, 221905503, 188021528, 164716714, 146227396, 128978693, 112710999, 98570204, 87444370, 78922230, 71549232, 65025043, 58396450, 52805867, 47063819, 41901365, 37771909, 34340841, 31182518, 28663705, 26779667, 25513135, 24623242, 23192804, 22031847, 20220509, 19598218, 18893068, 17859093, 16689982, 15762444, 15755366, 15376562, 15022759, 15113660, 13794209, 13806221, 13460999, 13095082, 12649737, 11842277, 12165356, 11450487, 11085277, 10918010, 11013500, 10434075, 9747744, 9682010, 9221477, 8865024, 8787047, 8627737, 8240159, 7463403, 7369528, 7270663, 6614386, 6312650, 6443920, 7013456, 6802224, 6207410, 6130549, 6598955, 6177293, 5949697, 5431229, 5507418, 5277106, 4878617, 4885138]
2234D885138k33727L62988L463j50052j41937n35755R5003L45353J12697o70407
2224D072764j44773K91860j35130k79242m5591l57832J62340m8650p658L78108
2214C886196m68716k41702k24250l08372k10004J42022l51646K27557l45953r6012
2204B009120K07324r3680j16228l28512N18008J9281L8165K75603J08715J81909
2194B819705o51043m76115N89124P61108k71987k97031r457P3453K42403l90781
2184B389379n27587J08135m3634K73736K57777J7114l49025J37159J86170p80013
2174A669211N37219M20813p08499J00376L9983k11817Q6014j72416k65410L06699
2164A802173k13401l70093k61350O65098l86505j37976O0007n22104J09208J11086
$$ y = [4885138, 4651411, 5014399, 5017862, 4867810, 4725873, 4190118, 4285121, 4630474, 4743171, 4072764, 3927991, 4219851, 4084721, 3805479, 3759888, 3402056, 3564396, 3515746, 3508088, 3886196, 3417480, 3175778, 2951528, 2643156, 2433152, 2575174, 2223528, 2451085, 2105132, 2009120, 2216444, 2122764, 2006536, 1678024, 2196032, 2215313, 2253478, 2529081, 2637796, 2819705, 2168662, 1692547, 2281671, 3042779, 2770792, 2473761, 2464304, 2537757, 2780160, 2389379, 1861792, 1969927, 1926293, 2200029, 2457806, 2474920, 2125895, 2263054, 2449224, 1669211, 2206430, 2627243, 1918744, 2019120, 2059103, 1847286, 1933300, 1760884, 1495474, 1802173, 1588772, 1218679, 957329, 1622427, 1235922, 1097946, 1157953, 635849, 745057, 856143]
2154H56143J16594m37989n8973J16892L53240j0434O22904m82108m94304J03044
2144F85009M91454q40950m39219L27313N07453J61134J86371q9368J70576J43526
2134A303299j60484l53103l28212Q5215K1548K81485r2661J42790K91741p07396
2124D84222j84451J17221L78010R0845k57996k4263K50356j26240L7929L6841
2114H02474K05491l08595l94907M72628j70606n51793j84664K93241n85310L51924
2104g0117N53071j03995J50977j30435p6066R37493J35758j13095m96218M24671
2094A212044m45505m35048J20052j16551J43946k05675O75084O94996o70513p00812
2084B72018k16586K84672o1135J11894m8285l00208M24293M62852L4368K84749
$$ y = [856143, 972737, 534748, 475775, 592667, 945907, 935473, 1558377, 1076269, 581965, 685009, 1176463, 335513, -103706, 223607, 731060, 892194, 1078565, 989197, 1159773, 1303299, 1142815, 789712, 461500, 546715, 568263, 849748, 757087, 899877, 1191618, 484222, 299771, 416992, 795002, 885847, 627851, 603588, 853944, 727704, 765633, 802474, 1007965, 699370, 304463, 777091, 606485, 54692, -129972, 163269, -422041, -70117, 482954, 378959, 529936, 399501, 323435, 1260928, 1396686, 1283591, 787373, 1212044, 766539, 331491, 451543, 334992, 478938, 273263, 948347, 1643343, 972830, 272018, 55432, 340104, 278969, 390863, 342578, 42370, 466663, 929515, 963883, 1248632]
2074A248632o16572m55115q1734K88771n77829j35560O71086k77917J31365L57932
2064E53059q3256N27857j37887o51297j27581M63865J35003P6306k9794p9609
2054F46666J86534J45137j64076M72807N08644r0934K64639k5052N20773j29283
2044B335855N21001m16604j54289l17001K10716j38146k63466l33606n56763J39485
2034A027182m43947k9046L20293N3157o63461M87595j3088n14181J67104k16401
2024A75207m7885j53106k35600j73663K24500K57739P7691j03412K51005N46982
2014H19458o83799j21619J59989j5999m63811j03344J09114o0279l6427J97015
2004a99702O20579K21743J5060n35053L93763P7792K8945q39264m08998O03975
$$ y = [1248632, 632060, 176945, 95211, 383982, -193847, -329407, 341679, 63762, 195127, 553059, 469803, 997660, 859773, 208476, 80895, 544760, 679763, 756069, 726275, 646666, 833200, 978337, 814261, 1287068, 1795712, 1704778, 1969417, 1944365, 2465138, 2335855, 2856856, 2440252, 2285963, 1968962, 2179678, 2041532, 1778066, 1444460, 887697, 1027182, 583235, 554189, 874482, 927639, 264178, 751773, 738685, 224504, 391608, 175207, 127322, -25784, -261384, -435047, -210547, 47192, 124883, 21471, 272476, 819458, 135659, 14040, 174029, 158030, -305781, -409125, -300011, -360290, -396717, -199702, 420877, 642620, 657680, 122627, 516390, 594182, 623127, -216137, -625135, -21160]
1994b1160L04389J6983m40919R046N6370L30880J03021l62183J86624J43484p87121
1983d60586O09034L69948M08146N6299L82422J1134r19866k76296k70809p9173
1973a69747m0535Q1659L37556k09863M24885J59485m28881K39556J77171k85003
1963B86283p84942j93418L5147M94483K86331K96298m90326K45577l3640o2882
1953G8911J16753j54213m05101M53901J15611m45034N5212j01815O91802K72006
1943F78033m12047j22231n92903L55625K25031J42627k7970N4369M14576j98868
1933E16242j91390o95384P17524P7696o1418j52257k05801P3584j09404K40085
1923B09477K08154j58416l83575O245M44389J81946l54075j73944j98260K80008
$$ y = [-21160, 283229, 300212, -140707, -131661, -75291, 255589, 358610, -3573, 183051, 326535, -460586, 148448, 518396, 926542, 982841, 1365263, 1376397, 456531, 180235, -90574, -169747, -210282, -128623, 208933, -930, 423955, 583440, 154559, 394115, 571286, 286283, -498659, -692077, -656930, -162447, 123884, 420182, -70144, 175433, 141793, 78911, 195664, 41451, -363650, 90251, 205862, -239172, -183960, -285775, 406027, 678033, 265986, 143755, -449148, -93523, 131508, 274135, 246165, 300534, 715110, 516242, 324852, -370532, 346992, 424688, 363270, 211013, 5212, 78796, -30608, 209477, 417631, 259215, -124360, -118115, 326274, 508220, 154145, -19799, -218059, 61949]
1913F1949J43316K15101k84622Q2995p9105l88223m96118j33596J62690j4413
1903g30026J010380m21578k57181M29035n84017Q5211M5814j5967K37128P5983
1893a25218L11470m6965L43176j80542l66125p1651m10299K25792K49895j1115
1883h1582N18645m38045j40480k21513j3159M52878j30425m34092K41379L87319
1873A40925l99948J23661J9395N27989m40781o12572j27066L46909M17608J25257
1863A21377j87456K38021l12440n47630J14488N89905L98236J13132m89438J05562
1853A43757L31425n26386N4858R2091J83958M31812l96905m42792M09682j72178
1843A09322O26445m99485p13733J85570K30270N6776j22924j41639j32467k76050
$$ y = [61949, 205265, 420366, 135744, 218739, 139634, -248589, -744707, -878303, -715613, -730026, 280354, -141224, -398405, 30630, -553387, -468176, -422362, -438329, -201201, -125218, 186252, 139287, 482463, 301921, -64204, -135855, -546154, -320362, -70467, -81582, 437063, -982, -141462, -362975, -376134, 76744, -53681, -487773, -246394, 140925, -259023, -135362, -115967, 412022, -28759, -641331, -768397, -421488, -3880, 121377, -66079, 171942, -140498, -688128, -573640, 16265, 414501, 527633, 38195, 143757, 475182, -51204, 3654, 95745, 279703, 711515, 314610, -128182, 281500, 109322, 735767, 236282, -477451, -291881, -61611, -4835, -127759, -269398, -401865, -677915]
1833f77915K69153p1276P05539N27659n53714k58442N05376l98534n5694N97493
1823E89645k20460o36116P0337P5534r4491L43760j33657l78307O84212k83927
1813A6530J29856M49216j77370n78524J94818k9673N1954M16896K66705L21289
1803A061697k6654m76003k51038K87850k68887r6761k56566M77280k04931n52869
1793c06882L03103M08929m98685k12454O04179K44855q6694O9552m77123P75318
1783H24098p3326l38263k28095q8707L6461N71721K2514n66582k36281q357M47223
1772C62406J03466j93764K29394l54741J05979o27349J70358P20993n07750l39222
1762c30230K73234n7262j69130O9271j32216P8597r0001k08867K80633J79548
$$ y = [-677915, -408762, -480038, 225501, 753160, 199446, -58996, 446380, 47846, -7848, 589645, 369185, -266931, -196594, -121060, -215551, 128209, -5448, -383755, 300457, 16530, 146386, 595602, 418232, -160292, 34526, 4853, 56807, 473703, 740408, 1061697, 1035043, 559040, 308002, 595852, 326965, 230204, -26362, 450918, 245987, -306882, -3779, 405150, -93535, -305989, 298190, 543045, 456351, 525903, 48780, 824098, 750772, 412509, 184414, 95707, 132168, 703889, 726403, 159821, -76460, -84817, 362406, 465872, 272108, 501502, 146761, 252740, -374609, -204251, 516742, 8992, -330230, -56996, -114258, -283388, -214117, -346333, -267736, -357737, -566604, -285971, -106423]
1752a06423K33826M91625k48998j59524K06564j7753n77409K087n5151K18157
1742a2999q476K99955L55935l41674l53978n07364L24695M23244J7741J72789
1732C69868l29101k2759M5294J15242j06216r1582j21692O5281k32141l2769R9773
1721b40802L28945K27340k03736n53337k438K39710k99519K48162L5108n4115
1711b74682Q38740l63689l52846K2802l46779L93343O73020j99897m45981N0202
1701e767R0178k25549K6786N7516j72864L21407L58940J41206l31359l42555K03821
1690A21760j55529r8797M73673l73329j0123n30919M507J13039L33845J66261
1680D4388l87320K56444R2722o1756K10673n14194L73373l49525k92583L48235
$$ y = [-106423, 127403, 619028, 370030, 210506, 417070, 399317, -178092, -176005, -231156, -12999, -21475, 278480, 634415, 292741, -61237, -568601, -243906, 179338, 197079, 369868, 40767, 18008, 63302, 178544, 72328, -19254, -140946, -75665, -307806, -340575, -240802, 88143, 315483, 111747, -441590, -444028, -204318, -503837, -255675, -220567, -274682, 564058, 200369, -152477, -129675, -476454, -83111, 589909, 390012, -55969, -5767, 84411, -141138, -114352, -56836, -229700, 91707, 450647, 591853, 260494, -82061, 121760, -33769, -132566, 341107, -32222, -42345, -573264, -568757, -455718, -121873, 44388, -342932, -86488, 6234, -55522, 155151, -359043, 14330, -335195, -627778, -279543]
1670b79543O4749j71613M83526J24782J4456j75091L61144L5192l75976J75225
1660B56851k25317k65058m85353N41067l3656k7960j77305j6966K83499P0076
1650h0122k59130Q2823j62393l36419o43426J55274O03290O08721l5915R1318
1640B4021j35687l34604N5642K52439j55570j35233J24631M99185L13821k26486
1630B82159r6623J61428N15016o26796l05598n9593K54091M22918k70090k34677
1620D2235m962L22267p67068l77580K17760q2699K38921K17864N31468m18936
1610h0730k83506K18341J37770L58421P9381o13203p66021k2759M89293r9509
1600e82522L40675P79784k81848Q8717j6416n43326J25741O8240k11511o01050
$$ y = [-279543, -214794, -386407, 97119, 221901, 236357, 61266, 422410, 457602, 81626, 256851, 31534, -233524, -718877, -177810, -211466, -239426, -416731, -433697, -150198, -80122, -339252, -256429, -418822, -755241, -1398667, -1243393, -640103, -31382, -67297, 24021, -111666, -446270, -390628, -138189, -293759, -428992, -304361, 194824, 508645, 282159, 185536, 346964, 861980, 235184, -70414, -130007, 124084, 547002, 276912, 42235, 37273, 359540, -407528, -785108, -567348, -650047, -411126, -193262, 338206, -80730, -364236, -145895, -8125, 350296, 429677, -183526, -949547, -972306, -483013, -582522, -241847, 537937, 256089, 344806, 328390, -214936, -89195, -20955, -232466, -833516]
1590h33516K71974Q3168k5669K23635j79940j60917M6370K96271M59344K33164
1580D13884J66299L07740q83160j86043M19786K99402m02997n0064M10787m09378
1570H6256m12743p13351L39725R30688l09242l83780j99420K56308K53383j0800
1560a62976K79114M69933l24340j01440J54243j61103l89856J50523o6231j92591
1550c44724J00474K18027K04233J60596j16346m43859j25467l28448K04275q8313
1540e59552J56417K64002K13173k05850m3431j26510j26846O74294n00650K49802
1530e151K48437L14541Q0723p67180j89312J5355j3986K12130L89235r2402k55742
1519f3352l20262J96030L86316k23326J61909j30632q1869k98066l92400N97914
$$ y = [-833516, -561542, -478374, -504043, -280408, -460348, -621265, -574895, -278624, 180720, 413884, 580183, 887923, 4763, -181280, 238506, 537908, 134911, 84847, 495634, 86256, -326487, -1039838, -700113, 230575, -78667, -462447, -661867, -405559, -152176, -162976, 116138, 586071, 261731, 160291, 314534, 153431, -236425, -85902, -152133, -344724, -244250, -26223, 178010, 338606, 222260, -221599, -347066, -675514, -471239, -559552, -403135, -139133, 74040, -131810, -175241, -301751, -428597, 245697, -254953, -5151, 243286, 557827, 638550, -128630, -317942, -302587, -316573, -104443, 284792, 192390, -63352, -383614, -187584, 198732, -24594, 137315, 6683, -75186, -373252, -765652, -167738]
1509a67738P95300q0258q53866J74077J81728l37290n9256N16094J34002l94303
1499i1510L94344N9619l47796l09777L77001J42523K7963n38057m88774K65506
1489e08958m39029o3363L70365J91325O5419L61104l4734M34896o33519M27952
1479A71458J84992j65646l65706O1687m75151n2024J77827M77301k0905L10927
1469C04760p2273j86818M15639K58777l14637j93554J85210k96372k00153m15409
1459e14830K22397K1075k68304L33138L88856j7873J96879l4180K13925j19001
1449D22082J55917L6622l77672k83723N0537k28523J45744j79876l02452K73381
1439b87963P24728l74912K75054L1150k83974m4811m0750n0518j64767L32806
$$ y = [-167738, 627562, 547304, -306562, -132485, 49243, -288047, -347303, 168791, 302793, -91510, 302834, 362453, 14657, -295120, 81881, 224404, 252367, -285690, -774464, -508958, -947987, -1011350, -640985, -449660, -384241, -23137, -57871, 377025, -256494, 171458, 356450, 190804, -174902, -113215, -588366, -640390, -462563, 14738, -6167, 304760, 232487, 45669, 461308, 720085, 405448, 211894, 397104, 100732, -99421, -514830, -292433, -271358, -539662, -206524, 182332, 164459, 361338, 327158, 541083, 422082, 577999, 614621, 236949, -46774, 3763, -224760, -79016, -258892, -561344, -287963, 436765, 61853, 336907, 368057, 84083, 39272, -1478, -51996, -216763, 116043]
1429A16043M22825m61218k25004N0275J86018k55641N0873M83091K77603J47377
1419G92242j236015o41773L05113P56917l33286K26148M35753q51639J01088N24740
1409G9288L18519l48906J76023j30789M4177j58255l51431K39029K69329l79020
1399b42036K23351k2114j3841j1641q3716k41660N82804J28191l2386m0152k28388
1388A8412k47779K51874J62001p03337j89631J59030J81603q3801N73756n32139
1378d10011M41986o8166L59361r2355J11774m69209l06366o567j23503j61994
1368g25050J87917N82431L46755K26139l83981K59519j21692j01973J22086k94079
1358I8072k69900j31824q5966M24325K50213l7939m30318j6577P67725l34966
$$ y = [116043, 538868, 77650, -147354, -97079, 88939, -166702, -115829, 367262, 644865, 792242, -443773, -1085546, -780433, -23516, -356802, -130654, 305099, -546540, -445452, 79288, 397807, 48901, 224924, 94135, 138312, -19943, -371374, -132345, 136984, -242036, -18685, -40799, -54640, -66281, -149997, -391657, 191147, 319338, 286952, 246800, 18412, -229367, 22507, 184508, -518829, -708460, -549430, -367827, -451628, 122128, -410011, 31975, -36191, 323170, 230815, 342589, -126620, -432986, -439553, -563056, -725050, -537133, 45298, 392053, 618192, 234211, 493730, 372038, 270065, 392151, 98072, -171828, -303652, -389618, 34707, 284920, 246981, -183337, -199914, 567811, 232845]
1348B32845J75275k13693j74751J94250M1898j2265l07653O6553K31002n710J3361
1337B41112L19544k90875k79982j43395k90638K95241l02017j34927O3486j83682
1327g06133Q50857j59990m49752j96715J54220l0217P56268n08093l96889K74598
1317d11846k19261k07937q9808M77978L42090J61349K93548J47858k96733n28918
1307c31680k79634P14446j57055l03043N00549k99764k34773L10470j75735l20030
1297e76249P5726k89958K24750n3494J8930M22990M25546j66383K27189K60927
1287E69974K2347k54802q75021K353j52091J18159O37837K60876m4313j12038
1277A73281j64658j99004K66202j35310k37575j42362m0716K73495j18242L99553
$$ y = [232845, 408120, 194427, 19676, 213926, 255824, 243559, -64094, 2459, 233461, 227751, 241112, 560656, 269781, -10201, -153596, -444234, -148993, -451010, -585937, -522451, -706133, 144724, -15266, -465018, -661733, -507513, -537730, 218538, -289555, -686444, -411846, -631107, -839044, -928852, -450874, -108784, 52565, 346113, 493971, 197238, -331680, -611314, 103132, -53923, -356966, 143583, -156181, -390954, -80484, -256219, -576249, -500523, -790481, -565731, -619225, -600295, -177305, 248241, 81858, 309047, 569974, 592321, 337519, -537502, -535149, -687240, -569081, 68756, 329632, 285319, 173281, 8623, -190381, 75821, -59489, -297064, -439426, -480142, -206647, -324889, 74664]
1267G4664m4372n15779k5052N45964L63247Q2519o54996m68182M04716q1436J57451
1256a61256J17723o82332N77371K50674j42263L10642j48652n5026K99976j6385
1246C50472J99740l63563q479M40988k01872j06712J11898l2951j27660J3839
1236B75700l86891q199M74788l18543k33151m7792M16692n4419k52728j90678
1226c25221K13621j38359J99513l6117M35477k60702k86152o9466J54362P0399
1216d2645l55801l3534j10807K7055q303K04621J20412J43030J22707j7783j20563
1205g1611k00901J10107K70100k80127P41031j540m24525k88966m42803K53595
1195c35640J98800j49624K30430N9610P8146m15708J98356K16308Q3691m80741
$$ y = [74664, 30292, -485487, -510539, 35425, 398672, 481191, -173805, -641987, -237271, -318707, -161256, -43533, -725865, -148494, 102180, -40083, 270559, 121907, 66881, 366857, 350472, 550212, 186649, 178170, 619158, 417286, 310574, 422472, 389521, 261861, 275700, -111191, -119390, 355398, 36855, -196296, -244088, 172604, 118185, -134543, -325221, -111600, -249959, -50446, -86563, 348914, 88212, -197940, -267406, -113044, -42645, -398446, -431980, -542787, -515732, -524035, -319414, -199002, -55972, 66735, 48952, -71611, -272512, -162405, 107695, -172432, 568599, 567059, 142534, -146432, -589235, -335640, -136840, -286464, -56034, 3576, 81722, -333986, -135630, 80678, 164369, -316372]
1185c16372j60254J22242N45376J3065k59051J26541o3079j00223m27756o5796
1175e85307J59448M66949J81798p2355O2152k42511j21962l16477k21585p0494
1165g60344M84220M23196P02360n11618n72951J83113L96463k83039r0189m382
1155c3171K66943L65304k68162l43250n6379M0529l64864N3545J4885N54409L45913
1144E75702r8014j58427j08500l91184j7266k03436N440M57832j77111K04625
1134H9661j20376M9209M39834j73421k4959j81730P1943k00242o48522l13118
1124a011721N762N23444J14636k03891J82473M32522p77478r4353O22485j30190
1114c36311j63071m0535M11705J66479m9336k70967J57547J26677L38778o50515
$$ y = [-316372, -476626, -354384, 190992, 204057, -54994, 71547, 8468, -91755, -519511, -585307, -425859, 41090, 222888, 150533, 212685, -29826, -151788, -468265, -689850, -760344, -276124, 147072, 849432, 337814, -235137, -52024, 344439, 61400, -28789, -33171, 233772, 599076, 330914, -12336, -68715, -28186, -393050, -339505, -324620, 229789, 575702, 477688, 319261, 210761, -180423, -197689, -401125, -395685, 62147, -114964, 89661, -30715, 18494, 458328, 284907, 259948, 78218, 150161, -50081, -698603, -1011721, -1005959, -482515, -367879, -571770, -389297, 43225, -734253, -828606, -206121, -336311, -499382, -539917, -128212, 38267, -11069, -282036, -124489, 2188, 340966, -309549]
1104c09549J78045K47828k16475m10147N86021L95833n61724l65868j57313K88394
1094c24955k10079L82555K39224k0622O5142k13623K08438m7597q3994M44221
1084D38710N7215L194l84752n93496M28590j40362J50861J50468m88674k36679
1074f14925j1550q2488O3091K51623M11933r0961k14265O0485O57070J24996l24998
1063B30011P3607l84061J70481n08755n30852J95854M99744L58470l27604L31082
1053A07977J37470m60504M0134J24886k03531M3061J5544J54196l9331O3717j60212
1042a76593K71317J67064R3992o4291l25219l32399r9404L8929N2007J48070K10070
1031a6457J25969k87018j2227m6178L61908J27343k60580j94475J20374J5315
$$ y = [-309549, -131504, 116324, -100151, -510298, 75723, 471556, -90168, -456036, -613349, -324955, -535034, -152479, 86745, 66123, 131265, -82358, 126080, 78483, -5511, 438710, 495925, 499119, 114367, -479129, -50539, -190901, -40040, 110428, -378246, -614925, -626475, -708963, -645872, -394249, 17684, -73277, -287542, -227057, 430013, 555009, 230011, 303618, -80443, 90038, -418717, -949569, -753715, -253971, 104499, -223105, 107977, 245447, -215057, -174923, -50037, -253568, -210507, -194963, -40767, -80098, -16381, -176593, 94724, 261788, 355780, 291489, -33730, -366129, -465533, -426604, -374597, -226527, -16457, 109512, -177506, -189733, -235911, 125997, 253340, -7240, -201715, -81341, -66026]
1021f6026K30282J07637K0935m04613L93643j52945n93633j37287M46787n27062
1011f82282K12153K5000M3336L32481Q727o79705k64396j88576j50439N31877
1001h11824N83625K93918K25336j410K22283n4095l23738M61388m30135p68261
991f02913L52005R6869l94151O3981J69128J9070J3480J51280j90120K9122j72862
980d65111o1232J90185m47040J36274P96113K18773j52097j04201N2126k68094
970a04304p3106j74151N28298N7372j51303l24917M79225J52383j91688J09806
960C07615j70935j18801J17946j21958K11054j36256K2034J8994L2464k04235
950d2078O1236J11329J12813R8044n6103j61576K61016J19160K86145n28203m11517
$$ y = [-66026, 164256, 271893, 292828, -111785, 281858, 128913, -464720, -602007, -155220, -682282, -470129, -445129, -401793, -69312, -60585, -740290, -1004686, -1193262, -1343701, -811824, -228199, 65719, 291055, 289645, 511928, 457833, 134095, 595483, 165348, -602913, -250908, -154039, -548190, -484209, -315081, -296011, -282531, -131251, -321371, -292249, -465111, -526343, -336158, -783198, -646924, 149189, 367962, 215865, 111664, 163790, -104304, -177410, -351561, 176737, 234109, 82806, -242111, 237114, 389497, 197809, 307615, 136680, 17879, 135825, 13867, 224921, 88665, 110699, 129693, 162157, -42078, 19158, 130487, 243300, 341344, 285241, 123665, 384681, 503841, 789986, 261783, -149734]
939a49734K1190L40479N39316j3624l42609q4082J13346O1260j62116n86491J55614
928a07451r0058J52235m12504K34858j72531j19192j16014p0534L82483O63220
918C44512j43729l67529k07126J06144k5160J46051L63690j43470q7872o9835
908h4324k2953j41694J57192k53512j89706J042754l47609l24470K83313n80247
898d61256J10851K95604J15598L18952k83564l01600L6569j13189l62603L89287
888b55351J83626K11357o2743k04213J80142k71650J53131K60934j2311l39299
878a56377J03611J7777j04025K17238q2997P7071L92072k11302j89845p727k54945
867a99449k01363N61161j90331L9522l94611J46822K53240k47952N07176M09348
$$ y = [-149734, -128544, 211935, 751251, 737627, 395018, 310936, 424282, 485542, 323426, -263065, -107451, -197509, -45274, -457778, -222920, -395451, -514643, -630657, -701191, -318708, 344512, 200783, -166746, -373872, -267728, -292888, -146837, 216853, 73383, -14489, -84324, -107277, -248971, -91779, -345291, -534997, 507757, 160148, -164322, 118991, -461256, -350405, -54801, 60797, 379749, 96185, -205415, -168846, -282035, -644638, -255351, -71725, 139632, 76889, -127324, 52818, -218832, -65701, 195233, 182922, -156377, -52766, -34989, -139014, 78224, -4773, 72298, 464370, 253068, 63223, 55496, -199449, -400812, 160349, -29982, 9540, -385071, -238249, 14991, -232961, 274215, 683563]
857F83563l44726l13380m36902L41685l4003j23812o4672k43484K06400l91164
847g20495O77403K831j28035p5997k80049j95302J40510O99653L7428m70025J18250
836a93828K39351L29588o26609L30307R8427j87901O45973K4111k45068m69342
826e4991l1949J15137j97378K67477j45339j33552P0043J96818m20254q0462j51878
815e66328R1792J92094M20520L63359Q3175n6139n68964L75996j8852r3500l64731
804a41578J23197k07572l02381K1392J91942K73720j173L594j13641k57726M10566
793C40P42128k35557k37329r2101n03356q5833P44945j44774m15007N78109l84071
782c2506j55448K64947j78651J67998l871k57614M77711o7242k10258l57075K19410
$$ y = [683563, 338837, 25457, -411445, -69760, -103763, -227575, -292247, -535731, -329331, -720495, -43092, -40261, -168296, -244293, -524342, -719644, -579134, 120519, 157947, -312078, -193828, 45523, 375111, -251498, 78809, 177236, -10665, 635308, 659419, 414351, -54991, -86940, 28197, -169181, 98296, -47043, -180595, -110552, 86266, -333988, -414450, -566328, -474536, -282442, 138078, 501437, 584612, 528473, -40491, 335505, 316653, 223153, -141578, -18381, -225953, -528334, -506942, -315000, -41280, -42453, -38859, -152500, -410226, 340, 742468, 506911, 269582, 177481, -325875, -411708, 333237, 188463, -226544, 351565, -32506, -187954, 76993, -101658, 66340, 62469, -195145, 282566, 215324, 5066, -352009, -132599]
771a32599n44028K16135K80095m50964O35801j21268K795j30211K26527l40480
761c58197J14552J27706l9247M60642j82364k78457j3465k75107M12383J63277
751A31723k77007M79300k5177M59270p07502P4158k49925j41299L3251O16498
741C93290M56585o17064l49224l61014O3524L61833J9599n49506R9075L5022j8389
730d66269K1081L01341m69370M11778N48539j73935n07428j7808L2491M2717j99019
719d75882L1782N62103k06297J03030j75065R762m5659N66692K58924n01365m7629
708H0396J80696K16167k768o19418j20149O7201N5793p786J44516q0475N1609
697c4218k16505L30726K38774M37976L09018n31491L92227l53204m84324j38838
$$ y = [-132599, -676627, -460492, -180397, -631361, 4440, -116828, -114033, -244244, -17717, -358197, -243645, -115939, -155186, 305456, 123092, -155365, -168830, -443937, -31554, 131723, -145284, 334016, 308839, 768109, 60607, 134765, -115160, -256459, -223208, 393290, 849875, 232811, -116413, -477427, -413903, -52070, -32471, -581977, -482902, -447880, -466269, -445188, -143847, -613217, -201439, 347100, 173165, -334263, -352071, -319580, -276863, -475882, -444100, 118003, -88294, 14736, -160329, -150567, -196226, 370466, 629390, 128025, 80396, 261092, 477259, 474491, -144927, -265076, -197875, -142082, -149868, -5352, -85827, -34218, -250723, 80003, 318777, 756753, 1065771, 534280, 926507, 573303, 88979, -49859]
687d9859K75788m90479P9272N7168R5484P2461j05571o41523P50930K05412O84096
676I33179K83751k58327n72348j66557k33861K17188K44715o49833L50243J57745
666C05895m22119n38528N85248K21343J8536m58681q6662p9090K41481j17134
656c29711k36119l0090J00987M7610k53012J28194k13340l99660J26667N98621
646d59853N21823L42823L28656j09365m56036n21747k35992J66421M71146k35506
636a87630m4465K19415p0920O70139m08318l10129k08598L90212L86701n10069
626g3662Q8335P4793K40342j46203j63588J9551j9959J52009m31409q9426P80142
615D30925J1634J99412k97641m87838j45533n92969r4936m1762L01323J064497
$$ y = [-49859, 225929, -264550, -185278, -128110, -32626, 39835, -65736, -707259, 43671, 249083, 933179, 1216930, 958603, 386255, 219698, -14163, 203025, 447740, -202093, 148150, 305895, -116224, -654752, -69504, 151839, 170375, -288306, -374968, -454058, -212577, -329711, -565830, -595920, -494933, -447323, -700335, -572141, -785481, -1185141, -1058474, -459853, 61970, 404793, 733449, 624084, 168048, -353699, -589691, -423270, 47876, -187630, -232095, -12680, -83600, 586539, 178221, -131908, -340506, 49706, 436407, -73662, 14673, 89466, 329808, 183605, 20017, 39568, 19609, 171618, -259791, -349217, 430925, 442559, 641971, 344330, -143508, -289041, -882010, -976946, -1018708, -717385, 347112]
605C47112l41556j00216P0642q499m6282J59411J03977O779J92958j27169p7361
594A79796j60102J44775J7563J51977k37899J60832J04022n11879r2828K77155
584C3412k2707l89108K38485k29198J97034k7093l07467q4901j45468M78814J99601
573e8596j28915k86266L75647m70296m5394K24714n60104L61210K97593J72031
563a18376k91761L18154k38869k03378K87098K43186o1119k25766M692K49380
553c6759l07173L53145J78499m55180L9457q5647N41431J1670J02787l37469k4708
542a9947k59595K42539m78443O622M75907L78677k26023k99265J84225j76399
532a71702m1722k44537K49838j0329K48404J7830j49275J80164P325K28679k3577
$$ y = [347112, 5556, -94660, -24018, -32517, -78799, 80612, 184589, 191368, 384326, 257157, 179796, 19694, 164469, 182032, 334009, 96110, 256942, 360964, -150915, -243743, 33412, 10705, -378403, -139918, -369116, -172082, -199175, -506642, -591543, -737011, -258197, -58596, -187511, -473777, -98130, -568426, -613820, -389106, -949210, -588000, -290407, -118376, -410137, -91983, -330852, -534230, -247132, -3946, -65065, -290831, -286139, -36759, -343932, 9213, 187712, -267468, -228011, -313658, 227773, 239443, 342230, 4761, -19947, -279542, -37003, -515446, -508824, -32917, 345760, 119737, -179528, 4697, -171702, -213424, -457961, -208123, -218452, 29952, 47782, -101493, 78671, 85996, 314675, 291098]
521B91098m46545M66300M7083k53853K0440J89737J2929m35115m80839L70308
511b18457K34846J80167K13316k00490K90151k82223l14871K59807N9901o27066
501d04919P9525Q42756n51377n67466j37237L45301j73480J44412O59401m94170
491b57254R8618J00296M39367M24864l80855j34888r5962K80644j02924m26785
481e4879l75335J75543q89l16505N9643L73320K17639q0528K47487J1776j93341
470F3931J4051N43209m3690k32579k5709n21651j44867K26098k53308M67787J15729
459B09001M01821j29356k31928K44264m43032r9053l51542J95906N34819j66534
449A64366k47366O9017J5148q23506M11005L44067K08045R46j36760J61486k12303
$$ y = [291098, -155447, 310853, 357936, 104083, 124523, 314260, 327189, -107926, -588765, -218457, 16389, 196556, 409872, 209382, 499533, 217310, -97561, 162246, 222147, -404919, -325394, 517362, -34015, -601481, -738718, -393417, -566897, -422485, 236916, -257254, -158636, -58340, 381027, 805891, 425036, 290148, 194186, 474830, 371906, -54879, -430214, -254671, -255560, -572065, -512422, -139102, 78537, -1991, 245496, 257272, 63931, 77982, 621191, 577501, 344922, 319213, -202438, -347305, -121207, -374515, 93272, 209001, 610822, 481466, 249538, 493802, 50770, -48283, -399825, -203919, 330900, 164366, -83000, -13983, 1165, -822341, -411336, -67269, 140776, 141722, 4962, 166448, -45855]
438d5855k38781L40102k16466J46291N5420K3077J48334n32824N16835K36045
428D32178k57424l99090p9886K3878j13770L09101J27115M7450J15787k16209
418a0870j67599l3966M8108J15333O7561L15349j64926j17100O0572l26369L25311
407A11404K53125J47124K18016j89036l40765J56810r9275j38694l28101k4173
397b33565M04470m2105K12908m2916o60889R2509K82319P79206k85733k79568
387B26636R9256l7603j65067M80922j27403m01494J78509J4695J41143N7830j07399
376C60025j73382k9637l32261J99926J1103J74466j68276l01160J48591P7148
366c3457j63936k17754j08322J88750j41859k32842J042250j07995j85314N69672
$$ y = [-45855, -284636, 55466, -161000, -14709, 40711, 63788, 212122, -320702, 196133, 432178, 174754, -224336, -304222, -280344, -394114, -85013, 42102, 89552, 205339, -10870, -178469, -212435, -164327, -48994, 18567, 333916, 168990, 51890, 112462, -213907, 111404, 364529, 511653, 729669, 540633, 199868, 356678, 257403, 118709, -209392, -233565, 170905, 128800, 341708, 298792, -362097, -269588, 12731, 791937, 506204, 226636, 325892, 288289, 123222, 604144, 476741, 75247, 253756, 268451, 409594, 467424, 360025, 186643, 157006, -175255, 24671, 35774, 210240, 41964, -259196, -110605, -33457, -197393, -415147, -523469, -334719, -476578, -709420, 332830, 224835, 39521, 609193]
356F09193J4291N0976j7803k24096J40798k38706k91283K48441K77631K61649
346H31091P0211l4425p09053M90219J46819j82342m03354k61500J15114M11634
336D74414K54123l16895J63736j69763P0509J24973M1223l32928K42878l09292
326B42978L71933K6640j75643m37637J55364k14802j70229M79169o57460n1348
316d31035M26466L17590K0509j58025m12769j93535R840K43062J09999J31209
306F3311L09858J99763k99151n82053K27442R1174j84133Q4331J81675j06702
296a4485k94276M60150l59546M40861L19260l65907K85694P8422J4728k45249
286C19652m67057j02928L44031M42442P2303J13601l94961j86674R4871k87074
$$ y = [609193, 623484, 674460, 656657, 432561, 573359, 334653, 43370, 291811, 569442, 831091, 901302, 866877, 157824, 648043, 794862, 612520, 209166, -52334, 62780, 474414, 728537, 411642, 575378, 405615, 476124, 601097, 642320, 309392, 552270, 242978, 614911, 641551, 465908, 28271, 183635, -31167, -201396, 277773, -379687, -431035, -4569, 313021, 333530, 175505, -237264, -430799, -420959, -177897, -67898, 63311, 373169, 572932, 273781, -308272, -80830, 10344, -173789, -89458, 92217, -14485, -308761, 151389, -208157, 232704, 551964, 186057, 471751, 550173, 564901, 319652, -147405, -250333, 93698, 536140, 608443, 722044, 327083, 140409, 235280, -51794]
276e1794j08921J15282r6869L27680j33387M7680K11875J65388m17167l5023J42072
265A66816L07087k20892j62276r6560R6126K59329l73499M76200R5406k02993
255C44744r0437m61550L48497L41048o1895j29466j86507j06029R6206j71348
245g6737K84651J36697k08343J52264J12521k04087K48311L08815l36579j99906
235B17607K25883m4567O21811q8503o99518n82109L00330L20627K18224L35726
225H25511m35525m72531j19798M97157n29680j02771K85938K95894k34334L46598
215C56459Q2398P4390o20712J27739M54118M40558n55031K77050j77827j36511
205C22631L26368j85077K2510o5328r1694q7965O2324N6933L4339k91545M7738
$$ y = [-51794, -160715, -45433, -142302, 185378, 51991, 99671, 311546, 476934, 59767, 24744, 166816, 473903, 253011, 90735, -5825, 90301, 349630, -23869, 452331, 547737, 344744, 254307, -207243, 141254, 482302, 420407, 290941, 104434, -1595, 94611, -76737, 207914, 344611, 136268, 288532, 401053, 196966, 445277, 754092, 417513, 217607, 443490, 398923, 1020734, 932231, 232713, -349396, -49066, 271561, 489785, 825511, 389986, -82545, -202343, 294814, -234866, -337637, -51699, 244195, 9861, 356459, 438857, 513247, -107465, 20274, 474392, 914950, 359919, 636969, 459142, 322631, 648999, 463922, 486432, 421104, 329410, 241445, 303769, 360702, 395041, 103496, 151234]
194A51234N1935m5171K59624k19627L01237K85100j91358J85996L1714l00805
184E09879n5693l1297k77390k74617k55539J38259N32683j33570O2426J38924
174C54065J49917M4156k25723r653K2410K85306j91143l83712j32725J25443L03174
163C41515K8151j44302N6879k49320k51391R0359J93528M97590l47345l00706
153h5042K17875K8214K50187k08743J97693N6661j0891j7480j13156K9374k25473
142A19219m9293K67903o17276l4588L27900M01221n5646l25179J04148j61150
132b2741j09840Q7933R4149l0876J1303N05956o36091k13283J79961M39419J57685
121D63575k01828J57263r1954k67886l6999J33197M01938J10061j88585P4744
$$ y = [151234, 203169, 157998, 417622, 197995, 499232, 784332, 592974, 778970, 810684, 509879, 454186, 422889, 145499, -129118, -384657, -246398, 286285, 152715, 215141, 354065, 503982, 548138, 322415, 312762, 335172, 620478, 429335, 45623, -87102, 38341, 341515, 369666, 225364, 282243, 32923, -218468, -128109, 65419, 563009, 215664, -85042, 132833, 161047, 411234, 202491, 400184, 456845, 445954, 428474, 315318, 344692, 119219, 69926, 337829, -279447, -314035, 13865, 415086, 359440, 34261, 138409, -22741, -132581, -44648, 49501, 18625, 29928, 535884, -100207, -313490, -133529, 305890, 463575, 261747, 419010, 327056, 59170, 22171, 155368, 557306, 667367, 478782, 553526]
111E53526j86034l04970q1801K39702J45227l81329P0779J85237j4247J50333
101C76423l50812j55319K61720j69284J18952K5995j3531J63889q1175r2338M3382
90A27902J07334K45301p6176l96150K17701J59162k99884L4560K99898M8565r1103
79C77110n2603J86219r4919l38164J88062J54284l5899l15446K11500J37262m48715
68c1309L14110R7079K52985j81355m64250M03880K43912M3208k19785j98845j83676
57G5954J65181M40625k29199j59849L83009J21738p417l05859k31543K2602m26260
46a51018J18336K50557J79259J17365j00234o7724J90047k16695l4940l8723k45207
35A023j51210L27429M19556j88282k92655L1779p1500K42657J44591Q3227n54846
$$ y = [553526, 367492, 62522, -19279, 220423, 365650, -15679, 55100, 240337, 226090, 376423, 25611, -129708, 132012, -37272, 81680, 107675, 94144, 258033, 176858, 84520, 127902, 235236, 480537, 404361, 8211, 225912, 385074, 85190, 119750, 419648, 468213, 377110, 324507, 510726, 415807, 77643, 265705, 419989, 384090, 68644, 280144, 417406, -31309, 282801, 379880, 632865, 451510, -12740, 391140, 635052, 678260, 458475, 259630, 75954, 241135, 681760, 452561, 292712, 675721, 797459, 790042, 484183, 252640, 275242, -151018, -32682, 217875, 397134, 514499, 414265, 346541, 536588, 319893, 284953, 246230, 1023, -150187, 177242, 596798, 408516, 115861, 147640, 76140, 318797, 463388, 546615, -8231]
24h231P3296J43199J88268j41284l31644j5303o4291J72738P4332k2553J32234
13B00761K79357j23574l8991K1100K31114J3325k32595m22319K194P1074K93283
2B94729K93452j99322
0C88859
$$ y = [-8231, 65065, 208264, 396532, 255248, -76396, -91699, -155990, 16748, 91080, 68527, 200761, 480118, 356544, 317553, 338653, 569767, 583092, 350497, -71822, -69628, 1446, 294729, 588181, 388859]
$$ Imaginary data points
##PAGE= N=2
##DATA TABLE= (X++(I..I)), XYDATA
16383c127828N1774k276n5687L9144K44895n3007m66910O0401M03806J88580l9470
16372b756578o6312P7797K48742O1198M36272M5542J64991K15259J48719k66859
16362a691229l13510o8248M77950P0265Q6066k22774j09358L12583j5569j86101
16352a659925J89887J49437J72398k03487o971J24690q8462n9091K99762K5352
16342a056410j64576O1720o9443K77994M673K5584M36509k21325j75558J22517
16332g58315J82176K1365O1431L02484J7794o2676P6406K95865j15961J37096
16322A57665k18411k80428M31582K19133r5012j79121l97942O05299N0964J23178
16312D16907l0331j30638L7453j6883J78138l01563j5875j43252K69483M50020
$$ y = [-3127828, -3076054, -3078330, -3134017, -3094873, -2849978, -2902985, -3369895, -3309494, -2905688, -2717108, -2756578, -2822890, -2745093, -2496351, -2435153, -1998881, -1953339, -1788348, -1573089, -1424370, -1691229, -2004739, -2072987, -1595037, -1524772, -1438706, -1661480, -1770838, -1458255, -1473824, -1659925, -1470038, -1320601, -1148203, -1351690, -1358661, -1233971, -1322433, -1381524, -1081762, -1056410, -1220986, -1159266, -1228709, -950715, -946042, -920458, -483949, -705274, -880832, -758315, -576139, -554774, -493343, -190859, -173065, -235741, -159335, 136530, 20569, 157665, -60746, -341174, 90408, 309541, 214529, 35408, -362534, 242765, 293729, 416907, 386576, 255938, 293391, 276508, 454646, 153083, 137208, -6044, 263439, 713459]
16302G13459n7856J36047M26057l90716j31487K58228r8081K62425j52292N8229
16292A024013K72941P2189Q3422m4265m33186r9912J10563J65993P23280j62279
16282A712759k61397L9233L87738N08991j87989k40025j30121l8445K78856p4459
16272A995141k69737L01216L23139k27874J039j68294j29364K92393L09539n6447
16262B370751l20326l3683M2618J10773R3007j08700j53317K34858J98630L81773
16252B816384r5515j55122N406K21610m58037L5982J83090J57263j72176j52158
16242B386727J9K53286K0369l60296K71087N33498k11592j466J43089k00288J65990
16231C000423M01710k74641J06245L17752o6281k56616J20872J09727k5152J72084
$$ y = [713459, 655603, 791650, 1217707, 826991, 695504, 953732, 855651, 1118076, 965784, 1024013, 1296954, 1369143, 1452565, 1408300, 975114, 875202, 985765, 1151758, 1875038, 1712759, 1451362, 1490595, 1878333, 2387324, 2199335, 1959310, 1829189, 1790744, 2069600, 1995141, 1725404, 2026620, 2349759, 2121885, 2122924, 1954630, 1825266, 2117659, 2427198, 2370751, 2050425, 2016742, 2059360, 2170133, 2263140, 2154440, 2001123, 2235981, 2434611, 2816384, 2720869, 2565747, 2571153, 2792763, 2334726, 2370708, 2553798, 2711061, 2538885, 2386727, 2386746, 2640032, 2660401, 2300105, 2571192, 3104690, 2893098, 2891632, 3034721, 2834433, 3000423, 3402133, 3127492, 3233737, 3551489, 3485208, 3228592, 3349464, 3459191, 3434039, 3606123]
16221C606123M73635J63656m65715q15529j51624L22411k7262K39184l5339L85281
16211C694821k9628n9794j45079L87833J66626P0839k65300n61726n25340O31867
16201C365119P76115j81109j51843M74078N1616m92992P531L02014k29592J18221
16191D039158J63368k44935l4585P7273L79948l22706m63841L56074J67704n18173
16181C599285P5175K82613J54704K04764p6373P2976n62950j24627P35445p3426
16171D287586l91453k69346k13956L61455L49744J57437J92167L34056m90732
16162D316958J90150J33507K9872m75074J44964K05081j49227P9019J82127O5524
16152D722901l09544l16973P9053J54397j68480L22330O4303m34341M44366M09272
$$ y = [3606123, 4079758, 4243414, 3777699, 2962170, 2810546, 3132957, 3105695, 3344879, 3309540, 3694821, 3665193, 3605399, 3460320, 3848153, 4014779, 4085618, 3820318, 3258592, 2733252, 3365119, 4141234, 3960125, 3808282, 4282360, 4333976, 3840984, 3848515, 4150529, 3920937, 4039158, 4202526, 3957591, 3923006, 4000279, 4380227, 4057521, 3593680, 3949754, 4117458, 3599285, 3674460, 3957073, 4111777, 4316541, 4240168, 4313144, 3750194, 3625567, 4361012, 4287586, 3896133, 3626787, 3412831, 3774286, 4124030, 4281467, 4473634, 4807690, 4316958, 4507108, 4640615, 4670487, 4195413, 4340377, 4545458, 4396231, 4475250, 4657377, 4722901, 4413357, 4096384, 4175437, 4329834, 4161354, 4483684, 4547987, 4113646, 4558012, 4967284]
16142D967284n14645j53155K01910l35344l4329R09577j31426k16964K07226Q3578
16132D983712j74197m65306k77936O99572k86934J77910k5396J59209j40436m10223
16122D239975N04967k43862k37453L89813k42407N1716r366j98514j33836n6779
16112D064254K38139J72221n7831N90718L25566m91173N418n274l11758M5324
16102D575604N2421J78833K904k796k7554l73740q7070K12834J37587k37800J72446
16091D603669L82093k06396j2951K47434J02681j42291M90297l26584l77755J06111
16081D866308K65437m41807m24456N18536k83119Q13145K4039l04711n4074o5633
16071D913665l33953O43016j25794k29808L38958q2081Q7022k49599k5192L86426
$$ y = [4967284, 4452639, 4299484, 4501394, 4166050, 4131721, 5041298, 4909872, 4692908, 4900134, 4983712, 4809515, 4344209, 4066273, 4765845, 4478911, 4656821, 4631425, 4790634, 4650198, 4239975, 4744942, 4501080, 4263627, 4653440, 4411033, 4462749, 4453383, 4254869, 4121033, 4064254, 4302393, 4474614, 4416783, 5007501, 5333067, 4841894, 4847312, 4842038, 4530280, 4575604, 4628025, 4806858, 4809762, 4806966, 4779412, 4405672, 4318602, 4531436, 4669023, 4431223, 4603669, 4985762, 4779366, 4766415, 5013849, 5116530, 4974239, 5464536, 5137952, 4760197, 4866308, 5131745, 4689938, 4265482, 4784018, 4500899, 5314044, 5338083, 5033372, 4979298, 4913665, 4579712, 5222728, 5096934, 4867126, 5206084, 5124003, 5211025, 4961426, 4936234, 5322660]
16061E322660j89379q21388J25159L69904j61020J78313L76910j17695j64923
16052D918541L18955M5086o8068k68062M7681K29845l31724K11010j92372j05797
16042D805095O56973n5758k64672n57945O5297O85560M45560m96250o99305K5369
16032D609924L34631l70410l43385M31738K85930j14831L538j92538k67378L51014
16022D728233M00860n8017m26348m05484K68012N2230j65002n725J53149J38523
16012D680431k66714L67038J17001k36519L09839k2625p97853K77230M06124p0590
16002D763362k20457J30611l96974N6783J62643K91624l47676K01083J6895m2135
15992D615759Q50994l1155k94406K13290k25850n86704J84498J46904K42792l34104
$$ y = [5322660, 5133281, 4311893, 4437052, 4806956, 4645936, 4824249, 5201159, 5083464, 4918541, 5237496, 5282582, 5214514, 4946452, 4994133, 5223978, 4892254, 5103264, 4910892, 4805095, 5462068, 5406310, 5141638, 4583693, 4648990, 5334550, 5780110, 5283860, 4584555, 4609924, 4944555, 4574145, 4230760, 4662498, 4948428, 4833597, 4837135, 4644597, 4377219, 4728233, 5129093, 5071076, 4644728, 4239244, 4507256, 4559486, 4394484, 4388759, 4541908, 4680431, 4413717, 4780755, 4897756, 4661237, 4971076, 4948451, 4150598, 4427828, 4833952, 4763362, 4542905, 4673516, 4276542, 4333325, 4495968, 4787592, 4439916, 4640999, 4657894, 4615759, 5466753, 5435598, 5141192, 5354482, 5128632, 4541928, 4726426, 4873330, 5116122, 4782018]
15982D782018n812N13556Q9279o62554P1152N27635l00283j51750L07020K98507
15972E468768J99987n76670l51427K48390k04848r8613K09133M60404o79599L55275
15962E030800j29070l33307J7107L31731K31471n52121k7844P74828l44765j33330
15952D865500K81418k05722K15361m38302L50748j98389N1611k4765k19581K77034
15942D954913J67871l32200J77869m74001k52544J15465L17294O7261M28756m2648
15932E128036j22605l74569n67279L03328j39824p5472l7506Q89316k20698k17528
15922D565199N3689k47049N66140j7749Q5515k0224J18908k95572j05224j22129
15912D581504J33033J28293k51078j52004l9275L28171K02048j82180m2918j51757
$$ y = [4782018, 4776206, 5289762, 5379041, 4716487, 4787639, 5315274, 5014991, 4863241, 5170261, 5468768, 5668755, 5092085, 4740658, 4989048, 4784200, 4685587, 4894720, 5355124, 4675525, 5030800, 4901730, 4568423, 4585530, 4917261, 5148732, 4596611, 4568767, 5343595, 4998830, 4865500, 5146918, 4941196, 5156557, 4718255, 5069003, 4870614, 4922225, 4897460, 4677879, 4954913, 5122784, 4790584, 4968453, 4494452, 4241908, 4357373, 4674667, 4741928, 5170684, 5128036, 5005431, 4630862, 4063583, 4366911, 4227087, 4151615, 4114109, 5003425, 4782727, 4565199, 4618888, 4371839, 4937979, 4920230, 5005745, 4985521, 5104429, 4808857, 4703633, 4581504, 4714537, 4842830, 4591752, 4439748, 4400473, 4728644, 4930692, 4748512, 4705594, 4553837]
15902D553837p04388k67411J066947N37815m22035M55909j05538n0511N1830M0635
15892E157090j97172r1393k08423k22443P1871K19184J92594K03073j91615J78763
15882E111529n3457J51635l39958j8574J45302j56461J70098J4548J63740N0991
15872E239393p6315l42981k1583K40549J36106K60423M75162n89472J45992j87214
15862E280060j24804l07194K07683K45238n36002J07621k19922J08332J38929
15853D899941J01993k08827j15525k42069N8438M81049K17532K55191j06819J02701
15843E443605o77810m95216J77769J38762J774L71480l29047j70296K61461P880
15833D730362j25654j86439N37867K29996J67457j3596L0084j06697k51346K4725
$$ y = [4553837, 3849449, 3582038, 4648985, 5186800, 4764765, 5220674, 5115136, 5064625, 5116455, 5157090, 4959918, 4868525, 4660102, 4437659, 4509530, 4728714, 4921308, 5124381, 4932766, 5111529, 5058072, 5209707, 4869749, 4851175, 4996477, 4840016, 5010114, 5024662, 5188402, 5239393, 5163078, 4820097, 4798514, 5039063, 5175169, 5435592, 5910754, 5321282, 5467274, 5280060, 5155256, 4848062, 5055745, 5300983, 4764981, 4872602, 4652680, 4761012, 4899941, 5001934, 4793107, 4677582, 4435513, 4493951, 4975000, 5192532, 5447723, 5340904, 5443605, 4765795, 4270579, 4448348, 4587110, 4588884, 4960364, 4631317, 4461021, 4722482, 4730362, 4604708, 4418269, 4956136, 5186132, 5353589, 5339993, 5370077, 5263380, 5012034, 5036759]
15823E036759j93462N13271k61162n81727N5630K86150L59170J0431J55395j48576
15813E231879J95713m88089q0748L72199N8696l60230k44383k41867N3173L79677
15803D876020r1610N98454q8336k75023l9499k3324K09035l52412O27258k01859
15793E238704l0270L97853m01994k88599k5389L83310n20336j17793L42545l05057
15783D672974K38281L13741k25123L52254L93031k45158k49228l00743Q26202
15774E776231m62902n13858N29185j92208L80567q1226r47310o667K82123l79227
15764D384708K19929K76954J54186Q4319j23311l37171K06965O73510n15238K8009
15754E052860R8694j74568R4991k2458J33385k4527l60787K29067N0632l06446
$$ y = [5036759, 4843297, 5356568, 5095406, 4513679, 4569309, 4855459, 5214629, 5225060, 5380455, 5231879, 5427592, 4939503, 4858755, 5230954, 5289650, 4929420, 4685037, 4443170, 4496343, 4876020, 4784410, 5382864, 5294528, 5019505, 4980006, 4956682, 5165717, 4813305, 5440563, 5238704, 5208434, 5606287, 5204293, 4915694, 4890305, 5273615, 4753279, 4635486, 4978031, 4672974, 4911255, 5224996, 4999873, 5352127, 5745158, 5500000, 5250772, 4950029, 5776231, 5313329, 4799471, 5328656, 5136448, 5517015, 5435789, 4488479, 4481812, 4763935, 4384708, 4604637, 4881591, 5035777, 5120096, 4996785, 4659614, 4866579, 5540089, 5024851, 5052860, 5151554, 4976986, 5071977, 5049519, 5182904, 5158377, 4797590, 5026657, 5077289, 4770843]
15744D770843l56709k59704N09266J39262M8368J28959M17885n2398m59241R6291
$$ y = [4770843, 4414134, 4154430, 4663696, 4802958, 4851326, 4980285, 5398170, 5345772, 4886531, 4982822]
$$ [...]
##END NTUPLES=NMR SPECTRUM
##END=
