##TITLE=1H_TG-2411-2
 200.13Hz, DMSO-d6+CCl4.
 8 sc
 14.7.2026
##JCAMPDX= 6.0         $$ Bruker NMR JCAMP-DX V2.0
##DATA TYPE= NMR SPECTRUM
##DATA CLASS= NTUPLES
##ORIGIN= UXNMR, Bruker Analytische Messtechnik GmbH
##OWNER= pz
$$ XWIN-NMR		Version 3.5
$$ Tue Jul 14 13:29:48 2026 Russian Standard Time (UT+4h)  she@DPX200
##.OBSERVE FREQUENCY= 200.1313
##.OBSERVE NUCLEUS= ^1H
##.ACQUISITION MODE= SIMULTANEOUS
##.ACQUISITION SCHEME= undefined
##.AVERAGES= 8
##.DIGITISER RES= 18
##SPECTROMETER/DATA SYSTEM= spect
##.PULSE SEQUENCE= zg30
##.SOLVENT NAME= DMSO
##.SHIFT REFERENCE= (INTERNAL, DMSO, 0, 15.5056)
##AUDIT TRAIL= $$ (NUMBER, WHEN, WHO, WHERE, WHAT)
$$ ##TITLE= Audit trail, XWIN-NMR		Version 3.5
$$ ##JCAMPDX= 5.01
$$ ##ORIGIN= Bruker BioSpin GmbH
$$ ##OWNER= she
$$ F:/spectra/data/she/nmr/H-C/1/pdata/1/auditp.txt
$$ ##AUDIT TRAIL=  $$ (NUMBER, WHEN, WHO, WHERE, WHAT)
(   1,<2026-07-14 13:28:28.29 +0400>,<she>,<DPX200>,
      <created by zg, POWCHK disabled, PULCHK disabled
       configuration hash MD5:
       00 E9 B6 7A A2 85 ED C7 34 08 36 98 17 FE 4E 26
       data hash MD5: 16K
       49 5A 58 21 FC EC 0A 1B 2F FE 94 68 9D 06 28 5B>)
(   2,<2026-07-14 13:28:32.48 +0400>,<she>,<DPX200>,
      <Start of raw data processing
       efp BC_mod = 2 LB = 0.25 FT_mod = 6 PKNL = 1 PHC0 = -4219.634 PHC1 = 9.7923 SI = 16K 
       data hash MD5: 16K
       66 F0 69 A3 D9 77 B9 0A A8 68 AC 2E 1F F5 98 E1>)
(   3,<2026-07-14 13:28:53.82 +0400>,<she>,<DPX200>,
      <pk PHC0 = -0.1539281 PHC1 = 0 
       data hash MD5: 16K
       F9 48 06 BA 28 3E 16 25 68 1C BD 86 55 4E 24 69>)
(   4,<2026-07-14 13:28:57.46 +0400>,<she>,<DPX200>,
      <abs ABSG = 5 
       data hash MD5: 16K
       EE 79 C3 E1 F2 FA CF 1F F6 C0 B6 E9 CA 72 4E 86>)
$$ ##END=
$$ 
$$ hash MD5
$$ 3F 65 F0 26 22 1A 47 CF 6B 97 01 8C C7 CC 5A C4
##$RELAX= 
##$RELAX= 
##$RELAX= 
##$RELAX= 
##$RELAX= 
##$RELAX= 
$$ Bruker specific parameters
$$ --------------------------
##$DU= <F:/spectra>
##$EXPNO= 1
##$NAME= <H-C>
##$PROCNO= 1
##$TYPE= <nmr>
##$USER= <she>
##$AMP= (0..31)
100 100 100 100 100 100 100 100 100 100 100 100 100 100 100 100 100 100 
100 100 100 100 100 100 100 100 100 100 100 100 100 100 
##$AQSEQ= 0
##$AQ_mod= 1
##$AUNM= <au_zg>
##$AUTOPOS= <>
##$BF1= 200.13
##$BF2= 200.13
##$BF3= 200.13
##$BF4= 200.13
##$BF5= 200.13
##$BF6= 200.13
##$BF7= 200.13
##$BF8= 200.13
##$BYTORDA= 1
##$CFDGTYP= 0
##$CFRGTYP= 5
##$CHEMSTR= <none>
##$CNST= (0..31)
1 1 145 1 1 1 1 1 1 1 1 1 1 1 1 1 1 1 1 1 1 1 1 1 1 1 1 1 1 1 1 1 
##$CPDPRG= <>
##$CPDPRG1= <>
##$CPDPRG2= <>
##$CPDPRG3= <>
##$CPDPRG4= <mlev>
##$CPDPRG5= <mlev>
##$CPDPRG6= <mlev>
##$CPDPRG7= <mlev>
##$CPDPRG8= <mlev>
##$CPDPRGB= <>
##$CPDPRGT= <>
##$D= (0..31)
0 0.7 0 0 0 0 0 0 0 0 0 0.03 0 0 0 0 0 0 0 0 0 0 0 0 0 0 0 0 0 0 0 0 
##$DATE= 1784021307
##$DBL= (0..7)
120 120 120 120 120 120 120 120 
##$DBP= (0..7)
150 150 150 150 150 150 150 150 
##$DBP07= 0
##$DBPNAM0= <>
##$DBPNAM1= <>
##$DBPNAM2= <>
##$DBPNAM3= <>
##$DBPNAM4= <>
$$ [...]
##$SUBNAM3= <"">
##$SUBNAM4= <"">
##$SUBNAM5= <"">
##$SUBNAM6= <"">
##$SUBNAM7= <"">
##$SUBNAM8= <"">
##$SUBNAM9= <"">
##$SW= 18.0517328524113
##$SWIBOX= (0..15)
0 0 2 0 0 0 0 0 0 0 0 0 0 0 0 0 
##$SW_h= 3612.71676300578
##$TD= 16384
##$TD0= 1
##$TE= 0
##$TE2= 300
##$TE3= 300
##$TEG= 300
##$TL= (0..7)
0 120 120 120 120 120 120 120 
##$TP= (0..7)
150 150 150 150 150 150 150 150 
##$TP07= 0
##$TPNAME0= <>
##$TPNAME1= <>
##$TPNAME2= <>
##$TPNAME3= <>
##$TPNAME4= <>
##$TPNAME5= <>
##$TPNAME6= <>
##$TPNAME7= <>
##$TPOAL= (0..7)
0.5 0.5 0.5 0.5 0.5 0.5 0.5 0.5 
##$TPOFFS= (0..7)
0 0 0 0 0 0 0 0 
##$TUNHIN= 0
##$TUNHOUT= 0
##$TUNXOUT= 0
##$USERA1= <user>
##$USERA2= <user>
##$USERA3= <user>
##$USERA4= <user>
##$USERA5= <user>
##$V9= 5
##$VALIST= <valist>
##$VCLIST= <CCCCCCCCCCCCCCC>
##$VD= 0
##$VDLIST= <DDDDDDDDDDDDDDD>
##$VPLIST= <PPPPPPPPPPPPPPP>
##$VTLIST= <TTTTTTTTTTTTTTT>
##$WBST= 1024
##$WBSW= 4
##$XGAIN= (0..3)
0 0 0 0 
##$XL= 0
##$YL= 0
##$YMAX_a= 446947
##$YMIN_a= -435392
##$ZGOPTNS= <>
##$ZL1= 120
##$ZL2= 120
##$ZL3= 120
##$ZL4= 120
##$ABSF1= 15.50119
##$ABSF2= -2.550659
##$ABSG= 5
##$ABSL= 3
##$ALPHA= 0
##$AQORDER= 0
##$ASSFAC= 0
##$ASSFACI= 0
##$ASSFACX= 0
##$ASSWID= 0
##$AUNMP= <proc_1d>
##$AZFE= 0.1
##$AZFW= 0.1
##$BCFW= 0
##$BC_mod= 2
##$BYTORDP= 0
##$COROFFS= 0
##$CY= -3
##$DATMOD= 1
##$DC= 0
##$DFILT= <>
##$DTYPP= 0
##$F1P= 0
##$F2P= 0
##$FCOR= 1
##$FTSIZE= 16384
##$FT_mod= 6
##$GAMMA= 0
##$GB= 0
##$INTBC= 1
##$INTSCL= 3.241238e-09
##$ISEN= 128
##$LB= 0.25
##$LEV0= 0
##$LPBIN= 0
##$MAXI= 10000
##$MC2= 0
##$MEAN= 0
##$ME_mod= 0
##$MI= 1.114404
##$NCOEF= 0
##$NC_proc= -6
##$NLEV= 6
##$NOISF1= 3.799351
##$NOISF2= 2.8
##$NSP= 0
##$NTH_PI= 0
##$NZP= 0
##$OFFSET= 15.5056
##$PC= 1
##$PHC0= -4219.788
##$PHC1= 9.7923
##$PH_mod= 1
##$PKNL= yes
##$PPARMOD= 0
##$PSCAL= 0
##$PSIGN= 0
##$REVERSE= no
##$SF= 200.130003224115
##$SI= 16384
##$SIGF1= 3
##$SIGF2= 2
##$SINO= 0.751879
##$SIOLD= 32768
##$SREGLST= <19F.Aceton>
##$SSB= 0
##$STSI= 16384
##$STSR= 0
##$SW_p= 3612.71676300578
##$SYMM= 0
##$S_DEV= 0
##$TDeff= 16384
##$TDoff= 0
##$TI= <>
##$TILT= no
##$TM1= 0
##$TM2= 0
##$TOPLEV= 0
##$USERP1= <user>
##$USERP2= <user>
##$USERP3= <user>
##$USERP4= <user>
##$USERP5= <user>
##$WDW= 1
##$XDIM= 16384
##$YMAX_p= 341117239
##$YMIN_p= -578132
$$ End of Bruker specific parameters
$$ ---------------------------------
##NTUPLES= NMR SPECTRUM
##VAR_NAME=  FREQUENCY,     SPECTRUM/REAL,   SPECTRUM/IMAG
##SYMBOL=    X,             R,               I
##VAR_TYPE=  INDEPENDENT,   DEPENDENT,       DEPENDENT
##VAR_FORM=  AFFN,          ASDF,            ASDF
##VAR_DIM=   16384,         16384,           16384
##UNITS=     HZ,            ARBITRARY UNITS, ARBITRARY UNITS
##FACTOR=    0.220516191357247, 1,           1
##FIRST=     3103.13577310585, 0,            0
##LAST=      -509.580989899929, 0,           0
##MIN=       -509.580989899929, -578132,     0
##MAX=       3103.13577310585, 341117239,    0
$$ Real data points
##PAGE= N=1
##DATA TABLE= (X++(R..R)), XYDATA
$$ [...]
$$ plain form
5890 6118670 6108961 6151114 6250327 6344535 6433289 6454310 6482906 6707318 6655810 6652056 6875205
5879 6875205 7095745 7163297 7232355 7284393 7498845 7530904 7489947 7591487 7596719 7705945 7814046
5868 7814046 7934166 8073016 8124432 8252493 8324779 8498592 8612020 9015938 9135270 8943100
5858 8943100 8993416 9163872 9239053 9605498 9761647 9848199 9904984 10151314 10104750 10015233 10303940
5847 10303940 10752499 10873277 10676077 10927579 11212902 11233959 11327799 11474531 11552714 11672399
5837 11672399 11805503 11788629 11763185 11935674 12124175 12128827 12134759 12417816 12660178 12743122 12804499
5826 12804499 13029107 13193892 13171848 13370693 13369370 13420451 13553451 13603398 13921985 13992996
5816 13992996 14138550 14205277 14247217 14363553 14494737 14634304 14759649 14881889 14840705 14719038
$$ packed form
5890F118670r709M2153R9213R4208Q8754K1021K8596K24412n1508l754K23149
5879F875205K20540O7552O9058N2038K14452L2059m0957J01540N232J09226J08101
5868G814046J20120J38850N1416J28061P2286J73813J13428M03918J19332j92170
5858H943100N0316J70456P5181L66445J56149Q6552N6785K46330m6564q9517K88707
5847A0303940M48559J20778j97200K51502K85323K1057R3840J46732P8183J19685
5837A1672399J33104j6874k5444J72489J88501M652N932K83057K42362Q2944O1377
5826A2804499K24608J64785k2044J98845j323N1081J33000M9947L18587P1011
5816A3992996J45554O6727M1940J16336J31184J39567J25345J22240m1184j21667
$$ plain form
5806 14719038 14778592 14834635 14863400 14966918 15199310 15165856 15296339 15385078 15390378 15418180 15320375
5795 15320375 15265992 15339302 15549105 15448929 15375983 15391074 15514232 15489294 15457948 15495952 15379250
5784 15379250 15253081 15195596 15345481 15211376 15237638 15304275 15306261 15234189 15137868 15212145 15383385
5773 15383385 15581150 15534408 15330931 15158365 15280458 15444059 15365308 15430098 15623090 15977278
5763 15977278 16265927 16660089 17411493 18431824 19689404 21772328 25456830 31099373 38366706
5754 38366706 45942130 51444393 54430019 54852287 53275835 49480724 44263586 39413667
5746 39413667 35293441 31257098 26950867 23518727 20742383 18868189 17450070 16451907
5738 16451907 15370119 14541614 13909521 13346919 12742808 12151676 11648350 11402964 11066790
$$ packed form
5806A4719038N9554N6043K8765J03518K32392l3454J30483Q8739N300K7802r7805
5795A5320375n4383P3310K09803j00176p2946J5091J23158k4938l1346L8004j16702
5784A5379250j26169n7485J49885j34105K6262O6637J986p2072r6321P4277J71240
5773A5383385J97765m6742k03477j72566J22093J63601p8751O4790J92992L54188
5763A5977278K88649L94162P51404J020331J257580K082924L684502N642543P267333
5754C8366706P575424N502263K985626M22268j576452l795111n217138m849919
5746C9413667m120226m036343m306231l432140k776344j874194j418119r98163
5738A6451907j081788q28505o32093n62602o04111n91132n03326k45386l36174
$$ plain form
5729 11066790 10703245 10706373 10512365 10192730 10057433 9924034 9773250 9715751 9521169 9636785
5719 9636785 9389886 9185591 9115507 9033893 8876430 8631713 8375778 8274708 8191472 8150269
5709 8150269 8091247 7847626 7759474 7639198 7365333 7164502 7344266 7164757 6974817 7023274
5699 7023274 7035787 6897201 6741026 6782798 6742256 6516181 6335269 6349123 6330127 6392943 6200908
5688 6200908 6257250 6242020 6110329 6086865 5998595 5758793 5801818 5782446 5603817 5641242 5745384
5677 5745384 5652409 5461423 5341624 5251542 5235366 5201915 5241714 5150743 5022511 5028161 5264771
5666 5264771 5246891 5136090 4940065 4759577 4681640 4527679 4581150 4708976 4745874 4734188
5656 4734188 4684114 4644826 4550878 4399862 4601360 4508625 4241164 4300169 4328192 4438589 4481420
$$ packed form
5729A1066790l63545L128j94008l19635j35297j33399j50784n7499j94582J15616
5719I636785k46899k04295p0084q1614j57463k44717k55935j01070q3236m1203
5709H150269n9022k43621q8152j20276k73865k00831J79764j79509j89940M8457
5699G023274J2513j38586j56175M1772m0542k26075j80912J3854j8996O2816j92035
5688F200908N6342j5230j31691k3464q8270k39802M3025j9372j78629L7425J04142
5677E745384r2975j90986j19799r0082j6176l3451L9799r0971j28232N650K36610
5666E264771j7880j10801j96025j80488p7937j53961N3471J27826L6898j1686
5656D734188n0074l9288r3948j51016K01498r2735k67461N9005K8023J10397M2831
$$ plain form
5645 4481420 4233352 4096427 4286924 4455678 4361231 4132614 4093574 4277567 4335702 4194149
5635 4194149 4120633 4250247 4249898 4134702 4185554 4236673 4135639 3819075 3833616 4080670 3868473
5624 3868473 3750064 3741172 3722991 3740584 3640859 3655336 3780457 3801131 3773665 3814690 3853424
5613 3853424 4084410 3797804 3761993 3833139 3881669 3899099 3781985 3770510 3807560 3724303 3701911
5602 3701911 3628795 3666897 3720031 3734146 3802253 3681710 3616621 3724404 3905501 3828925 3610253
5591 3610253 3799341 3730528 3814692 3852232 3699131 3818549 3899820 3861317 3861343 3904864 3833022
5580 3833022 3831033 3770934 3814480 3971545 3954741 3842436 3855122 3786522 3566374 3582393 3508544
5569 3508544 3536022 3736867 3768534 3706514 3881066 3710540 3651679 3733948 3563710 3554060 3544323
$$ packed form
5645D481420k48068j36925J90497J68754r4447k28617l9040J83993N8135j41553
5635D194149p3516J29614l49j15196N0852N1119j01034l16564J4541K47054k12197
5624C868473j18409q892j8181J7593r9725J4477J25121K0674k7466M1025L8734
5613C853424K30986k86606l5811P1146M8530J7430j17114j1475L7050q3257k2392
5602C701911p3116L8102N3134J4115O8107j20543o5089J07783J81097p6576k18672
5591C610253J89088o8813Q4164L7540j53101J19418Q1271l8503K6M3521p1842
5580C833022j989o0099M3546J57065j6804j12305J2686o8600k20148J6019p3849
5569C508544K7478K00845L1667o2020J74552j70526n8861Q2269j70238r650r737
$$ plain form
5558 3544323 3583027 3659764 3635809 3681187 3640400 3861118 4029734 3924735 4005171 4165886 4157925
5547 4157925 4049340 4049255 3903149 3999798 3962566 3951125 3860399 3945431 3864804 3958586 4130733
5536 4130733 4098716 4142415 4178921 4177888 4283719 4369785 4303074 4398735 4573431 4491902 4611979
5525 4611979 4653524 4568920 4569789 4707178 4654316 4798321 4873847 4881118 4763314 4727375 4807596
5514 4807596 4988395 5134484 5317152 5500191 5420095 5525630 5754397 5967870 6094785 6392922
5504 6392922 6949528 7550859 8451790 9831192 11361555 12917099 14318789 14907430 14995721
5495 14995721 14630258 13868780 12895957 12040166 11227273 10462585 9762547 9233464 8767403
5486 8767403 8285329 8037469 7942335 7975478 7951200 7932911 8071506 8377348 8335237 8680759
$$ packed form
5558C544323L8704P6737k3955M5378m0787K20718J68616j04999Q0436J60715p961
5547D157925j08585q5j46106R6649l7232j1441r0726Q5032q0627R3782J72147
5536D130733l2017M3699L6506j033J05831Q6066o6711R5661J74696q1529J20077
5525D611979M1545q4604Q69J37389n2862J44005P5526P271j17804l5939Q0221
5514D807596J80799J46089J82668J83039q0096J05535K28767K13473J26915K98137
5504F392922N56606O01331R00931J379402J530363J555544J401690N88641Q8291
5495A4995721l65463p61478r72823q55791q12893p64688p00038n29083m66061
5486H767403m82074k47860r5134L3143k4278j8289J38595L05842m2111L45522
$$ plain form
5476 8680759 9148794 9904803 10604939 11576047 13201837 15387177 18461670 22579981 27236582
5467 27236582 31700020 34971897 36519992 36262368 34463590 31687838 28697322 25827181
5459 25827181 22921972 20223117 17819074 15602514 14067496 13220397 12507178 11831392 11361422
5450 11361422 11141788 11058356 10938096 10724120 10932516 11028662 11235784 11827003 12692504 13693190
5440 13693190 15176680 17718436 21315039 26011671 30832154 34951539 37839096 38779384
5432 38779384 37696924 35455159 32569283 29497951 26316091 23404906 20715253 18257308
5424 18257308 16136662 14499950 13609284 12669137 11945084 11434995 11273408 10853461 10312508
5415 10312508 10175524 10123814 9967673 10066536 10178965 10573422 11171019 11710301 12754394 14018084
$$ packed form
5476H680759M68035P56009P00136R71108J625790K185340L074493M118311M656601
5467B7236582M463438L271877J548095k57624j798778k775752k990516k870141
5459B5827181k905209k698855k404043k216560j535018q47099p13219o75786m69970
5450A1361422k19634q3432j20260k13976K08396R6146K07122N91219Q65501J000686
5440A3693190J483490K541756L596603M696632M820483M119385K887557R40288
5432C8779384j082460k241765k885876l071332l181860k911185k689653k457945
5424A8257308k120646j636712q90666r40147p24053n10089j61587m19947n40953
5415A0312508j36984n1710j56141R8863J12429L94457N97597N39282J044093J263690
$$ plain form
5405 14018084 15629886 17124243 18542401 19266968 19257653 18619709 17628891 16617798 15643397
5396 15643397 14690257 13735775 12892394 12080257 11453733 10896794 10612130 10442234 10231759
5387 10231759 9918467 9963674 9940968 9647869 9463126 9416442 9266021 9297077 9572911 9394442
5377 9394442 9436141 9571360 9497029 9560482 9688602 9662669 9541975 9634992 9728458 9861939 10148846
5366 10148846 10157132 10030962 10092373 10262112 10199003 10229072 10342622 10316563 10398608 10370367 10556829
5355 10556829 10770609 10724767 11065920 11216843 11057197 10965331 11101362 11256588 11221213 11398580
5345 11398580 11676406 11821151 11879490 11845903 12011891 12048670 12021956 12202706 12499799 12618943
5335 12618943 12808397 12876034 12912929 13268630 13375708 13381570 13525325 13744137 13913622 14059840
$$ packed form
5405A4018084J611802J494357J418158P24567r315o37944r90818j011093r74401
5396A5643397r53140r54482q43381q12137o26524n56939k84664j69896k10475
5387A0231759l13292M5207k2706k93099j84743m6684j50421L1056K75834j78469
5377I394442M1699J35219p4331O3453J28120k5933j20694R3017R3466J33481K86907
5366A0148846Q286j26170O1411J69739o3109L0069J13550k6059Q2045k8241J86462
5355A0556829K13780m5842L41153J50923j59646r1866J36031J55226l5375J77367
5345A1398580K77826J44745N8339l3587J65988L6779k6714J80750K97093J19144
5335A2618943J89454O7637L6895L55701J07078N862J43755K18812J69485J46218
$$ plain form
5325 14059840 14051535 14155133 14307784 14495483 14780598 14982615 14880047 15085623 15265643 15471142
5315 15471142 15772826 15893694 16137948 16339800 16436150 16479589 16746571 16835115 17122547 17202526
5305 17202526 17449920 17674668 17825411 18213526 18537705 18700778 18734803 18847226 19015773 19224334
5295 19224334 19693875 20075658 20147733 20328721 20756527 21105052 21432022 21674913 21939945 22395555
5285 22395555 22581941 22830254 23184208 23575876 23885730 24262119 24508977 24698893 25133046
5276 25133046 25548537 25828348 26190304 26557506 26920894 27376926 27770985 28049474 28550746
5267 28550746 29003207 29371762 29746267 30297850 30752374 31000915 31371105 31853826 32330849
5258 32330849 32895540 33422063 33953225 34582418 35114225 35435029 35824807 36432127 37146317
$$ packed form
5325A4059840q305J03598J52651J87699K85115K02017j02568K05576J80020K05499
5315A5471142L01684J20868K44254K01852R6350M3439K66982Q8544K87432P9979
5305A7202526K47394K24748J50743L88115L24179J63073L4025J12423J68547K08561
5295A9224334M69541L81783P2075J80988M27806L48525L26970K42891K65032M55610
5285B2395555J86386K48313L53954L91668L09854L76389K46858J89916M34153
5276B5133046M15491K79811L61956L67202L63388M56032L94059K78489N01272
5267B8550746M52461L68555L74505N51583M54524K48541L70190M82721M77023
5258C2330849N64691N26523N31162O29193N31807L20804L89778O07320P14190
$$ plain form
5249 37146317 37697363 38433718 38993009 39299462 39847045 40587419 41172482 42004846 42669239
5240 42669239 43224765 43791009 44578192 45262449 45924363 46724070 47320758 47957212 48690722
5231 48690722 49426111 50235817 50907927 51757031 52607134 53313256 53874774 54651601 55698930
5222 55698930 56553787 57635832 58829937 60004408 61191224 62273177 63335839 64251946
5214 64251946 64910856 65374736 65613557 66092969 66638530 66951498 67212464 67529542 67871425
5205 67871425 68428143 68838714 69371066 69943901 70319249 70871162 71315159 71665568 72086062
5196 72086062 72486879 72925257 73053696 73410807 73593877 73696050 73976507 73981033 74199144 74374784
5186 74374784 74430336 74435607 74442176 74248138 74015329 73845880 73651268 73630770 73376213 73068696
$$ packed form
5249C7146317N51046P36355N59291L06453N47583P40374N85063Q32364O64393
5240D2669239N55526N66244P87183O84257O61914P99707N96688O36454P33510
5231D8690722P35389Q09706O72110Q49104Q50103P06122N61518P76827J047329
5222E5698930Q54857J082045J194105J174471J186816J081953J062662R16107
5214F4251946O58910M63880K38821M79412N45561L12968K60966L17078L41883
5205F7871425N56718M10571N32352N72835L75348N51913M43997L50409M20494
5196G2086062M00817M38378J28439L57111J83070J02173K80457M526K18111J75640
5186G4374784N5552N271O569j94038k32809j69449j94612k0498k54557l07517
$$ plain form
5176 73068696 72670803 72339552 71831953 71396129 70844917 70366913 69871959 69292672 68795846
5167 68795846 68366230 67645738 66968634 66214988 65723309 65050533 64303824 63706364 62915090
5158 62915090 62177726 61347119 60556375 59685780 59116946 58445077 57664916 56876470 56092003
5149 56092003 55571238 54838296 54085282 53125743 52420574 51571728 50825650 50214715 49441870
5140 49441870 48644353 47920592 47358631 46621471 45830975 45175337 44496565 43878009 43301358
5131 43301358 42702252 41986911 41330426 40682555 39913494 39256923 38758508 38140329 37584424
5122 37584424 37242725 36641538 36152926 35697626 35151552 34728579 34170634 33413506 32900417
5113 32900417 32414653 31976420 31481758 31100691 30592679 30022661 29620671 29074236 28522264
$$ packed form
5176G3068696l97893l31251n07599m35824n51212m78004m94954n79287m96826
5167F8795846m29616p20492o77104p53646m91679o72776p46709n97460p91274
5158F2915090p37364q30607p90744q70595n68834o71869p80161p88446p84467
5149E6092003n20765p32942p53014r59539p05169q48846p46078o10935p72845
5140D9441870p97517p23761n61961p37160p90496o55638o78772o18556n76651
5131D3301358n99106p15341o56485o47871p69061o56571m98415o18179n55905
5122C7584424l41699o01187m88612m55300n46074m22973n57945p57128n13089
5113C2900417m85764m38233m94662l81067n08012n70018m01990n46435n51972
$$ plain form
5104 28522264 28223529 27795434 27415810 26978413 26648389 26228651 25703521 25238852 24903405
5095 24903405 24647682 24600898 24092649 23614635 23384618 23099536 22735158 22576553 22494807 22084473
5085 22084473 21558610 21241352 20838872 20721579 20496143 20175128 19839861 19451676 19342671
5076 19342671 19097685 18779054 18617683 18469517 18132851 17911730 17668275 17379946 17068981
5067 17068981 17008565 16821961 16728976 16524275 16362001 16218389 15929828 15673592 15514797 15332866
5057 15332866 15147880 14959538 14871723 14735711 14363803 14083274 13960617 13950361 13786551 13326975
5047 13326975 13056569 12932044 12691525 12634862 12435287 12482177 12413538 12162631 11942205 11767120
5037 11767120 11854941 11705333 11468842 11502551 11263775 11085928 10959667 10855920 10998034 10725833
$$ packed form
5104B8522264k98735m28095l79624m37397l30024m19738n25130m64669l35447
5095B4903405k55723m6784n08249m78014k30017k85082l64378j58605q1746m10334
5085B2084473n25863l17258m02480j17293k25436l21015l35267l88185j09005
5076A9342671k44986l18631j61371j48166l36666k21121k43455k88329l10965
5067A7068981o0416j86604r2985k04701j62274j43612k88561k56236j58795j81931
5057A5332866j84986j88342q7815j36012l71908k80529j22657j0256j63810m59576
5047A3326975k70406j24525k40519n6663j99575M6890o8639k50907k20426j75085
5037A1767120Q7821j49608k36491L3709k38776j77847j26261j03747J42114k72201
$$ plain form
5027 10725833 10628036 10718045 10420322 10095018 10110019 10077633 9962919 9865543 9700120 9697626 9646528
5016 9646528 9524034 9380617 9225483 9198943 9088736 9006317 8989026 8785406 8503122 8608814
5006 8608814 8685534 8584075 8488164 8291148 8378105 8270471 7999727 8008422 8151289 8157868 8048628
4995 8048628 8112297 8216761 7886901 7874095 7959330 7937894 8137685 8234509 8431892 8530800 8487599
4984 8487599 8343038 8361854 8152933 8040906 7893165 7691184 7584733 7297103 7163725 7111745
4974 7111745 7036402 6769294 6542577 6322027 6426749 6350299 6249066 6298922 6474508 6503657
4964 6503657 6286798 6251588 6172964 6259064 6197175 6013733 5930087 5813555 5793486 5805435 5827307
4953 5827307 5976560 5710904 5469742 5536619 5645471 5455113 5572188 5522237 5482153 5488060
$$ packed form
5027A0725833r7797R0009k97723l25304J5001l2386j14714r7376j65423k494n1098
5016I646528j22494j43417j55134k6540j10207q2419j7291k03620k82284J05692
5006H608814P6720j01459r5911j97016Q6957j07634k70744Q695J42867O579j09240
4995H048628O3669J04464l29860j2806Q5235k1436J99791R6824J97383R8908m3201
4984H487599j44561J8816k08921j12027j47741k01981j06451k87630j33378n1980
4974G111745p5343k67108k26717k20550J04722p6450j01233M9856J75586K9149
4964F503657k16859l5210p8624Q6100o1889j83442q3646j16532k0069J1949K1872
4953E827307J49253k65656k41162O6877J08852j90358J17075m9951m0084N907
$$ plain form
4943 5488060 5302337 5479624 5431995 5227642 5158991 5185801 5144921 5106052 5207818 5148505 5183159
4932 5183159 5070293 5017505 5021406 5072615 4947062 4848015 4888051 4964138 4905599 4892246 4877665
4921 4877665 4996879 5006887 4627009 4536102 4760429 4773696 4681642 4754019 4856264 4863923 4771643
4910 4771643 4994865 4980797 4921822 4814195 4888717 4812320 4740652 4710368 4821793 4950255 4941846
4899 4941846 4799007 4819837 5088210 5000706 4908171 4918879 4787513 4779152 4673569 4807771 4939214
4888 4939214 5043734 4999286 4800446 4949970 4858673 4750957 4723079 4932241 4737202 4655170
4878 4655170 4798651 4964051 4957782 4929633 4831810 4950794 5085211 4984643 5011942 5128870
4868 5128870 5457706 5383898 5354533 5452618 5487171 5595667 5673392 5537314 5645134 5792704
$$ packed form
4943E488060j85723J77287m7629k04353o8651K6810m0880l8869J01766n9313L4654
4932E183159j12866n2788L901N1209j25553r9047M0036P6087n8539j3353j4581
4921D877665J19214J0008l79878r0907K24327J3267r2054P2377J02245P659r2280
4910D771643K23222j4068n8975j07627P4522p6397p1668l0284J11425J28462q409
4899D941846j42839K0830K68373q7504r2535J0708j31366q361j05583J34202J31443
4888D939214J04520m4448j98840J49524r1297j07716k7878K09162j95039q2032
4878D655170J43481J65400o269k8149r7823J18984J34417j00568K7299J16928
4868E128870L28836p3808k9365R8085L4553J08496P7725j36078J07820J47570
$$ plain form
4858 5792704 5927249 5947995 5891827 6044551 6244248 6271763 6324823 6566246 6797449 7174502
4848 7174502 7650413 7721529 8082815 8388212 8396020 8493947 8462035 8519886 8879416 8793817 8826038
4837 8826038 8984326 8841072 9055284 9183193 9488069 9839542 10191032 10510577 10838943 11447704
4827 11447704 12126032 12825213 13772573 15088070 16719856 19313257 23526648 28843174 34888744
4818 34888744 39689462 42904374 44592117 44788983 43469515 40424695 37716629 35765790
4810 35765790 34031084 31916603 30210779 29245833 28616883 28403339 28631262 28963564 29258540
4801 29258540 29576446 29927515 30182934 30765023 31131295 31717960 32254444 32930145 33768181
4792 33768181 34553398 35593496 36645005 37859278 39059705 40257514 41618406 42869100
$$ packed form
4858E792704J34545K0746n6168J52724J99697K7515N3060K41423K31203L77053
4848G174502M75911P1116L61286L05397P808R7927l1912N7851L59530q5599L2221
4837H826038J58288j43254K14212J27909L04876L51473L51490L19545L28366O08761
4827A1447704O78328O99181R47360J315497J631786K593401M213391N316526O045570
4818C4888744M800718L214912J687743J96866j319468l044820k708066j950839
4810C5765790j734706k114481j705824r64946o28950k13544K27923L32302K94976
4801B9258540L17906L51069K55419N82089L66272N86665N36484O75701Q38036
4792C3768181P85217J040098J051509J214273J200427J197809J360892J250694
$$ plain form
4784 42869100 44035051 45355125 46741034 47791297 48945621 50013859 50778611 51410362
4776 51410362 52016380 52387238 52292591 52319315 51948486 51529051 50877918 50152598 49371576 48764910
4766 48764910 47920221 47177140 46431534 45604584 44720043 44034626 43419418 42720123 41924246
4757 41924246 41159943 40390935 39431879 38580507 37753225 36877775 35849936 34722161 33765763
4748 33765763 32812418 31745982 30819968 29988199 28786306 27920243 27050622 26146055 25383426
4739 25383426 24586761 23951110 23471846 22924636 22383296 22052770 21832228 21451595 21338064
4730 21338064 21446224 21494663 21489931 21327690 21674317 21914858 22209954 22566377 23049993 23803769
4720 23803769 24324650 24846272 25724728 26466801 27393467 28223190 29195445 30240388 30978893
$$ packed form
4784D2869100J165951J320074J385909J050263J154324J068238P64752O31751
4776E1410362O06018L70858r4647K6724l70829m19435o51133p25320p81022o06666
4766D8764910q44689p43081p45606q26950q84541o85417o15208o99295p95877
4757D1924246p64303p69008r59056q51372q27282q75450j027839j127775r56398
4748C3765763r53345j066436r26014q31769j201893q66063q69621r04567p62629
4739B5383426p96665o35651m79264n47210n41340l30526k20542l80633j13531
4730B1338064J08160M8439m732j62241L46627K40541K95096L56423M83616P53776
4720B3803769N20881N21622Q78456P42073R26666Q29723R72255J044943P38505
$$ plain form
4711 30978893 31945075 32981286 33700452 34551022 35516622 36299607 37130707 37860885 38558717
4702 38558717 39270904 39950146 40840804 41777131 42593181 43472517 44442891 45401473 46135108
4693 46135108 47224770 48211842 49059766 49906677 50529068 51129344 51592652 51787783 51681997
4684 51681997 51672298 51374705 50996038 50211618 49559383 48649523 47502443 46440738 45136994
4675 45136994 43931311 42757434 41552489 40364856 39177032 37890445 36823007 35880009
4667 35880009 34907014 34096393 33183804 32422879 31808296 30830309 29858431 29236100 28685101
4658 28685101 27830397 26976369 26141096 25349528 24465512 23682472 22652958 21858042 21022754
4649 21022754 20117466 19234369 18465567 17678903 16876521 16171905 15540176 14856104 14268805
$$ packed form
4711C0978893R66182J036211P19166Q50570R65600P82985Q31100P30178O97832
4702C8558717P12187O79242Q90658R36327Q16050Q79336R70374R58582P33635
4693D6135108J089662R87072Q47924Q46911O22391O00276M63308J95131j05786
4684E1681997r699k97593l78667p84420o52235r09860j147080j061705j303744
4675D5136994j205683j173877j204945j187633j187824j286587j067438r42998
4667C5880009r72995q10621r12589p60925o14583r77987r71878o22331n50999
4658B8685101q54704q54028q35273p91568q84016p83040j029514p94916q35288
4649B1022754r05288q83097p68802p86664q02382p04616o31729o84072n87299
$$ plain form
4640 14268805 13730028 13221079 12940673 12399061 12201050 11896191 11601661 11448162 11448967 11519786
4630 11519786 11660619 12295989 13419047 14515702 15770700 16731331 17270966 17216221 16982878
4621 16982878 16186199 15123441 14234218 13382951 12588414 11743237 11258358 11077821 11152837
4612 11152837 11302893 11919949 12819422 13493923 14420512 15353022 15928618 16501329 17349218
4603 17349218 18435796 19684565 20893989 22100334 23406709 24261158 24888234 25561701 26391355
4594 26391355 27246413 28320150 29298944 30224637 30826875 30801219 30324492 29720568 29070862
4585 29070862 28550983 28286393 27821161 26948856 25897544 24738292 23445418 22166501 21060155
4576 21060155 19989149 18837132 17698211 16626139 15543368 14351455 13236057 12244365
$$ packed form
4640A4268805n38777n08949k80406n41612j98011l04859k94530j53499Q05P0819
4630A1519786J40833O35370J123058J096655J254998R60631N39635n4745k33343
4621A6982878p96679j062758q89223q51267p94537q45177m84879j80537P5016
4612A1152837J50056O17056Q99473O74501R26589R32510N75596N72711Q47889
4603A7349218J086578J248769J209424J206345J306375Q54449O27076O73467Q29654
4594B6391355Q55058J073737R78794R25693O02238k5656m76727o03924o49706
4585B9070862n19879k64590m65232q72305j051312j159252j292874j278917j106346
4576B1060155j071006j152017j138921j072072j082771j191913j115398r91692
$$ plain form
4568 12244365 11045750 10236695 9490101 8583723 7717049 7173760 6889518 6355447 6010096
4559 6010096 5637049 5422834 5275053 5011261 4792945 4794678 4568597 4266465 4205647 4187980
4549 4187980 4073392 3788870 3701448 3858607 3971724 3760902 3539346 3431256 3468926 3255116
4539 3255116 3267620 3399274 3296767 3244044 3210062 3078755 3042541 3029531 2808017 2972520
4529 2972520 2975288 2838504 2759918 2619961 2768173 2881434 2672770 2474692 2614923 2520372
4519 2520372 2435432 2493288 2490996 2388724 2427175 2456580 2439651 2431891 2368895 2431248 2410523 2313026
4507 2313026 2248196 2358965 2329699 2098723 2062356 2202019 2170896 2182620 2032538 1942448 2258019
4496 2258019 2075137 1982148 2100238 2073269 2066086 2059148 2020795 2045899 2240750 2148401 1976294
$$ packed form
4568A2244365j198615q09055p46594r06378q66674n43289k84242n34071l45351
4559F010096l73047k14215j47781k63792k18316J733k26081l02132o0818j7667
4549D187980j14588k84522q7422J57159J13117k10822k21556j08090L7670k13810
4539C255116J2504J31654j02507n2723l3982j31307l6214j3010k21514J64503
4529B972520K768j36784p8586j39957J48212J13261k08664j98078J40231r4551
4519B520372q4940N7856k292j02272L8451K9405j6929p760o2996O2353k0725r7497
4507B313026o4830J10769k9266k30976l6367J39663l1123J1724j50082r0090L15571
4496B258019j82882r2989J18090k6969p183o938l8353K5104J94851r2349j72107
$$ plain form
4485 1976294 1928291 2043760 1881691 1735908 1950501 2086438 1997592 2042850 2027172 1871288
4475 1871288 1730211 1711817 1708844 1728423 1755387 1830635 1799433 1763889 1863782 1883221 1818317
4464 1818317 1764359 1669325 1612628 1654543 1648936 1576482 1463466 1381064 1534679 1600991 1586610
4453 1586610 1541620 1606472 1691773 1616317 1633803 1411427 1250575 1358376 1449781 1565972 1471927
4442 1471927 1510296 1477733 1361604 1265208 1345541 1554497 1473008 1317587 1349406 1496173 1555598
4431 1555598 1521398 1501802 1510303 1509393 1503678 1505901 1463103 1476948 1531630 1597629 1697721 1910666
4419 1910666 1784632 1558164 1641560 1656857 1502383 1495720 1647619 1583301 1610037 1694068 1739869
4408 1739869 1695388 1479565 1376817 1440290 1572958 1577428 1549864 1815362 1773036 1669163 1607963
$$ packed form
4485A976294m8003J15469j62069j45783K14593J35937q8846M5258j5678j55884
4475A871288j41077j8394k973J9579K6964P5248l1202l5544R9893J9439o4904
4464A818317n3958r5034n6697M1915n607p2454j13016q2402J53615O6312j4381
4453A586610m4990O4852Q5301p5456J7486k22376j60852J07801R1405J16191r4045
4442A471927L8369l2563j16129r6396Q0333K08956q1489j55421L1819J46767N9425
4431A555598l4200j9596Q501r10n715K223m2798J3845N4682O5999J00092K12945
4419A910666j26034k26468Q3396J5297j54474o663J51899o4318K6736Q4031M5801
4408A739869m4481k15823j02748O3473J32668M470k7564K65498m2326j03873o1200
$$ plain form
4397 1607963 1815275 1847948 1831731 1786716 1638034 1774413 1870478 1843493 1864354 1888181 1958210
4386 1958210 1936797 1833240 1782051 1665970 1842489 1795779 1610940 1726717 1876403 1934553
4376 1934553 2030854 1962150 1838258 1940647 1924854 1938064 1996595 1880055 1829351 1882701 2031936
4365 2031936 2107825 1985137 2026837 2095473 2078033 1992932 1894166 1912670 2009124 2099983 2219403
4354 2219403 2204449 2290968 2241006 2191010 2099296 2192323 2461573 2631789 2780824 2823011 2696196
4343 2696196 2667959 2882489 2888186 2785623 3062274 2924839 2853194 2965870 2828699 2912101
4333 2912101 3061761 3143978 3102205 3186596 3296508 3489438 3688595 3591128 3380961 3398126
4323 3398126 3506478 3534752 3613567 3752722 3899985 4036572 4192950 4180463 4249682 4395510
$$ packed form
4397A607963K07312L2673j6217m5015j48682J36379R6065k6985K0861K3827P0029
4386A958210k1413j03557n1189j16081J76519m6710j84839J15777J49686N8150
4376A934553R6301o8704j23892J02389j5793J3210N8531j16540n0704N3350J49235
4365B031936P5889j22688M1700O8636j7440q5101r8766J8504R6454R0859J19420
4354B219403j4954Q6519m9962m9996r1714R3027K69250J70216J49035M2187j26815
4343B696196k8237K14530N697j02563K76651j37435p1645J12676j37171Q3402
4333B912101J49660Q2217m1773Q4391J09912J92930J99157r7467k10167J7165
4323C398126J08352K8274P8815J39155J47263J36587J56378j2487O9219J45828
$$ plain form
4313 4395510 4537714 4603512 4719658 4743578 4937622 5214186 5312115 5427413 5725010 6116867
4303 6116867 6285234 6380894 6603726 6937499 7270540 7641090 7950628 8067007 8310959 8548187
4293 8548187 8989468 9472922 9784149 10196077 10634193 11217714 11644769 12056092 12492935 13247641
4283 13247641 13797204 14307925 14929803 15504503 16007450 16610702 17109579 17652818 18317173
4274 18317173 18847557 19392869 20070110 20539293 20945229 21414139 21711871 22053767 22436366
4265 22436366 22581980 22689279 22970121 23323332 23391135 23474867 23453424 23364417 23327800 23318816 23111329
4254 23111329 22907240 22902005 22632348 22122089 21840660 21413062 21069419 20677139 20331165 19781489
4244 19781489 19245820 18812680 18278283 17819087 17264967 16756637 16416672 16013740 15214346
$$ packed form
4313D395510J42204O5798J16146K3920J94044K76564R7929J15298K97597L91857
4303F116867J68367R5660K22832L33773L33041L70550L09538J16379K43952K37228
4293H548187M41281M83454L11227M11928M38116N83521M27055M11323M36843P54706
4283A3247641N49563N10721O21878N74700N02947O03252M98877N43239O64355
4274A8317173N30384N45312O77241M69183M05936M68910K97732L41896L82599
4265B2436366J45614J07299K80842L53211O7803Q3732k1443q9007l6617q984k07487
4254B3111329k04089n235k69657n10259k81429m27598l43643l92280l45974n49676
4244A9781489n35669m33140n34397m59196n54120n08330l39965m02932p99394
$$ plain form
4235 15214346 14539307 14098408 13564898 13132022 12742589 12339103 11755529 11407521 11028867
4226 11028867 10637472 10481918 10437156 10342272 10134354 10023870 9955706 9621304 9285441 8885817
4216 8885817 8383632 8028150 7681197 7326368 6905697 6615005 6223153 6095909 5933828 5771929
4206 5771929 5773806 5687148 5369044 5198006 5151630 5038580 4857716 4879634 4837096 4768967 4508598
4195 4508598 4302171 4457335 4474901 4212939 4133359 4083288 4074288 4149927 4013923 3907344 3805844
4184 3805844 3788955 3798172 3786929 3667775 3638181 3701586 3533688 3634138 3695269 3557750 3326831
4173 3326831 3304622 3366038 3177512 3148904 3437237 3292489 3234341 3244820 3227628 3207844 3148299
4162 3148299 3132237 3251186 3177357 3149646 3032303 2956243 3007696 2988087 2894090 2971917 3170815
$$ packed form
4235A5214346o75039m40899n33510m32876l89433m03486n83574l48008l78654
4226A1028867l91395j55554m4762r4884k07918j10484o8164l34402l35863l99624
4216H885817n02185l55482l46953l54829m20671k90692l91852j27244j62081j61899
4206E771929J877q6658l18104j71038m6376j13050j80864K1918m2538o8129k60369
4195D508598k06427J55164J7566k61962p9580n0071r000P5639j36004j06579j01500
4184C805844j6889R217j1243j19154k9594O3405j67898J00450O1131j37519k30919
4173C326831k2209O1416j88526k8608K88333j44748n8148J0479j7192j9784n9545
4162C148299j6062J18949p3829k7711j17343p6060N1453j9609r3997P7827J98898
$$ plain form
4151 3170815 3092600 2968798 2955618 3010997 2997247 2760859 2584781 2674253 2950684 3002719 2991896
4140 2991896 2954647 2912617 2957209 2938143 2990132 2836635 2883834 2875444 2862887 2870532 2752632
4129 2752632 2797443 2873704 2923448 2989512 3025785 2973461 2877538 2952412 2921653 2842891 2669840
4118 2669840 2625063 2856236 2931678 2979486 2884878 2857968 2809936 2891267 2804669 2722600 2703864
4107 2703864 2716384 2699170 2719621 2626796 2666229 2757949 2625839 2631370 2760213 2753706 2791619
4096 2791619 2976708 2891251 3081994 3083909 3050989 2936885 2851856 2934371 3008392 3038858 3049009
4085 3049009 3022663 3114581 3156242 3114686 3164122 3350318 3179912 3159112 3129150 3090627 3136388
4074 3136388 3241934 3151450 3144308 3228792 3202929 3279772 3294975 3408714 3645980 3676395 3590309
$$ packed form
4151C170815p8215j23802j3180N5379j3750k36388j76078Q9472K76431N2035j0823
4140B991896l7249m2030M4592j9066N1989j53497M7199q390j2557P645j17900
4129B752632M4811P6261M9744O6064L6273n2324r5923P4874l0759p8762j73051
4118B669840m4777K31173P5442M7808r4608k6910m8032Q1331q6598q2069j8736
4107B703864J2520j7214K0451r2825L9433R1720j32110N531J28843o507L7913
4096B791619J85089q5457J90743J915l2920j14104q5029Q2515P4021L0466J0151
4085C049009k6346R1918M1661m1556M9436J86196j70406k0800k9962l8523M5761
4074C136388J05546r0484p142Q4484k5863P6843J5203J13739K37266L0415q6086
$$ plain form
4063 3590309 3457574 3548713 3755701 3752340 3744307 3776970 3774007 3701796 3657203 3596701 3644749 3712207
4051 3712207 3711512 4031861 4099078 3975356 3824846 3736777 3984623 4154950 4035828 4176034
4041 4176034 4477742 4416048 4486633 4591025 4526196 4409913 4563536 4705245 4721933 4845148
4031 4845148 4961696 4957685 4948619 4984162 5004629 5147274 5299796 5314718 5152729 5302201 5493760
4020 5493760 5512857 5574034 5628490 5861883 5959156 5926771 6172943 6335688 6413878 6568890 6726064
4009 6726064 6811028 7037640 7145557 7546560 7618597 7589533 7822683 8098970 8402071 8465691
3999 8465691 8644864 8664680 8743212 8992333 9297992 9652712 9862793 10119461 10518916 10780777
3989 10780777 10985113 11448008 11655472 11815261 12089422 12443491 12821081 13154810 13469514
$$ packed form
4063C590309j32735R1139K06988l361q033L2663k963p2211m4593o0502M8048O7458
4051C712207o95L20349O7217j23722j50510q8069K47846J70327j19122J40206
4041D176034L01708o1694P0585J04392o4829j16283J53623J41709J6688J23215
4031D845148J16548m011r066L5543K0467J42645J52522J4922j61989J49472J91559
4020E493760J9097O1177N4456K33393R7273l2385K46172J62745P8190J55012J57174
4009F726064Q4964K26612J07917M01003P2037k9064K33150K76287L03101O3620
3999H465691J79173J9816P8532K49121L05659L54720K10081K56668L99455K61861
3989A0780777K04336M62895K07464J59789K74161L54069L77590L33729L14704
$$ plain form
3980 13469514 13896613 14276813 14554927 15112228 15443647 15690022 16085244 16638992 16962807
3971 16962807 17339797 17599992 17987133 18355884 18834542 19510273 19991376 20476159 21267752
3962 21267752 21815634 22621410 23636072 24554694 25504328 26662041 27904795 29231474 30562850
3953 30562850 31931612 33622327 35290428 36853924 38513920 40320153 41997882 43577129
3945 43577129 45389167 47273139 49480371 51826978 54404946 56501550 58325953 60282222
3937 60282222 61950047 63502731 65095395 66534327 68234868 70069317 71665288 73270484
3929 73270484 74862731 76529177 78073788 79789398 81665971 83172859 84778931 86459770
3921 86459770 87815402 89053462 90317651 91271927 91933665 92282126 92594824 92933785 92858261
$$ packed form
3980A3469514M27099L80200K78114N57301L31419K46375L95222N53748L23815
3971A6962807L76990K60195L87141L68751M78658O75731M81103M84783P91593
3962B1267752N47882Q05776J014662R18622R49634J157713J242754J326679J331376
3953C0562850J368762J690715J668101J563496J659996J806233J677729J579247
3945D3577129J812038J883972K207232K346607K577968K096604J824403J956269
3937F0282222J667825J552684J592664J438932J700541J834449J595971J605196
3929G3270484J592247J666446J544611J715610J876573J506888J606072J680839
3921H6459770J355632J238060J264189R54276O61738L48461L12698L38961p5524
$$ plain form
3912 92858261 92622326 92547377 92157363 91472122 90415979 88897189 87127863 85259684 82962327
3903 82962327 80439812 78152354 75703190 73172132 70743123 68258808 65812654 63393886
3895 63393886 61096780 59266960 57427149 55372180 53451757 51886246 50260842 48706922
3887 48706922 47251710 45690417 43993400 42568588 41076330 39597226 38265949 36564197
3879 36564197 34950350 33567196 32214576 30881772 29561869 28398274 27320251 26401322
3871 26401322 25325072 24331180 23571958 22823995 22154134 21208227 20668676 20364188 19767123
3862 19767123 19452332 18920603 18544005 18300731 18141730 17981416 17467090 17058593 16650616
3853 16650616 16337374 16095624 15727397 15401453 15107137 14802054 14400328 14164617 14016759
$$ packed form
3912I2858261k35935p4949l90014o85241j056143j518790j769326j868179k297357
3903H2962327k522515k287458k449164k531058k429009k484315k446154k418768
3895F3393886k297106j829820j839811k054969j920423j565511j625404j553920
3887D8706922j455212j561293j697017j424812j492258j479104j331277j701752
3879C6564197j613847j383154j352620j332804j319903j163595j078023r18929
3871B6401322j076250r93892p59222p47963o69861r45907n39551l04488n97065
3862A9767123l14791n31729l76598k43274j59001j60314n14326m08497m07977
3853A6650616l13242k41750l68227l25944k94316l05083m01726k35711j47858
$$ plain form
3844 14016759 13897264 13622127 13036022 12771313 12740037 12474987 12259969 11997377 11803633 11748893
3834 11748893 11587492 11473975 11517273 11280307 11148327 11060565 11004721 10954311 10979370 10879672
3824 10879672 10616161 10613882 10444917 10355177 10312075 10149232 10117360 10014634 10088463 9992225 10049164
3813 10049164 9992051 10071782 10107355 10135263 10114865 10135103 10276814 10237274 10205001 10305516 10289850
3802 10289850 10409841 10525470 10638835 10673583 10708843 10821847 10899618 11027897 10966634 11068680
3792 11068680 11132349 11268777 11208058 11168028 11413033 11512890 11674887 11746867 11675917 11622320 11630268
3781 11630268 11713119 11915591 12031182 11973396 12009282 12051532 12116264 11925887 12092453 12331076
3771 12331076 12408380 12531068 12480576 12664883 12733347 12601410 12729253 13089477 13351222 13337668
$$ packed form
3844A4016759j19495k75137n86105k64709l1276k65050k15018k62592j93744n4740
3834A1748893j61401j13517M3298k36966j31980q7762n5844n0410K5059r9698
3824A0879672k63511k279j68965q9740m3102j62843l1872j02726P3829r6238N6939
3813A0049164n7113P9731L5573K7908k0398K0238J41711l9540l2273J00515j5666
3802A0289850J19991J15629J13365L4748L5260J13004P7771J28279o1263J02046
3792A1068680O3669J36428o0719m0030K45005R9857J61997P1980p0950n3597P948
3781A1630268Q2851K02472J15591n7786L5886M2250O4732j90377J66566K38623
3771A2331076P7304J22688n0492J84307O8464j31937J27843L60224K61745j3554
$$ plain form
3761 13337668 13369072 13551778 13669292 13844371 14050136 14237728 14401697 14365324 14499524 14955614
3751 14955614 15163908 15272700 15457401 15775965 15864423 16259570 16836572 17150632 17482680 17767826
3741 17767826 18241303 18741120 19243757 19771646 20258327 20828259 21355625 21800886 22364660
3732 22364660 23124806 23819066 24334446 24967952 25607882 26445627 27016278 28036919 28801419
3723 28801419 29414470 30159509 30852478 31553873 32313192 32943284 33409345 34037801 34857411
3714 34857411 35403672 35816236 36274972 36692796 36909156 37247673 37393387 37598660 37605925 37769450
3704 37769450 37751117 37770166 37363612 37237204 37036660 36804368 36405747 35851936 35423401 34954128
3694 34954128 34309125 33749059 33327690 32809532 32016779 31251274 30579606 30106355 29405791
$$ packed form
3761A3337668L1404J82706J17514J75079K05765J87592J63969l6373J34200M56090
3751A4955614K08294J08792J84701L18564Q8458L95147N77002L14060L32048K85146
3741A7767826M73477M99817N02637N27889M86681N69932N27366M45261N63774
3732B2364660P60146O94260N15380O33506O39930Q37745N70651J020641P64500
3723B8801419O13051P45039O92969P01395P59319O30092M66061O28456Q19610
3714C4857411N46261M12564M58736M17824K16360L38517J45714K05273P265J63525
3704C7769450j8333J9049m06554j26408k00544k32292l98621n53811m28535m69273
3694C4954128o45003n60066m21369n18158p92753p65505o71668m73251p00564
$$ plain form
3685 29405791 28618301 27793449 27135981 26714019 25979554 25391582 24839950 24271664 23507918
3676 23507918 23113498 22668955 22269891 21700633 21239500 20704281 20203636 19805518 19594382
3667 19594382 19276919 18952676 18834204 18546948 18259093 18109486 17525637 17323461 17073282
3658 17073282 16990187 16795526 16676228 16503255 16258797 16171746 15994784 15790748 15776093 15666526
3648 15666526 15581875 15725816 15583380 15448833 15403684 15305329 15227654 15351333 15211485 15310157
3638 15310157 15475818 15380792 15320706 15461573 15498910 15666705 15763585 15751117 15843970 15798005 16009712
3627 16009712 16149237 16375552 16363314 16599620 16893795 17130349 17033442 17318439 17662539 18042569
3617 18042569 18233074 18274001 18630807 18888445 18980526 19406529 19677443 19932235 20188682 20463067
$$ packed form
3685B9405791p87490q24852o57468m21962p34465n87972n51632n68286p63746
3676B3507918l94420m44543l99064n69258m61133n35219n00645l98118k11136
3667A9594382l17463l24243j18472k87256k87855j49607n83849k02176k50179
3658A7073282q3095j94661j19298j72973k44458q7051j76962k04036j4655j09567
3648A5666526q4651J43941j42436j34547m5149r8355p7675J23679j39848R8672
3638A5310157J65661r5026o0086J40867L7337J67795R6880j2468R2853m5965K11707
3627A6009712J39525K26315j2238K36306K94175K36554r6907K84997L44100L80030
3617A8042569J90505M0927L56806K57638R2081M26003K70914K54792K56447K74385
$$ plain form
3607 20463067 20618253 20778224 21100886 21781601 22139530 22337778 22889508 23545450 24014863
3598 24014863 24626918 25212713 25680018 26212054 26913406 27742234 28424659 29184012 30095094
3589 30095094 31022653 31926338 32968762 34144605 35589079 37319682 39116653 41347676
3581 41347676 43789118 46780396 50326853 54695340 59952133 66040139 72716308 78907540
3573 78907540 84316712 88477034 90885899 91505250 90802937 88684537 85987643 82946951
3565 82946951 79950503 76986331 74605165 72600927 70968642 69949374 69390914 69287329
3557 69287329 69568219 70237908 71270006 72610676 74524719 76782292 79625615 82919494
3549 82919494 86916318 91863745 98238287 106383072 116579972 128971460 142908625 156463100
$$ packed form
3607B0463067J55186J59971L22662O80715L57929J98248N51730O55942M69413
3598B4014863O12055N85795M67305N32036P01352Q28828O82425P59353R11082
3589C0095094R27559R03685J042424J175843J444474J730603J796971K231023
3581D1347676K441442K991278L546457M368487N256793O088006O676169O191232
3573G8907540N409172M160322K408865O19351p02313k118400k696894l040692
3565H2946951k996448k964172k381166k004238j632285j019268n58460j03585
3557F9287329K80890O69689J032098J340670J914043K257573K843323L293879
3549H2919494L996824M947427O374542Q144785J0196900J2391488J3937165J3554475
$$ plain form
3541 156463100 167726817 175590382 179651412 179783673 176042964 169806900 162372465 154767556
3533 154767556 147207951 139951668 133505740 128102098 123980340 120903684 118970317 117482652
3525 117482652 116703066 116481681 116709125 117316739 118511860 120121466 122365880 125309198 128690830
3516 128690830 132727957 137326137 143016268 149644429 156909608 164838905 172536301 179163317
3508 179163317 184378493 187931119 189471177 189744471 188372740 186254510 183807607 181078850
3500 181078850 178571764 176259971 174032487 171713456 169395519 167164104 164643135 161771656
3492 161771656 158853178 155708928 152188221 148561024 144906548 140995806 137234339 133392125
3484 133392125 129419477 125499021 121268946 116970275 112506895 108092154 103489300 98934179
$$ packed form
3541A56463100J1263717P863565M061030J32261l740709o236064p434435p604909
3533A54767556p559605p256283o445928n403642m121758l076656j933367j487665
3525A17482652p79586k21385K27444O07614J195121J609606K244414K943318L381632
3516A28690830M037127M598180N690131O628161P265179P929297P697396O627016
3508A79163317N215176L552626J540058K73294j371731k118230k446903k728757
3500A81078850k507086k311793k227484k319031k317937k231415k520969k871479
3492A61771656k918478l144250l520707l627197l654476l910742l761467l842214
3484A33392125l972648l920456m230075m298671m463380m414741m602854m555121
$$ plain form
3476 98934179 94414818 89863989 85476757 81259863 77130483 73236068 69655388 66256833
3468 66256833 63181674 60478807 57999026 55465354 53288205 51301608 49564924 47905252
3460 47905252 46292190 44910262 43690023 42610388 41601848 40604885 39778999 39077035 38454682
3451 38454682 38036967 37509971 37125495 36802363 36466427 36147765 36125539 36200446 36132360 36337309
3441 36337309 36348171 36227555 36038601 35810969 35220948 34506945 33708927 32949033 32095084 31397632
3431 31397632 30699682 29855718 29139254 28535312 27718905 27056280 26400546 25687255 25033034
3422 25033034 24456604 23739773 23007717 22145405 21428818 20761223 20026071 19564281 19098573
3413 19098573 18728608 18338428 17796999 17490198 17155616 16825655 16407747 16154310 16035388
$$ packed form
3476I8934179m519361m550829m387232m216894m129380l894415l580680l398555
3468F6256833l075159k702867k479781k533672k177149j986597j736684j659672
3460D7905252j613062j381928j220239j079635j008540r96963q25886p01964o22353
3451C8454682m17715n26996l84476l23132l35936l18662k2226P4907o8086K04949
3441C6337309J0862j20616j88954k27632n90021p14003p98018p59894q53949o97452
3431C1397632o97950q43964p16464o03942q16407o62625o55734p13291o54221
3422B5033034n76430p16831p32056q62312p16587o67595p35152m61790m65708
3413A9098573l69965l90180n41429l06801l34582l29961m17908k53437j18922
$$ plain form
3404 16035388 15727148 15514782 15355465 15137314 14965175 14804916 14792627 14557548 14611130 14430900
3394 14430900 14409700 14493110 14572894 14611218 14738939 14876588 14825978 14951764 14979024 14916012 14963368
3383 14963368 15104443 15145774 15200722 15311153 15385386 15525530 15562435 15641844 15880154 16030616
3373 16030616 16245133 16568159 16591780 16538414 16662123 16936172 16923286 17004478 17263003 17450836
3363 17450836 17550146 17722931 18303264 18735455 19195572 19755962 20566160 21307486 21970512 23006856
3353 23006856 24124827 25210415 26490966 28291154 29996297 32040351 34445890 36957064
3345 36957064 40229179 43746221 47822648 52254612 57345912 62994256 68981433 75324368
3337 75324368 82488624 90779041 99486091 108213965 116206117 121911453 124533934 124225785
$$ packed form
3404A6035388l08240k12366j59317k18151j72139j60259j2289k35079N3582j80230
3394A4430900k1200Q3410P9784L8324J27721J37649n0610J25786K7260o3012M7356
3383A4963368J41075M1331N4948J10431P4233J40144L6905P9409K38310J50462
3373A6030616K14517L23026K3621n3366J23709K74049j2886Q1192K58525J87833
3363A7450836R9310J72785N80333M32191M60117N60390Q10198P41326O63026J036344
3353B3006856J117971J085588J280551J800188J705143K044054K405539K511174
3345C6957064L272115L517042M076427M431964N091300N648344N987177O342935
3337G5324368P164256Q290417Q707050Q727874P992152N705336K622481l08149
$$ plain form
3329 124225785 121061196 115719071 109143170 101662118 94407874 86889265 79328221 72444594
3321 72444594 66135609 60597502 55457039 51204834 47369914 43758584 40722407 38243889
3313 38243889 36156119 34440047 33169381 32181883 31588786 31520230 32208363 33803445 36893433
3304 36893433 42432687 50517276 59662634 68079561 73785473 76115307 74781065 70541963
3296 70541963 64262882 57477948 51146562 45594572 39785146 34610837 30536907 27390890
3288 27390890 25287056 23817420 22736739 21710082 20794797 19851349 18799017 17967168 17317916
3279 17317916 16869901 16783949 16755597 16839218 17453889 18655079 20664106 23871879 28053531
3270 28053531 32492013 36031202 38153973 38828773 37906315 35498773 32430885 29286755
$$ packed form
3329A24225785l164589n342125o575901p481052p254244p518609p561044o883627
3321G2444594o308985n538107n140463m252205l834920l611330l036177k478518
3313C8243889k087770j716072j270666r87498n93097o8556O88133J595082L089988
3304C6893433N539254Q084589R145358Q416927N705912K329834j334242m239102
3296G0541963o279081o784934o331386n551990n809426n174309m073930l146017
3288B7390890k103834j469636j080681j026657r15285r43448j052332q31849o49252
3279A7317916m48015q5952k8352Q3621O14671J201190K009027L207773M181652
3270B8053531M438482L539189K122771O74800r22458k407542l067888l144130
$$ plain form
3262 29286755 26257817 23726634 21230938 19273489 17404120 15922454 15056238 14129742
3254 14129742 13348431 12492172 11833609 11217425 10538817 10087683 9683056 9369620 9035105
3245 9035105 8641790 8199651 8074985 7949017 7703580 7488728 7533308 7499450 7287182 7214912
3235 7214912 7096044 7029308 7057881 7120919 6988032 6759655 6640177 6792501 6831615 6778239
3225 6778239 6651660 6657267 6522855 6509145 6602991 6536164 6488539 6645664 6577724 6723488 6718839
3214 6718839 6611629 6570164 6654241 6547391 6520048 6590792 6430347 6575040 6608929 6510498 6655909
3203 6655909 6682899 6796372 6922204 7029781 6871463 6881711 7033978 6913251 6802037 6752772
3193 6752772 6694621 6637480 6698595 6623384 6744976 6923115 7076691 7186731 7245876 7180443 7188072
$$ packed form
3262B9286755l028938k531183k495696j957449j869369j481666q66216r26496
3254A4129742p81311q56259o58563o16184o78608m51134m04627l13436l34515
3245I035105l93315m42139j24666j25968k45437k14852M4580l3858k12268p2270
3235G214912j18868o6736K8573O3038j32887k28377j19478J52324L9114n3376
3225F778239j26579N607j34412j3710R3846o6827m7625J57125o7940J45764m649
3214F718839j07210m1465Q4077j06850k7343P0744j60445J44693L3889r8431J45411
3203F655909K6990J13473J25832J07577j58318J0248J52267j20727j11214m9265
3193F752772n8151n7141O1115p5211J21592J78139J53576J10040N9145o5433P629
$$ plain form
3182 7188072 7289590 7499134 7659685 7715270 7809913 8040419 8533440 8717245 8959099 9147186
3172 9147186 9376015 9607166 9901261 9910942 9975716 9965581 10087920 10197539 10128163 10175247 10154803
3161 10154803 10153062 10239820 10280172 10404002 10530596 10688783 10855921 10899308 11019521 11499632
3151 11499632 11487005 11690992 11919111 12168007 12290979 12689769 13048916 13441996 13841809 14136472
3141 14136472 14544597 14874634 15415902 15886741 16406309 17002492 17559995 17931306 18584072
3132 18584072 19323271 19931615 20562577 21214984 21871396 22748690 23607697 24317543 25078626
3123 25078626 26025530 26899415 27759322 28858843 30058636 31403478 33039894 34857273 36708778
3114 36708778 38642030 41162538 43708745 46406425 49239211 52387713 56007193 60327261
$$ packed form
3182G188072J01518K09544J60551N5585R4643K30506M93021J83805K41854J88087
3172I147186K28829K31151K94095R681O4774j0135J22339J09619o9376M7084k0444
3161A0154803j741Q6758M0352J23830J26594J58187J67138M3387J20213M80111
3151A1499632j2627K03987K28119K48896J22972L98790L59147L93080L99813K94663
3141A4136472M08125L30037N41268M70839N19568N96183N57503L71311O52766
3132A8584072P39199O08344O30962O52407O56412Q77294Q59007P09846P61083
3123B5078626R46904Q73885Q59907J099521J199793J344842J636416J817379J851505
3114C6708778J933252K520508K546207K697680K832786L148502L619480M320068
$$ plain form
3106 60327261 65072180 70860215 77600313 85659673 95121493 106391952 119937509 136015263
3098 136015263 155054918 177572286 203865060 232705819 262287638 290497423 314511840
3091 314511840 331787337 340938611 341117239 332970455 318106908 298273015 275310568 250987768
3083 250987768 226823454 203473336 181586468 161934036 144688566 129673046 116380846
3076 116380846 104828764 94854510 86003949 78054792 70991950 65200336 59986936 55659000
3068 55659000 51790858 48592759 45686314 43176818 41008457 39156068 37144032 35180180
3060 35180180 33667624 32167642 30790914 29452210 28074061 26799323 25613824 24481869
3052 24481869 23536363 22530885 21656908 20724661 20027949 19417896 18730436 17996193 17234412
$$ packed form
3106F0327261M744919N788035O740098Q059360R461820J1270459J3545557J6077754
3098A36015263J9039655K2517368K6292774K8840759K9581819K8209785K4014417
3091C14511840J7275497R151274J78628q146784j4863547j9833893k2962447k4322800
3083B50987768k4164314k3350118k1886868j9652432j7245470j5015520j3292200
3076A16380846j1552082r974254q850561p949157p062842n791614n213400m327936
3068E5659000l868142l198099k906445k509496k168361j852389k012036j963852
3060C5180180j512556j499982j376728j338704j378149j274738j185499j131955
3052B4481869r45506j005478q73977r32247o96712o10053o87460p34243p61781
$$ plain form
3043 17234412 16610139 16194079 15617278 14877976 14453450 13987057 13680837 13127936 12708944
3034 12708944 12258362 11926327 11674222 11328700 10996698 10886424 10622038 10345973 10107085
3025 10107085 9680990 9401371 9221651 9039701 8847438 8524286 8310151 8118189 7784782
3016 7784782 7515682 7419357 7502932 7271072 7058203 6813977 6788720 6603321 6428479 6261542
3006 6261542 5978678 5827661 5610721 5503146 5412437 5074371 5088371 4988478 5074140 5081575 5033306
2995 5033306 4793701 4648047 4631330 4559765 4467890 4465067 4427136 4550532 4348303 4323068 4331961
2984 4331961 4154006 4105296 4035452 4120286 3845396 3685716 3726197 3527408 3322142 3385240
2974 3385240 3316264 3231713 3229865 3064575 3052902 2930148 2660578 2777148 2830832 2794900 2763655
$$ packed form
3043A7234412o24273m16060n76801p39302m24526m66393l06220n52901m18992
3034A2708944m50582l32035k52105l45522l32002j10274k64386k76065k38888
3025A0107085m26095k79619j79720j81950j92263l23152k14135j91962l33407
3016G784782k69100r6325Q3575k31860k12869k44226k5257j85399j74842j66937
3006F261542k82864j51017k16940j07575r0709l38066J4000r9893Q5662P435m8269
2995E033306k39605j45654j6717p1565r1875k823l7931J23396k02229k5235Q893
2984D331961j77955m8710o9844Q4834k74890j59680M0481j98789k05266O3098
2974C385240o8976q4551j848j65290j1673j22754k69570J16570N3684l5932l1245
$$ plain form
2963 2763655 2712434 2593557 2466276 2539688 2572490 2497673 2597281 2680822 2440601 2434518 2577810
2952 2577810 2535363 2307748 2293929 2390417 2340033 2127497 2063087 2004487 1971081 2032080 1981689
2941 1981689 1878675 1757458 1740569 1692537 1715545 1770678 1726112 1864901 1744979 1698625 1649625
2930 1649625 1613686 1471203 1484792 1389323 1549668 1657187 1524734 1634842 1532623 1404549
2920 1404549 1354029 1325255 1347173 1215347 1099250 1023886 1196458 1134115 1252765 1150042
2910 1150042 1036120 1122045 1060337 1158196 1196306 1249807 1128349 1115027 1043338 1287244 1130962
2899 1130962 1132512 965241 1040835 1034099 797913 820323 1014916 1077037 950111 877146 795275
2888 795275 843552 755233 826896 867905 926456 848816 825925 639719 651775 708689 717627 833649
$$ packed form
2963B763655n1221j18877j27281P3412L2802p4817R9608Q3541k40221o083J43292
2952B577810m2447k27615j3819R6488n0384k12536o4410n8600l3406O0999n0391
2941A981689j03014j21217j6889m8032K3008N5133m4566J38789j19922m6354m9000
2930A649625l5939j42483J3589r5469J60345J07519j32453J10108j02219j28074
2920A404549n0520k8774K1918j31826j16097p5364J72572o2343J18650j02723
2910A150042j13922Q5925o1708R7859L8110N3501j21458j3322p1689K43906j56282
2899A130962J550j67271P5594o736k36186K2410J94593O2121j26926p2965q1871
2888G95275M8277q8319P1663M1009N8551p7640k2891j86206J2056N6914Q938J16022
$$ plain form
2876 833649 680572 725741 617574 597610 606424 736039 891572 856485 750807 594611 696465
2865 696465 729497 770386 821247 785076 851648 960746 838255 825384 816797 724893 851858
2854 851858 762255 763486 721345 729362 709064 658733 730710 906739 934651 900698 803323 708964
2842 708964 655485 767854 693714 562044 455571 495531 513889 603709 613781 623234 676012
2831 676012 837459 842548 748831 709337 794590 859724 784685 639054 722703 894357 939861
2820 939861 1028209 983267 1031068 1023858 1007799 1327391 1324758 1425833 1479030 1580721 1818602
2809 1818602 1995446 1932143 1864596 1913547 1870384 1726367 1722074 1638542 1547726 1480964 1349415
2798 1349415 1273297 1164478 1025129 893659 962588 883537 826738 749183 695885 659958 564841
$$ packed form
2876H33649j53077M5169j08167j9964Q814J29615J55533l5087j05678j56196J01854
2865F96465L3032M0889N0861l6171O6572J09098j22491j2871q587r1904J26965
2854H51858q9603J231m2141Q017k0298n0331P1977J76029K7912l3953r7375r4359
2842G08964n3479J12369p4140j31670j06473L9960J8358Q9820J0072R453N2778
2831F76012J61447N089r3717l9494Q5253O5134p5039j45631Q3649J71654M5504
2820I39861Q8348m4942M7801p210j6059L19592k633J01075N3197J01691K37881
2809A818602J76844o3303o7547M8951m3163j44017m293q3532r0816o6762j31549
2798A349415p6118j08819j39349j31470O8929p9051n6799p7555n3298l5927r5117
$$ plain form
2787 564841 661998 850196 745576 734213 733313 741045 740845 612999 651992 719828 414169 522675
2775 522675 731304 679967 628352 668731 606299 422388 405625 546800 416679 483171 434067
2764 434067 436845 527523 483542 591047 534111 494442 305555 353424 286061 384964 517777
2753 517777 270043 243008 260418 330562 360528 389782 278450 83527 147534 380413 421260
2742 421260 347037 418078 231623 150420 431486 369874 419655 284259 133458 173927 259496
2731 259496 263317 216660 212496 232360 290847 312318 231125 345220 321768 417440 312125 369530
2719 369530 219719 172904 240579 204432 101392 63594 223390 298505 156937 140148 193238
2708 193238 147521 257896 160259 62399 178460 105275 243480 162904 115359 210469 286998
$$ packed form
2787E64841R7157J88198j04620j1363r00P732k00j27846L8993O7836l05659J08506
2775E22675K08629n1337n1615M0379o2432j83911j6763J41175j30121O6492m9104
2764D34067K778R0678m3981J07505n6936l9669j88887M7869o7363R8903J32813
2753E17777k47734k7035J7410P0144K9966K9254j11332j94923O4007K32879M0847
2742D21260p4223P1041j86455q1203K81066o1612M9781j35396j50801M0469Q5569
2731B59496L821m6657m164J9864N8487K1471q1193J14095k3452R5672j05315N7405
2719C69530j49811m6815O7675l6147j03040l7798J59796P5115j41568j6789N3090
2708A93238m5717J10375r7637r7860J16061p3185J38205q0576m7545R5110P6529
$$ plain form
2697 286998 186899 249322 270666 122328 123039 60929 173630 91726 186148 267928 188597
2686 188597 175596 195103 107544 138895 103978 9800 212339 300250 385580 215103 206518
2675 206518 129607 135748 65709 -73081 116337 214153 170302 71502 167074 201986 290494
2664 290494 195455 119580 108631 228187 243375 193612 111710 37030 98091 237387 102707
2653 102707 109976 112090 317569 300471 284382 258993 61379 201813 309625 99398 42567
2642 42567 196829 216441 107075 39573 72865 174229 254807 166936 63448 142385 150724
2631 150724 302337 308432 252894 158149 210400 262864 136310 60499 17248 262696 350880
2620 350880 159336 225819 235676 297188 157260 137759 182704 36559 30982 124191 131975 300377
$$ packed form
2697B86998j00099O2423K1344j48338P11o2110J12701q1904R4422Q1780p9331
2686A88597j3001J9507q7559L1351l4917r4178K02539Q7911Q5330j70477q585
2675B06518p6911O141p0039j38790J89418R7816m3851r8800R5572L4912Q8508
2664B90494r5039p5875j0949J19556J5188m9763q1902p4680O1061J39296j34680
2653A02707P269K114K05479j7098j6089k5389j97614J40434J07812k10227n6831
2642D2567J54262J9612j09366o7502L3292J01364Q0578q7871j03488P8937Q339
2631A50724J51613O095n5538r4745N2251N2464j26554p5811m3251K45448Q8184
2620C50880j91544O6483R857O1512j39928j9501M4945j46145n577R3209P784J68402
$$ plain form
2608 300377 232287 226875 240595 336362 301692 137810 251154 443896 408554 250171 54324
2597 54324 193637 140235 149076 158130 140161 119867 186950 270692 213416 383455 230893 125873
2585 125873 246751 333995 460953 623409 807293 877719 999008 902437 920363 977626 931889
2574 931889 665369 507656 609753 602693 575512 538331 594169 448919 141846 233173 350490
2563 350490 259193 270423 290980 257990 236497 169524 140129 94319 -55044 8842 150172
2552 150172 151120 -22527 -15354 101012 173917 137869 48466 -165341 68560 52039 100493
2541 100493 151645 345308 311719 198411 140693 277786 174417 94708 1813 62711 81993
2530 81993 2714 212582 254902 251435 248382 286067 310783 357155 301084 181905 208428 221104
$$ packed form
2608C00377o8090n412J3720R5767l4670j63882J13344J92742l5342j58383j95847
2597E4324J39313n3402Q841R054j7969k0294O7083Q3742n7276J70039j52562j05020
2585A25873J20878Q7244J26958J62456J83884P0426J21289r6571J7926N7263m5737
2574I31889k66520j57713J02097p060k7181l7181N5838j45250l07073R1327J17317
2563C50490r1297J1230K0557l2990k1493o6973k9395m5810j49363O3886J41330
2552A50172R48j73647P173J16366P2905l6048q9403k13807K33901j6521M8454
2541A00493N1152J93663l3589j13308n7718J37093j03369p9709r2895O0898J9282
2530H1993p9279K09868M2320l467l053L7685K4716M6372n6071j19179K6523J2676
$$ plain form
2518 221104 162918 137356 227045 340330 251630 124691 179801 260459 445547 131626 109574
2507 109574 301805 305970 2439 72547 167039 18762 81060 -1030 -44760 114109 129917
2496 129917 -11190 124036 85147 51084 223706 9174 196432 202354 152594 195080 134347
2485 134347 169283 305169 456877 412166 227036 319725 275112 271355 191783 190123 148245
2474 148245 -35779 51821 106805 64820 88529 55026 67437 186362 337462 167477 45694
2463 45694 315380 285235 215319 -17879 20142 77430 87369 175004 279803 355813 368086
2452 368086 412585 546021 582707 506795 381789 467791 515139 398952 235394 226713 462435
2441 462435 519646 517694 563481 655125 536932 467299 491626 499012 528404 400491 472735 557746
$$ packed form
2518B21104n8186k5562Q9689J13285q8700j26939N5110Q0658J85088l13921k2052
2507A09574J92231M165l03531P0108R4492j48277O2298q2090m3730J58869J5808
2496A29917j41107J35226l8889l4063J72622k14532J87258N922m9760M2486o0733
2485A34347L4936J35886J51708m4711j85130R2689m4613l757p9572j660m1878
2474A48245j84024Q7600N4984m1985K3709l3503J2411J18925J51100j69985j21783
2463D5694K69686l0145o9916k33198L8021N7288R939Q7635J04799P6010J2273
2452C68086M4499J33436L6686p5912j25006Q6002M7348j16187j63558q681K35722
2441D62435N7211j952M5787R1644j18193o9633K4327P386K9392j27913P2244Q5011
$$ plain form
2429 557746 679183 618927 663046 649441 679050 579331 543330 482206 700629 602296 667435
2418 667435 789451 751724 440400 555351 612219 517203 343194 440043 550524 643794 597636
2407 597636 522550 701989 694132 715781 902933 832717 834996 775133 780679 862274 747039 875396
2395 875396 838708 973516 1057377 874220 994742 1221668 1168542 1017342 1039922 1073169 1115496
2384 1115496 1023249 983717 1072785 1106558 912388 949686 1195055 1254173 1272606 1336399 1338061
2373 1338061 1371700 1467881 1419296 1436694 1573565 1629406 1715723 1763721 1867526 1944088 1920348
2362 1920348 1951693 2087589 2199463 2171791 2199670 2262117 2381518 2535572 2548440 2468070 2679020
2351 2679020 2832278 2671969 2637673 2771373 2873424 2714840 2816163 2986149 3073929 3210299
$$ packed form
2429E57746J21437o0256M4119j3605K9609r9719l6001o1124K18423r8333O5139
2418F67435J22016l7727l11324J14951N6868r5016j74009R6849J10481R3270m6158
2407E97636p5086J79439p857K1649J87152p0216K279n9863N546Q1595j15235J28357
2395H75396l6688J34808Q3861j83157J20522K26926n3126j51200K2580L3247M2327
2384A115496r2247l9532Q9068L3773j94170L7298K45369N9118J8433O3793J662
2373A338061L3639R6181m8585J7398J36871N5841Q6317M7998J03805P6562k3740
2362A920348L1345J35896J11874k7672K7879O2447J19401J54054J2868q0370K10950
2351B679020J53258j60309l4296J33700J02051j58584J01323J69986Q7780J36370
$$ plain form
2341 3210299 3489594 3821517 3959335 4303355 4829035 5290940 5656578 6148817 6852975 7603460
2331 7603460 8360339 9336899 10494877 11645523 12702661 13484968 14494320 15540434 16874071
2322 16874071 18743795 21457549 25245154 30800252 39627526 55150499 79636076 109279885
2314 109279885 138400175 158289392 168861654 168317184 158715205 141662995 121910843
2307 121910843 104503297 89758637 74511757 59490864 47770952 38895311 33417537
2300 33417537 29779406 27048123 24775881 22692061 20689830 18517321 16363086 14610895
2292 14610895 13068297 11939868 10777277 9949681 9312535 8648258 8128394 7582066 7128504
2283 7128504 7161198 6929885 6549691 6528593 6411326 6108867 5852796 5591798 5307022 5286950
$$ packed form
2341C210299K79295L31923J37818L44020N25680M61905L65638M92239P04158P50485
2331G603460P56879R76560J157978J150646J057138P82307J009352J046114J333637
2322A6874071J869724K713754L787605N555098Q827274J5522973K4485577K9643809
2314A09279885K9120290J9889217J0572262n44470r601979j7052210j9752152
2307A21910843j7407546j4744660j5246880j5020893j1719912q875641n477774
2300C3417537l638131k731283k272242k083820k002231k172509k154235j752191
2292A4610895j542598j128429j162591q27596o37146o64277n19864n46328m53562
2283G128504L2694k31313l80194k1098j17267l02459k56071k60998k84776k0072
$$ plain form
2273 5286950 5159000 4862092 4647028 4545426 4420536 4248571 4134670 3822060 3691480 3524277
2263 3524277 3542745 3489853 3218563 3046039 3232889 3247151 3051528 2905086 2908317 2949026 2635401
2252 2635401 2452379 2312330 2284870 2408709 2193133 2327278 2253144 2188200 2126239 2326871
2242 2326871 2272764 2061371 1981342 2036766 1875980 1741255 1737365 1663399 1563938 1421522 1417043
2231 1417043 1421441 1298152 1384869 1291621 1234061 1215333 1298741 1141741 1008182 1174240 1041177
2220 1041177 854434 814236 804253 891405 1034785 1128213 1087133 1102005 1031983 1225280 1304743
2209 1304743 1277908 1161273 1229186 1011463 859954 979531 1004005 985995 910542 778417
2199 778417 709575 778121 765112 663276 537027 761910 889040 710223 642179 563401 517577
$$ packed form
2273E286950j27950k96908k15064j01602j24890j71965j13901l12610j30580j67203
2263C524277J8468n2892k71290j72524J86850J4262j95623j46442L231M0709l13625
2252B635401j83022j40049k7460J23839k15576J34145p4134o4944o1961K00632
2242B326871n4107k11393q0029N5424j60786j34725l890p3966r9461j42416m479
2231A417043M398j23289Q6717r3248n7560j8728Q3408j57000j33559J66058j33063
2220A041177j86743m0198r983Q7152J43380R3428m1080J4872p0022J93297P9463
2209A304743k6835j16635O7913k17723j51509J19577K4474j8010p5453j32125
2199G78417o8842O8546j3009j01836j26249K24883J27130j78817o8044p8778m5824
$$ plain form
2188 517577 442013 352795 486169 421988 505329 511301 495954 623670 545910 421631 441398
2177 441398 630285 476151 421865 522506 585108 549981 511130 505108 477266 525623 524347
2166 524347 596685 471152 443409 421905 132771 296990 426111 331559 341929 225000 557750
2155 557750 535213 393100 168964 125061 131523 184518 238066 374589 259210 331442 415975
2144 415975 493040 481062 229800 226496 158877 121875 258876 331427 448293 364491 89610
2133 89610 127571 324455 187091 202597 330840 220904 241931 185121 247926 255107 118979
2122 118979 62339 107314 245409 357774 364137 195006 105832 65328 115012 56211 106865
2111 106865 123395 127862 116791 119675 131953 150174 37385 93863 166718 256994 188094 56104
$$ packed form
2188E17577p5564q9218J33374o4181Q3341N972j5347J27716p7760j24279J9767
2177D41398J88887j54134n4286J00641O2602l5127l8851o022k7842M8357j276
2166E24347P2338j25533k7743k1504k89134J64219J29121r4552J0370j16929L32750
2155E57750k2537j42113k24136m3903O462N2995N3548J36523j15379P2232Q4533
2144D15975P7065j1978k51262l304o7619l7002J37001P2551J16866q3802k74881
2133H9610L7961J96884j37364J5506J28243j09936K1027n6810O2805P181j36128
2122A18979n6640M4975J38095J12365O363j69131q9174m0504M9684n8801N0654
2111A06865J6530M467j1071K884J2278J8221j12789N6478P2855R0276o8900j31990
$$ plain form
2099 56104 151216 28233 -109493 13248 70687 84516 132980 69472 159647 283907 200885
2088 200885 271458 371264 229537 172863 -16638 33406 15447 -95141 94116 104038 -62368
2077 -62368 23490 21801 225648 271808 181128 136354 89704 140571 162495 180891 144897 118766
2065 118766 178309 83044 65838 91595 -380 -32783 24926 173646 267585 210508 276440
2054 276440 185761 141698 158321 153783 100820 246074 243616 162711 345951 247865 508395
2043 508395 879973 1028679 1036380 822991 719559 564292 532016 504883 573806 503065 335488
2032 335488 294247 165177 190155 159015 -24653 -119301 66824 162727 104425 48360 143271
2021 143271 142776 -64805 32428 201855 195613 194701 12827 -44004 -147964 -23666 75196 -31362
$$ packed form
2099E6104R5112j22983j37726J22741N7439J3829M8464o3508R0175J24260q3022
2088B00885P0573R9806j41727n6674j89501N0044j7959j10588J89257R922j66406
2077f2368Q5858j689K03847M6160r0680m4774m6650N0867K1924J8396l5994k6131
2065A18766N9543r5265j7206K5757r1975l2403N7709J48720R3939n7077O5932
2054B76440r0679m4063J6623m538n2963J45254k458q0905J83240r8086K60530
2043E08395L71578J48706P701k13389j03432j55267l2276k7133O8923p0741j67577
2032C35488m1241j29070K4978l1140j83668r4648J86125R5903n8302n6065R4911
2021A43271m95k07581R7233J69427o242r12j81874n6831j03960J24298R8862j06558
$$ plain form
2009 -31362 41010 37387 44729 13315 -7185 -129673 -173847 -30244 -32371 30011 -39662 43621
1997 43621 183656 12264 -67159 -140974 -129003 -73558 8527 -7067 -30186 -106977 -129959
1986 -129959 -122394 -81746 -28865 46662 70598 132760 71733 -71619 -76113 17097 -14588 -116247
1974 -116247 -205828 -176689 -120541 -187030 -85705 -76112 14531 -31577 -153531 -102474 10956
1963 10956 -10756 28929 104281 138456 73296 35570 85262 188660 119047 226380 49228
1952 49228 105255 140112 -114503 -69608 96577 191319 -114103 -128922 26009 -114971 -196898
1941 -196898 -101688 -94759 -84113 -99939 -139701 -59211 45159 -163286 -315377 -182579 -92392
1930 -92392 -118690 -117859 -54549 26900 112450 162395 199783 235281 112354 -5375 -30654 -4230
$$ packed form
2009c1362P2372l623P342l1414k0500j22488m4174J43603k127O2382o9673Q3283
1997D3621J40035j71392p9423p3815J1971N5445Q2085j5594k3119p6791k2982
1986a29959P565M0648N2881P5527K3936O2162o1027j43352m494R3210l1685j01659
1974a16247q9581K9139N6148o6489J01325R593R0643m6108j21954N1057J13430
1963A0956k1712L9685P5352L4175o5160l7726M9692J03398o9613J07333j77152
1952D9228N6027L4857k54615M4895J66185R4742l05422j4819J54931j40980q1927
1941a96898R5210O929J0646j5826l9762Q0490J04370k08445j52091J32798R0187
1930i2392k6298Q31O3310Q1449Q5550M9945L7388L5498j22927j17729k5279K6424
$$ plain form
1918 -4230 -11712 61198 67809 114831 -15878 -23211 129935 62504 67602 -111950 -357490 -164052
1906 -164052 -209646 -144953 -61903 -27584 -68277 -57828 127666 202107 66166 -129316 -173534
1895 -173534 -46869 -47687 -91087 -116738 -970 134496 -19765 -136304 -245130 -198513 -102352
1884 -102352 -81368 11675 -66524 -134229 -8733 93401 84097 -33949 -129284 -243622 -266258
1873 -266258 -301690 -162163 -123835 58872 221254 13107 17240 -17210 -176755 19616 -26860
1862 -26860 -26033 90683 150487 156857 23568 -71895 -94590 -66075 41219 -15855 -196071 -280975
1850 -280975 -187787 -66155 -136338 23192 19448 -149472 -275589 -342258 -436443 -373607 -245352
1839 -245352 -92118 -111178 -133126 -25753 20001 101191 70949 138592 96317 91980 105113
$$ packed form
1918d230p482P2910O611M7022j30709p333J53146o7431N098j79552k45540J93438
1906a64052m5594O4693Q3050L4319m0693J0449J85494P4441j35941j95482m4218
1895a73534J26665q18m3400k5651J15768J35466j54261j16539j08826M6617R6161
1884a02352K0984R3043p8199o7705J25496J02134r304j18046r5335j14338k2636
1873b66258l5432J39527L8328J82707J62382k08147M133l4450j59545J96371m6476
1862b6860Q27J16716N9804O370j33289r5463k2695K8515J07294n7074j80216q4904
1850b80975R3188J21632p0183J59530l744j68920j26117o6669r4185O2836J28255
1839b45352J53234j9060k1948J07373M5754Q1190l0242O7643m2275m337J3133
$$ plain form
1828 105113 47308 -148953 -184984 -102771 92147 141735 -38781 -76526 -1774 58330 151575
1817 151575 12199 23554 -89800 -82614 -14901 -102522 5809 -55120 -278443 -215666 -58186
1806 -58186 -36280 -126642 24171 -20259 49627 94703 -48798 -32981 76985 34335 -9194
1795 -9194 -29606 -135303 -205456 -229262 -138329 -158190 -202865 -236224 -301559 -327189 -232443 -150683
1783 -150683 -93304 -94689 -40012 -81006 -126175 -28888 23088 -16231 -122267 -56103 85411
1772 85411 -47116 1714 63554 -84738 -49164 -101957 -78778 35082 30294 149141 73638
1761 73638 243679 166006 -25500 -34941 112964 136726 51761 -131951 -173841 -72645 -8907
1750 -8907 -60831 49350 115087 116620 109155 31333 36373 47886 102279 -119724 -282497 -101066
$$ packed form
1828A05113n7805j96261l6031Q2213J94918M9588j80516l7745P4752O0104R3245
1817A51575j39376J1355j13354P186O7713q7621J08331o0929k23323O2777J57480
1806e8186K1906r0362J50813m4430O9886M5076j43501J5817J09966m2650m3529
1795i194k0412j05697p0153k3806R0933j9861m4675l3359o5335k5630R4746Q1760
1783a50683N7379j385N4677m0994m5169R7287N1976l9319j06036O6164J41514
1772H5411j32527M8830O1840j48292L5574n2793K3179J13860m788J18847p5503
1761G3638J70041p7673j91506r441J47905K3762q4965j83712m1890J01196O3738
1750h907n1924J10181O5737J533p465p7822N040J1513N4393k22003j62773J81431
$$ plain form
1738 -101066 -24420 178796 120353 64243 -24674 -56280 -137105 -147510 -184522 -190887 -82430
1727 -82430 7461 -170954 -233745 -285356 -206969 -90476 -103392 -196107 -269401 -96150 -142498
1716 -142498 -73073 -268535 -155885 -61744 -64477 -5851 141739 190600 212418 189646 -9006
1705 -9006 -101914 96193 -74377 -150007 -83783 92292 955 111803 79411 -133684 -17619
1694 -17619 -46346 -101120 -88447 -57974 -248023 -336856 -147271 -159678 -314834 -121040 -258842
1683 -258842 -233733 -67580 6417 -30135 35404 32801 -149846 -138190 50059 -68086 -139706
1672 -139706 -16382 141382 22542 31132 12001 -72269 -15271 9006 -99051 -78075 -75161
1661 -75161 -259966 -344690 -267379 24102 -133128 -64591 110004 126331 -46877 -224831 -78389
$$ packed form
1738a01066P6646K03216n8443n6110q8917l1606q0825j0405l7012o365J08457
1727h2430Q9891j78415o2791n1611P8387J16493j2916r2715p3294J73251m6348
1716a42498O9425j95462J12650R4141k733N8626J47590M8861K1818k2772j98652
1705i006r2908J98107j70570p5630O6224J76075r1337J10848l2392k13095J16065
1694a7619k8727n4774J2673L0473j90049q8833J89585j2407j55156J93794j37802
1683b58842K5109J66153P3997l6552O5539k603j82647J1656J88249j18145p1620
1672a39706J23324J57764j18840Q590j9131q4270N6998K4277j08057K0976K914
1661g5161j84805q4724P7311K91481j57230O8537J74595J6327j73208j77954J46442
$$ plain form
1650 -78389 -7689 13886 96732 142658 80282 -39812 65291 129919 218966 174543 49031
1639 49031 -161489 178469 -99640 -260824 -135699 -164711 -104903 -101210 -206223 -217208 -234193
1628 -234193 -238590 -267252 -306174 -143950 -134702 -141264 -54670 -5412 -32898 63854 108651 189635
1616 189635 10989 97743 32053 25409 -101365 -61965 46807 5023 -30993 -233651 -199738
1605 -199738 108232 -107674 -223793 -185958 -181707 -34826 -60765 26071 81423 6475 -72443
1594 -72443 -18262 -1394 -136110 -39764 24547 -48922 47124 -7522 106799 164514 55551
1583 55551 -119766 -29313 203423 92013 -19929 -8079 -151697 -265248 -396987 -431205
1573 -431205 -326340 -155306 -127777 -120068 -24753 -58821 -154569 -129888 -137867 -142336 -156204 -206528
$$ packed form
1650g8389P0700K1575Q2846M5926o2376j20094J05103O4628Q9047m4423j25512
1639D9031k10520L39958k78109j61184J25125k9012N9808L693j05013j0985j6985
1628b34193m397k8662l8922J62224R248o562Q6594M9258k7486R6752M4797Q0984
1616A89635j78646Q6754o5690o644j26774L9400J08772m1784l6016k02658L3913
1605a99738L07970k15906j16119L7835M251J46881k5939Q6836N5352p4948p8918
1594g2443N4181J6868j34716R6346O4311p3469R6046n4646J14321N7715j08963
1583E5551j75317R0453K32736j11410j11942J1850j43618j13551j31739l4218
1573d31205J04865J71034K7529P709R5315l4068r5748K4681p979m469j3868n0324
$$ plain form
1561 -206528 -207843 -5884 36089 -1473 124701 25424 60428 207587 184488 121462 156082
1550 156082 136844 125536 126331 41002 21920 114872 85840 -29016 -80713 926 -79238 -157791
1538 -157791 -127658 -111521 -108225 -127705 -241243 -237280 -234542 -105203 -276990 -152677 60373
1527 60373 -64089 27942 -58056 -27427 -97510 -96646 -99364 -142287 -9773 -114644 -33319 5643
1515 5643 -126357 -55868 -67001 -36508 98228 53892 -124633 -98391 -191979 -218860 -105984
1504 -105984 -176698 -175458 -98274 40312 126186 64576 75974 166241 40992 64839 96739
1493 96739 155475 66083 49785 53446 -35920 4787 -49837 -122761 -101941 -89790 -71991 -126383
1481 -126383 -121352 -78814 -137803 -185802 -106182 150607 66126 -15522 -71989 -48246 62992
$$ packed form
1561b06528j315K01959M1973l7562J26174r9277L5004J47159k3099o3026L4620
1550A56082j9238j1308P95q5329j9082R2952k9032j14856n1697Q1639q0164p8553
1538a57791L0133J6137L296j9480j13538L963K738J29339j71787J24313K13050
1527F0373j24462R2031q5998L0629p0083Q64k718m2923J32514j04871Q1325L8962
1515E643j32000P0489j1133L0493J34736m4336j78525K6242r3588k6881J12876
1504a05984p0714J240P7184J38586Q5874o1610J1398R0267j25249K3847L1900
1493I6739N8736q9392j6298L661q9366M0707n4624p2924K0820J2151J7799n4392
1481a26383N031M2538n8989m7999P9620K56789q4481q1648n6467K3743J11238
$$ plain form
1470 62992 38628 -50829 -145267 -26387 1242 -134633 -88644 -97257 -233897 -60520 78432
1459 78432 -48228 -124185 -71855 -10944 58524 -4095 21010 72035 -56849 -107955 -189398
1448 -189398 -103375 -90001 -118696 -55820 -102883 -45776 43500 96724 121715 63029 -36382 19895
1436 19895 -7257 24658 77051 -118719 -69277 -32635 -130157 -130687 33528 -161339 -298395
1425 -298395 -170176 -147761 -66964 68596 215220 80329 -59028 64322 -139687 -48684
1415 -48684 -184104 -315063 -112556 -136774 -96165 84028 97562 54771 -133300 -107481 87502
1404 87502 142310 57306 56405 72149 242003 266737 209295 66784 -61671 10320 -61029 45034
1392 45034 26108 57395 -38649 9894 -133868 16186 193423 145854 132454 115183 156464
$$ packed form
1470F2992k4364q9457r4438J18880K7629j35875M5989q613j36640J73377J38952
1459G8432j26660p5957N2330O0911O9468o2619K5105N1025j28884n1106q1443
1448a89398Q6023J3374k8695O2876m7063N7107Q9276N3224K4991n8686r9411N6277
1436A9895k7152L1915N2393j95770M9442L6642r7522n30J64215j94867j37056
1425b98395J28219K2415Q0797J35560J46624j34891j39357J23350k04009R1003
1415d8684j35420j30959K02507k4218M0609J80193J3534m2791j88071K5819J94983
1404H7502N4808q5004r01J5744J69854K4734n7442j42511j28455P1991p1349J06063
1392D5034j8926L1287r6044M8543j43762J50054J77237m7569j3400j7271M1281
$$ plain form
1381 156464 148135 12258 -56934 111462 67121 3564 90667 131905 -24862 -26372 114496
1370 114496 72137 -42750 50889 210452 123522 6281 -27894 -95332 -154920 -9213 -131574
1359 -131574 -169318 -102840 -16795 -4141 -11310 -162396 -363047 -89265 33840 129740 29949
1348 29949 58980 144393 55052 1247 -42597 75551 61554 113088 47698 24580 50861 85237
1336 85237 116628 169453 234150 96992 -2339 72212 159755 -21939 10117 -41880 -66516
1325 -66516 115515 5585 60036 -77970 -344286 -260595 -80955 -108655 -74268 -98050 -143795
1314 -143795 -188722 -187303 -27204 28995 -76949 -97294 -66848 -172389 -124863 -120404 -99973
1303 -99973 84201 31572 34068 -27699 -2759 -54590 -110600 -97662 7708 90586 19211 -87018
$$ packed form
1381A56464q329j35877o9192J68396m4341o3557Q7103M1238j56767j510J40868
1370A14496m2359j14887R3639J59563q6930j17241l4175o7438n9588J45707j22361
1359a31574l7744O6478Q6045J2654p169j51086k00651K73782J23105R5900r9791
1348B9949K9031Q5413q9341n3805m3844J18148j3997N1534o5390k3118K6281L4376
1336H5237L1391N2825O4697j37158r9331P4551Q7543j81694L2056n1997k4636
1325f6516J82031j09930N4451j38006k66316Q3691J79640k7700L4387k3782m5745
1314a43795m4927J419J60099N6199j05944k0345L0446j05541M7526M459K0431
1303i9973J84174n2629K496o1767K4940n1831n6010J2938J05370Q2878p1375j06229
$$ plain form
1291 -87018 13796 156355 34189 53736 38416 -53587 -51265 -27911 -104661 95815 -43325
1280 -43325 -172550 -38547 -159681 -157992 2935 -49295 -79706 -54776 -107189 97633 223088
1269 223088 37133 -27492 2457 154856 -37699 -96173 -5210 -81724 -164432 -283594 -354307
1258 -354307 -340818 -314531 -253899 -150447 13214 1637 5087 78658 118656 -2284 -63715
1247 -63715 -107940 17244 27006 84072 76857 33531 -77177 -75510 -24521 -72628 -127974 39597
1235 39597 38389 -182166 -103751 -143639 -19527 -62750 -205417 -173277 -41309 -11767 -20675
1224 -20675 -89472 -44845 48524 -41846 -95403 43755 153729 -34276 -67859 51561 28087
1213 28087 111636 18421 15019 -19196 -133068 -134644 124126 -42723 -52373 -73697 -42795 -100267
$$ packed form
1291h7018J00814J42559j22166J9547j5320r2003K322K3354p6750K00476j39140
1280d3325j29225J34003j21134J689J60927n2230l0411K4930n2413K04822J25455
1269B23088j85955o4625K9949J52399j92555n8474R0963p6514q2708j19162p0713
1258c54307J3489K6287O0632J03452J63661j1577L450P3571L9998j20940o1431
1247f3715m4225J25184R762N7066p215m3326j10708J667N0989m8107n5346J67571
1235C9597j208k20555P8415l9888J24112m3223j42667L2140J31968K9542q908
1224b0675o8797M4627R3369r0370n3557J39158J09974j88005l3583J19420k3474
1213B8087Q3549r3215l402l4215j13872j576K58770j66849r650k1324L0902n7472
$$ plain form
1201 -100267 -230510 -117650 -135209 -146679 -48423 -148086 -58633 243466 62488 45197 101836
1190 101836 152575 62830 144111 195835 125524 41730 7135 -50273 21211 52775 -83839
1179 -83839 -50169 58951 -85100 -239504 10889 46288 167601 -76768 -87194 -78146 -104711
1168 -104711 21743 -71748 -71200 113514 22249 -7309 -126866 -31541 13108 7082 -56243 -101223
1156 -101223 80734 65071 136474 35392 -20589 -80062 151315 51809 52687 39380 -27694
1145 -27694 -11212 8140 -23240 -86764 5511 78010 86763 -50488 -7586 -9796 -122731 -23755
1133 -23755 -34311 57881 17447 -67170 -150599 -78285 -112960 -101909 48454 -106822 -140885
1122 -140885 -86559 67126 -105863 -103383 205494 78060 -2875 -11737 87611 99362 -105264
$$ packed form
1201a00267j30243J12860j7559j1470R8256r9663Q9453L02099j80978j7291N6639
1190A01836N0739q9745Q1281N1724p0311q3794l4595n7408P1484L1564j36614
1179h3839L3670J09120j44051j54404K50393L5399J21313k44369j0426R048k6565
1168a04711J26454r3491N48J84714r1265k9558j19557R5325M4649o026o3325m4980
1156a01223J81957j5663P1403j01082n5981n9473K31377r9506Q78j3307o7074
1145b7694J6482J9352l1380o3524R2275P2499Q753j37251M2902k210j12935R8976
1133b3755j0556R2192m0434q4617q3429P2314l4675J1051J50363j55276l4063
1122a40885N4326J53685j72989K480L08877j27434q0935q862R9348J1751k04626
$$ plain form
1111 -105264 -164876 -34505 7963 -68439 -146156 -111808 -118682 -152580 -74822 183997 261209
1100 261209 32996 -94391 -196204 -235996 -245414 -168048 -190698 -117440 -34283 -4325 64589
1089 64589 105581 31345 -187810 -229124 6516 -28406 13791 122151 42429 -46706 -138178
1078 -138178 -37316 -47609 -59948 -161925 -82763 -13632 50605 234821 86768 21982 -35146
1067 -35146 90286 239435 147168 -7244 50572 217469 125682 73533 -164026 -191598 -120326
1056 -120326 -92798 -103571 -18486 135412 -45543 -21631 84457 -59608 29911 134031 133639
1045 133639 21238 -139355 -356039 -200627 155533 32471 -137306 -49234 -43252 61068
1035 61068 40545 71187 106338 -90623 -159941 -228954 -200125 -363515 -216674 -55744 -149888
$$ packed form
1111a05264n9612J30371M2468p6402p7717L4348o874l3898P7758K58819P7212
1100B61209k28213j27387j01813l9792r418P7366k2650P3258Q3157K9958O8914
1089F4589M0992p4236k19155m1314K35640l4922M2197J08360p9722q9135r1472
1078a38178J00862j0293j2339j01977P9162O9131O4237J84216j48053o4786n7128
1067c5146J25432J49149r2267j54412N7816J66897r1787n2149k37559k7572P1272
1056a20326K7528j0773Q5085J53898j80955K3912J06088j44065Q9519J04120l92
1045A33639j12401j60593k16684J55412L56160j23062j69777Q8072N982J04320
1035F1068k0523L0642L5151j96961o9318o9013K8829j63390J46841J60930r4144
$$ plain form
1024 -149888 -8175 176806 -252 67846 178014 230631 74479 96213 154554 -30236
1014 -30236 -772 34187 112173 52841 47667 -50868 -205030 -233670 -146943 -16051 -28541 -120756
1002 -120756 -127912 29813 87108 106094 84831 27872 45256 38286 109678 223078 83398
991 83398 6885 8333 29924 -46098 -14429 104066 -119501 22634 55378 -73543 34772
980 34772 48387 -95588 -2088 78492 -10771 -117094 -129962 -147749 -157572 -36033 -63456 -118044
968 -118044 -143397 42340 172085 73014 56371 262601 118155 -35178 -27292 -85835 157433
957 157433 411463 204086 62678 105469 224513 192212 -18375 -176337 38314 -25705
947 -25705 56717 -12840 -93768 -70354 16946 82093 120598 164650 -30916 -84238 -145236 -268538
$$ packed form
1024a49888J41713J84981j77058O8098J10168N2617j56152K1734N8341j84790
1014c0236K9464L4959P7986n9332n174r8535j54162k8640Q6727J30892j2490r2215
1002a20756p156J57725N7295J8986k1263n6959J7384o970P1392J13400j39680
991H3398p6513J448K1591p6022L1669J18495k23567J42135L2744j28921J08315
980C4772J3615j43975R3500Q0580q9263j06323j2868j7787r823J21539k7423n4588
968a18044k5353J85737J29745r9071j6643K06230j44446j53333P886n8543K43268
957A57433K54030k07377j41408M2791J19044l2301k10587j57962K14651o4019
947b5705Q2422o9557q0928K3414Q7300O5147L8505M4052j95566n3322o0998j23302
$$ plain form
935 -268538 -216043 -133616 29425 208716 32102 -8476 11387 84820 -16208 -29959 -74567
924 -74567 -12856 -32349 -39855 80395 182617 4837 80877 78187 96450 20057 -150506 -206087
912 -206087 -88336 -174181 -18133 -96205 -159849 -120006 14618 169702 203249 147452 79491
901 79491 84496 104114 -17900 31742 141934 352068 340093 -103587 -121866 -191440 -53893
890 -53893 -10001 99651 102003 14917 10847 -77604 -97009 5570 -2569 -38280 145564 295616
878 295616 -14548 -227912 -225551 -101285 -243449 22359 171340 139719 171080 117296 586
867 586 -179457 -357549 -243273 -120710 -50109 -67779 -34951 2926 -29946 -96151 -24071 66134
855 66134 23304 -217828 -151856 -210432 -337452 -134031 21478 51478 40705 162842 -22331
$$ packed form
935b68538N2495Q2427J63041J79291j76614m0578J9863P3433j01028j3751m4608
924g4567O1711j9493p506J20250J02222j77780P6040k690J8263p6393j70563n5581
912b06087J17751q5845J56048p8072o3644L9843J34624J55084L3547n5797o7961
901G9491N005J9618j22014M9642J10192K10134j1975m43680j8279o9574J37547
890e3893M3892J09652K352q7086m070q8451j9405J02579q139l5711J83844J50052
878B95616l10164k13364K361J24266j42164K65808J48981l1621L1361n3784j16710
867E86j80043j78092J14276J22563P0601j7670L2828L7877l2872o6205P2080R0205
855F6134m2830k41132O5972n8576j27020K03421J55509L0000j0773J22137j85173
$$ plain form
844 -22331 50519 -26209 27031 76087 141048 196079 142472 71223 122848 322924 255742 59445
832 59445 141089 197636 -133468 -241092 30394 11593 -103340 75844 146703 89208 25642
821 25642 -224934 -287418 -134002 -141494 -151873 -32523 -30078 -170584 -142088 42730 76893
810 76893 187103 -73827 54291 117302 41847 -126449 -223976 95444 98012 -15443 -82365
799 -82365 -89174 -119064 -82256 -115950 -161649 -131179 -23592 -21536 38759 62891 125279 109715
787 109715 40871 -169546 -298565 -186209 106077 146113 21059 4456 187461 64011
777 64011 20064 57656 104877 214902 104444 109028 250818 99986 -116784 -99020 -56145
766 -56145 45212 -57298 -172984 -9619 82029 29864 -50346 -53620 164451 21003 -49703
$$ packed form
844b2331P2850p6728N3240M9056O4961N5031n3607p1249N1625K00076o7182j96297
832E9445Q1644N6547l31104j07624K71486j8801j14933J79184P0859n7495o3566
821B5642k50576o2484J53416p492j0379J19350K445j40506K8496J84818L4163
810G6893J10210k60930J28118O3011p5455j68296r7527L19420K568j13455o6922
799h2365o809k9890L6808l3694m5699L0470J07587K056O0295K4132O2388j5564
787A09715o8844k10417j29019J12356K92286M0036j25054j6603J83005j23450
777F4011m3947L7592M7221J10025j10458M584J41790j50832k16770J7764M2875
766e6145J01357j02510j15686J63365R1648n2165q0210l274K18071j43448p0706
$$ plain form
755 -49703 -60284 -10250 76705 61411 197623 221080 60749 79462 103571 134409 13961
744 13961 -545 -3390 67351 34827 -19336 83379 123387 29264 -32586 -47714 8100 -8491
732 -8491 -59558 79735 36218 -99809 -217893 -109662 4852 -97081 -89482 35737 168033
721 168033 227253 63227 52926 217402 244746 200974 289309 267838 32833 -68133 45278
710 45278 53278 -33563 -51325 -207645 -38610 100884 -7090 -12316 12971 51990 51932 1205
698 1205 22292 160727 127039 15902 156153 226600 42814 17559 185165 165312 22247
687 22247 77693 113282 55902 -82763 -85567 4110 98249 -72509 -195963 -74256 -7449
676 -7449 46053 -130054 -311388 86050 179177 -44850 5747 5043 9019 -117315 -98114 34259
$$ packed form
755d9703j0581N0034Q6955j5294J36212K3457j60331J8713K4109L0838j20448
744A3961j4506k845P0741l2524n4163J02715M0008r4123o1850j5128N5814j6591
732h491n1067J39293m3517j36027j18084J08231J14514j01933P599J25219J32296
721A68033N9220j64026j0301J64476K7344m3772Q8335k1471k35005j00966J13411
710D5278Q000q6841j7762j56320J69035J39494j07974n226K5287L9019n8n0727
698A205K1087J38435l3688j11137J40251P0447j83786k5255J67606j9853j43065
687B2247N5446L5589n7380j38665k804Q9677R4139j70758j23454J21707O6807
676g449N3502j76107j81334L97438R3127k24027N0597p04L976j26334J9201J32373
$$ plain form
664 34259 -138462 -68333 7952 123287 223734 168220 -15218 192037 99195 -42368 142989
653 142989 318509 207619 33136 190409 89789 -49104 93447 -66341 29155 26346
643 26346 54248 102073 68403 90143 -154626 -323197 -258932 74181 249380 59430 69276
632 69276 120389 -12981 -27034 -178595 -167465 -173014 -105907 1951 175705 122420 74680
621 74680 165579 116021 65908 106448 80528 -47626 -20177 94333 153783 203104 8009
610 8009 -53415 -182117 -68125 -83448 94516 128982 33080 45680 -148359 10585 86169
599 86169 8958 -79655 32824 203458 85382 -49372 -57880 165737 259791 125538 -6941
588 -6941 50682 49036 61974 -94191 -121338 -277659 -93613 122979 107292 -33430 -41282 117390
$$ packed form
664C4259j72721P0129P6285J15335J00447n5514j83438K07255r2842j41563J85357
653A42989J75520j10890j74483J57273j00620j38893J42551j59788R5496k809
643B6346K7902M7825l3670K1740k44769j68571O4265L33113J75199j89950R846
632F9276N1113j33370j4053j51561J1130n549O7107J07858J73754n3285m7740
621G4680R0899m9558n0113M0540k5920j28154K7449J14510N9450M9321j95095
610H009o1424j28702J13992j5323J77964L4466r5902J2600j94039J58944P5584
599H6169p7211q8613J12479J70634j18076j34754q508K23617R4054j34253j32479
588f941N7623j646J2938j56165k7147j56321J84046K16592j5687j40722p852J58672
$$ plain form
576 117390 100744 -62453 -3349 87736 13133 -4367 -127960 -191543 -36331 166264 16382
565 16382 -141183 -79375 111905 86180 71212 54582 64686 28515 -35190 -98736 -209869
554 -209869 -193807 4322 49376 213946 115416 -73053 -40438 -127068 -185492 -125776 -205591
543 -205591 -137054 -12393 27362 -101768 76384 260969 16243 26184 144961 104411 41034
532 41034 -11234 -16697 81177 32026 69922 85589 939 172602 132843 -94467 -105269 -133168
520 -133168 -1584 102715 1936 -94023 -197463 28907 30403 -77832 110538 54734 -73262
509 -73262 -125271 -129302 1716 91307 83336 40606 27259 53888 24911 36701 42781 -73252
497 -73252 -119041 -162925 38457 44894 98910 95450 26203 -145563 -219369 -21312 -72110 -83560
$$ packed form
576A17390j6646j63197N9104R1085p4603j7500j23593o3583J55212K02595j49882
565A6382j57565O1808J91280k5725j4968j6630J0104l6171o3705o3546j11133
554b09869J6062J98129M5054J64570r8530j88469L2615q6630n8424N9716p9815
543b05591O8537J24661L9755j29130J78152J84585k44726R941J18777m0550o3377
532D1034n2268n463R7874m9151L7896J5667q4650J71663l9759k27310j0802k7899
520a33168J31584J04299j00779r5959j03440K26370J496j08235J88370n5804j27996
509g3262n2009m031J31018Q9591p971m2730j3347K6629k8977J1790O080j16033
497g3252m5789m3884K01382O437N4016l460o9247j71766p3806J98057n0798j1450
$$ plain form
485 -83560 12522 46600 33859 125738 227654 78181 35473 72913 128455 172492 56077
474 56077 11469 21384 -112932 -121709 -65001 -91734 -37969 15641 160248 323377 127346 36418
462 36418 -96423 -50388 -67093 -231350 -102439 -33026 -5211 21450 40226 108704 272025
451 272025 195348 21317 -90535 2585 109021 55585 95882 146375 59312 -220256 -127058
440 -127058 -90033 -216570 74129 69790 -69914 -75814 107615 162856 88800 -11 -78840
429 -78840 30548 83882 -148314 -202138 -18428 -131847 -234091 -113121 -73848 -9110 43017
418 43017 -107741 -338048 -100394 -61068 -87042 -6670 164679 211808 137825 183275 312728
407 312728 157242 17095 -16119 -12869 173729 125026 -21862 3822 74745 26949 113282
$$ packed form
485h3560R6082L4078j2741R1879J01916j49473m2708L7440N5542M4037j16415
474E6077m4608R915j34316q777N6708k6733N3765N3610J44607J63129j96031r0928
462C6418j32841M6035j6705j64257J28911O9413K7815K6661J8776O8478J63321
451B72025p6677j74031j11852R3120J06436n3436M0297N0493q7063k79568R3198
440a27058L7025j26537K90699m339j39704n900J83429N5241p4056q8811p8829
429g8840J09388N3334k32196n3824J83710j13419j02244J20970L9273O4738N2127
418D3017j50758k30307K37654L9326k5974Q0372J71349M7129p3983M5450J29453
407C12728j55486j40147l3214L250J86598m8703j46888K5684P0923m7796Q6333
$$ plain form
396 113282 283036 79365 94346 103456 -2292 -70393 -26718 -29705 -76634 -53516 -41358 -152228
384 -152228 52865 116219 -51372 -38974 -56511 42196 43392 103878 154958 308398 254781
373 254781 132008 73792 152437 149562 143922 97010 78639 -27177 6828 -31628 27611 14776
361 14776 -51088 -53132 -116383 -100042 8956 161262 227281 200518 113964 51450 190353 172078
349 172078 152566 199412 78848 91569 80152 93638 38520 -449 -107346 -123773 54183
338 54183 -27365 -200782 30558 126886 22926 -126036 -102745 -8370 -140923 -175533 166500
327 166500 -26556 1677 126247 -41169 102643 112718 -9961 -33610 7286 -70043 -115110
316 -115110 35170 121167 156368 134323 -14184 -44662 91949 222563 130710 176359 197698
$$ packed form
396A13282J69754k03671J4981R110j05748o8101M3675k987m6929K3118J2158j10870
384a52228K05093O3354j67591J2398j7537R8707J196O0486N1080J53440n3617
373B54781j22773n8216P8645k875n640m6912j8371j05816L4005l8456N9239j2835
361A4776o5864k044o3251J6341J08998J52306O6019k6763q6554o2514J38903j8275
349A72078j9512M6846j20564J2721j1417J3486n5118l8969j06897j6427J77956
338E4183q1548j73417K31340R6328j03960j48962K3291R4375j32553l4610L42033
327A66500j93056K8233J24570j67416J43812J0075j22679k3649M0896p7329m5067
316a15110J50280Q5997L5201k2045j48507l0478J36611J30614r1853M5649K1339
$$ plain form
305 197698 169179 85555 144401 65416 -71113 122189 139501 99013 171742 132176 219261
294 219261 154066 168814 9175 199446 350382 140505 294603 355974 218422 154832 22443
283 22443 143390 283706 296795 141850 130238 169564 84630 -87732 -127278 -22198 -67516
272 -67516 -82414 53553 45510 14380 171297 135100 71150 -48136 26444 -68174 56 194006
260 194006 101114 -17184 41396 -29464 -112622 -196418 -155658 -82421 -61143 -114053 -134077 41187
248 41187 143150 11139 -40267 -24562 -137365 -31998 50940 102371 143787 -60459 -238610
237 -238610 -176838 -221516 -35078 88305 40519 35159 59842 -2586 -30544 42320 2943 -37042
225 -37042 116764 201035 73999 61624 -51340 45248 25748 -117389 43851 75757 119750
$$ packed form
305A97698k8519q3624N8846p8985j36529J93302J7312m0488P2729l9566Q7085
294B19261o5195J4748j59639J90271J50936k09877J54098O1371j37552o3590j32389
283B2443J20947J40316J3089j54945j1612L9326q4934j72362l9546J05080m5318
272f7516j4898J35967q043l1130J56917l6197o3950j19286P4580r4618O8230J93950
260A94006r2892j18298N8580p0860q3158q3796M0760P3237K1278n2910k0024J75264
248D1187J01963j32011n1406J5705j12803J05367Q2938N1431M1416k04246j78151
237b38610O1772m4678J86438J23383m7786n360K4683o2428k7958P2864l9377l9985
225c7042J53806Q4271j27036j2375j12964R6588j9500j43137J61240L1906M3993
$$ plain form
214 119750 247337 245688 280373 277528 238634 209948 322294 331163 65825 -74578 69508
203 69508 42276 -32929 -108658 128021 -8350 -49135 4754 47605 87727 152561 68984 36439
191 36439 73722 111619 119138 -14741 109066 214469 79910 157588 327132 -57089 -26441
180 -26441 141112 152187 38151 -73008 -128973 -96819 -53110 -47573 -17429 117028 42342
169 42342 -3992 91576 45619 121244 123143 -42018 147350 128217 -59577 -76950 150051
158 150051 180397 70047 25528 146438 148722 -10943 57277 112422 125248 71145 -123018
147 -123018 -22544 -35408 -30477 -13819 14634 82663 -55614 -73500 71885 -64454 -102115
136 -102115 45530 84959 -22811 35699 149059 34849 103199 33308 6233 100546 40603
$$ packed form
214A19750J27587j649L4685k845l8894k8686J12346Q869k65338j40403J44086
203F9508k7232p5205p5729K36679j36371m0785N3889M2851M0122O4834q3577l2545
191C6439L7283L7897P519j33879J23807J05403j34559P7678J69544l84221L0648
180b6441J67553J1075j14036j11159n5965L2154M3709N537L0144J34457p4686
169D2342m6334R5568m5957P5625J899j65161J89368j9133j87794j7373K27001
158A50051L0346j10350m4519J20910K284j59665O8220N5145J2826n4103j94163
147a23018J00474j2864M931J6658K8453O8029j38277j7886J45385j36339l7661
136a02115J47645L9429j07770N8510J13360j14210O8350o9891k7075R4313n9943
$$ plain form
125 40603 -115522 -137431 -4250 34380 102064 19223 -16439 193106 182193 113051 5592
114 5592 28951 41586 89789 53840 183621 109996 -13531 -8818 -20185 -21092 20351 14688 11351
101 11351 16038 -117220 -79068 141381 32332 19454 -14936 121718 195225 111977 29953
90 29953 31493 107147 22351 -10978 44288 39641 85283 100121 104741 131622 138687 -19623 -42742
77 -42742 -52045 -161733 -36164 -38357 -164020 -99591 24678 45732 244953 139256 37234
66 37234 176124 167707 32307 -60003 4515 108242 171177 204014 72388 24359 67942 80160
54 80160 150164 185109 139741 -28459 -118302 26529 123824 37719 -32314 126772 64399 -100756
42 -100756 -88708 -9471 73787 112720 -16428 63370 81958 24756 47942 96482 76723 41968
$$ packed form
125D0603j56125k1909J33181L8630O7684q2841l5662K09545j0913o9142j07459
114E592K3359J2635M8203l5949J29781p3625j23527M713j1367r07M1443n663l337
101A1351M687j33258L8152K20449j09049j2878l4390J36654P3507q3248q2024
90B9953J540P5654q4796l3329N5266m647M5642J4838M620K6881P065j58310k3119
77d2742r303j09688J25569k193j25663O4429J24269K1054J99221j05697j02022
66C7234J38890q417j35400r2310O4518J03727O2935L2837j31626m8029M3583J2218
54H0160P0004L4945m5368j68200q9843J44831R7295q6105p0033J59086o2373j65155
42a00756J2048P9237Q3258L8933j29148P9798J8588n7202K3186M8540j9759l4755
$$ plain form
30 41968 6140 84245 -34156 -41717 26818 101433 102718 18019 31204 39826 2555 -106877
18 -106877 -114130 44052 109754 64822 -19241 19304 136644 11394 71997 90048 85535 77156
6 77156 52406 14779 84774 59783 -68577 -73792
0 -73792
$$ packed form
30D1968l5828P8105j18401p561O8535P4615J285q4699J3185Q622l7271j09432
18a06877p253J58182O5702m4932q4063L8545J17340j25250O0603J8051m513q379
6G7156k4750l7627O9995k4991j28360n215
0g3792
$$ Imaginary data points
##PAGE= N=2
##DATA TABLE= (X++(I..I)), XYDATA
$$ plain form
16383 -1894873 -1840529 -1750331 -1849493 -1893160 -1757329 -1754781 -1647060 -1711502 -1817558 -1642025 -1589252
16372 -1589252 -1682043 -1697893 -1528940 -1418919 -1308043 -1379837 -1322912 -1328973 -1367151 -1335336 -1206221
16361 -1206221 -1044143 -960309 -1138258 -1224083 -1192783 -1181168 -1205330 -1140048 -1168165 -1035336 -971511
16350 -971511 -987273 -914656 -905261 -857918 -827522 -838789 -877071 -853164 -797837 -739811 -617153
16339 -617153 -597611 -640417 -524450 -494526 -538343 -409593 -337158 -244700 -234368 -339350 -346602
16328 -346602 -293646 -244961 -199365 -81275 -182699 -177320 -259515 -152619 -119769 -104777 -55
16317 -55 21497 -16420 8154 7438 -76014 111796 304361 232823 204607 174325 112298 52155
$$ packed form
16383a894873N4344R0198r9162m3667J35831K548J07721o4442j06056J75533N2773
16372a589252r2791j5850J68953J10021J10876p1794N6925o061l8178L1815J29115
16361a206221J62078Q3834j77949q5825L1300J1615k4162O5282k8117J32829O3825
16350i71511j5762P2617R395M7343L0396j1267l8282K3907N5327N8026J22658
16339f17153J9542m2806J15967K9924m3817J28750P2435R2458J0332j04982p252
16328c46602N2956M8685M5596J18090j01424N379q2195J06896L2850J4992J04722
16317e5K1552l7917K4574p16q3452J87810J92565p1538k8216l0282o2027o0143
$$ [...]
##END NTUPLES=NMR SPECTRUM
##END=
