##TITLE=1H_TG-2411-1
 200.13Hz, DMSO-d6+CCl4.
 8 sc
 14.7.2026
##JCAMPDX= 6.0         $$ Bruker NMR JCAMP-DX V2.0
##DATA TYPE= NMR SPECTRUM
##DATA CLASS= NTUPLES
##ORIGIN= UXNMR, Bruker Analytische Messtechnik GmbH
##OWNER= pz
$$ XWIN-NMR		Version 3.5
$$ Tue Jul 14 13:22:55 2026 Russian Standard Time (UT+4h)  she@DPX200
##.OBSERVE FREQUENCY= 200.1313
##.OBSERVE NUCLEUS= ^1H
##.ACQUISITION MODE= SIMULTANEOUS
##.ACQUISITION SCHEME= undefined
##.AVERAGES= 8
##.DIGITISER RES= 18
##SPECTROMETER/DATA SYSTEM= spect
##.PULSE SEQUENCE= zg30
##.SOLVENT NAME= DMSO
##.SHIFT REFERENCE= (INTERNAL, DMSO, 0, 15.5012)
##AUDIT TRAIL= $$ (NUMBER, WHEN, WHO, WHERE, WHAT)
$$ ##TITLE= Audit trail, XWIN-NMR		Version 3.5
$$ ##JCAMPDX= 5.01
$$ ##ORIGIN= Bruker BioSpin GmbH
$$ ##OWNER= she
$$ F:/spectra/data/she/nmr/H-C/1/pdata/1/auditp.txt
$$ ##AUDIT TRAIL=  $$ (NUMBER, WHEN, WHO, WHERE, WHAT)
(   1,<2026-07-14 13:21:30.51 +0400>,<she>,<DPX200>,
      <created by zg, POWCHK disabled, PULCHK disabled
       configuration hash MD5:
       00 E9 B6 7A A2 85 ED C7 34 08 36 98 17 FE 4E 26
       data hash MD5: 16K
       1B A3 04 80 B8 22 CB 27 8D 80 EE A3 BC B2 08 42>)
(   2,<2026-07-14 13:21:33.15 +0400>,<she>,<DPX200>,
      <Start of raw data processing
       efp BC_mod = 2 LB = 0.25 FT_mod = 6 PKNL = 1 PHC0 = -4224.492 PHC1 = 17.3923 SI = 16K 
       data hash MD5: 16K
       94 40 53 20 35 A9 CC E5 6E 30 96 CF 5D CA 41 92>)
(   3,<2026-07-14 13:22:06.51 +0400>,<she>,<DPX200>,
      <pk PHC0 = 4.858178 PHC1 = -7.599999 
       data hash MD5: 16K
       E5 ED 15 76 C7 4D AC EF BB BB 9C C4 C9 06 55 C9>)
(   4,<2026-07-14 13:22:10.09 +0400>,<she>,<DPX200>,
      <abs ABSG = 5 
       data hash MD5: 16K
       94 85 14 99 26 59 BD 53 1B DC C7 9E 64 81 45 E1>)
$$ ##END=
$$ 
$$ hash MD5
$$ C7 88 EE 31 9C 64 3F 8B C9 07 54 07 2B 7D 58 0A
##$RELAX= 
##$RELAX= 
##$RELAX= 
##$RELAX= 
##$RELAX= 
##$RELAX= 
$$ Bruker specific parameters
$$ --------------------------
##$DU= <F:/spectra>
##$EXPNO= 1
##$NAME= <H-C>
##$PROCNO= 1
##$TYPE= <nmr>
##$USER= <she>
##$AMP= (0..31)
100 100 100 100 100 100 100 100 100 100 100 100 100 100 100 100 100 100 
100 100 100 100 100 100 100 100 100 100 100 100 100 100 
##$AQSEQ= 0
##$AQ_mod= 1
##$AUNM= <au_zg>
##$AUTOPOS= <>
##$BF1= 200.13
##$BF2= 200.13
##$BF3= 200.13
##$BF4= 200.13
##$BF5= 200.13
##$BF6= 200.13
##$BF7= 200.13
##$BF8= 200.13
##$BYTORDA= 1
##$CFDGTYP= 0
##$CFRGTYP= 5
##$CHEMSTR= <none>
##$CNST= (0..31)
1 1 145 1 1 1 1 1 1 1 1 1 1 1 1 1 1 1 1 1 1 1 1 1 1 1 1 1 1 1 1 1 
##$CPDPRG= <>
##$CPDPRG1= <>
##$CPDPRG2= <>
##$CPDPRG3= <>
##$CPDPRG4= <mlev>
##$CPDPRG5= <mlev>
##$CPDPRG6= <mlev>
##$CPDPRG7= <mlev>
##$CPDPRG8= <mlev>
##$CPDPRGB= <>
##$CPDPRGT= <>
##$D= (0..31)
0 0.7 0 0 0 0 0 0 0 0 0 0.03 0 0 0 0 0 0 0 0 0 0 0 0 0 0 0 0 0 0 0 0 
##$DATE= 1784020889
##$DBL= (0..7)
120 120 120 120 120 120 120 120 
##$DBP= (0..7)
150 150 150 150 150 150 150 150 
##$DBP07= 0
##$DBPNAM0= <>
##$DBPNAM1= <>
##$DBPNAM2= <>
##$DBPNAM3= <>
##$DBPNAM4= <>
$$ [...]
##$SUBNAM3= <"">
##$SUBNAM4= <"">
##$SUBNAM5= <"">
##$SUBNAM6= <"">
##$SUBNAM7= <"">
##$SUBNAM8= <"">
##$SUBNAM9= <"">
##$SW= 18.0517328524113
##$SWIBOX= (0..15)
0 0 2 0 0 0 0 0 0 0 0 0 0 0 0 0 
##$SW_h= 3612.71676300578
##$TD= 16384
##$TD0= 1
##$TE= 0
##$TE2= 300
##$TE3= 300
##$TEG= 300
##$TL= (0..7)
0 120 120 120 120 120 120 120 
##$TP= (0..7)
150 150 150 150 150 150 150 150 
##$TP07= 0
##$TPNAME0= <>
##$TPNAME1= <>
##$TPNAME2= <>
##$TPNAME3= <>
##$TPNAME4= <>
##$TPNAME5= <>
##$TPNAME6= <>
##$TPNAME7= <>
##$TPOAL= (0..7)
0.5 0.5 0.5 0.5 0.5 0.5 0.5 0.5 
##$TPOFFS= (0..7)
0 0 0 0 0 0 0 0 
##$TUNHIN= 0
##$TUNHOUT= 0
##$TUNXOUT= 0
##$USERA1= <user>
##$USERA2= <user>
##$USERA3= <user>
##$USERA4= <user>
##$USERA5= <user>
##$V9= 5
##$VALIST= <valist>
##$VCLIST= <CCCCCCCCCCCCCCC>
##$VD= 0
##$VDLIST= <DDDDDDDDDDDDDDD>
##$VPLIST= <PPPPPPPPPPPPPPP>
##$VTLIST= <TTTTTTTTTTTTTTT>
##$WBST= 1024
##$WBSW= 4
##$XGAIN= (0..3)
0 0 0 0 
##$XL= 0
##$YL= 0
##$YMAX_a= 693156
##$YMIN_a= -719325
##$ZGOPTNS= <>
##$ZL1= 120
##$ZL2= 120
##$ZL3= 120
##$ZL4= 120
##$ABSF1= 15.51331
##$ABSF2= -2.538539
##$ABSG= 5
##$ABSL= 3
##$ALPHA= 0
##$AQORDER= 0
##$ASSFAC= 0
##$ASSFACI= 0
##$ASSFACX= 0
##$ASSWID= 0
##$AUNMP= <proc_1d>
##$AZFE= 0.1
##$AZFW= 0.1
##$BCFW= 0
##$BC_mod= 2
##$BYTORDP= 0
##$COROFFS= 0
##$CY= -3
##$DATMOD= 1
##$DC= 0
##$DFILT= <>
##$DTYPP= 0
##$F1P= 0
##$F2P= 0
##$FCOR= 1
##$FTSIZE= 16384
##$FT_mod= 6
##$GAMMA= 0
##$GB= 0
##$INTBC= 1
##$INTSCL= 3.241238e-09
##$ISEN= 128
##$LB= 0.25
##$LEV0= 0
##$LPBIN= 0
##$MAXI= 10000
##$MC2= 0
##$MEAN= 0
##$ME_mod= 0
##$MI= 1.114404
##$NCOEF= 0
##$NC_proc= -6
##$NLEV= 6
##$NOISF1= 3.799351
##$NOISF2= 2.8
##$NSP= 0
##$NTH_PI= 0
##$NZP= 0
##$OFFSET= 15.50119
##$PC= 1
##$PHC0= -4219.634
##$PHC1= 9.792301
##$PH_mod= 1
##$PKNL= yes
##$PPARMOD= 0
##$PSCAL= 0
##$PSIGN= 0
##$REVERSE= no
##$SF= 200.130004105809
##$SI= 16384
##$SIGF1= 3
##$SIGF2= 2
##$SINO= 0.751879
##$SIOLD= 32768
##$SREGLST= <19F.Aceton>
##$SSB= 0
##$STSI= 16384
##$STSR= 0
##$SW_p= 3612.71676300578
##$SYMM= 0
##$S_DEV= 0
##$TDeff= 16384
##$TDoff= 0
##$TI= <>
##$TILT= no
##$TM1= 0
##$TM2= 0
##$TOPLEV= 0
##$USERP1= <user>
##$USERP2= <user>
##$USERP3= <user>
##$USERP4= <user>
##$USERP5= <user>
##$WDW= 1
##$XDIM= 16384
##$YMAX_p= 413917661
##$YMIN_p= -1374189
$$ End of Bruker specific parameters
$$ ---------------------------------
##NTUPLES= NMR SPECTRUM
##VAR_NAME=  FREQUENCY,     SPECTRUM/REAL,   SPECTRUM/IMAG
##SYMBOL=    X,             R,               I
##VAR_TYPE=  INDEPENDENT,   DEPENDENT,       DEPENDENT
##VAR_FORM=  AFFN,          ASDF,            ASDF
##VAR_DIM=   16384,         16384,           16384
##UNITS=     HZ,            ARBITRARY UNITS, ARBITRARY UNITS
##FACTOR=    0.220516191357247, 1,           1
##FIRST=     3102.25325547842, 0,            0
##LAST=      -510.463507527358, 0,           0
##MIN=       -510.463507527358, -1374189,    0
##MAX=       3102.25325547842, 413917661,    0
$$ Real data points
##PAGE= N=1
##DATA TABLE= (X++(R..R)), XYDATA
$$ [...]
5828A7721602j40656k56173k7570n3243J84535M54219J48275K05518K58834M03307
$$ 17721602 17580946 17324773 17297203 17243960 17428495 17882714 18030989 18236507 18495341 18898648
5818A8898648P17552P51222O21416Q14493R46856J169713J247531J415105J576894
$$ 18898648 19616200 20367422 20988838 21803331 22750187 23919900 25167431 26582536 28159430
5809B8159430J317186J829460K234194K153770K472925K603022K742126L135105
$$ 28159430 29476616 31306076 33540270 35694040 38166965 40769987 43512113 46647218
5801D6647218K906359K900798L179628K644962K326166J925689J589288R30746
$$ 46647218 49553577 52454375 55634003 58278965 60605131 62530820 64120108 65050854
5793F5050854K05017m61422j277263j806178j787951k208276k702964l053081
$$ 65050854 65255871 64794449 63517186 61711008 59923057 57714781 55011817 51958736
5785E1958736k964089k987953k851567k766104k463980k299941k236814k077961
$$ 51958736 48994647 46006694 43155127 40389023 37925043 35625102 33388288 31310327
5777C1310327j948161j554873j486730j257072j320928j258271j041322n51480
$$ 31310327 29362166 27807293 26320563 25063491 23742563 22484292 21442970 20891490
5769B0891490o95782q03942n96296m38212j15564k15540j23162L84594O01417
$$ 20891490 20195708 19391766 18795470 18357258 18241694 18026154 17902992 18287586 18889003
5760A8889003J204848K457400M297274O545436R072024P376450L445822K50666
$$ 18889003 20093851 22551251 26848525 33393961 42465985 49842435 53288257 53538923
5752E3538923j335460k789543n306619n470591n326052n296618m576949l505522
$$ 53538923 52203463 49413920 44107301 38636710 33310658 28014040 23437091 19931569
5744A9931569l158506k015833j382520j173426j032376n42285o01849p74992m11427
$$ 19931569 16773063 14757230 13374710 12201284 11168908 10626623 10024774 9249782 8838355
5735H838355n26287l40747k83753k94627k30571l27476j43633j5903n07127l66705
$$ 8838355 8312068 7971321 7687568 7392941 7162370 6834894 6691261 6675358 6168231 5801526
5725E801526J1085j26399J1901k26056j68678j05808k05609r4523o2066J3747
$$ 5801526 5812611 5686212 5698113 5472057 5303379 5197571 4991962 4897439 4835373 4849120
5715D849120j3720O3474n6045j85691J4833L29r9831r4681j64013J2222J537j28295
$$ 4849120 4835400 4898874 4842829 4657138 4671971 4672300 4572469 4477788 4313775 4325997 4327534 4199239
5703D199239k82038j61481k6838N4967O0305j80418j01921k88886j92478p4964
$$ 4199239 3917201 3755720 3728882 3783849 3844154 3663736 3561815 3272929 3080451 3005487
5693C005487K1046J20952Q9517j28078k08421L564n0235N2272j75682k00473q5311
$$ 3005487 3026533 3147485 3237002 3108924 2900503 2904067 2853832 2906104 2730422 2529949 2444638
5682B444638P6718n1699O3088j80922p1368J00103K4798q6893l2633l429J44892
$$ 2444638 2521356 2469657 2532745 2351823 2280455 2380558 2405356 2318463 2285830 2282401 2427293
5671B427293m8787n3125m9977K26811L35835k56322j73749O4737N6066J78q5732
$$ 2427293 2378506 2325381 2275404 2502215 2838050 2581728 2407979 2472716 2528782 2528960 2443228
5660B443228o9736j79547k36920o8762J05767j51826J356J2750L4503m8655j9768
$$ 2443228 2373492 2193945 1957025 1888263 1994030 1842204 1843560 1856310 1890813 1842158 1822390
5649A822390j00579j27959j5836j27374R7958M822l37j72016k0245m8209J19023
$$ 1822390 1721811 1593852 1578016 1450642 1548600 1553422 1553085 1381069 1360824 1312615 1431638
5638A431638O029J82360P6949j62459j0370j00184j6391K06973p4958Q0901q2975
$$ 1431638 1437667 1620027 1696976 1534517 1524147 1423963 1407572 1614545 1539587 1620488 1537513
5627A537513o3274m8017J7652J3043q5852k0470P1713K1093j25140n2969j89897
$$ 1537513 1474239 1426222 1443874 1456917 1371065 1350595 1422308 1443401 1318261 1265292 1075395
5616A075395J57961R5512K86449l7723l7374j33913j12134q8862k8449K46962
$$ 1075395 1233356 1328868 1615317 1577594 1540220 1406307 1294173 1205311 1176862 1423824
5606A423824R5024J62072j55012j58832Q3669J73712o0517L7973j78877j07996
$$ 1423824 1518848 1680920 1525908 1367076 1450745 1624457 1563940 1601913 1423036 1315040
5596A315040J08193J56471J29406k8377J89755R327J43992K07668K9423P6995
$$ 1315040 1423233 1579704 1709110 1680733 1870488 1879815 2023807 2231475 2260898 2337893
5586B337893p5749J56438J41370J41070K15848l315j44241J9935k3217j03055
$$ 2337893 2262144 2418582 2559952 2701022 2916870 2913555 2769314 2789249 2766032 2662977
5576B662977l9537j21852q3464K0580j75401j40217l30309k28264O5966n7956
$$ 2662977 2623440 2501588 2418124 2438704 2263303 2123086 1792777 1564513 1630479 1572523
5566A572523j45161p4718K5528J31266J7990j49265K8723l0221J8024j06838J11906
$$ 1572523 1427362 1352644 1378172 1509438 1527428 1378163 1406886 1376665 1394689 1287851 1399757
5555A399757J48021K2057P7863L0328m329R6187J29490J1896n0896Q7599J81724
$$ 1399757 1547778 1569835 1647698 1678026 1673697 1769884 1899374 1911270 1860374 1947973 2129697
5544B129697q5204J10042J88443r3999J32404K28769L58758J42052J12258K03076
$$ 2129697 2044493 2154535 2342978 2248979 2381383 2610152 2968910 3110962 3223220 3426296
5534C426296q5976l2656J43081J2332k49659o06J37373P1538O347J24043N2534
$$ 3426296 3340320 3307664 3450745 3463077 3213418 3212812 3350185 3421723 3428070 3552113 3604647
5523C604647k39873k02023j29069m5292n1049j71489k56977j10193l01256j05219
$$ 3604647 3364774 3162751 3033682 2988390 2937341 2765852 2508875 2398682 2097426 1992207
5513A992207q7610J81115K6562j15771j90780J05181K26643k17302n4283J403
$$ 1992207 1904597 2085712 2112274 1996503 1805723 1910904 2137547 1920245 1865962 1867365
5503A867365K72348J00979j8684J28827j23768j05951N4386j27176P4143k85169
$$ 1867365 2139713 2240692 2222008 2350835 2227067 2121116 2175502 2048326 2122469 1837300
5493A837300o5698K75005Q802q6538j55167J40784J7250j46613O7817N301K2281
$$ 1837300 1771602 2046607 2055409 1968871 1813704 1954488 1971738 1825125 1892942 1898243 1920524
5482A920524M0862k4906j60320K79803K9565M0132N982J24635J76502O3295M5126
$$ 1920524 1961386 1936480 1776160 2055963 2085528 2125660 2131642 2256277 2432779 2496074 2541200
5471B541200J92816M80178J05135K18454M0691Q0736j48128l57426k93383k96308
$$ 2541200 2734016 3214194 3319329 3537783 3578474 3659210 3511082 3153656 2860273 2563965
5461B563965j99723j8519J37627j71537k41350p0036R1183J24412j11957k74881
$$ 2563965 2364242 2345723 2483350 2311813 2070463 2000427 2091610 2216022 2104065 1829184
5451A829184P963J27694Q2372m1572L9843K21350R280k5904J26681K40544K83307
$$ 1829184 1837147 1964841 2047213 2005641 2045484 2266834 2276114 2250210 2376891 2617435 2900742
5440B900742Q6896M43439L98037M902J60516K35468J26024l89182j28426J38935
$$ 2900742 2987638 3431077 3829114 3834016 3994532 4230000 4356024 3966842 3838416 3977351
5430C977351j7448k23458N873L70482K21147J52119K47470N9919J39468J03271
$$ 3977351 3959903 3736445 3742318 4112800 4333947 4486066 4733536 4793455 4932923 5036194
5420E036194J26660R888M4605K65605J62877M3218l9891j092P1632j69241r1636
$$ 5036194 5162854 5172742 5217347 5482952 5645829 5689047 5649156 5648064 5719696 5550455 5458819
5409E458819J8119J15266m4560m0289k56504n8879j2700o9202l39551m18863m4934
$$ 5458819 5476938 5592204 5547644 5507355 5250851 5191972 5179272 5110070 4770519 4351656 4306722
5398D306722k81337m92560j88216J55016J39423O6433k27708j78560r7673p0474
$$ 4306722 4025385 3532825 3344609 3499625 3639048 3705481 3477773 3299213 3201540 3131066
5388C131066L6221p6168k26400J65606J54342l9906j66550n9067r5904n1679n1610
$$ 3131066 3167287 3091119 2864719 3030325 3184667 3144761 2978211 2919144 2823240 2771561 2719951
5377B719951L5066n0110K14651J68758o5124k75074J23916K44394j00466l48582
$$ 2719951 2755017 2704907 2919558 3088316 3023192 2748118 2872034 3116428 3015962 2667380
5367B667380j95305K59064K65553O6186J381q5851n1064M9069n7315o156J26240
$$ 2667380 2472075 2731139 2996692 3062878 3064259 2978408 2927344 2976413 2919098 2912942 3039182
5356C039182j7717O7859J43517R546L37187k0897j9856o2963j07962L44970L7374
$$ 3039182 3021465 3089324 3232841 3242387 3579574 3558677 3538821 3475858 3367896 3712866 3750240
5345C750240j14516K837O1062M7251K03640L9401j68381q4080R9056k0722L3184
$$ 3750240 3635724 3638561 3699623 3746874 3950514 3989915 3821534 3737454 3836510 3815788 3848972
5334C848972K68255L23940J27047J15466J0802j1452K7366J72746R0480O121M00691
$$ 3848972 4117227 4441167 4568214 4683680 4694482 4683030 4710396 4883142 4973622 4979743 5380434
5323E380434M53382K45556J72727K89264K01556K12915J81897L91179M60272M65041
$$ 5380434 5833816 6079372 6252099 6541363 6742919 6955834 7137731 7528910 7989182 8454223
5313H454223N43911O90005N70835P68846J049347R96352R29234J469121J605102
$$ 8454223 8998134 9688139 10258974 11027820 12077167 13073519 14002753 15471874 17076976
5304A7076976K147406K507058K836167L042716L261098L041349K675419K020341
$$ 17076976 19224382 21731440 24567607 27610323 30871421 33912770 36588189 38608530
5296C8608530J483588O28933K41681n5511m67441K40967N37337O63504O85157
$$ 38608530 40092118 40721051 40962732 40907221 40439780 40680747 41218084 41881588 42566745
5287D2566745M23630m6531m41041j539459k196631k506035k929882l020714k765224
$$ 42566745 42990375 42943844 42502803 40963344 38766713 36260678 33330796 30310082 27544858
5278B7544858k774027k318548k130554k060110j718739j399608j132983j194962
$$ 27544858 24770831 22452283 20321729 18261619 16542880 15143272 14010289 12815327
5270A2815327r69446o75000p54959m95155l80255p36061m01772n2593m03773m56617
$$ 12815327 11845881 11170881 10415922 9920767 9540512 8804451 8402679 8350086 7946313 7489696
5260G489696l74107l5363j54581l11455m30548j91182J5791j42914J3409q1618
$$ 7489696 7115589 7080226 6925645 6614190 6183642 5992460 6008251 5865337 5878746 5797128
5250E797128j37386M7994p3426j48549j13880p6219J48323o9618j39179J01866
$$ 5797128 5659742 5707736 5634310 5485761 5371881 5295662 5443985 5374367 5235188 5337054
5240E337054p3992j57162P5822K1933q0825k14212J12602J64521j56325j77974
$$ 5337054 5263062 5105900 5181722 5203655 5122830 4908618 5021220 5185741 5029416 4851442
5230D851442K6881R0542j96862j38481P730J28951p3658q2224P1524k8909K27500
$$ 4851442 4878323 4968865 4772003 4633522 4641252 4770203 4696545 4614321 4685845 4656936 4884436
5219D884436p8118j55969k41254P0559J40168j664o9278m7713J23281J56387K9345
$$ 4884436 4806318 4650349 4409095 4479654 4619822 4618158 4548880 4501167 4624448 4780835 4810180
5208D810180k17209L5679M5782p441K0293J11339J86624J36927m2976j52445J90220
$$ 4810180 4592971 4628650 4674432 4666991 4687284 4798623 4985247 5122174 5079198 4926753 5116973
5197E116973K0873P2082k52388o3968J49104J87924J71564k116j69523n652J75389
$$ 5116973 5137846 5209928 4957540 4893572 5042676 5230600 5402164 5400048 5230525 5224873 5400262
5186E400262k0749k90866J03985J94007J43942J3502k04398J00750j08238K65296
$$ 5400262 5379513 5088647 5192632 5386639 5530581 5544083 5339685 5440435 5332197 5597493
5176E597493l1383L5911R7028K69562k68948J26589K11866J44198Q7880q9449
$$ 5597493 5566110 5602021 5699049 5968611 5699663 5826252 6038118 6182316 6270196 6180747
5166F180747L3905J56276j8450j02616Q9948o6000L45630J87863r3296q0009m5083
$$ 6180747 6214652 6370928 6352478 6249862 6339810 6273810 6619440 6807303 6714007 6633998 6588915
5155F588915J81815J98846k29273m8347J87642K26481P7076l8310K31222J34983
$$ 6588915 6770730 6969576 6740303 6691956 6879598 7106079 7183155 7144845 7376067 7511050
5145G511050J24554p5934r0078m5054n126J70928M26K33222J38608J52277M6917
$$ 7511050 7635604 7559670 7469592 7424538 7419412 7590340 7590766 7823988 7962596 8114873 8161790
5134H161790m4643J62733q6670k2534J69018K02050J02828J73467R9046J65799
$$ 8161790 8117147 8279880 8193210 8170676 8339694 8541744 8644572 8818039 8917085 9082884
5124I082884q2933J99144K26108O5107k8592K65090L33091O8095L3689Q4850j0626
$$ 9082884 8999951 9199095 9425203 9490310 9461718 9726808 10059899 10127994 10161683 10246533 10235907
5113A0235907j37497K8591L41642R7236K0873J45124O3215K92489K75039K45510
$$ 10235907 10098410 10127001 10468643 10565879 10586752 10731876 10795091 11087580 11362619 11608129
5103A1608129j45115P9079J38512J85760P4213J39453K15334J99452K09413M22871
$$ 11608129 11463014 11542093 11680605 11866365 11940578 12080031 12295365 12494817 12704230 13127101
5093A3127101J24125J02250m6954J67549L01238J64481L63310K94953k0529K05861
$$ 13127101 13251226 13353476 13306522 13474071 13775309 13939790 14303100 14598053 14577524 14783385
5083A4783385K55137L41783J49064J89051K39341P9167K66650M58311J48097M2806
$$ 14783385 15038522 15380305 15529369 15718420 15957761 16036928 16303578 16761889 16909986 16952792
5073A6952792L23995J20486L31131K50598J39642M39423K73060J14163L31067
$$ 16952792 17276787 17397273 17728404 17979002 18118644 18558067 18831127 18945290 19276357
5064A9276357K42620L14413L86302L47015j0641K25297L89592J52192K54180M27308
$$ 19276357 19518977 19833390 20219692 20566707 20556066 20781363 21170955 21323147 21577327 22004635
5054B2004635L98268K19381L75207M07635L11925J66390J89157L87600N82942
$$ 22004635 22402903 22622284 22997491 23405126 23717051 23883441 24072598 24460198 25043140
5045B5043140L73917M91458L84615M40579K69232L89226N51499J92965K45872
$$ 25043140 25417057 25908515 26293130 26733709 27002941 27392167 27943666 28136631 28382503
5036B8382503M50774N96063N80285N16960O63479M70128K21846N08467L28348
$$ 28382503 28833277 29429340 30009625 30526585 31190064 31660192 31882038 32390505 32718853
5027C2718853M95929L39841M04962O08278O70409N12902N95221L28649P09692
$$ 32718853 33214782 33554623 33959585 34567863 35238272 35751174 36346395 36675044 37384736
5018C7384736M83415N54885K72201N55780O71478M78903N08777N68896N32876
$$ 37384736 37868151 38423036 38695237 39251017 39922495 40401398 40910175 41479071 42011947
5009D2011947M79281M97635M42433N51837N29866M86918O85648O00099N39995
$$ 42011947 42491228 42988863 43431296 43983133 44512999 44999917 45685565 46285664 46825659
5000D6825659O22298K53606M22711M52738O05745L66179N61146N02608N52193
$$ 46825659 47447957 47701563 48124274 48577012 49182757 49548936 50110082 50612690 51164883
4991E1164883M23939O37788P51994R11970R41121J062966O78771K59554L20242
$$ 51164883 51588822 52226610 52978604 53890574 54831695 55894661 56573432 56832986 57153228
4982E7153228J46466k18027n04050m24862k62008l74402l60436k89253k96312
$$ 57153228 57299694 57081667 56577617 56152755 55890747 55516345 55155909 54866656 54570344
4973E4570344j88087k37982j86952j43633l99884k23737j35672l95919k98534
$$ 54570344 54382257 54144275 53957323 53813690 53413806 53190069 53054397 52658478 52359944
4964E2359944j16221m49233j73112l78668m13332k99983l33547m13936l69803
$$ 52359944 52243723 51794490 51621378 51242710 50829378 50529395 50195848 49781912 49412109
4955D9412109m04608l97826m51700l69243n28765n07680l23708m27092k14490
$$ 49412109 49007501 48609675 48157975 47788732 47259967 46752287 46428579 46001487 45786997
4946D5786997o18430o60370m60205n48090m16478l24463m34192p07201o71925
$$ 45786997 45168567 44508197 44047992 43499902 43083424 42758961 42324769 41617568 40945643
4937D0945643m83317m17998m98275n83937m83512n43483k86954n40096l13805
$$ 40945643 40462326 40044328 39546053 38962116 38478604 37935121 37648167 37108071 36794266
4928C6794266o07441o37172n57302l51417l60932m89498l23160n25692m28373
$$ 36794266 36186825 35549653 34992351 34640934 34280002 33790504 33467344 32941652 32513279
4919C2513279n16701n68302l52099l92958l70465m99430k61946l97894l20210
$$ 32513279 31996578 31428276 31076177 30683219 30312754 29813324 29551378 29153484 28833274
4910B8833274m33858m29107l91257l23423k48923k99863o13771l56690k14031
$$ 28833274 28399416 27970309 27579052 27255629 27006706 26706843 26093072 25736382 25522351
4901B5522351k70638m26961k97781l32255p7724k12101l89352m12295j46339k88056
$$ 25522351 25251713 24824752 24526971 24194716 24116992 23904891 23515539 23103244 22956905 22668849
4891B2668849k85821k35543l34250j04880K0579k86289m70608m97979r4326r7279
$$ 22668849 22383028 22147485 21813235 21708355 21728934 21442645 20972037 20474058 20379732 20282453
4881B0282453m46376m5682N2804J78376l76238l34054k63588k07235l49076k41514
$$ 20282453 19836077 19790395 19843199 20021575 19645337 19311283 19047695 18840460 18491384 18249870
4871A8249870j65883R0563j8571J88849j90954j86937j14684k4455n0421j06646
$$ 18249870 18083987 18174550 18155979 18344828 18153874 17966937 17852253 17827798 17777377 17670731
4861A7670731j05219M2094m4405k69611N4330J28696J5831J95096J46675J23475
$$ 17670731 17565512 17607606 17563201 17293590 17347920 17476616 17492447 17687543 17834218 17957693
4851A7957693M96028O04228O42497L91661M19878N82431L16745M0183l25327j90740
$$ 17957693 18453721 19057949 19700446 20092107 20511985 21094416 21411161 21451344 21126017 20935277
4841B0935277k13825k09241n17645l32613J61335K48383r961J75220J98906N08451
$$ 20935277 20721452 20512211 19994566 19661953 19823288 20071671 20061710 20236930 20435836 20944287
4831B0944287L97065J33254N88859O76588R84836J072110J135446J895750L107946
$$ 20944287 21341352 21474606 22063465 22740053 23724889 24796999 25932445 27828195 30936141
4822C0936141M319577O330911P018589M711385K155278L00467n85360k130947
$$ 30936141 35255718 41586629 48605218 53316603 55471881 55772348 55186988 53056041
4814E3056041k883856k565408k860459k462022j523269j105439m71631J47258
$$ 53056041 50172185 47606777 44746318 42284296 40761027 39655588 39183957 39331215
4806C9331215J45250N48638Q49379P71895O01295P69330R31144O79166Q44990
$$ 39331215 39476465 40025103 40874482 41646377 42247672 43017002 43948146 44627312 45472302
4797D5472302Q10766R59054J001112J153200J159917J051000J302933J518253
$$ 45472302 46283068 47242122 48243234 49396434 50556351 51607351 52910284 54428537
4789E4428537J521873J311884J195108J309374J980679J663117J395818J507855
$$ 54428537 55950410 57262294 58457402 59766776 61747455 63410572 64806390 66314245
4781F6314245J526657J370567J274393J173065J057948R99267Q56415L04342O13863
$$ 66314245 67840902 69211469 70485862 71658927 72716875 73716142 74572557 74876899 75490762
4772G5490762K97510K8813k60688n16488n74219m30251o75865p07664p06698n40956
$$ 75490762 75788272 75817085 75556397 75039909 74465690 74035439 73359574 72651910 71945212 71404256
4762G1404256m17510o23401o65943o39173q54553m61562o78895p89265r27030
$$ 71404256 70986746 70363345 69697402 69058229 68203676 67742114 67063219 66273954 65346924
4753F5346924q66498p84215j103429j232644j219798j205095j148261j410875
$$ 65346924 64480426 63696211 62592782 61360138 60140340 58935245 57786984 56376109
4745E6376109j502046j192695j466817j241881j009971j238260j188793j255406
$$ 56376109 54874063 53681368 52214551 50972670 49962699 48724439 47535646 46280240
4737D6280240j058313p22138r00891q57408o87991m23182o33014m83327m98941
$$ 46280240 45221927 44499789 43598898 42741490 42053499 41630317 40997303 40513976 40015035
4728D0015035m99540m33126j0001k17303k17371J2914J64033L11185L67151L12057
$$ 40015035 39515495 39082369 39072368 38855065 38637694 38650608 38814641 39125826 39492977 39805034
4718C9805034P14525M98169O31629P47130Q52365R21336R60189J119846R82201
$$ 39805034 40519559 41017728 41649357 42396487 43248852 44170188 45130377 46250223 47232424
4709D7232424J105803J244626J048114Q07294J002644R83376J101219J038933
$$ 47232424 48338227 49582853 50630967 51438261 52440905 53424281 54525500 55564433
4701E5564433J063965J232573J188994J246078J168319J365881J437163J143363
$$ 55564433 56628398 57860971 59049965 60296043 61464362 62830243 64267406 65410769
4693F5410769J238023J171421J443385J583315J372266J140176R88563R41324
$$ 65410769 66648792 67820213 69263598 70846913 72219179 73359355 74347918 75289242
4685G5289242P78496M13842K95592K21625k44726j16675n48173r25307o90972
$$ 75289242 76067738 76481580 76777172 76998797 76754071 76637396 76089223 75163916 74472944
4676G4472944q85928j046171j296431j220731j099923j177728j516131j069068
$$ 74472944 73587016 72540845 71244414 70023683 68923760 67746032 66229901 65160833
4668F5160833r42612r57439j254277j336431q53610r19281q46379r64639j348788
$$ 65160833 64218221 63260782 62006505 60670074 59816464 58897183 58050804 57086165 55737377
4659E5737377p77178j189189j159519j226995j382637j304277j370924j235194
$$ 55737377 54960199 53771010 52611491 51384496 50001859 48697582 47326658 46091464
4651D6091464j530673j456105j521862j478920j619097j468754j397481j348743
$$ 46091464 44560791 43104686 41582824 40103904 38484807 37016053 35618572 34269829
4643C4269829j202111j143740j271027j063364r72939q69268r14542p89172p28106
$$ 34269829 33067718 31923978 30652951 29589587 28616648 27747380 26832838 26043666 25315560
4634B5315560q83634n36247m23313l94477m06900p201N89143J086066J541810
$$ 25315560 24431926 23895679 23472366 23077889 22670989 22663788 23252931 24338997 25880807
4625B5880807J120192J70436m25270o32436q90307j427168j576402j249806j229981
$$ 25880807 27000999 27171435 26746165 26113729 25223422 23796254 22219852 20970046 19740065
4616A9740065r56283q20406n18204j91061J41494L73188N40447N13403P46919
$$ 19740065 18783782 17963376 17445172 17254111 17395605 17768793 18309240 18822643 19569562
4607A9569562P41003N96509M26686O58572P41022J185917J491753J667231J277242
$$ 19569562 20310565 20907074 21333760 21992332 22733354 23919271 25411024 27078255 28355497
4598B8355497J018589Q13937N72618M71763O65030J036072J375207R57721Q26448
$$ 28355497 29374086 30188023 30760641 31232404 31897434 32933506 34308713 35266434 36092882
4589C6092882M51552j68576m51264q35853p74398o45901o57699q95020j126797
$$ 36092882 36544434 36375858 35924594 35088741 34314343 33668442 33010743 32115723 30988926
4580C0988926j392757j376580j358033j423672j561307j030169j037337j355439
$$ 30988926 29596169 28219589 26861556 25437884 23876577 22846408 21809071 20453632
4572B0453632j448914j380524j333932j001848j227111j202792q55015q65725
$$ 20453632 19004718 17624194 16290262 15288414 14061303 12858511 12003496 11137771
4564A1137771p34810p61192o31955k98026l21480j63275m4433k22989j19229j91044
$$ 11137771 10402961 9641769 9009814 8711788 8390308 8227033 8182600 7959611 7840382 7649338
4554G649338k07093J04080j01740j0940p5532j79235l6304R599J23736M2671j52336
$$ 7649338 7442245 7546325 7444585 7433645 7358113 7178878 7142574 7152173 7275909 7318580 7166244
4543G166244N5393k3704j0511j69456j13043j7938J26519P5404j22133k78708
$$ 7166244 7221637 7197933 7187422 7017966 6904923 6886985 7013504 7088908 6966775 6688067
4533F688067j34808j38336R7194l10428k18925Q9244K3540j5989r6464o9068K10589
$$ 6688067 6553259 6414923 6512117 6201689 5982764 6072008 6095548 6079559 5983095 5914027 6124616
4522F124616j8679J8556Q2716J30608N09383M49623N09461Q94414J230418J569502
$$ 6124616 6105937 6124493 6207209 6337817 6847200 7296823 7806284 8700698 9931116 11500618
4512A1500618J743569J716057J279624R30937O91180J00984j80280j8455L21704
$$ 11500618 13244187 14960244 16239868 17170805 17861985 17962969 17782689 17764234 18085938
4503A8085938P68983J445785K409750K758378J993858P46287m7623q05994j526892
$$ 18085938 18854921 20300706 22710456 25468834 27462692 28208979 28161356 27355362 25828470
4494B5828470j741236k078158j842944j226363l58603j42084l9644m07638n60897
$$ 25828470 24087234 22009076 20166132 18939769 18581166 18439082 18399438 17991800 17430903
4485A7430903p96525j274111j451896j306701j464431j060983j324792j065491
$$ 17430903 16634378 15360267 13908371 12601670 11137239 10076256 8751464 7685973
4477G685973n35906m20770m26491k78694l19556q0661p8197l19784k70384j91393
$$ 7685973 7150067 6729297 6302806 6024112 5704556 5623895 5545698 5225914 4955530 4764137
4467D764137l1393N281l5190q9586K66653J9139l22368k95980j95945M6329q958
$$ 4764137 4732744 4738025 4702835 4613249 4879902 4899041 4576673 4280693 4084748 4131077 4122119
4456D122119l11807j98843J07945J29606n8065j14058j15864q8489P0981j25477
$$ 4122119 3810312 3611469 3719414 3849020 3790955 3676897 3561033 3472544 3543525 3418048
4446C418048j49351j4134J18647p4018q5270m0065P7245K06668l5236o9506m5352
$$ 3418048 3268697 3254563 3373210 3299192 3213922 3173857 3251102 3457770 3422534 3353028 3307676
4435C307676K37178Q3534j39427j27534K33206P5969j67366k6573J69272J06781
$$ 3307676 3544854 3628388 3488961 3361427 3594633 3670602 3503236 3476663 3645935 3752716
4425C752716J5j59922p5391l0308K78313K4850j60186j8200j39061M2052L0871
$$ 3752716 3752731 3592809 3517418 3487110 3765423 3790273 3630087 3611887 3472826 3514878 3545749
4414C545749K236J33018P219k6461p804Q157O2169j98830q705K8308L988R8755
$$ 3545749 3547985 3681003 3688222 3661761 3653957 3662114 3724283 3525453 3516748 3545056 3549044 3647799
4402C647799K34176Q24q5125M0184J04472k2545j44329J3996J15664K91974p7373
$$ 3647799 3881975 3882799 3797674 3837858 3942330 3919785 3775456 3789452 3905116 4197090 4119717
4391D119717J05928K71592P8784K2253k76395p28Q6217K25853J04572k07220k22232
$$ 4119717 4225645 4497237 4576021 4598274 4321879 4321151 4407368 4633221 4737793 4530573 4308341
4380D308341L84585j26207p7208J16047j38311Q8466j3633K5369k6545o6598J0031
$$ 4308341 4692926 4566719 4489511 4605558 4467247 4555713 4542080 4567449 4540904 4474306 4484337
4369D484337R0657P3060p9953Q6089M969j05092n5199J61997j13764o689J18225
$$ 4484337 4574994 4648054 4568101 4654190 4659159 4554067 4498868 4660865 4547101 4540412 4658637
4358D658637L2533R5818j59995J59602K16904K65008m2246Q9067L15771M26390
$$ 4658637 4691170 4786988 4626993 4786595 5003499 5268507 5226261 5315328 5631099 6057489
4348F057489N01759P62651P86447O57831K59004R4339k705j08433l35605k59747
$$ 6057489 6559248 7321899 8108346 8766177 9025181 9119520 9116815 9008382 8672777 8413030
4338H413030n98430l19337k93767k69452j516o0730j56633p3176N5563k7431J5862
$$ 8413030 7814600 7495263 7201496 6932044 6930528 6869798 6713165 6639989 6695552 6668121 6683983
4327F683983R102J70742K1904r7090j90484K0391J6536q3011N1365L7074J75071
$$ 6683983 6693085 6863827 6885731 6788641 6598157 6618548 6635084 6552073 6603438 6640512 6815583
4316F815583J65101n4883J68267J05558J9493K9451j10781J45786J46922J29390
$$ 6815583 6980684 6925801 7094068 7199626 7219119 7248570 7137789 7283575 7430497 7559887
4306G559887j1966J67370L13154J65976P2980J58171N0020L03874M17088J66530
$$ 7559887 7547921 7715291 8028445 8194421 8267401 8425572 8475592 8779466 9196554 9363084
4296I363084J11690K28102K03420L06472J92294L69059M09462J76528N03380M96291
$$ 9363084 9474774 9702876 9906296 10212768 10405062 10774121 11183583 11360111 11863491 12359782
4286A2359782O10858N71047P36874M28370L10911N87941Q46853O17461O69029
$$ 12359782 12970640 13541687 14278561 14706931 15017842 15605783 16452636 17070097 17739126
4277A7739126O09611P92031P41234P08467Q89237R30013R19995N65087Q47297
$$ 17739126 18348737 19140768 19882002 20590469 21479706 22409719 23329714 23894801 24742098
4268B4742098Q38420O86164N10442N63955N48976N68730Q56864O31201P15260
$$ 24742098 25580518 26266682 26777124 27341079 27890055 28458785 29315649 29946850 30662110
4259C0662110M92282O80555P27034M12149M83087N56097L83836K62183J41122
$$ 30662110 31154392 31834947 32561981 32974130 33457217 34013314 34397150 34659333 34800455
4250C4800455M0144P3179J37804J78949k11213l25580J96249J24501m0249j54402
$$ 34800455 34840599 34913778 35051582 35230531 35019318 34693738 34889987 35014488 34974239 34819837
4240C4819837K35374L67574J72324j75785Q5438J2925l26248n25438o98592o30614
$$ 34819837 35055211 35422785 35595109 35419324 35504762 35517687 35191439 34666001 33967409 33336795
4230C3336795o41993o12337o81825l49507j62313K5169J43894p491J64660n8901
$$ 33336795 32694802 32082465 31400640 31051133 30888820 30913989 31057883 31050392 31215052 31156151
4220C1156151l44799m36933j047934j278313j027483q82809j027455j058662n61591
$$ 31156151 30811352 30374419 29326485 28048172 27020689 26137880 25110425 24051763 23490172
4211B3490172l90509m51741l35463J9093r9618m87467o90148r62000o87584p40497
$$ 23490172 23099663 22647922 22312459 22331552 22231934 21744467 21054319 20092319 19404735 18664238
4201A8664238q83721j187309r96693o17752l65448m43621m61834m36080j3020
$$ 18664238 17780517 16593208 15596515 14978763 14613315 14169694 13707860 13271780 13258760
4192A3258760l55842m44644l49248l84092n24420m59436p17725m57943m07008
$$ 13258760 12902918 12458274 12109026 11724934 11200514 10741078 10023353 9565410 9158402
4183I158402l42055k85135n55132l19231n3243r8975k77925j76306k21656j65222
$$ 9158402 8816347 8531212 7976080 7656849 7603606 7504631 7226706 7050400 6828744 6663522
4173F663522j20061k63955j13196p1565j25269p6189k80712j19459l4090J8246
$$ 6663522 6543461 6279506 6166310 6094745 5969476 5893287 5612575 5493116 5459026 5477272
4163E477272L714j86797p6085Q6214P1236q9043j20151L4757J48022J18508p3740
$$ 5477272 5480986 5294189 5218104 5304318 5375554 5286511 5166360 5201117 5349139 5467647 5393907
4152E393907Q490K64507L9430K0853J25987L385J04562M5732L9546K00368R5505
$$ 5393907 5402397 5666904 5706334 5727187 5853174 5856559 5961121 6006853 6046399 6246767 6342272
4141F342272o1845N89j8786P9394l8446J23583k70966j43154N0199m4611j14810
$$ 6342272 6280427 6281016 6262230 6341624 6303178 6426761 6155795 6012641 6062840 6018229 5903419
4130E903419r6249l9663K7414j59494r88j83603K7976n70M6839j14717j74605
$$ 5903419 5807170 5767507 5794921 5635427 5634439 5450836 5478812 5478242 5525081 5410364 5235759
4119E235759k4740J9118J72373j79955k27318J2658R575j14851m9314N7979j76026
$$ 5235759 5211019 5230137 5402510 5222555 4995237 5007895 5017470 4902619 4853305 4911284 4735258
4108D735258K0212M8592m5852J03563k61564J29022m5981p8337P6405m5219N2567
$$ 4735258 4755470 4804062 4758210 4861773 4600209 4729231 4683250 4604913 4681318 4636099 4688666
4097D688666j9669J7033R5397j11533l3741k519o0500K22582J86079J1161J4565
$$ 4688666 4668997 4686030 4781427 4669894 4636153 4633634 4573134 4795716 4981795 4992956 5007521
4086E007521P063J3762N5765J16852J45519K62025p7620q8045m8346K03423R6042
$$ 5007521 5014584 5028346 5084111 5200963 5346482 5608507 5530887 5442842 5394496 5597919 5693961
4075E693961l8784J01295j79269o7920Q5181l2521J8645r7082N2494J82950Q5995
$$ 5693961 5655177 5756472 5577203 5509283 5594464 5561943 5580588 5483506 5536000 5718950 5804945
4064E804945O0658p2517P9407k7699J37405k0184P3825M24536r689o4424N8755
$$ 5804945 5865603 5793086 5872493 5844794 5982199 5962015 6035840 6460376 6450687 6386263 6445018
4053F445018j7263R0258R7661q2125J12046Q0201L97433L15614k23124k5429J63000
$$ 6445018 6427755 6518013 6615674 6533549 6645595 6725796 7123229 7438843 7215719 7190290 7353290
4042G353290M46070P4338J26701K99318P6347K1940K66194J73722p281K41749
$$ 7353290 7799360 7873698 8000399 8299717 8376064 8398004 8664198 8837920 8830639 9072388
4032I072388J24904L0020m5367J03260K39820R6632n3216J4455k2978J71880m1398
$$ 9072388 9197292 9227312 9181945 9285205 9525025 9621657 9568441 9582896 9559918 9731798 9690400
4021I690400K50564M7744j53436L9907J20551J798P2814q836K09178P1136J14
$$ 9690400 9940964 9988708 9835272 9875179 9995730 9997528 10070342 10061506 10270684 10341820 10341934
4010A0341934L35468N5038K37917M6256K0504J94794J92148L78110L18465K59693
$$ 10341934 10677402 10732440 10970357 11016613 11037117 11231911 11424059 11802169 12120634 12380327
4000A2380327K84761K02605M27030M56089L81890L02668K95531M38909N97737
$$ 12380327 12665088 12867693 13294723 13750812 14132702 14435370 14730901 15169810 15767547
3991A5767547M05452O04319M89512K92639M88952M44070O48962O31271N51683
$$ 15767547 16172999 16777318 17266830 17559469 18048421 18492491 19141453 19772724 20324407
3982B0324407O23359P82172Q85315Q95310O60369P64757P17576O74479R52240
$$ 20324407 20947766 21729938 22615253 23510563 24170932 24935689 25653265 26327744 27279984
3973B7279984Q27756P71423O74677Q45998Q13601Q14185J036232J155931R21259
$$ 27279984 28107740 28879163 29553840 30399838 31213439 32027624 33063856 34219787 35141046
3964C5141046J047341J091706J246417J437892J548196J510067J620668J842589
$$ 35141046 36188387 37280093 38526510 39964402 41512598 43022665 44643333 46485922
3956D6485922J743361J873197J839884K181336K166482K505822K563357K494094
$$ 46485922 48229283 50102480 51942364 54123700 56290182 58796004 61359361 63853455
3948F3853455K235129K270288K483554K900619K811184K976301L345547L222334
$$ 63853455 66088584 68358872 70842426 73743045 76554229 79530530 82876077 86098411
3940H6098411K815646K522737K666429K312379K570981K375245K470423K527662
$$ 86098411 88914057 91436794 94103223 96415602 98986583 101361828 103832251 106359913
3932A06359913K754030K833788K835796K502904K766066K881619K792012K586930
$$ 106359913 109113943 111947731 114783527 117286431 120052497 122934116 125726128 128313058
3924A28313058K570018K371339K393999K186802J866943J720461J710020J397917
$$ 128313058 130883076 133254415 135648414 137835216 139702159 141422620 143132640 144530557
3916A44530557J160556Q22224L14325L24775K90758K86512l22542r50691j292328
$$ 144530557 145691113 146513337 146827662 147152437 147443195 147729707 147407165 146456474 145164146
3907A45164146j722226k104929k645553k901499l063887l339727l414032l299315
$$ 145164146 143441920 141336991 138691438 135789939 132726052 129386325 125972293 122672978
3899A22672978l285829l398509l313114l285678l155784l027575l246480l169324
$$ 122672978 119387149 115988640 112675526 109389848 106234064 103206489 99960009 96790685
3891I6790685k907011k816567k655772k504684k544904k499838k365989k417669
$$ 96790685 93883674 91067107 88411335 85906651 83361747 80861909 78495920 76078251
3883G6078251k436679k422704k349555k352148k231231k332218k118763j875062
$$ 76078251 73641572 71218868 68869313 66517165 64285934 61953716 59834953 57959891
3875E7959891j936733j807754j823713j912494j410258j642901j585733j647603
$$ 57959891 56023158 54215404 52391691 50479197 49068939 47426038 45840305 44192702
3867D4192702j349974j062467j061194j044959q89918j113078r11228r22750q02524
$$ 44192702 42842728 41780261 40719067 39674108 38784190 37671112 36759884 35837134 35034610
3858C5034610q03612p78392p49540o25035m98953o27091o08309n97935p61079
$$ 35034610 34230998 33452606 32703066 32078031 31579078 30951987 30343678 29745743 28984664
3849B8984664r51225n70443o92520p03403n02849n30290m86646m49668n00588
$$ 28984664 28033439 27462996 26770476 26067073 25564224 25033934 24547288 24097620 23597032
3840B3597032m98073m25703m28605n21074l93783j06508j71550m10714m18510
$$ 23597032 23098959 22673256 22244651 21723577 21329794 21223286 21051736 20641022 20222512
3831B0222512m80127l24076j99832m02718j92655n36738l76975l30596l26990
$$ 20222512 19742385 19418309 19218477 18815759 18623104 18086366 17709391 17378795 17051805
3822A7051805j99755k56702j81648m35445m20324j7091m9735O6443p7501k52098
$$ 17051805 16852050 16595348 16413700 15978255 15557931 15540840 15491105 15557548 15480047 15227949
3812A5227949J79922J61541J06669J31526l1733J74589L17442K25542M54236J96531
$$ 15227949 15407871 15569412 15676081 15807607 15775874 15950463 16267905 16493447 16947683 17144214
3802A7144214M02675J31773L57906L47762N03195L19388K22577M06055L81157
$$ 17144214 17546889 17678662 18036568 18384330 18887525 19206913 19429490 19835545 20216702
3793B0216702M06335O22187O40071N41736P51794Q06682P69680J025383P29721
$$ 20216702 20623037 21245224 21885295 22427031 23178825 23985507 24755187 25780570 26510291
3784B6510291P75642O17670L71972O19053N80415O07418K00450J51915K31370
$$ 26510291 27285933 27903603 28275575 28894628 29475043 30082461 30282911 30434826 30666196
3775C0666196J50167N7013m5391m4018R8991N909j27510K22331o509J52855m3128
$$ 30666196 30816363 30873376 30827985 30783967 30882958 30888867 30761357 30983688 30977179 31130034 31086906
3764C1086906j18665N2070J7031r4234n4337q8007N9759K44284Q655J52755M4968
$$ 31086906 30968241 31020311 31037342 30943108 30888771 30800764 30860523 31104807 31113462 31266217 31311185
3753C1311185K137l4737m9900r2755j85974Q6031k68655m68127n01375n35600
$$ 31311185 31313322 31278585 31228685 31135930 30949956 31035987 30767332 30299205 29797830 29262230
3743B9262230l37495p10450n26063m82086l69680k95613m17051l64807j80583
$$ 29262230 28924735 28214285 27688222 27206136 26836456 26540843 26123792 25758985 25578402
3734B5578402j08733o5787J95724J60922J70582K89321K70747N64555O53404R01973
$$ 25578402 25469669 25403882 25599606 25760528 25931110 26220431 26491178 27055733 27709137 28611110
3724B8611110J000619Q37556J106475J376407J560320J834277J881475K224165
$$ 28611110 29611729 30449285 31555760 32932167 34492487 36326764 38208239 40432404
3716D0432404K264321K416406K318127K391285K542731K370183K258234K128109
$$ 40432404 42696725 45113131 47431258 49822543 52365274 54735457 56993691 59121800
3708E9121800J601254J659887J269868J099620P21894N68577L27470N9148P1862
$$ 59121800 60723054 62382941 63652809 64752429 65474323 66042900 66370370 66429518 66501380
3699F6501380J15606j06708n8473k63397m67458p10382r04828j109677j595794
$$ 66501380 66616986 66510278 66451805 66188408 65720950 65010568 64105740 62996063 61400269
3690F1400269j395377j862297j958199k269855k244711k107760j875006j952451
$$ 61400269 60004892 58142595 56184396 53914541 51669830 49562070 47687064 45734613
3682D5734613k008489j741497j691219j242097j142137j210423q08100q03805
$$ 45734613 43726124 41984627 40293408 39051311 37909174 36698751 35890651 35086846
3674C5086846q80126r19309p77840n26008p49266p72321p42860o95539n71242
$$ 35086846 34206720 33287411 32509571 31983563 31234297 30461976 29719116 29023577 28452335
3665B8452335p12082o20971n83532m20570l52422n53522m68624j70902j79883
$$ 28452335 27740253 27119282 26535750 26115180 25762758 25209236 24740612 24569710 24389827
3656B4389827o679j61830J7517n4410J76384J07247K81789J84309L16049L89574
$$ 24389827 24383148 24221318 24238835 24184425 24360809 24468056 24749845 24934154 25250203 25639777
3646B5639777M51422M33156N54523N89608N32576M19793N20580P13934P08437
$$ 25639777 26091199 26524355 27078878 27668486 28201062 28620855 29141435 29855369 30563806
3637C0563806O98043O55309P58899R99700J190814J220720J414044J371271J913021
$$ 30563806 31261849 31917158 32676057 33675757 34866571 36087291 37501335 38872606 40785627
3628D0785627K278958K656910K988516L414542L645378L503258L384935L283745
$$ 40785627 43064585 45721495 48710011 52124553 55769931 59273189 62658124 65941869
3620F5941869K719027K371318J796119R61432M61462J59375r7700m50136m37600
$$ 65941869 68660896 71032214 72828333 73789765 74251227 74410602 74312902 73862766 73425166
3611G3425166j75302M41712M09962N12358O75202O01112M63781J07584k05735
$$ 73425166 73249864 73691576 74101538 74613896 75289098 75890210 76353991 76461575 76255840
3602G6255840m55746p72249j195112j332031j427553j204295j289042q45858m86171
$$ 76255840 75800094 75027845 73832733 72500702 71073149 69868854 68579812 67733954 67247783
3593F7247783j22964L08600K92419K79475M98534K27171K37929K78764K69829
$$ 67247783 67124819 67433419 67725838 68005313 68503847 68731018 68968947 69247711 69517540
3584F9517540N07244P79397J165932J535713J779233K503580L375907M074264
$$ 69517540 70024784 70804181 71970113 73505826 75285059 77788639 81164546 85238810
3576H5238810M992926O069025O171394N216505L773010J664463o6669j434396
$$ 85238810 90231736 96300761 102472155 107688660 111461670 113126133 113059464 111625068
3568A11625068k512025k888363l302165l018347k499548j419317p29642L01623
$$ 111625068 109113043 106224680 102922515 99904168 97404620 95985303 95255661 95557284
3560I5557284J124914J514189J226057J252039J325258J447879K217852L158389
$$ 95557284 96682198 98196387 99422444 100674483 101999741 103447620 105665472 108823861
3552A08823861L813525M577855N291274N769303O120835O147261O923792Q585118
$$ 108823861 112637386 117215241 122506515 128275818 134396653 140543914 147467706 156052824
3544A56052824J0712848J2685491J4082683J2231245Q140972L790823K92400k719300
$$ 156052824 166765672 179451163 193533846 205765091 213906063 217696886 217989286 215269986
3536B15269986m980527o056606o328956o207755n063758l623788k022508o20621
$$ 215269986 210289459 204232853 197903897 191696142 186632384 183008596 180986088 180365467
3528A80365467P58888J633626K342904K370184K762373L270074L929427N062931
$$ 180365467 181124355 182757981 185100885 187471069 190233442 193503516 197432943 202495874
3520B02495874O201171P292753P845137P476329O141992M952491M456239L925176
$$ 202495874 208697045 215989798 223834935 231311264 237453256 242405747 246861986 250787162
3512B50787162L846429M200879M123683L301659J955794J45847j824514l115864
$$ 250787162 254633591 258834470 262958153 266259812 268215606 268361453 266536939 263421075
3504B63421075m295242n153055n527273n902902n629418n166704m750134m008084
$$ 263421075 259125833 253972778 248445505 242542603 236913185 231746481 226996347 222988263
3496B22988263l964416l422403l197941l151498l008485k943854k541691k196962
$$ 222988263 219023847 215601444 212403503 209252005 206243520 203299666 200757975 198561013
3488A98561013j902299j565936j357209j615460k055179k851208l370823l876599
$$ 198561013 196658714 195092778 193735569 192120109 190064930 187213722 183842899 179966300
3480A79966300m298936m416773m282858l686907l593718k984673k144305j958008
$$ 179966300 175667364 171250591 166967733 163280826 159687108 156702435 154558130 152600122
3472A52600122j211215m75374j26643J79611J99177P8617K58379J90170R6735
$$ 152600122 151388907 150913533 150786890 150966501 151165678 151244295 151502674 151692844 151789579
3463A51789579K72561J71354P5232j1459J86223k68613m17114m55591r77080j048972
$$ 151789579 152062140 152233494 152308726 152297267 152483490 152214877 151797763 151342172 150365092 149316120
3453A49316120j425978j874458k385883k729453k734209l285135l636139l417773
$$ 149316120 147890142 146015684 143629801 140900348 138166139 134881004 131244865 127827092
3445A27827092l303520l500836l799734l955676l639464l589300l222982k646349
$$ 127827092 124523572 121022736 117223002 113267326 109627862 106038562 102815580 100169231
3437A00169231k128284j630504r13851J93183Q56075J289803J646088J745031
$$ 100169231 98040947 96410443 95496592 95689775 96545850 97835653 99481741 101226772
3429A01226772J571270J563344J417946P28002o1841n75929j010943j181818j471755
$$ 101226772 102798042 104361386 105779332 106507334 106445493 105869564 104858621 103676803 102205048
3420A02205048j638365k019679j739830j487100j058574q17195p16427k77285
$$ 102205048 100566683 98547004 96807174 95320074 94261500 93444305 92727878 92450593
3412I2450593l49700o35522o03892o63100j089981j657504k146974k599512k667847
$$ 92450593 92100893 91465371 90861479 90198379 89108398 87450894 85303920 82704408 80036561
3403H0036561l045594l208703l479064l325095l187669l068257k962846k920904
$$ 80036561 76990967 73782264 70303200 66978105 63790436 60722179 57759333 54838429
3395E4838429k389353k143634k089347j790281j482014j324760j237053j273173
$$ 54838429 52449076 50305442 48216095 46425814 44943800 43619040 42381987 41108814
3387D1108814r53548r99268n32370m32957p57637k99850k92862j99138J85281
$$ 41108814 40155266 39155998 38623628 38190671 37433034 37133184 36840322 36641184 36826465
3378C6826465r9868L0513n6024j05562K56287L02192J50528l2720k01142M591
$$ 36826465 36726597 36757110 36701086 36595524 36851811 37154003 37304531 37271811 37070669 37075260
3368C7075260k79389n979J66660j37413k60539J12956K42217N48807N51732O17096
$$ 37075260 36795871 36789892 36956552 36819139 36558600 36671556 36913773 37462580 38014312 38631408
3358C8631408N25389M86520O35554P52037P04132R78868Q75263J243028J114349
$$ 38631408 39156797 39643317 40278871 41030908 41735040 42713908 43589171 44832199 45946548
3349D5946548J364338J762591J583416J815061K106426K769715L057938L314671
$$ 45946548 47310886 49073477 50656893 52471954 54578380 57348095 60406033 63720704
3341F3720704L764816M150720M708683N073298N302681N563199N434349N091447
$$ 63720704 67485520 71636240 76344923 81418221 86720902 92284101 97718450 102809897
3333A02809897M206569K989687J965891Q64473n13486j564228k604476l276863
$$ 102809897 107016466 110006153 111972044 112836517 112323031 110758803 108154327 104877464
3325A04877464m099721m535693m793076m711774m812728m264117l851758l726974
$$ 104877464 100777743 96242050 91448974 86737200 81924472 77660355 73808597 70081623
3317G0081623l090131k637672j965437j458340r41799r03703q12300k03054M15842
$$ 70081623 66991492 64353820 62388383 60930043 59988244 59084541 58272241 58069187 58485029
3308E8485029M24977Q82828J477378J950368K575049K552191K746192K620653
$$ 58485029 58910006 59792834 61270212 63220580 65795629 68347820 71094012 73714665
3300G3714665K242001J952909J828319J236367O69218k71844r22454j871294k515226
$$ 73714665 75956666 77909575 79737894 80974261 81643479 81371635 80449181 78577887 76062661
3291G6062661l180514l813045m182686m465254m478432m779825m418989l730622
$$ 76062661 72882147 69069102 64886416 60421162 55942730 51162905 46743916 43013294
3283D3013294l705743l293154k846738k547775j931861j488278j475287j260899
$$ 43013294 39307551 36014397 33167659 30619884 28688023 27199745 25724458 24463559
3275B4463559j142361p19133n32910n95638l22733n77725m09127n69696q39010
$$ 24463559 23321198 22602065 22069155 21473517 21150784 20573059 20163932 19594236 18755226
3266A8755226p16649n79819l95885m53046o40547k19955l97972k83422j02952
$$ 18755226 18038577 17458758 17062873 16609827 15969280 15749325 15351353 15067931 14964979
3257A4964979n81990j57030l3556j82924j83526k62307j22710Q7664k54742j08812
$$ 14964979 14382989 14225959 14192403 14009479 13825953 13563646 13440936 13528600 13273858 13165046
3247A3165046k28140j41268j44621j30209J67117r4841r2782Q1342l17718P859
$$ 13165046 12936906 12795638 12651017 12520808 12687925 12593084 12500302 12581644 12263926 12271785
3237A2271785M4123K05404J52914k28579M1309P5128J98353j9442k37294k1209
$$ 12271785 12315908 12521312 12674226 12445647 12486956 12562084 12760437 12740995 12503701 12482492
3227A2482492K96729r2122J98990K9084M82768L20612L54645N60313Q7565M9243
$$ 12482492 12779221 12687099 12886089 12915173 13397941 13718553 14073198 14633511 14721076 14770319
3217A4770319K00436p2187O2844J30956J69141r7727k76295j91412k58287p8023
$$ 14770319 14970755 14898568 14961412 15092368 15261509 15163782 14887487 14696075 14437788 14359765
3207A4359765P5691k27320k40761J56992L27582K34626J44883M63306P33713N00488
$$ 14359765 14435456 14208136 13967375 14124367 14451949 14686575 14831458 15294764 16028477 16528965
3197A6528965P07893O54258N93562N31139J03718m644j43323k17811l04942l58527
$$ 16528965 17236858 17891116 18484678 19015817 19119535 19114891 18971568 18753757 18448815 18090288
3187A8090288k96654l9844n879K75363L76967N08451L43608K85196N61447L78399
$$ 18090288 17793634 17753790 17747911 18023274 18400241 18908692 19252300 19537496 20098943 20477342
3177B0477342L64420N15801l8105K35164P6152m7775J10780n319L1958O4118K36462
$$ 20477342 20841762 21357563 21319458 21554622 21630774 21582999 21693779 21688460 21720418 21784536 22020998
3166B2020998K51450M38766O73143Q52856R40065J309685J289659J304867J244225
$$ 22020998 22272448 22711214 23384357 24237213 25177278 26486963 27776622 29081489 30325714
3157C0325714P00802Q58387P49841O52269L77505O0850k54904k62009k49861l44918
$$ 30325714 31026516 31884903 32634744 33287013 33664518 33725368 33470464 33208455 32958594 32613676
3147C2613676k89026j91608j23232R5716M42984N06740N25299M72132K47270L47101
$$ 32613676 32324650 32133042 32009810 32105526 32548510 33055250 33580549 34052681 34299951 34647052
3137C4647052K29728M14923L24841Q2313J84336K20876M89831O78298O95339R47287
$$ 34647052 34876780 35291703 35616544 35698857 35883193 36104069 36593900 37272198 37967537 38914824
3127C8914824J273952J374340J307587J600021J945783K099709K334951K717622
$$ 38914824 40188776 41563116 42870703 44470724 46416507 48516216 50851167 53568789
3119E3568789L219250L674960M336476M904316N064035M446681M019727L350940
$$ 53568789 56788039 60462999 64799475 69703791 74767826 79214507 83234234 86585174
3111H6585174K084696J364050J463089J174164J420758K032774K882525L850291
$$ 86585174 88669870 90033920 91497009 92671173 94091931 96124705 99007230 102857521
3103A02857521N066603O737878Q695900J0694115J3153000J6199977J9342677
$$ 102857521 107924124 114662002 123357902 134052017 147205017 163404994 182747671
3096A82747671K3327919K7911166L2565276L5810849L6295670L2657994K4767563
$$ 182747671 206075590 233986756 266552032 302362881 338658551 371316545 396084108
3089C96084108J4445945L387608o880371j5556816k1364630k4852820k5373332
$$ 396084108 410530053 413917661 407037290 391480474 370115844 345263024 319889692
3082C19889692k4424398k1353334j7161242j2561347q671919n907814m103134
$$ 319889692 295465294 274111960 256950718 244389371 235717452 229809638 225706504
3075B25706504l539284l150761j801897K97954L972246J0050474J7456336K4317010
$$ 225706504 222167220 219016459 217214562 217512516 221484762 231535236 248991572 273308582
3067B73308582K7310398K2511896J1814662j22568j0169320j9019954k5778983
$$ 273308582 300618980 323130876 334945538 334822970 324653650 305633696 279854713
3060B79854713k9024482l0063425k8724375k5886407k2132452j8192845j4424486
$$ 279854713 250830231 220766806 192042431 166156024 144023572 125830727 111406241
3053A11406241j1224616q832748p557485o539013n755352m806063m226727l915877
$$ 111406241 100181625 91348877 83791392 77252379 71497027 66690964 62464237 58548360
3045E8548360l580703l093952k806977k210086k335190k285835k078236j694922
$$ 58548360 54967657 51873705 49066728 46856642 44521452 42235617 40157381 38462459
3037C8462459j563075j524559j651700j417798j102138j210553j323139r57444
$$ 38462459 36899384 35374825 33723125 32305327 31203189 29992636 28669497 27712053
3029B7712053q53690j105761r54548q15635p56205m82886p59243o67662p60484
$$ 27712053 26858363 25752602 24798054 23982419 23226214 22743328 21984085 21316423 20555939
3020B0555939n79655n80953p31651o14969m93253n58789m74308l65240k17002
$$ 20555939 19976284 19395331 18663680 18048711 17555458 16996669 16522361 16157121 15940119
3011A5940119k05045k86392l81993m75606k34387j12260k29464j62163m71133
$$ 15940119 15735074 15448682 15066689 14591083 14356696 14244436 14014972 13852809 13381676
3002A3381676k86381j95094m74128k77093j52989k64196l50504k49551l65038
$$ 13381676 13095295 12900201 12426073 12148980 11995991 11731795 11381291 11131740 10766702
2993A0766702j79147m55615j65031k59624j99945j78956p8302p0852l37850k86483
$$ 10766702 10587555 10131940 9966909 9707285 9507340 9328384 9250082 9179230 8841380 8554897
2983H554897M4517o8380k23009p7674K633l04563j42578j3298k31923j71237q9253
$$ 8554897 8599414 8531034 8308025 8230351 8232984 7928421 7785843 7772545 7540622 7369385 7280132
2972G280132p6171P4260J19266n7013k44775m72325j56988n7466k38159O2029
$$ 7280132 7203961 7278221 7397487 7340474 7095699 6623374 6466386 6408920 6170761 6232790
2962F232790J1061L5879j90940j35106M8045j79415k74485n2101k05043k5263
$$ 6232790 6243851 6279730 6088790 5953684 6001729 5822314 5547829 5495728 5290685 5265422
2952E265422O167j34048n806q8228q9544j26533j73416l3064j19647l02446j4343
$$ 5265422 5271589 5137541 5131735 5043507 4953963 4827430 4654014 4620950 4501303 4198857 4184514
2941D184514k1859K2319o5259n9880m5319j26939k2362J11173n6426j72506q3359
$$ 4184514 4162655 4184974 4119715 4059835 4014516 3887577 3865215 3976388 3919962 3747456 3664097
2930C664097j67230k13366R3334M2288M2016N4662k59589j24341R7624j49908
$$ 3664097 3496867 3283501 3376835 3419123 3461139 3515801 3256212 3131871 3229495 3079587
2920C079587o8738M6258j3126M1177j51810N1912r7829j84971P2386l9991j25618
$$ 3079587 3010849 3057107 3043981 3085158 2933348 2985260 2887431 2702460 2774846 2734855 2609237
2909B609237o5621O0836j00786r3948p4087J9295k5627j72762o9646n6338J30318
$$ 2609237 2543616 2604452 2503666 2409718 2335631 2354926 2329299 2156537 2086891 2030553 2160871
2898B160871j08649m6012L4208j0502l5323M3748l43q1565K02114l3654j50704
$$ 2160871 2052222 2006210 2040418 2029916 1994593 2038341 2037998 1956433 2158547 2124893 1974189
2887A974189p3455J91805K20964L8687j13155k4437l052j1820l213j09641O6674
$$ 1974189 1900734 2092539 2313503 2352190 2239035 2214598 2211546 2199726 2196513 2086872 2153546
2876B153546J1784j27261p3331j92357K16184k8141k34587l177j34121Q3214M6087
$$ 2153546 2165330 2038069 1964738 1772381 1988565 1960424 1725837 1722660 1588539 1671753 1717840
2865A717840k364k8606j796l3969K36658j88695o4344j1492o1026K3824N0692
$$ 1717840 1715476 1686870 1685074 1651105 1887763 1699068 1634724 1623232 1562206 1586030 1636722
2854A636722K68286k20417j59014k0775j62370K18417Q1681K710R1237k35886
$$ 1636722 1905008 1684591 1525577 1504802 1342432 1560849 1642530 1645240 1736477 1500591
2844A500591k7076J15405j60501J71527j8362j89074R7175O7709L7634p5153J52653
$$ 1500591 1473515 1588920 1428419 1599946 1581584 1392510 1489685 1557394 1595028 1519875 1672528
2833A672528K47114l00898L0481n3615M1068Q1979k79069k7123j752P84R0138
$$ 1672528 1919642 1618744 1649225 1595610 1636678 1718657 1439588 1412465 1410713 1411497 1501635
2822A501635M211j9726K6032k0903J39180K7797K06901M9266n9997J48796J29702
$$ 1501635 1505846 1486120 1512152 1491249 1630429 1658226 1865127 1914393 1854396 2003192 2132894
2811B132894J55895L08333J70837J10727l6240J38207L1400p1772j12838L6864
$$ 2132894 2288789 2597122 2767959 2878686 2842446 2980653 3012053 2940281 2827443 2864307
2801B864307j77734m4582o3129m2383j13298k36798o8205j64406K03319R3395
$$ 2864307 2686573 2641991 2578862 2536479 2423181 2186383 2118178 1953772 2157091 2250486
2791B250486k08621n6656k80478K16409J73706j48122M3812J5659J10331L00329
$$ 2250486 2041865 1985209 1704731 1921140 2094846 1946724 1990536 2006195 2116526 2416855
2781B416855J22795R2852k99098l41125j02976j27460k845n6904k50381P0927
$$ 2416855 2539650 2632502 2333404 1992279 1889303 1761843 1758998 1702094 1451713 1522640
2771A522640k10536K9200P2083J06369Q2083l22739k42512l4412Q3653j22800
$$ 1522640 1312104 1341304 1413387 1519756 1601839 1279100 1036588 1002176 1085829 963029
2761I63029j34361n0681J01599Q6130O6114k73422j02451R5735k40359l6934O6362
$$ 963029 828668 777987 879586 965716 1031830 758408 655957 751692 511333 474399 540761
2750E40761q4823J54401p0669n200L1390J38247L8968k53028l01760K8501J56864
$$ 540761 455938 610339 539670 534470 565860 704107 743075 490047 188287 216788 373652
2739C73652K48471n9078r3837j12360J02482J42756K9190r6170J00706k1605L9097
$$ 373652 622123 563045 469208 356848 459330 602086 631276 535106 635812 614207 653304
2728F53304J63205j24076n5213k8211j24259R4614N1390j56871n2055Q1105L1393
$$ 653304 816509 692433 637220 609009 484750 579364 630754 473883 421828 502933 534326
2717E34326J31328j1708k6684j57644r6582j29174J93463N3821n5374K3725J9239
$$ 534326 665654 653946 627262 469618 373036 243862 437325 491146 435772 459497 478736
2706D78736q5218O8431J29233o0508j66582R059M352k07378O7392k516k0987K17462
$$ 478736 393518 461949 591182 530674 364092 373151 377503 170125 237517 235001 214014 431476
2694D31476K18308J2293M2088j37436j708j76649q839O697Q94J79052K19547r1228
$$ 431476 649784 662077 704165 566729 565021 388372 379533 386230 387124 566176 785723 694495
2682F94495r169n1246J0446J5136m0298j48409j09525m0995K04026O0874j38881
$$ 694495 685326 634080 644526 659662 619364 470955 361430 320435 524461 585335 446454
2671D46454j09805j13682J965J89579L3124k04914o7623j02591J29979M974n3114
$$ 446454 336649 222967 224932 414511 447635 242721 175098 72507 202486 207460 154346
2660A54346J76998m6192j4686p2664J3045J76214l6698j59847N9022J45902k6899
$$ 154346 331344 285152 270466 197802 210847 387061 350363 190516 249538 395440 368541
2649C68541k2963K5411p7085J8166J11356j27542M3176J69200L0417j25176o1372
$$ 368541 345578 370989 293904 312070 423426 295884 339060 508260 538677 413501 352129
2638C52129n9778l7678l6753j47707J5413N5759J53707n152j30790R3834L215
$$ 352129 292351 254673 217920 70213 85626 141385 295092 289940 159150 252984 256199
2627B56199Q1340k33848q4929m6439J0906P1462j366J10690j5386L5671J35598
$$ 256199 337539 103691 18762 -27677 -16771 54691 53325 164015 148629 184300 319898
2616C19898j70574r0014J38221J79216j90161k12089P3069Q0352J37898M9266
$$ 319898 149324 59310 197531 376747 186586 -25503 47566 127918 265816 315082
2606C15082j63993l5680k889j24414J66699r036K465J30800k2734J48702j6633
$$ 315082 151089 115409 112520 -11894 154805 145769 148234 279034 256300 405002 388369
2595C88369P7192o3427p1518o2886m7601J63102p6759o7123K05334J33735J73711
$$ 388369 465561 402134 330616 267730 220129 383231 306472 239349 444683 578418 752129
2584G52129L42325k00736P0848p0339K3119Q4999r7933k37345O5587o4429j0211
$$ 752129 1094454 893718 964566 894227 917346 1002345 904412 667067 732654 668225 658014
2573F58014l6853q6647p1088J31138j0118j28095Q9130J54206J6294o6851p1050
$$ 658014 621161 534514 463426 594564 584446 456351 545481 699687 715981 649130 578080
2562E78080j68048R1520l4147M10j07442o2416l6501N3840P2713q2769o0149O485
$$ 578080 410032 501552 467405 467815 360373 297957 261456 315296 388009 305240 245091 251576
2550B51576r9674n5286J04520M8721l3653j26978n3172k3956J01196L9401m7367
$$ 251576 151902 96616 201136 249857 216204 89226 36054 12098 113294 152695 105328
2539A05328N0815J80304n0940N0596k05808J9508J49705o3611P7973L1006P2945
$$ 105328 156143 336447 285507 336103 130295 149803 299508 235897 313870 344876 417821
2528D17821j74885m8482J0175l2060N8656J50413q788L378l5453R6883r5008j04890
$$ 417821 242936 194454 204629 172569 231225 381638 372850 376228 340775 437658 342650 237760
2516B37760K674J14613l2445j11987j16572L3337O2774j9832q5270k32698M2322
$$ 237760 240434 355047 322602 210615 94043 127380 190154 170322 85052 -147646 -105324
2505a05324K84763N6061K1409L6169N5331J16825j43043L5693q3176j42031Q0827
$$ -105324 179439 235500 256909 293078 348409 465234 322191 357884 274708 132677 213504
2494B13504o9994M7663J12240P0182k2596k33033N7586J52181P3745K4065j40866
$$ 213504 143510 191173 303413 373595 350999 117966 175552 327733 401478 425543 284677
2483B84677l1201J59738J67159q4k47151j06991J00517m2104j05239n4442P5521
$$ 284677 253476 413214 580373 580289 333138 226147 326664 284560 179321 124879 200400
2472B00400j10413n0572K03428K01141M5989k5452j84077j20172Q5658R1487n5128
$$ 200400 89987 39415 242843 443984 489973 464521 280444 160272 245930 337417 282289
2461B82289l11718P8750K18224K84219K7935j34557J2390j58371o745J52866O7184
$$ 282289 -29429 49321 267545 551764 579699 445142 457532 299161 292416 445282 512466
2450E12466N8022J41639k45648N8467J50805J10849p581j58850o301m1148n6258
$$ 512466 570488 712127 466479 524946 675751 786600 779019 620169 613868 572720 516462
2439E16462K9402m4472k0046p1233j1547P8503l9645p9524q1374j45989J54662
$$ 516462 545864 501392 481346 410113 398566 477069 437424 357900 276526 130537 285199
2428B85199P6309J96760J34760j61232o1035j428R3391J49035o7721j64378K60807
$$ 285199 361508 558268 693028 531796 470761 469333 562724 711759 644038 479660 740467
2417G40467p6311J83347p9400q5808R586o5630J13391m5433J83459L0892o1334
$$ 740467 664156 847503 768103 682295 691881 626251 739642 694209 877668 908560 847226
2406H47226j56555j34636J44133J58517j9346k4636L7202p3512R8960O7855k16200
$$ 847226 690671 556035 700168 858685 839339 814703 851905 778393 877353 945208 729008
2395G29008n8966R7258K07560K3817P8704k6412J0089O1767J28872N4018j02142
$$ 729008 670042 767300 974860 998677 1077381 1050969 1061058 1122825 1251697 1305715 1203573
2384A203573Q4714J00326p5751j85334j09235K42596K32627m3641j80107L5961
$$ 1203573 1288287 1388613 1312862 1127528 1018293 1260889 1493516 1449875 1269768 1305729
2374A305729J96908K62664L0048j52011J07156J78572L7290J38843J49335j84155
$$ 1305729 1502637 1765301 1795349 1643338 1750494 1929066 1966356 2105199 2254534 2070379
2364B070379j11530m6372O6730K07659J5239J26930P4689p8110N9017K62322J69740
$$ 2070379 1958849 1912477 1979207 2186866 2202105 2329035 2403724 2325614 2384631 2646953 2816693
2353B816693j69965J02448K84324j7861J7667R9779K29941K88590l2216M5186
$$ 2816693 2646728 2749176 3033500 3015639 3033306 3133085 3363026 3651616 3619400 3664586
2343C664586J51646L25412K34427L98173K37721M19871N44934Q49185L58498J033041
$$ 3664586 3816232 4141644 4376071 4774244 5011965 5431836 5976770 6825955 7184453 8217494
2333H217494J320125J686646J145214J044658R20323J007865Q28139J449034J692342
$$ 8217494 9537619 11224265 12369479 13414137 14334460 15342325 16170464 17619498 19311840
2324A9311840K711738L560033N600900R062569J6111491K4266858L5317637L1667133
$$ 19311840 22023578 25583611 31184511 40247080 56358571 80625429 115943066 147610199
2316A47610199J5240837J615717m729366p960848j9444343k0110220j8989266
$$ 147610199 162851036 164466753 159737387 151776539 132332196 112221976 93232710
2309I3232710j8894135j5689893j2543366j0039715o216175l641386k288844j756591
$$ 93232710 74338575 58648682 46105316 36065601 29849426 26208040 23919196 22162605
2301B2162605j927146j767017j642406j621590j482511j423544j189878j113919
$$ 22162605 20235459 18468442 16826036 15204446 13721935 12298391 11108513 9994594
2293I994594p12878p35527n59859l61305l41037n11901m05666k19460j92961m39523
$$ 9994594 9281716 8546189 7986330 7625025 7283988 6772087 6366421 6146961 5954000 5514477
2283E514477k87765k30915j63850k71063p9106k88463j4271l8839k91992j8752
$$ 5514477 5226712 4995797 4831947 4560884 4481778 4193315 4179044 4140205 3848213 3829461
2273C829461k38884q3120j00532j52943j81440K0109J17308l04564o9505m2808
$$ 3829461 3590577 3507457 3406925 3253982 3072542 3092651 3209959 2905395 2835890 2793082
2263B793082j76973q3166N7087j41416r9815l1854K32941L5055k08908J18859
$$ 2793082 2616109 2532943 2590030 2448614 2348799 2316945 2549886 2584941 2376033 2494892
2253B494892l9277k67424k16789j56380L4365j20386j29384J24019J36673k2679
$$ 2494892 2455615 2188191 1971402 1815022 1849387 1729001 1599617 1723636 1860309 1837630
2243A837630n0537k40320j25238j39762j1727O696k43001J16199P307n4955Q7228
$$ 1837630 1787093 1546773 1421535 1281773 1270046 1276742 1033741 1149940 1157247 1102292 1189520
2232A189520L6427r9189L3786K8596R0850j18166K44164j6255k04065j7791j5702
$$ 1189520 1225947 1126758 1160544 1189140 1279990 1161824 1405988 1389733 1185668 1167877 1152175
2221A152175k03998J73449n9753r2242j38476J88843j0227K5512q2810j95052
$$ 1152175 948177 1121626 1061873 969631 831155 1019998 1009771 1035283 952473 757421
2211G57421O0706L8717M0691L7920m8324K7555M5959j4003n1175J68209j96815
$$ 757421 818127 856844 897535 935455 887131 914686 960645 946642 895467 1063676 866861
2200H66861j18019j41802R935J41129J42758k2323j54839k52896J94204J33889
$$ 866861 748842 607040 616975 758104 900862 878539 723700 470804 665008 798897
2190G98897R6302p1474k10813m6365j27100q7540L00390N7089o1819r1644k75713
$$ 798897 895199 823725 612912 566547 439447 351907 652297 709386 647567 555923 280210
2179B80210J33343L20360J10121k72615K93L9396m7981j7887j5133k60842R8668
$$ 280210 413553 733913 844034 571419 571712 611108 563127 545240 530107 269265 367933
2168C67933j11206J45613K0606j20957l5898j8441n4926J19198j3612O2725k07781
$$ 367933 256727 402340 422946 301989 266091 247650 192724 311922 298310 361035 153254
2157A53254J4862O1342m5837J20886N0762j08087n4710Q507M6581k9015j83348
$$ 153254 168116 229458 183621 304507 355269 247182 192472 200979 247560 218545 35197
2146C5197J94739J85218L8962L8749J7048J13675l79183j85023J3998j49107M5917
$$ 35197 229936 415154 454116 492865 509913 623588 244405 59382 73380 -75727 -29810
2135b9810J36011J04633j21780j7264K86468r9054l7645k13103j01559l4901M7818
$$ -29810 106201 210834 89054 71790 358258 259204 221559 8456 -93103 -128004 -80186
2124h0186J56005j61718K12768k4214j65610o2084n2079O0228R7190m8464Q5952
$$ -80186 75819 -85899 126869 102655 -62955 -125039 -177118 -116890 -19700 -68164 17788
2113A7788J76388K31899j95067L61j36042k2502K57065J4180j88608J8734L979
$$ 17788 194176 426075 231008 231369 95327 72825 329890 344070 155462 174196 178175
2102A78175M2652K4822k6705j03792l1056Q3988m779l801J20154J05972p4537
$$ 178175 220827 245649 218944 115152 84096 168084 163305 159504 279658 385630 311093
2091C11093j54800N5201L1824j91040j27771J5707K7025N4670k6153M9110J12401
$$ 311093 156293 211494 243318 52278 -75493 -59786 -32761 21909 -4244 44866 157267
2080A57267q4243J03597j31717n2282m975j82393k8719k9890K08827K22723M0385
$$ 157267 73024 176621 44904 -7378 -12353 -194746 -223465 -253355 -44528 178195 218580
2069B18580n9924K8758K0989m3933o966J22197J217k16594L5285J43606n2403
$$ 218580 158656 187414 208403 164470 157504 279701 280918 64324 99609 243215 190812
2058A90812m0656l3901Q77J0283k28053J85908K24124R7439J45367J04172J26327
$$ 190812 150156 116255 117132 127415 -100638 85270 309394 406833 552200 656372 782699
2047G82699J41305J0175k02749l08856j652K00219J99861j34778j51565j72489
$$ 782699 924004 934179 731430 422574 420922 621141 821002 686224 534659 362170
2037C62170J1123j90646r4446q1213N7344l398P5178J02393K7932J93348O268
$$ 362170 373293 182647 88201 6988 64332 60934 136112 238505 266437 459785 466053
2026D66053k92345j22695j17012P4623l2437j27557K30006P5688J79801J7594
$$ 466053 173708 51013 -65999 8624 -23813 -151370 78636 154324 334125 351719
2016C51719k24113J16322O9742j27495o9578k24629K3695K66974j22984J5717
$$ 351719 127606 243928 313670 186175 116597 -108032 -84337 182637 59653 75370
2006G5370n6663j67532j20705l8569K86146m1438L3365K47125n7571k09102Q1293
$$ 75370 18707 -148825 -269530 -308099 -21953 -63391 -30026 217099 159528 -49574 31719
1995C1719q8422o9053j33293J20326K27250k17176M9731J72573Q0542J10256q8838
$$ 31719 -56703 -125756 -259049 -138723 88527 -128649 -78918 93655 174197 284453 195615
1984A95615j04919m8046j4767n2019j11487L575J68954J58839j5219m7179p4169
$$ 195615 90696 42650 27883 -24136 -135623 -132048 36906 195745 180526 133347 59178
1973E9178j00324l6513Q9963J0706q3408k20942K03125J93148k35172J40570l5320
$$ 59178 -41146 -77659 12304 23010 -60398 -281340 -78215 114933 -120239 20331 -14989
1962a4989L7364q6899l9343j03642J88771p7433n4563Q3770J31579L1953K0779
$$ -14989 22375 -64524 -103867 -207509 -18738 -96171 -150734 -66964 64615 96568 117347
1951A17347j74524Q9207n4188K13556P3243L9506q8422j23860K22305j72094j49986
$$ 117347 -57177 32030 -22158 191398 264641 304147 215725 91865 314170 142076 -7910
1940g910j9371K13396j20626q2819o7339R4603P0194j6270Q6846j01901l5166
$$ -7910 -27281 186115 65489 -17330 -84669 9934 80128 63858 150704 48803 13637
1929A3637m7819m3692o2841R9721K73713j70441k7110j30084M5881m7028k04391
$$ 13637 -34182 -77874 -140715 -40994 232719 62278 35168 -94916 -49035 -96063 -300454
1918c00454Q2006J23654J55438m1112j5571N1837Q1411j25517j43448O1971j42445
$$ -300454 -218448 -94794 60644 19532 3961 55798 137209 11692 -131756 -69785 -212230
1907b12230R3197J69256p8693R9685l328o7832j9631p9455J08127n609j47618
$$ -212230 -119033 50223 -28470 71215 67887 55 -19576 -99031 9096 3487 -144131
1896a44131Q8708O7896j42565r463J3047P6419o6176J07166J20814n6942k28395
$$ -144131 -55423 12473 -130092 -139555 -126508 -50089 -116265 -9099 111715 54773 -173622
1885a73622P6684K0124O7639O9567L3448l6868Q1082r1201j53748J5864J08603
$$ -173622 -96938 -76814 -9175 60392 93840 56972 138054 46853 -106895 -91031 17572
1874A7572j7757j40258J13061j30043J36275K01533m3041j2377J03355k8857j32809
$$ 17572 -185 -140443 -27382 -157425 -21150 180383 137342 124965 228320 199463 66654
1863F6654k36269J83438J60598j66072P1748p7732j02369m6336l8824K5958J4310
$$ 66654 -169615 13823 174421 8349 80097 2365 -100004 -146340 -185164 -159206 -144896
1852a44896K0541l9177j0779J83146N5826n6852j67179l5355J17537p5934k1076
$$ -144896 -124355 -163532 -174311 8835 64661 7809 -159370 -194725 -77188 -153122 -174198
1841a74198N929j09462J73465l443R0634O8586N998Q6631l229r2130j01733K8523
$$ -174198 -168269 -277731 -104266 -107709 -17075 51511 57509 144140 140911 48781 -52952 -24429
1829b4429J9924j32665J01813J13315j33169M4092J4994k1472M1400p334j10125
$$ -24429 -4505 -137170 -35357 77958 -55211 -11119 3875 -17597 23803 16469 -93656
1818i3656N8554j1471J24936O5179J3297j52962J1725O4100q6935j0277p626r2274
$$ -93656 -35102 -46573 78363 143542 156839 3877 15602 79702 -7233 -17510 -25136 -117410
1806a17410J27663O3287M0071l6321j6085j05987r3804J03879M3212j8915n7596
$$ -117410 10253 73540 113611 77290 61205 -44782 -138586 -34707 8505 -10410 -68006
1795f8006j26512l3875J46593J8232k4184j22879J34299k657K73760K1569j98426
$$ -68006 -194518 -228393 -81800 -63568 -87752 -210631 -76332 -78989 194771 216340 17914
1784A7914p4536J1393R8976N425K4594j45796K8322P78j27778P8472l9808J21518
$$ 17914 -56622 -45229 53747 59172 83766 -62030 -33708 -32930 -160708 -82236 -122044 -526
1772e26J3446P192k0101O4201M6751j63727m1409Q1159O4830N3021k6248j17216
$$ -526 12920 20112 11 64212 110963 -52764 -94173 -13014 51816 104837 78589 -38627
1760c8627J53690N573n6895q1358k9740P381J32737j2781L4694j3676N2996j63329
$$ -38627 115063 120636 63741 -17617 -47357 -39976 92761 79980 114674 100998 153994 -9335
1748i335j5543m9460j8508K06669j22101q7418O5131k3479M9645L233n8055J49518
$$ -9335 -24878 -74338 -92846 113823 -8278 -95696 -30565 -54044 -4399 -1166 -59221 90297
1736I0297j35746j0741J56834k59095J8285j7137O7377j0460N7935J11793k02323
$$ 90297 -45449 -56190 100644 -158451 -140166 -157303 -89926 -100386 -42451 69342 -132981
1725a32981j21368K25466J52080l087k18712J03443P0025p0758J02915l9632m683
$$ -132981 -254349 -28883 123197 120110 -98602 4841 74866 4108 107023 67391 62708
1714F2708j14082q007R1755n8335O7877N5935l3289j46496n5399O7760j71756
$$ 62708 -51374 -59381 32374 -25961 41916 97851 64562 -81934 -137333 -69573 -241329
1703b41329K5726K91867L2624j40460J63670j82934P7303n7864k94662L7387P5237
$$ -241329 -215603 76264 108888 -31572 132098 -50836 26467 -31397 -326059 -288672 -213435
1692b13435J17735l3927M309K9353j1058j06648n958J63070K99623j38482l10113
$$ -213435 -95700 -129627 -125318 -95965 -107023 -213671 -219629 -56559 243064 104582 -205531
1681b05531P5256n9744J78140N7027Q096r978j0979P4519J10032j60275m7267
$$ -205531 -130275 -190019 -11879 45148 53244 43266 32287 106806 216838 56563 9296
1670I296n8785P4523L6411j27885L112L0115j25825L0906Q793P6811l8223J44630
$$ 9296 -49489 25034 61445 -66440 -63328 -33213 -159038 -128132 -119339 -42528 -80751 63879
1658F3879r8335j7540J93522Q5571l50149j27854J7588J31637L10922k35470k0544
$$ 63879 -34456 -51996 141526 227097 -123052 -250906 -233318 -101681 209241 -26229 -46773
1647d6773j69924L6844J75264j0820j8652n352n7049j50764O4806K60175J15458
$$ -46773 -216697 -179853 -4589 -15409 -34061 -39413 -96462 -247226 -182420 77755 193213
1636A93213M6354l8401l7480R8636o8350j70868k2412q4234j13100J08914R7654
$$ 193213 239567 201166 163686 262322 193972 23104 692 -83542 -196642 -87728 9926
1625I926j1755q1410J56516k2448k60106J24462L2842r551j2557j43958O2857
$$ 9926 -1829 -83239 73277 50829 -209277 -84815 -51973 -61524 -74081 -218039 -155182
1614a55182J11281J63984o5712l68174N8498Q8271K56533p2184j30834L7193M1612
$$ -155182 -43901 120083 54371 -313803 -255305 -167034 89499 17315 -113519 -76326 -34714
1603c4714j8135J07706j30988M6865P9193q0738n2198J23103J13063k1255j14414
$$ -34714 -52849 54857 -76131 -29266 49927 -30811 -83009 40094 153157 131902 17488
1592A7488j19731o395J14564J7572q4677l2369l420j00123J31008J9972j25053
$$ 17488 -102243 -108638 5926 23498 -61179 -93548 -96968 -197091 -66083 -46111 -171164
1581a71164j15990J25010J25479j20691P8748r0549l9501K10056J44982n4059
$$ -171164 -287154 -162144 -36665 -157356 -78608 -169157 -208658 1398 146380 92321
1571I2321r2493r8711o8855j8702J53647L4358O5278J93117k37442j27619K30400
$$ 92321 -172 -98883 -167738 -186440 -32793 1565 66843 259960 22518 -105101 125299
1560A25299m4831K9898o8944j41860k9281J52724P9620J34723p5932o1228j51407
$$ 125299 80468 110366 41422 -100438 -129719 23005 102625 237348 161416 100188 -51219
1549e1219l4546K027m0134O9745k8501K9820o2742j32915K8700k6682M3228J24399
$$ -51219 -85765 -83738 -123872 -54127 -82628 -52808 -115550 -248465 -219765 -246447 -203219 -78820
1537g8820j44094J47093J85937K5825q3162q5986j48047K3649J84528j53996R82
$$ -78820 -222914 -75821 110116 135941 52779 -33207 -181254 -157605 26923 -127073 -126091
1526a26091j15506L601L4720J29802J76801L5919J01249j04004o0373q4545k044
$$ -126091 -241597 -237996 -203276 -73474 103327 139246 240495 136491 76118 -8427 -10471
1515a0471j5239q6235l1074J44352l3484Q754p0256j06074O6153n500J52325l0808
$$ -10471 -25710 -111945 -143019 1333 -32151 -23397 -93653 -199727 -133574 -139074 13251 -17557
1503a7557k02749j6498J64741K68772j63198j69530l173L2666N44n0785j9361
$$ -17557 -220306 -236804 -72063 196709 33511 -136019 -139192 -106526 -105982 -156767 -176128
1492a76128J51744p1300j70442J48278J28178n7391j48886M7433J88482J28205
$$ -176128 -24384 -95684 -266126 -117848 10330 -47061 -195947 -148514 39968 168173
1482A68173r0164J4711J2924k79484m8695J37152P4434n5361L720J95745k753
$$ 168173 78009 92720 105644 -173840 -222535 -85383 -10949 -66310 -62590 133155 130402
1471A30402J40438k5457j97785j80023Q2064k05573R157J61173J00868J5664n9633
$$ 130402 270840 245383 47598 -132425 -50361 -255934 -246777 -85604 15264 30928 -28705
1460b8705o6306l2553J53629m9989k79243j8923K25690R2655L7831r2035M1466
$$ -28705 -95011 -127564 26065 -23924 -303167 -322090 -96400 -3745 34086 -57949 -16483
1449a6483J07808J43246k87062l28383J08871Q5719K35482J24493p8606n0294
$$ -16483 91325 234571 -52491 -380874 -272003 -186284 49198 173691 95085 44791
1439D4791k1690p6338N1077j74655j2425J94241p0748j466N6640P8808O604q3080
$$ 44791 23101 -53237 -2160 -176815 -189240 5001 -65747 -67213 -10573 68235 74839 -8241
1427h241q7052m8722Q7024q5059o1058R5934O940J59349j21253q1574J26625m5278
$$ -8241 -95293 -144015 -56991 -142050 -203108 -107174 -100234 59115 -62138 -143712 -17087 -62365
1415f2365m1420O4578j91320L1738J95391k9817O2363j16256J14015n614k8392
$$ -62365 -103785 -39207 -230527 -198789 -3398 -33215 29148 -87108 26907 21293 -7099
1404g099o0586o1504K30168m1647l3799J2365p2694J32179L4696k31670p055p8231
$$ -7099 -67685 -129189 100979 59332 25533 37898 -34796 97383 132079 -99591 -106646 -184877
1392a84877L4716n299p5357K36535K43440j43849k56107k03571O8825J17134K8684
$$ -184877 -150161 -155460 -230817 5718 249158 105309 -150798 -354369 -285544 -168410 -139726
1381a39726N9047P7688r4943N7970K937j0716n6786O3284K9563j38118j22745
$$ -139726 -80679 -2991 -97934 -39964 -37027 -47743 -104529 -41245 -11682 -149800 -272545
1370b72545K30764K04180J2054l74328J83450P3383j14636J64607q3887n8084
$$ -272545 -41781 162399 174453 -199875 -16425 56958 -57678 106929 23042 -35042
1360c5042J7269n1267P5595j91169Q6621J74039N0222q6502J1258J09674l71904
$$ -35042 -17773 -69040 6555 -184614 -97993 76046 126268 39766 51024 160698 -211206
1349b11206j16891k9521J26539K06843L40975j92791j56895n983j06344M9520
$$ -211206 -328097 -357618 -231079 -24236 316739 123948 -32947 -38930 -145274 -95754
1339i5754q2598r5845J75622N9129N9708q475J80472k4546j03409o3855q9053
$$ -95754 -178352 -274197 -98575 -39446 20262 11787 192259 167713 64304 449 -88604
1328h8604l7925q5014M5055J86299L1665J96281j17500q0595L9227q410l96708
$$ -88604 -126529 -211543 -166488 19811 51476 247757 130257 49662 88889 80479 -316229
1317c16229O0565L00315m4904j09159M5746J59225j20003j14335k587p5291J6144
$$ -316229 -255664 44651 -253 -109412 -63666 95559 -24444 -138779 -141366 -216657 -200513
1306b00513j22100n9457J04950K58432K26672n1623j26047O833J21763j50735
$$ -200513 -322613 -382070 -277120 -18688 207984 156361 30314 37147 158910 8175
1296H175j98523J16939M1095M0702K08739Q0663k28842p1476R9597m0598j40666
$$ 8175 -190348 -73409 -32314 8388 217127 297790 68948 -2528 97069 56471 -84195
1285h4195n9464k13P4779k43274Q1602L08458J5435j37398l8006R2151l3182J39924
$$ -84195 -143659 -143872 -69093 -312367 -230765 77693 93128 -44270 -82276 9875 -23307 116617
1273A16617j84075M4666K57353m7179m3666j58982j88894J87662q7649p3287q9528
$$ 116617 -67458 -22792 234561 187382 143716 -15266 -204160 -16498 -104147 -177434 -266962
1262b66962m3361K93688J02410o1375J2154j26593R3313j45787k56513q0862M06562
$$ -266962 -310323 -16635 85775 24400 36554 -90039 3274 -142513 -399026 -479888 -73326
1251g3326J83499J98089j26826l5171J01591j88698j67084O1898l773k1632M6963
$$ -73326 110173 308262 181436 146265 247856 59158 -107926 -46028 -49801 -71433 -24470
1240b4470r7879K03851P7664j23113j40602j11538q1293K97134M9020k32899J40428
$$ -24470 -122349 81502 159166 36053 -104549 -216087 -297380 -246 48774 -184125 -43697
1229d3697J76027K9801o2933r1480j65644J1638j14946R427J20549L12819N8019
$$ -43697 132330 162131 99198 7718 -157926 -146288 -261234 -251807 -131258 181561 239580
1218B39580N3975l02713L971J29031l30429r3064M349J78245L06379j8598n2015
$$ 239580 293555 -9158 -5187 123844 -206585 -299649 -295300 -117055 189324 170726 118711
1207A18711J88215j72250o2786o7697j97403k0994J8850q8922K01734J67893L3491
$$ 118711 306926 134676 71890 4193 -193210 -214204 -195354 -284276 -82542 85351 118842
1196A18842P7382j35804k50305J20886M6918J40925m2373J1615K3085P4099K6705
$$ 118842 196224 60420 -189885 -68999 -22081 118844 76471 88086 111171 185270 211975
1185B11975k03179j01111L3129j2511J40574o3121n6418J62780n2441J485o6432
$$ 211975 8796 -92315 -59186 -71697 68877 5756 -50662 112118 59677 61162 -5270
1174e270r6158M6712l3246q7839j14598K19764J54568j02726J10565N8171p3427
$$ -5270 -101428 -54716 -87962 -175801 -290399 -70635 83933 -18793 91772 149943 76516
1163G6516n7770j31170M711J02422r0560J5731n8264K82747J27358j33096K3791
$$ 76516 18746 -112424 -107713 -5291 -95851 -80120 -138384 144363 271721 138625 162416
1152A62416m00489m5163J40736P1907k9702M3014J6471O0183l5164j378k8313
$$ 162416 -238073 -283236 -142500 -70593 -100295 -57281 -40810 19373 -15791 -17169 -45482
1141d5482k97409Q4164L23187J20320j26220o6686n8374m3270R2445N7596j31203
$$ -45482 -342891 -258727 64460 184780 58560 -8126 -66500 -109770 -17325 40271 -90932
1130i0932j4723j21476J05178R1960J29567M7084j57340o7983R531R420K17727
$$ -90932 -105655 -227131 -121953 -29993 99574 146658 -10682 -78665 -69134 -59714 158013
1119A58013k8339r2323l2256m460k8793j10554n9885L4948J77852P0965Q9617
$$ 158013 129674 37351 5095 635 -28158 -138712 -198597 -163649 14203 85168 174785
1108A74785k87088O1395O761M2531P6596j64827J74016r4967k56052J48178j38462
$$ 174785 -112303 -50908 -44147 -1616 74980 -89847 84169 -10798 -266850 -118672 -257134
1097b57134J64675J3082N4149k8803j13146J72881r738j69162O2049k1420m4338
$$ -257134 -92459 -79377 -25228 -54031 -167177 5704 -4034 -173196 -111147 -132567 -176905
1086a76905M2944O9464K06482j51839M2036R7275p3023P0509P9384n9784j42693
$$ -176905 -133961 -64497 141985 -9854 32182 129457 56434 126943 206327 146543 3850
1075C850o0805J28569J9967j37017L9984k3937n475Q5555j2260l3131J8302M4632
$$ 3850 -56955 71614 91581 -45436 -5452 -29389 -34864 50691 38431 5300 23602 68234
1063F8234m8349o2287m1639M2479q0201J50226r953N1815m2615q6716J93837J27529
$$ 68234 19885 -42402 -84041 -41562 -121763 28463 18510 70325 27710 -59006 134831 262360
1051B62360j52537n2987L7379J04422j18934M5522n5058N9143K42250j57542j51651
$$ 262360 109823 56836 94215 198637 79703 125225 70167 129310 371560 214018 62367
1040F2367k54071J8438J52182k14281L1198K82683o7901K403R8870j40417N1377
$$ 62367 -191704 -173266 -21084 -235365 -204167 78516 10615 13018 111888 -28529 22848
1029B2848k29500L0865L885P7716J23324k3426P0726j40964o8827p6685j4817
$$ 22848 -206652 -175787 -171902 -94186 29138 5712 76438 -64526 -133353 -210038 -224855
1018b24855O6212J20530J05363L2104k1826k14110N089l9643P282m9534R4223
$$ -224855 -158643 -38113 67250 99354 77528 -136582 -131493 -171136 -163854 -213388 -119165
1007a19165J84083j04943J4401l3823l2769M2003O1842j39647P0357K65515k6605
$$ -119165 64918 -40025 -25624 -59447 -92216 -50213 11629 -128018 -57661 207854 181249
996A81249k43106N8205n4246r451J14284k14922K2858M5703j86055Q8259m4688
$$ 181249 -61857 -3652 -57898 -67349 46935 -167987 -145129 -99426 -285481 -197222 -241910
985b41910j5835J43007M1821J4673n246R5163P0270j49637r9455O9458l1987K70223
$$ -241910 -257745 -114738 -72917 -58244 -63490 31673 101943 -47694 -147149 -77691 -109678 160545
973A60545Q4468k29282J66654j13103l4529r748j88252j6577J83270M993j6449
$$ 160545 245013 15731 182385 69282 34753 25005 -163247 -179824 3446 8439 -8010
962h010J24396r220k0707M1723l08187O8505K26311J55689k28432j26036j42221
$$ -8010 116386 107166 86459 128182 -180005 -111500 114811 270500 42068 -83968 -226189
951b26189Q3295Q1357m4121j19386l4022J29844N5171K3701K7748P5154J01968
$$ -226189 -142894 -61537 -105658 -225044 -259066 -129222 -74051 -50350 -22602 52552 154520
940A54520j56181m4868R2394j38429R5183j17177q4099J99744K96725k15634j42070
$$ 154520 -1661 -46529 45865 -92564 2619 -114558 -198657 1087 297812 82178 -59892
929e9892M1150J25940o0725j24814J3717K0762m2093K9111O4307M9617N074k62153
$$ -59892 -18742 107198 46473 -78341 -64624 -43862 -85955 -56844 7463 57080 62154 -199999
917a99999L2040P9176n6624j1832N6409l9697j03055j148J74432J91209j66785
$$ -199999 -167959 -88783 -145407 -157239 -100830 -140527 -243582 -244730 -70298 120911 -45874
906d5874q5625N0907J78867J20512j5983k54155J35265j90172Q4975n3759K9962
$$ -45874 -131499 -80592 98275 218787 202804 -51351 83914 -106258 -21283 -75042 -45080
895d5080N6199L3811J02211j5733n2833j21636k018j04685K01110m5691l2357
$$ -45080 11119 44930 147141 131408 78575 -43061 -45079 -149764 51346 5655 -26702
884b6702j13883J10205J44545j43945o5940P0509p2713m9782j46895Q5036L2250
$$ -26702 -140585 -30380 114165 -29780 -95720 -25211 -97924 -147706 -294601 -209565 -177315
873a77315J46683O5816k16199j72808J47098J19328O0324Q0382n3987r7876j11251
$$ -177315 -30632 35184 -181015 -353823 -206725 -87397 -27073 53309 -678 -98554 -209805
862b09805J71358n6652K22036O8568j55723l6291n9611K55082j14661k31421J51865
$$ -209805 -38447 -95099 126937 195505 39782 3491 -56120 198962 84301 -147120 4745
851D745O1888L0110M6249j96037j29636J11963Q0617J08197R1855j60577j10696
$$ 4745 66633 96743 142992 -53045 -182681 -70718 9899 118096 209951 49374 -61322
840f1322L0453l9956M4335R182J225k03191k26J14325k07124J45284K14891p7606
$$ -61322 -30869 -70825 -26490 -17308 -16083 -219274 -219500 -105175 -312299 -167015 47876 -29730
828b9730M0126J25282O8872j02804j43827n7795j7475k221J94770O8716M9244
$$ -29730 10396 135678 204550 101746 -42081 -99876 -117351 -119572 75198 143914 193158
817A93158j6088m4850o1083j0903p9192J6383m6600J8042K31445M2674N0220j08446
$$ 193158 177070 132220 71137 60234 -18958 -2575 -49175 -31133 200312 242986 293206 184760
805A84760o6186Q432p6892J135k3573J46620o3461j52713N7109p5881R1394j62471
$$ 184760 118574 127006 50114 51249 27676 174296 110835 -41878 15231 -60650 30744 -131727
793a31727m2774J67043N2613o8763j12523j00497J187k5336J227J7732l8959R1975
$$ -131727 -174501 -7458 45155 -23608 -136131 -236628 -235441 -260777 -259550 -241818 -280777 -188802
781a88802L3657J15886N0282J57094k8743j00661n2656n578J51770l1034o0395
$$ -188802 -155145 -39259 11023 168117 139374 38713 -13943 -19521 132249 101215 40820
770D0820j68607J82715O6391J12876j14505j52199k2442Q6776k6897j40291j62270
$$ 40820 -127787 54928 121319 234195 119690 -32509 -54951 31825 4928 -135363 -297633
759b97633J06111l0425j6953K87896K2567J7322M9153j73315j55242O0394J20599
$$ -297633 -191522 -221947 -238900 48996 71563 88885 138038 -35277 -190519 -130125 -9526
748i526J25255j64962J04273P7936P2193r8413k21977P3723L0211q959M8727j88023
$$ -9526 115729 -49233 55040 132976 205169 106756 -115221 -41498 -11287 -20246 28481 -159542
736a59542K43516J29524l3173J064j84705L1982N5179n0777K8976J5360O5200
$$ -159542 83974 213498 180325 181389 -3316 28666 83845 33068 62044 77404 142604
725A42604j16832k76573L1233J44925J39482J00211n2410o0497n7093N1913o3623
$$ 142604 25772 -250801 -219568 -74643 64839 165050 112640 52143 -4950 46963 -16660
714a6660o0474P5305o2524n8180R4671q3073N4174N1227m7002Q6068J57158J24947
$$ -16660 -77134 -1829 -64353 -122533 -27862 -110935 -56761 -5534 -52536 33532 190690 315637
702C15637j48751j63293l0810O3516K4614o5362N4674J8959k35584J73863J61966
$$ 315637 166886 3593 -27217 36299 60913 -4449 50225 69184 -166400 7463 169429
691A69429J15793j94685j23948j93264O2679J38688J15023K8002M2992K0351l2667
$$ 169429 285222 90537 -33411 -226675 -163996 -25308 89715 117717 160709 181060 148393
680A48393r7879j04646O243l8963o9524m6607J53371J41516r967q1072N2373J32028
$$ 148393 50514 -54132 -47889 -86852 -156376 -202983 -49612 91904 81937 865 53238 185266
668A85266j12021l1855L0362q9504j2618K2017K59631j15648k0274k831j6620
$$ 185266 73245 41390 71752 -17752 -30370 -8353 251278 135630 115356 112525 95905
657I5905k7208j21395J12890k8319j66918j08141n8639K06123J31790p2533O3366
$$ 95905 68697 -52698 60192 31873 -135045 -243186 -301825 -95702 36088 -36445 26921
646B6921j29291j83793J69597K28469p1249k00577k5445R978J58415J00902J25774
$$ 26921 -102370 -286163 -116566 111903 40654 -159923 -185368 -175390 -16975 83927 209701
635B09701k20366j76924O3365j24497O2738J14736p0313L2296j2015L08830n4792
$$ 209701 -10665 -187589 -124224 -248721 -185983 -71247 -141560 -109264 -121279 187551 132759
624A32759r9835p2457k451M553j0839J28794P3642j45630Q9028O2777j14930K3614
$$ 132759 32924 -39533 -41984 -37431 -48270 80524 154166 8536 97564 160341 45411 69025
612F9025P986j2861n9009j2143j36568K17706O3938J38787k08938k22435R7683
$$ 69025 77011 64150 5141 -7002 -143570 74136 138074 276861 67923 -154512 -56829
601e6829L9014J22718j74854N1431N4558J47484j26142j70525J6634j14230J35937
$$ -56829 -17815 104903 -69951 -18520 36038 183522 57380 -113145 -96511 -210741 -74804
590g4804M7359J05950m8764R1807k7805p2646o441R0138p567j06521j82823J28135
$$ -74804 -27445 78505 29741 121548 93743 21097 14656 104794 97227 -9294 -192117 -63982
578f3982J04592O3944K895j92509P5822O0419j64629j41755P5048R1176Q2335
$$ -63982 40610 104554 107449 -85060 -9238 51181 -113448 -255203 -180155 -88979 -6644
567f644J0748q341J0959l9784p2882q6791J54102Q3387j50443k20459q978K99039
$$ -6644 4104 -4237 6722 -33062 -105944 -192735 -38633 44754 -105689 -326148 -335126 -36087
555c6087J56745p8498k7585k34808Q7205K72163N4521q3857j17209Q6032N6304
$$ -36087 120658 42160 14575 -220233 -133028 139135 193656 109799 -7410 78622 134926
544A34926j29614P9615J26809j21061M7931k00356Q9392J18381q4996N5168Q5865
$$ 134926 5312 84927 211736 90675 138606 -61750 27642 146023 61027 116195 202060
533B02060j98411k3509J42837k05723k8970K9716Q651J11826J538J37922R0739
$$ 202060 3649 -19860 122977 -82746 -111716 -82000 -73349 38477 40015 177937 268676
522B68676j9949j39757j31464m0394J18525m5477N8252o5591J08288P708l6189
$$ 268676 248727 108970 -22494 -62888 55637 10160 68412 2821 111109 118817 82628
511H2628p504N262J05417q5861O0755k85940J34280K49600j40947j62713P7987
$$ 82628 75124 80386 185803 99942 160697 -125243 9037 258637 117690 -45023 32964
500C2964J9144N1202q8016j4642J05393K1204J46156j67513k45508J45856N0076
$$ 32964 52108 103310 15294 652 106045 127249 273405 105892 -139616 6240 56316
489E6316K15985r5q1006k9653j0425k23188k4798J10843J9806k4135L2701m6279
$$ 56316 272301 272206 191200 161547 151122 -72066 -96864 13979 33785 9650 42351 -3928
477c928J14351J84678k80356m8840j9406J26761r1965k8192J2555J39099Q1822
$$ -3928 110423 295101 14745 -34095 -53501 73260 -18705 -46897 -34342 104757 186579
466A86579J3741j23294M9024l0085Q523j419q5005o1029j2190R5648K2332p8080
$$ 186579 200320 77026 126050 95965 104488 103069 18064 -42965 -55155 40493 62825 -15255
454a5255j17596J81090Q8046l7100q3097P4207P967R701l258k3557J1558M3748
$$ -15255 -132851 48239 136285 99185 16088 90295 98262 107963 104705 81148 92706 136454
442A36454k130q3933j53423J13205M3499j15080K6433o5275M5061M0963J0017
$$ 136454 134324 50391 -103032 10173 53672 -61408 -34975 -100250 -55189 -14226 -4209
431d209k5040o8292J8282O0519j19585k8745J49437J50850n5292o8821P3409j28840
$$ -4209 -29249 -97541 -79259 -18740 -138325 -167070 -17633 133217 77925 9104 82513 -46327
419d6327l41168J64434J27450o040J91234j5753Q9933o8389j9648k25528n6973
$$ -46327 -387495 -223061 -95611 -101651 89583 73830 163763 95374 75726 -149802 -206775
408b06775Q8178J94899J04005j00140R7228j3893j75189l1717J11234Q9376m3990
$$ -206775 -118597 76302 180307 80167 177395 163502 -11687 -43404 67830 157206 113216
397A13216L2011k8215m7168Q1339P4329k9488l18441j9462n7968J79790k1109
$$ 113216 145227 117012 69844 151183 225512 196024 -122417 -141879 -199847 -20057 -41166
386d1166R3644J85840q3955q4897q9448J04656J87292j12137k61234J26355K5494
$$ -41166 52478 238318 154363 69466 -19982 84674 271966 159829 -101405 24950 50444
375E0444j41121Q905J43926O7940j5983P7175n6570R899o742k3699r0767j96087
$$ 50444 -90677 -81772 62154 130094 114111 191286 134716 144615 137873 114174 23407 -172680
363a72680R5233K34526J55062j13491r9915p9848k8732P6701J16578J87496m1439
$$ -172680 -77447 157079 312141 198650 98735 18887 -9845 66856 183434 370930 329491
352C29491m4076k20167J69918n6700k02058j28258j35890K66178K22162k20582
$$ 329491 285415 65248 235166 178466 -23592 -151850 -287740 -21562 200600 -19982
342a9982M0274K65670j81630Q6729k08869K1599r3152N3520J78104m8207K3323
$$ -19982 20292 285962 104332 191061 -17808 3791 -89361 -35841 142263 94056 117379
331A17379K07882j16540k31094j49444O8560J07277P9340R7499p5382q5431K17209
$$ 117379 325261 208721 -22373 -171817 -103257 4020 83360 180859 105477 20046 237255
320B37255O9844n8411j80590k24843R6791j25960M4457J53233K3660j04093O6122
$$ 237255 307099 248688 68098 -156745 -59954 -185914 -141457 11776 35436 -68657 -2535
309b535J35060l0771j53853o6237j84505J78420j1446J14418J14948p1895N6636
$$ -2535 132525 101754 -52099 -118336 -302841 -124421 -135867 -21449 93499 21604 78240
298G8240J19609j7839j10252Q4465k1163K6032l7334q3962N4105Q2970n0467k68686
$$ 78240 197849 180010 69758 154223 133060 159092 121758 37796 91901 174871 124404 -144282
286a44282j13289K31577K30070J37240j24683q6376J16396k19896R5134o865k45012
$$ -144282 -257571 -25994 204076 341316 216633 130257 246653 26757 121891 115026 -129986
275a29986J01869J16001O04o64P913N6476q8368j57532J23307K10068j52890j44533
$$ -129986 -28117 87884 88488 87824 95737 152213 63845 -93687 29620 239688 86798 -57735
263e7735j5953K2570L43759j08176k01985m2830R3223K08371J6593k68281N9160
$$ -57735 -73688 -51118 292641 184465 -17520 -60350 32873 241244 257837 -10444 48716
252D8716K4044K8880J25484M6452L3195j09825j50195n2147n8152j1092M3148
$$ 48716 72760 101640 227124 273576 306771 196946 46751 -5396 -63548 -74640 -31492
241c1492K3844P6720J21669o7630k01592p1397J79767J52390n9718p5380J376
$$ -31492 -7648 69072 190741 123111 -78481 -149878 29889 182279 122561 47181 48557
230D8557L31407R257k45064l9972N3515L5623p5575j37494J7192M9454M8672K07365
$$ 48557 379964 389221 144157 104185 157700 193323 117748 -19746 -2554 46900 95572 302937
218C02937k05219N784M563M0456o0671j5851j5374M5558J10014L7861k63796J6456
$$ 302937 97718 103502 108065 148521 87850 71999 56625 102183 212197 250058 -13738 2718
206B718Q6408K905q021R5203J83711l8381k12514j63426J02988m9994J26129n0336
$$ 2718 89126 92031 84010 179213 362924 324543 112029 -51397 51591 1597 127726 77390
194G7390K736m7286j20111P6517m7499l3043K83651j43469l7673K5155q2021J10708
$$ 77390 80126 32840 -87271 -10754 -58253 -91296 192355 48886 11213 36368 -45653 65055
182F5055R3364j58330k0440R8828m6460j36571j1953J30014J15975q1928j97080
$$ 65055 158419 89 -20351 78477 32017 -104554 -116507 13507 129482 47554 -149526
171a49526L9274L39877j5168j72101l0755J02515m2251J16602j22748j0973J22264
$$ -149526 -110252 229625 214457 42356 11601 114116 71865 188467 65719 54746 177010
160A77010Q2613j0247k12438p7062k0582m7995L5000K15176J25995j81587q30
$$ 177010 259623 249376 36938 -40124 -60706 -108701 -73701 141475 267470 85883 85053
149H5053M272P6871K7529j49011K1365N4191L96j0472o4976J41106J03648k29295
$$ 85053 89325 166196 193725 44714 66079 120270 120666 110194 45218 186324 289972 60677
137F0677r7255K07843L2587J12168j04893j95368k142O6691J59525p1524j41876
$$ 60677 -36578 171265 203852 316020 211127 15759 13617 80308 239833 168309 26433
126B6433m6799Q3723K13n7116m8110j0746J55469m4247o7316K7253r97j3211j77805
$$ 26433 -20366 63357 63570 6454 -41656 -52402 103067 58820 -8496 18757 17760 4549 -173256
113a73256R8062J33548J00527K5247J3668j37410K5436O4032j44227o4744l9919
$$ -173256 -75194 58354 158881 184128 197796 60386 85822 149854 5627 -59117 -99036
102i9036O8367J84576p853L5771O5432j32139l8802K1156j17425J53530n1136
$$ -99036 -30669 153907 146054 181825 247257 115118 76316 97472 -19953 133577 82441
91H2441J17963N3O4762j5039n1551q2943j15415K4631J47657n0386J7852l9455
$$ 82441 200404 200457 265219 250180 198629 115686 271 24902 172559 122173 140025 100570
79A00570j04647N101O8826n6804L1944j5948k0137j4152K8430K07680n067j25290
$$ 100570 -4077 1024 69850 13046 44990 29042 8905 -5247 23183 230863 225796 100506
67A00506n1215P678J08159P5003m4370j29147r2910P1624P9001N0198J04895Q185
$$ 100506 49291 56969 165128 240131 195761 66614 -26296 45328 124329 174527 279422 287607
55B87607k7220j76676n1125Q8274j09972O2497n5503r6370J56050j7626r6888
$$ 287607 260387 83711 32586 120860 10888 73385 17882 -78488 77562 59936 -36952
44c6952q0374l7122J45090N5450J12056n2552l6586J87979J1247k4099l7582r4387
$$ -36952 -117326 -154448 -9358 46092 158148 105596 69010 256989 268236 244137 206555 112168
32A12168J626m1916L7762M9373r8611n1696O3914j4101J0831J2029M2753o7788
$$ 112168 113794 71878 109640 159013 60402 8706 72620 58519 69350 81379 124132 56344
20E6344o4627P2128n9503j25907J07727J5536J01104j9070P8716P2583j72232
$$ 56344 -8283 63845 4342 -121565 -13838 1698 102802 83732 162448 235031 62799
9F2799m7379J15809N6806j8085k1803m0171n0814J37165j15385
$$ 62799 15420 131229 188035 169950 148147 107976 57162 194327 78942
0G8942
$$ 78942
$$ Imaginary data points
##PAGE= N=2
##DATA TABLE= (X++(I..I)), XYDATA
16383c240378J51752K12139K448J00077l5023J3387m6689p0280K17068J92314
$$ -3240378 -3088626 -2876487 -2874039 -2773962 -2808985 -2795598 -2842287 -2912567 -2695499 -2503185
16373b503185J4938P1980K3485N4677K8958M9609j04704O3772M4056j9580J56776
$$ -2503185 -2488247 -2416267 -2392782 -2338105 -2309147 -2259538 -2364242 -2300470 -2256414 -2275994 -2119218
16362b119218O4994n7600J27412q3193P2927P7531O6737M8016L4692j8101j2013
$$ -2119218 -2054224 -2111824 -1984412 -2067605 -1994678 -1917147 -1850410 -1802394 -1767702 -1785803 -1797816
16351a797816J55242J4054R2979q2739Q6112K18202L8401l6774m06J33176j3890
$$ -1797816 -1642574 -1628520 -1535541 -1618280 -1532168 -1313966 -1275565 -1312339 -1312745 -1179569 -1193459
16340a193459J5497L9305N6939J35466k629j53386J24074J55912J23870N5289
$$ -1193459 -1177962 -1138657 -1081718 -946252 -948881 -1102267 -978193 -822281 -698411 -643122
$$ [...]
##END NTUPLES=NMR SPECTRUM
##END=
