##TITLE=1H_TG-2410
 200.13Hz, CDCl3.
 8 sc
 30.6.2026
##JCAMPDX= 6.0         $$ Bruker NMR JCAMP-DX V2.0
##DATA TYPE= NMR SPECTRUM
##DATA CLASS= NTUPLES
##ORIGIN= UXNMR, Bruker Analytische Messtechnik GmbH
##OWNER= pz
$$ XWIN-NMR		Version 3.5
$$ Tue Jun 30 13:34:12 2026 Russian Standard Time (UT+4h)  she@DPX200
##.OBSERVE FREQUENCY= 200.1313
##.OBSERVE NUCLEUS= ^1H
##.ACQUISITION MODE= SIMULTANEOUS
##.ACQUISITION SCHEME= undefined
##.AVERAGES= 8
##.DIGITISER RES= 18
##SPECTROMETER/DATA SYSTEM= spect
##.PULSE SEQUENCE= zg30
##.SOLVENT NAME= CDCl3
##.SHIFT REFERENCE= (INTERNAL, CDCl3, 0, 15.51)
##AUDIT TRAIL= $$ (NUMBER, WHEN, WHO, WHERE, WHAT)
$$ ##TITLE= Audit trail, XWIN-NMR		Version 3.5
$$ ##JCAMPDX= 5.01
$$ ##ORIGIN= Bruker BioSpin GmbH
$$ ##OWNER= she
$$ F:/spectra/data/she/nmr/H-C/1/pdata/1/auditp.txt
$$ ##AUDIT TRAIL=  $$ (NUMBER, WHEN, WHO, WHERE, WHAT)
(   1,<2026-06-30 13:33:03.75 +0400>,<she>,<DPX200>,
      <created by zg, POWCHK disabled, PULCHK disabled
       configuration hash MD5:
       00 E9 B6 7A A2 85 ED C7 34 08 36 98 17 FE 4E 26
       data hash MD5: 16K
       A3 CB C8 52 DA 67 FD 9D F7 85 F2 D5 20 AD A6 E3>)
(   2,<2026-06-30 13:33:06.31 +0400>,<she>,<DPX200>,
      <Start of raw data processing
       efp BC_mod = 2 LB = 0.25 FT_mod = 6 PKNL = 1 PHC0 = -4382.271 PHC1 = 15.5923 SI = 16K 
       data hash MD5: 16K
       B3 B1 FE 4D 0A C3 F0 95 6D 59 13 B7 C5 CE C6 2F>)
(   3,<2026-06-30 13:33:10.90 +0400>,<she>,<DPX200>,
      <abs ABSG = 5 
       data hash MD5: 16K
       94 A2 BA 69 88 CF 9A 3D 8B 11 95 CA DF 17 A3 E1>)
(   4,<2026-06-30 13:33:24.57 +0400>,<she>,<DPX200>,
      <pk PHC0 = -0.2856868 PHC1 = 0 
       data hash MD5: 16K
       AC D3 24 CB 05 E8 8D 5D D9 0D B8 D3 F9 63 5B B5>)
$$ ##END=
$$ 
$$ hash MD5
$$ 7D 64 AF 07 6D 11 E2 D4 44 37 C7 C5 1E 0F D4 0F
##$RELAX= 
##$RELAX= 
##$RELAX= 
##$RELAX= 
##$RELAX= 
##$RELAX= 
$$ Bruker specific parameters
$$ --------------------------
##$DU= <F:/spectra>
##$EXPNO= 1
##$NAME= <H-C>
##$PROCNO= 1
##$TYPE= <nmr>
##$USER= <she>
##$AMP= (0..31)
100 100 100 100 100 100 100 100 100 100 100 100 100 100 100 100 100 100 
100 100 100 100 100 100 100 100 100 100 100 100 100 100 
##$AQSEQ= 0
##$AQ_mod= 1
##$AUNM= <au_zg>
##$AUTOPOS= <>
##$BF1= 200.13
##$BF2= 200.13
##$BF3= 200.13
##$BF4= 200.13
##$BF5= 200.13
##$BF6= 200.13
##$BF7= 200.13
##$BF8= 200.13
##$BYTORDA= 1
##$CFDGTYP= 0
##$CFRGTYP= 5
##$CHEMSTR= <none>
##$CNST= (0..31)
1 1 145 1 1 1 1 1 1 1 1 1 1 1 1 1 1 1 1 1 1 1 1 1 1 1 1 1 1 1 1 1 
##$CPDPRG= <>
##$CPDPRG1= <>
##$CPDPRG2= <>
##$CPDPRG3= <>
##$CPDPRG4= <mlev>
##$CPDPRG5= <mlev>
##$CPDPRG6= <mlev>
##$CPDPRG7= <mlev>
##$CPDPRG8= <mlev>
##$CPDPRGB= <>
##$CPDPRGT= <>
##$D= (0..31)
0 0.7 0 0 0 0 0 0 0 0 0 0.03 0 0 0 0 0 0 0 0 0 0 0 0 0 0 0 0 0 0 0 0 
##$DATE= 1782811983
##$DBL= (0..7)
120 120 120 120 120 120 120 120 
##$DBP= (0..7)
150 150 150 150 150 150 150 150 
##$DBP07= 0
##$DBPNAM0= <>
##$DBPNAM1= <>
##$DBPNAM2= <>
##$DBPNAM3= <>
##$DBPNAM4= <>
##$DBPNAM5= <>
$$ [...]
##$SUBNAM3= <"">
##$SUBNAM4= <"">
##$SUBNAM5= <"">
##$SUBNAM6= <"">
##$SUBNAM7= <"">
##$SUBNAM8= <"">
##$SUBNAM9= <"">
##$SW= 18.0517328524113
##$SWIBOX= (0..15)
0 0 2 0 0 0 0 0 0 0 0 0 0 0 0 0 
##$SW_h= 3612.71676300578
##$TD= 16384
##$TD0= 1
##$TE= 0
##$TE2= 300
##$TE3= 300
##$TEG= 300
##$TL= (0..7)
0 120 120 120 120 120 120 120 
##$TP= (0..7)
150 150 150 150 150 150 150 150 
##$TP07= 0
##$TPNAME0= <>
##$TPNAME1= <>
##$TPNAME2= <>
##$TPNAME3= <>
##$TPNAME4= <>
##$TPNAME5= <>
##$TPNAME6= <>
##$TPNAME7= <>
##$TPOAL= (0..7)
0.5 0.5 0.5 0.5 0.5 0.5 0.5 0.5 
##$TPOFFS= (0..7)
0 0 0 0 0 0 0 0 
##$TUNHIN= 0
##$TUNHOUT= 0
##$TUNXOUT= 0
##$USERA1= <user>
##$USERA2= <user>
##$USERA3= <user>
##$USERA4= <user>
##$USERA5= <user>
##$V9= 5
##$VALIST= <valist>
##$VCLIST= <CCCCCCCCCCCCCCC>
##$VD= 0
##$VDLIST= <DDDDDDDDDDDDDDD>
##$VPLIST= <PPPPPPPPPPPPPPP>
##$VTLIST= <TTTTTTTTTTTTTTT>
##$WBST= 1024
##$WBSW= 4
##$XGAIN= (0..3)
0 0 0 0 
##$XL= 0
##$YL= 0
##$YMAX_a= 546517
##$YMIN_a= -459849
##$ZGOPTNS= <>
##$ZL1= 120
##$ZL2= 120
##$ZL3= 120
##$ZL4= 120
##$ABSF1= 15.51551
##$ABSF2= -2.53634
##$ABSG= 5
##$ABSL= 3
##$ALPHA= 0
##$AQORDER= 0
##$ASSFAC= 0
##$ASSFACI= 0
##$ASSFACX= 0
##$ASSWID= 0
##$AUNMP= <proc_1d>
##$AZFE= 0.1
##$AZFW= 0.1
##$BCFW= 0
##$BC_mod= 2
##$BYTORDP= 0
##$COROFFS= 0
##$CY= -3
##$DATMOD= 1
##$DC= 0
##$DFILT= <>
##$DTYPP= 0
##$F1P= 0
##$F2P= 0
##$FCOR= 1
##$FTSIZE= 16384
##$FT_mod= 6
##$GAMMA= 0
##$GB= 0
##$INTBC= 1
##$INTSCL= 3.241238e-09
##$ISEN= 128
##$LB= 0.25
##$LEV0= 0
##$LPBIN= 0
##$MAXI= 10000
##$MC2= 0
##$MEAN= 0
##$ME_mod= 0
##$MI= 1.114404
##$NCOEF= 0
##$NC_proc= -4
##$NLEV= 6
##$NOISF1= 3.799351
##$NOISF2= 2.8
##$NSP= 0
##$NTH_PI= 0
##$NZP= 0
##$OFFSET= 15.51
##$PC= 1
##$PHC0= -4382.557
##$PHC1= 15.5923
##$PH_mod= 1
##$PKNL= yes
##$PPARMOD= 0
##$PSCAL= 0
##$PSIGN= 0
##$REVERSE= no
##$SF= 200.130002340582
##$SI= 16384
##$SIGF1= 3
##$SIGF2= 2
##$SINO= 0.751879
##$SIOLD= 32768
##$SREGLST= <19F.Aceton>
##$SSB= 0
##$STSI= 16384
##$STSR= 0
##$SW_p= 3612.71676300578
##$SYMM= 0
##$S_DEV= 0
##$TDeff= 16384
##$TDoff= 0
##$TI= <>
##$TILT= no
##$TM1= 0
##$TM2= 0
##$TOPLEV= 0
##$USERP1= <user>
##$USERP2= <user>
##$USERP3= <user>
##$USERP4= <user>
##$USERP5= <user>
##$WDW= 1
##$XDIM= 16384
##$YMAX_p= 288683167
##$YMIN_p= -52315
$$ End of Bruker specific parameters
$$ ---------------------------------
##NTUPLES= NMR SPECTRUM
##VAR_NAME=  FREQUENCY,     SPECTRUM/REAL,   SPECTRUM/IMAG
##SYMBOL=    X,             R,               I
##VAR_TYPE=  INDEPENDENT,   DEPENDENT,       DEPENDENT
##VAR_FORM=  AFFN,          ASDF,            ASDF
##VAR_DIM=   16384,         16384,           16384
##UNITS=     HZ,            ARBITRARY UNITS, ARBITRARY UNITS
##FACTOR=    0.220516191357247, 1,           1
##FIRST=     3104.01638210855, 0,            0
##LAST=      -508.700380897231, 0,           0
##MIN=       -508.700380897231, -52315,      0
##MAX=       3104.01638210855, 288683167,    0
$$ Real data points
##PAGE= N=1
##DATA TABLE= (X++(R..R)), XYDATA
$$ [...]
$$ plain form
6370 21219 19853 17339 18998 17048 28338 23464 19303 12422 17062 12840 25324 38231 54717 53244
6356 53244 50398 37585 26369 50382 52564 41751 32791 25483 20727 20598 21326 9305 7484 32249
6342 32249 32516 36918 28316 9622 23847 27067 11335 12351 32085 28693 15248 16972 28467
6329 28467 30093 34525 45072 44467 32848 40409 44104 52832 60604 43559 25453 31858 43280 40900
6315 40900 39414 42404 40572 38608 44461 31385 21885 33104 54838 45433 39479 39619 37336 26541
6301 26541 24700 24767 22681 22251 26383 38662 26681 34534 39903 27816 40550 55117 46849 55624
6287 55624 76569 74540 76769 63716 43325 30856 36178 46138 59034 44808 38799 46917 41358
6274 41358 35112 11413 18196 31730 38142 32235 39926 33807 22518 29606 19307 33029 28956
$$ packed form
6370B1219j366k514J659j950J1290m874m161o881M640m222J2484J2907J6486j473
6356E3244k846j2813j1216K4013K182j0813q960p308m756j29P28j2021j821K4765
6342C2249K67M402q602j8694J4225L220j5732J016J9734l392j3445J724J1495
6329B8467J626M432J0547o05j1619P561L695Q728P772j7045j8106O405J1422k380
6315D0900j486K990j832j964N853j3076r500J1219K1734r405n954J40k283j0795
6301B6541j841O7k086m30M132J2279j1981P853N369j2087J2734J4567q268Q775
6287E5624K0945k029K229j3053k0391j2469N322R960J2896j4226o009Q118n559
6274D1358o246k3699O783J3534O412n907P691o119j1289P088j0299J3722m073
$$ plain form
6261 28956 26915 43410 38580 43042 52889 53950 58848 78190 80892 78932 78021 94302 59511 33374
6247 33374 43984 37938 48605 53997 53150 55262 35555 39523 44518 47065 42251 35425 35047 39253
6233 39253 30054 36302 41092 32042 46639 51078 34097 22510 46129 57178 60109 58649 60070
6220 60070 52923 51281 50220 52015 42513 43935 43468 58487 57080 46594 50076 47835 50379 55162
6206 55162 55293 47239 46577 45810 44582 32035 22021 29475 42988 55012 59993 64154 56147 46091
6192 46091 39929 46760 53381 49990 56888 84375 76865 57113 62565 56055 43730 61058 78196
6179 78196 97455 111482 108313 123759 135842 148285 137114 139022 131916 115638 105925 92878 62890
6166 62890 61549 56251 37176 50274 56557 51247 47655 47432 50535 53562 52307 70502 63127 51916
$$ packed form
6261B8956k041J6495m830M462R847J061M898J9342K702j960r11J6281l4791k6137
6247C3374J0610o046J0667N392q47K112j9707L968M995K547m814o826l78M206
6233C9253r199O248M790r050J4597M439j6981j1587K3619J1049K931j460J421
6220F0070p147j642j061J795r502J422m67J5019j407j0486L482k241K544M783
6206E5162J31q054o62p67j228j2547j0014P454J3513J2024M981M161q007j0056
6192D6091o162O831O621l391O898K7487p510j9752N452o510j2325J7328J7138
6179G8196J9259J4027l169J5446J2083J2443j1171J908p106j6278r713j3047k9988
6166F2890j341n298j9075J3098O283n310l592k23L103L027j255J8195p375j1211
$$ plain form
6152 51916 52548 31214 43907 42272 40392 39597 34117 54201 67310 41859 46961 42884 34258 37790
6138 37790 53822 57788 47813 46074 43098 46339 55180 59168 40927 42683 37703 28027 37607 51451
6124 51451 59005 61543 66049 69843 53527 55428 43782 48744 54518 40825 40724 37778 31562 45015
6110 45015 35122 47976 56704 65329 57910 58974 55922 66530 60739 44997 53722 60340 44100 37436
6096 37436 43428 47314 51362 50797 64082 62788 55567 68478 67476 55910 58599 45948 44461 51937
6082 51937 61357 50323 46614 36251 49757 56125 35646 44608 63275 67978 67303 63718 63580 49717
6068 49717 74027 71319 54492 50411 52767 66970 61194 54208 42460 43956 37469 65978 61424
6055 61424 48236 42135 34575 45945 48002 58553 68238 71396 67503 71102 71574 77518 74862 75231
$$ packed form
6152E1916O32k1334J2693j635j880p95n480K0084J3109k5451N102m077q626L532
6138C7790J6032L966r975j739k976L241Q841L988j8241J756m980r676R580J3844
6124E1451P554K538M506L794j6316J901j1646M962N774j3693j01k946o216J3453
6110D5015r893J2854Q728Q625p419J064l052J0608n791j5742Q725O618j6240o664
6096C7436N992L886M048n65J3285j294p221J2911j002j1566K689j2651j487P476
6082E1937R420j1034l709j0363J3506O368k0479Q962J8667M703o75l585j38j3863
6068D9717K4310k708j6827m081K356J4203n776o986j1748J496o487K8509m554
6055F1424j3188o101p560J1370K057J0551R685L158l893L599M72N944k656L69
$$ plain form
6041 75231 64097 75983 68114 53894 54195 60142 66247 68539 68133 65653 81698 88327 91168 79042
6027 79042 44950 54041 61497 67264 82230 78856 61001 65005 72849 75014 41961 58233 73688
6014 73688 60242 74755 77067 79838 74498 71054 60169 65293 70442 79000 68047 64817 48146
6001 48146 60700 77289 77764 58270 65307 77841 74628 92726 90439 88238 89677 94185 89067 101491
5987 101491 114098 100593 110723 106460 91373 91705 104790 120952 117833 102813 98243 103779 115698
5974 115698 118764 110071 111997 121629 124395 120907 116006 129377 147542 151050 176149 199387 226097
5961 226097 229451 242686 279546 302910 337176 351436 354881 357027 344945 327525 335827 358166
5949 358166 370766 373231 369403 375680 364813 350505 346130 339112 320853 311629 285586 252837 242789
$$ packed form
6041G5231j1134J1886p869j4220L01N947O105K292m06k480J6045O629K841j2126
6027G9042l4092R091P456N767J4966l374j7855M004P844K165l3053J6272J5455
6014G3688j3446J4513K312K771n340l444j0885N124N149Q558j0953l230j6671
6001D8146J2554J6589M75j9494P037J2534l213J8098k287k201J439M508n118J2424
5987A01491J2607j3505J0130m263j5087L32J3085J6162l119j5020m570N536J1919
5974A15698L066q693J926R632K766l488m901J3371J8165L508K5099K3238K6710
5961B26097L354J3235L6860K3364L4266J4260L445K146j2082j7420Q302K2339
5949C58166J2600K465l828O277j0867j4308m375p018j8259r224k6043l2749j0048
$$ plain form
5936 242789 232777 215564 188544 169721 174698 170713 165702 155394 144634 133245 135332 136814 127795
5923 127795 136357 124212 118994 129982 131608 128948 133192 123632 124984 131908 126964 137054 142947 141087
5909 141087 135124 116646 132958 141423 147812 148296 166834 158061 162970 169703 154357 145963 156124
5896 156124 157442 149090 155090 145040 141976 148049 164746 151475 153123 162908 165782 152927 149244
5883 149244 153846 141145 138004 139044 127231 132707 119196 124928 131250 118365 115694 142469 143198
5870 143198 154859 151118 140809 141429 146207 151165 146259 161041 168837 167560 151521 170893 173999
5857 173999 176444 156871 147900 153955 158260 164238 171698 169035 165708 174120 172026 162716 167851 174831
5843 174831 187164 182293 176682 177279 173485 185004 203686 212369 213843 212768 209478 198018 197118 193337
$$ packed form
5936B42789j0012j7213k7020j8823M977l985n011j0308j0760j1389K087J482r019
5923A27795Q562j2145n218J0988J626k660M244r560J352O924m944J0090N893j860
5909A41087n963j8478J6312Q465O389M84J8538q773M909O733j5346q394J0161
5896A56124J318q352O000j0050l064O073J6697j3271J648R785K874j2855l683
5883A49244M602j2701l141J040j1813N476j3511N732O322j2885k671K6775P29
5870A43198J1661l741j0309O20M778M958m906J4782P796j277j6039J9372L106
5857A73999K445j9573q971O055M305N978P460k663l327Q412k094r310N135O980
5843A74831J2333m871n611N97l794J1519J8682Q683J474j075l290j1460r00l781
$$ plain form
5829 193337 197752 207873 203100 218367 216150 220303 216538 229487 225633 221889 228683 228557 232568 238880
5815 238880 227073 217357 225016 226342 232444 231107 229526 248056 250360 256411 274577 268366 262693 254252
5801 254252 259383 268773 255021 256103 265617 274218 276945 284963 299263 293840 307263 319106 329052
5788 329052 329041 344047 346351 333360 344046 362327 355740 338391 346160 370898 385784 396026 398294
5775 398294 407804 421087 406267 406674 407143 417141 410318 424735 440921 436914 435091 457060 456202 446674
5761 446674 449271 463034 478975 487596 484531 489503 510935 519294 545047 547415 544296 551268 568736
5748 568736 570642 551254 563003 568271 569452 602476 618331 652382 666980 661736 677819 695804
5736 695804 709746 731898 744368 754568 765399 781687 794053 804712 832524 853228 869451 892183
$$ packed form
5829A93337M415J0121m773J5267k217M153l765J2949l854l744O794j26M011O312
5815B38880j1807r716P659J326O102j337j581J8530K304O051J8166o211n673q441
5801B54252N131R390j3752J082R514Q601K727Q018J4300n423J3423J1843R946
5788C29052j1J5006K304j2991J0686J8281o587j7349P769K4738J4886J0242K268
5775C98294R510J3283j4820M07M69R998o823J4417J6186m007j823K1969q58r528
5761D46674K597J3763J5941Q621l065M972K1432Q359K5753K368l119O972J7468
5748E68736J906j9388J1749N268J181L3024J5855L4051J4598n244J6083J7985
5736F95804J3942K2152J2470J0200J0831J6288J2366J0659K7812K0704J6223K2732
$$ plain form
5724 892183 910583 934538 942063 944054 971776 990031 1021193 1053057 1096198 1133839 1165731 1195731
5712 1195731 1236616 1233946 1231155 1245359 1251606 1279805 1295528 1309743 1300311 1336322 1368147 1396351
5700 1396351 1408965 1424655 1453845 1463112 1483707 1477472 1470827 1473086 1477348 1488721 1520386 1565938
5688 1565938 1621720 1680353 1728572 1770149 1808474 1875626 1953310 2021589 2101023 2206846 2289877
5677 2289877 2388360 2485435 2581241 2687534 2801968 2942265 3062939 3218895 3372422 3535801
5667 3535801 3716264 3924934 4155043 4397576 4658891 4927860 5228955 5556426 5933016 6371136
5657 6371136 6850748 7375145 8028155 8806710 9721889 10843471 12223399 13989778 16265315
5648 16265315 19294001 23189094 28092589 34089698 40809671 47419207 52705935 55771083
$$ packed form
5724H92183J8400K3955P525J991K7722J8255L1162L1864M3141L7641L1892L0000
5712A195731M0885k670k791J4204O247K8199J5723J4215r432L6011L1825K8204
5700A396351J2614J5690K9190R267K0595o235o645K259M262J1373L1665M5552
5688A565938N5782N8633M8219M1577L8325O7152P7684O8279P9434J05823Q3031
5677B289877R8483R7075R5806J06293J14434J40297J20674J55956J53527J63379
5667C535801J80463K08670K30109K42533K61315K68969L01095L27471L76590M38120
5657F371136M79612N24397O53010P78555R15179J121582J379928J766379K275537
5648A6265315L028686L895093M903495N997109O719973O609536N286728L065148
$$ plain form
5640 55771083 56841105 56746706 55886686 54909194 54543540 55046616 56506741 58499543 60103927
5631 60103927 60453647 58954738 55829805 51871066 47236420 41946716 36468024 31101356
5623 31101356 26085950 21699909 18047544 15112808 12863740 11130999 9731508 8633111
5615 8633111 7742200 6949858 6270539 5696311 5203888 4782882 4402059 4060909 3772959 3496654
5605 3496654 3258290 3070104 2898910 2731853 2570961 2461349 2376381 2279448 2196514 2119390
5595 2119390 2051897 2007699 1953140 1887869 1832645 1810947 1775475 1726373 1684133 1651662 1607094
5584 1607094 1578796 1553374 1507644 1456583 1415002 1367125 1316391 1266902 1243100 1197392 1144787
5573 1144787 1077691 1048808 1015082 967724 944839 919009 890960 860514 851344 835397 793732 761714
$$ packed form
5640E5771083J070022r4399q60020r77492l65654N03076J460125J992802J604384
5631F0103927L49720j498909l124933l958739m634646n289704n478692n366668
5623C1101356n015406m386041l652365k934736k249068j732741j399491j098397
5615H633111q90911p92342o79319n74228m92423m21006l80823l41150k87950k76305
5605C496654k38364j88186j71194j67057j60892j09612q4968r6933q2934p7124
5595B119390o7493m4198n4559o5271n5224k1698l5472m9102m2240l2471m4568
5584A607094k8298k5422m5730n1061m1581m7877n0734m9489k3802m5708n2605
5573A144787o7096k8883l3726m7358k2885k5830k8049l0446r170j5947m1665l2018
$$ plain form
5561 761714 749583 711551 690065 665740 649457 616813 593520 591012 594946 597610 583493 567060
5549 567060 571461 552243 545182 535002 534402 535120 509622 517270 528554 530165 540033 535298 509927 502483
5535 502483 503080 505916 510436 511237 507285 515273 507840 505136 513617 514604 528809 529247 531629 531194 516474
5520 516474 499631 510967 499830 485254 485484 502042 501482 504520 510583 493378 491979 490428 463389
5507 463389 458772 467014 468767 477883 472974 486108 490262 479316 487993 501614 494824 494951 490576 507118
5493 507118 512345 503770 523977 532395 561568 555968 556679 572852 587028 607550 610336 609421 636953
5480 636953 662273 647821 659232 652858 675256 696712 718853 719716 723881 720411 699137 695740 694165
5467 694165 714542 715338 709611 710293 713119 712232 724571 729313 736882 759972 787522 790720 784119 794227
$$ packed form
5561G61714j2131l8032k1486k4325j6283l2644k3293k508L934K664j4117j6433
5549E67060M401j9218p061j0180o00P18k5498P648J1284J611R868m735k5371p444
5535E02483N97K836M520Q01l952P988p433k704Q481R87J4205M38K382m35j4720
5520E16474j6843J1336j1137j4576K30J6558n60L038O063j7205j399j551k7039
5507D63389m617Q242J753R116m909J3134M154j0946Q677J3621o790J27m375J6542
5493E07118N227q575K0207Q418K9173n600P11J6173J4176K0522K786r15K7532
5480F36953K5320j4452J1411o374K2398K1456K2141Q63M165l470k1274l397j575
5467F94165K0377P96n727O82K826q87J2339M742P569K3090K7550L198o601J0108
$$ plain form
5453 794227 787363 790243 778011 790022 801987 832781 870145 899560 920601 946659 978007 992991
5441 992991 1034227 1072291 1111542 1153989 1196174 1236014 1286666 1331069 1370818 1438781 1506062 1571852
5429 1571852 1638719 1712880 1796723 1894170 1987505 2095999 2233092 2355843 2468113 2604204
5419 2604204 2767663 2925267 3082262 3293137 3564612 3875457 4258576 4740045 5318283 5989674
5409 5989674 6808085 7910880 9381634 11448522 14400191 18392461 22982608 27118567
5401 27118567 29604626 29952380 29141027 28079652 26740109 25369050 24417631 24172760 25162457
5392 25162457 27336121 29889313 31638469 31507723 29774334 27583023 25066781 22126174
5384 22126174 19112787 16109328 13250702 10775280 8731303 7180471 6084360 5281599
$$ packed form
5453G94227o864K880j2232J2011J1965L0794L7364K9415K1041K6058L1348J4984
5441I92991M1236L8064L9251M2447M2185L9840N0652M4403L9749O7963O7281O5790
5429A571852O6867P4161Q3843R7447R3335J08494J37093J22751J12270J36091
5419B604204J63459J57604J56995K10875K71475L10845L83119M81469N78238O71391
5409E989674Q18411J102795J470754K066888K951669L992270M590147M135959
5401B7118567K486059L47754q11353j061375j339543j371059r51419k44871R89697
5392B5162457K173664K553192J749156j30746j733389k191311k516242k940607
5384B2126174l013387l003459k858626k475422k043977j550832j096111q02761
$$ plain form
5376 5281599 4653001 4122552 3675374 3306924 3008781 2725981 2498131 2309548 2151626 2000984
5366 2000984 1840016 1712284 1595835 1515616 1452150 1368416 1283830 1217120 1162197 1127619 1078461
5355 1078461 1047155 1014152 1000772 960595 934279 897681 878622 871377 844501 830845 828139 815791
5343 815791 792145 779228 776726 743288 714206 691999 691376 675802 644453 632234 609477 581738
5331 581738 570919 570460 581133 604277 622415 642952 644676 645742 646158 643941 620768 611755 606181
5318 606181 614122 595822 586221 571809 544355 535804 547665 530782 506775 477395 467120 420573
5306 420573 375485 360858 351467 320665 303555 283423 253015 231134 218858 227990 221482 207247
5294 207247 199981 210340 210094 196773 179713 163428 177770 191316 177783 160549 160258 173818 182977
$$ packed form
5376E281599o28598n30449m47178l68450k98143k82800k27850j88583j57922j50642
5366B000984j60968j27732j16449q0219o3466q3734q4586o6710n4923l4578m9158
5355A078461l1306l3003j3380m0177k6316l6598j9059p245k6876j3656k706j2348
5343H15791k3646j2917k502l3438k9082k2207o23j5574l1349j2219k2757k7739
5331E81738j0819m59J0673K3144J8138K0537J724J066M16k217k3173r013n574
5318F06181P941j8300r601j4412k7454q551J1861j6883k4007k9380j0275m6547
5306D20573m5088j4627r391l0802j7110k0132l0408k1881j2276R132o508j4235
5294B07247p266J0359k46j3321j7060j6285J4342J3546j3533j7234k91J3560R159
$$ plain form
5281 182977 176256 155803 160678 164550 167045 170448 158682 151973 147181 158509 156640 139908 126303
5268 126303 131902 130246 135993 134829 143127 135945 107567 107305 110922 106661 110238 106494 109627 96881
5254 96881 64322 59978 66060 60638 68018 80402 78602 72340 90814 88581 79858 62041 66272 72310
5240 72310 72238 77652 77091 76130 64496 75121 73735 84362 80293 79129 82401 88060 70697 49186
5226 49186 21994 30560 55308 53993 45810 61663 66685 60470 50911 43338 54346 62706 52465
5213 52465 67788 63190 55018 44348 25063 21086 27811 32010 48355 46388 29504 17717 28259
5200 28259 28200 14057 23819 30973 41152 48886 41735 19325 9638 22409 21338 24127 37077 48496
5186 48496 34426 48701 47482 46357 45892 31125 44996 31261 29630 47237 38066 42921 46280
$$ packed form
5281A82977o721k0453M875L872K495L403j1766o709m792J1328j869j6732j3605
5268A26303N599j656N747j164Q298p182k8378k62L617m261L577l744L133j2746
5254I6881l2559m344O082n422P380J2384j800o262J8474k233q723j7817M231O038
5240G2310p2N414n61r61j1634J0625j386J0627m069j164L272N659j7363k1511
5226D9186k7192Q566K4748j315q183J5853N022o215r559p573J1008Q360j0241
5213E2465J5323m598q172j0670j9285l977O725M199J6345j967j6884j1787J0542
5200B8259n9j4143R762P154J0179P734p151k2410r687J2771j071K789J2950J1419
5186D8496j4070J4275j219j125m65j4767J3871j3735j631J7607r171M855L359
$$ plain form
5173 46280 19349 10576 12213 20716 33318 28813 46809 44774 33204 38195 26016 26090 29762 40188
5159 40188 39075 16164 11381 23074 12463 766 -7209 -4323 -2410 6858 15279 19975 16284 15706
5145 15706 21794 9752 5283 9782 25887 36711 22314 11028 12561 16887 5569 21437 4502
5132 4502 3731 1614 -9610 8290 15196 4886 6564 5772 -3595 -9174 -10163 -5666 3046 21969 22621
5117 22621 20524 32067 32873 30133 20784 27586 34848 36386 39207 21590 17282 29210 29769 27386
5103 27386 35201 47523 43053 34211 41148 42444 34754 42788 46998 54739 54572 58246 62347 78884
5089 78884 90935 133086 153975 161164 158939 146615 145625 142074 148352 155102 146364 141623 150844 154154
5075 154154 181157 177675 181550 149649 122885 115815 110287 87908 68401 66546 60354 57366 47200
$$ packed form
5173D6280k6931q773J637Q503J2602m505J7996k035j1570M991j2179P4L672J0426
5159D0188j113k2911m783J1693j0611j1697p975K886J913R268Q421M696l691n78
5145A5706O088j2042m469M499J6105J0824j4397j1286J533M326j1318J5868j6935
5132D502p71k117j1224J7900O906j0310J678p92r367n579r89M497Q712J8923O52
5117B2621k097J1543Q06k740r349O802P262J538K821j7617m308J1928N59k383
5103B7386P815J2322m470q842O937J296p690Q034M210P741j67L674M101J6537
5089G8884J2051M2151K0889P189k225j2324r90l551O278O750q738m741R221L310
5075A54154K7003l482L875l1901k6764p070n528k2379j9507j855o192k988j0166
$$ plain form
5062 47200 34584 21531 30170 33252 32184 28150 29065 39504 46160 30773 31773 30452 33536 39592
5048 39592 22429 26621 13418 25780 37773 44122 21414 20212 22601 21062 22753 23664 20696 2462
5034 2462 4325 7466 4235 5565 17639 28745 38689 45668 38007 19439 13254 -2885 5752 8408
5020 8408 693 1756 11261 7960 13033 29921 22070 23426 20864 30164 20088 14731 4448 -10239
5006 -10239 -10497 -2378 12804 18343 12690 26852 25543 6706 -7330 16167 19786 16647 16492 5206
4992 5206 17437 18414 20944 16897 14462 32592 20008 5606 24122 17593 14018 8162 18281 3414
4978 3414 3110 18374 29915 43250 22047 19402 41204 22321 10737 34435 49781 39551 27917
4965 27917 21559 18199 11244 12581 5127 12564 26517 37065 39294 36290 42422 48829 23384 30968
$$ packed form
5062D7200j2616j3053Q639L082j068m034R15J0439O656j5387J000j321L084O056
5048C9592j7163M192j3203J2362J1993O349k2708j202K389j539J691R11k968j8234
5034B462J863L141l231J330J2074J1106R944O979p661j8568o185j6139Q637K656
5020H408p715J063R505l301N073J6888p851J356k562R300j0076n357j0283j4687
5006a0239k58Q119J5182N539n653J4162j309j8837j4036K3497L619l139j55j1286
4992E206J2231R77K530m047k435J8130j2584j4402J8516o529l575n856J0119j4867
4978C414l04J5264J1541J3335k1203k645K1802j8883j1584K3698J5346j0230j1634
4965B7917o358l360o955J337p454P437J3953J0548K229l004O132O407k5445P584
$$ plain form
4951 30968 27669 26211 32706 27794 26054 15863 19506 21834 22068 17441 17453 23692 32600 28247 30571
4936 30571 32978 37165 28451 24741 27390 27121 15670 24248 21536 38059 47424 49760 46280 47084 47906
4921 47906 28922 44419 48077 34618 37013 34690 46128 40895 33841 39286 37259 41833 49442 50016
4907 50016 34834 40583 44974 38286 41889 47402 54940 49941 48171 42326 43161 37381 33393 28920 40064
4892 40064 38994 24926 28384 37142 46189 45310 32088 34591 48163 49396 50962 66438 76231 86259
4878 86259 111712 121481 127150 144103 151432 160929 165791 145686 141021 151494 170118 186513 212181
4865 212181 224792 232386 238600 230697 233187 245527 215368 219682 232581 247670 262438 249419 242870
4852 242870 261241 241792 231397 214646 212815 192114 168688 155953 137283 148750 141757 148776
$$ packed form
4951C0968l299j458O495m912j740j0191L643K328K34m627J2O239Q908m353K324
4936C0571K407M187q714l710K649k69j1451Q578k712J6523R365K336l480Q04Q22
4921D7906j8984J5497L658j3459K395k323J1438n233p054N445k027M574P609N74
4907E0016j5182N749M391o688L603N513P538m999j770n845Q35n780l988m473J1144
4892D0064j070j4068L458Q758R047q79j3222K503J3572J233J566J5476R793J0028
4878H6259K5453R769N669J6953P329R497M862k0105m665J0473J8624J6395K5668
4865B12181J2611P594O214p903K490J2340l0159M314J2899J5089J4768j3019o549
4852B42870J8371j9449j0395j6751j831k0701k3426j2735j8670J1467o993P019
$$ plain form
4840 148776 143802 120707 108550 125016 122508 107376 104965 87691 92036 94055 94969 86258 79148
4827 79148 74909 97508 101521 65649 68467 86172 97083 84142 83227 85257 90550 98264 79577
4814 79577 77559 92699 97582 101269 89283 89427 88005 102678 104695 98091 79490 78293 72430 71335
4800 71335 70688 69512 55559 45020 57307 72492 80900 78655 71678 72248 73679 86334 87634 88313
4786 88313 90738 92992 91187 71228 60824 69131 72412 56230 49466 64013 83822 70590 84561
4773 84561 73736 60538 85271 79135 68011 77893 84694 78201 93669 83143 81099 87215 68616
4760 68616 77011 100871 106357 94550 94874 87569 87104 85424 86195 89275 93307 82087 96178 91536
4746 91536 65805 67801 86908 80285 81346 91309 93467 99829 99686 104555 98124 77768 69659 65994
$$ packed form
4840A48776m974k3095j2157J6466k508j5132k411j7274M345K019R14q711p110
4827G9148m239K2599M013l5872K818J7705J0911j2941r15K030N293P714j8687
4814G9577k018J5140M883L687j1986J44j422J4673K017o604j8601j197n863j095
4800G1335o47j176j3953j0539J2287J5185Q408k245o977N70J431J2655J300O79
4786H8313K425K254j805j9959j0404Q307L281j6182o764J4547J9809j3232J3971
4773H4561j0825j3198K4733o136j1124R882O801o493J5468j0526k044O116j8599
4760F8616Q395K3860N486j1807L24p305m65j680P71L080M032j1220J4091m642
4746I1536k5731J996J9107o623J061R963K158O362j43M869o431k0356q109l665
$$ plain form
4732 65994 78979 91616 78045 91436 80051 93440 99280 113454 109807 102446 104369 92720 90167
4719 90167 90176 84181 85129 98645 96286 90663 86005 90896 67329 69246 79126 81977 95044 96759 109266
4704 109266 93157 82448 84767 80517 95454 87653 88574 93848 108449 104003 95477 96084 92837 92639
4690 92639 101314 105933 81799 78046 84339 95070 87812 80835 73683 68121 98196 98057 89372 92351
4676 92351 88305 77773 74998 74454 82736 84388 75129 76006 82734 85463 106106 106898 92724 75810
4662 75810 76498 81456 87971 94541 97867 102820 106960 120703 122375 123787 118182 107159 96870 91203
4648 91203 96230 108855 99082 101557 100578 99555 84366 97894 104878 98763 89533 93118 99863 116266
4634 116266 113280 85414 109593 100848 84239 77628 86458 99502 106228 106490 94220 103535 111278
$$ packed form
4732F5994J2985J2637j3571J3391j1385J3389N840J4174l647p361J923j1649k553
4719I0167Rn995R48J3516k359n623m658M891k3567J917R880K851J3067J715J2507
4704A09266j6109j0709K319m250J4937p801R21N274J4601m446q526O07l247j98
4690I2639Q675M619k4134l753O293J0731p258o977p152n562L0075j39q685K979
4676I2351m046j0532k775n44Q282J652r259Q77O728K729K0643P92j4174j6914
4662G5810O88M958O515O570L326M953M140J3743J672J412n605j1023j0289n667
4648I1203N027J2625r773K475r79j023j5189J3528O984o115r230L585O745J6403
4634A16266k986k7866K4179q745j6609o611Q830J3044O726K62j2270R315P743
$$ plain form
4621 111278 118463 90676 107335 102138 94685 107969 111588 112027 113351 109515 103352 116753 106708
4608 106708 118995 112637 100891 101773 100071 118666 127619 119074 112053 108372 122898 115977 114434 113492
4594 113492 120655 121705 119753 117592 124590 142509 153883 126467 134017 136010 153798 160347 144513
4581 144513 159728 168013 165395 156653 161603 155098 160255 178479 178763 184974 205811 196630 185361 197906
4567 197906 210363 215633 215692 204393 216762 225011 228787 231803 230802 227005 238035 234219 234425 235574
4553 235574 245223 241433 235774 247287 245150 248668 251678 251354 252048 242912 227402 245743 244650 240255
4539 240255 239548 243019 242467 227400 222688 223200 213305 214503 217614 215803 201978 201733 209875 224659 227999
4524 227999 208879 208532 208065 194144 193950 196244 202082 197427 189895 196500 202410 207078 192463 192071 209550
$$ packed form
4621A11278P185k7787J6659n197p453J3284L619M39J324l836o163J3401j0045
4608A06708J2287o358j1746Q82j702J8595Q953q545p021l681J4526o921j543r42
4594A13492P163J050j952k161O998J7919J1374k7416P550J993J7788O549j5834
4581A44513J5215Q285k618q742M950o505N157J8224K84O211K0837r181j1269J2545
4567A97906J2457N270N9j1299J2369Q249L776L016j001l797J1030l816K06J149
4553B35574R649l790n659J1513k137L518L010l24O94r136j5510J8341j093m395
4539B40255p07L471n52j5067m712N12r895J198L111j811j3825k45Q142J4784L340
4524B27999j9120l47m67j3921j94K294N838m655p532O605N910M668j4615l92J7479
$$ plain form
4509 209550 219193 207113 197024 194370 204643 203620 197585 187065 205317 204244 207387 218550 210264
4496 210264 214426 227382 227695 230481 228144 234598 230328 224134 236366 228979 230077 243685 244056 241729
4482 241729 234325 231585 259620 257902 245137 238993 246426 247523 246530 247564 256987 263036 263634 292738
4468 292738 293558 289732 291968 306623 299668 297229 293988 297666 318991 335752 332932 348062 353004 360700
4454 360700 387660 423106 459692 487528 514760 552504 579929 596204 611819 603243 594008 583347
4442 583347 572323 549490 537649 502127 484418 469346 464063 452705 446373 442069 446304 473120
4430 473120 476064 454371 451626 478826 494570 505022 535921 568780 593082 601287 582935 578745
4418 578745 595820 595207 617883 637301 671525 701308 715846 726510 741971 749475 746502 730899
$$ packed form
4509B09550R643j2080j0089k654J0273j023o035j0520J8252j073L143J1163q286
4496B10264M162J2956L13K786k337O454m270o194J2232p387J098J3608L71k327
4482B41729p404k740K8035j718j2765o144P433J097r93J034R423O049N98K9104
4468B92738Q20l826K236J4655o955k439l241L678K1325J6761k820J5130M942P696
4454C60700K6960L5446L6586K7836K7232L7744K7425J6275J5615q576r235j0661
4442E83347j1024k2833j1841l5522j7709j5072n283j1358o332m304M235K6816
4430D73120K944k1693k745K7200J5744J0452L0899L2859K4302Q205j8352m190
4418E78745J7075o13K2676J9418L4224K9783J4538J0664J5461P504k973j5603
$$ plain form
4406 730899 737162 726742 741304 772844 797127 821128 833593 830248 830664 846915 845026 832001 822076
4393 822076 806048 807905 834757 838502 859530 893521 886922 874009 892479 895320 910933 909264 899100
4380 899100 919755 939712 951186 969295 980360 1000749 1031341 1045501 1058032 1065435 1072203 1092857
4368 1092857 1110189 1127953 1142009 1167247 1179285 1193297 1224753 1242743 1257903 1271087 1286915
4357 1286915 1316945 1326980 1337871 1353148 1380412 1407310 1440797 1467473 1502729 1552263 1587921
4346 1587921 1642823 1695711 1735119 1785851 1848424 1921263 1993071 2045778 2104012 2184734 2269760
4335 2269760 2355330 2438291 2521594 2629454 2752175 2866990 2994257 3125802 3313704 3511394
4325 3511394 3720566 3967742 4291929 4660300 5111435 5676740 6420705 7335440 8446707
$$ packed form
4406G30899O263j0420J4562L1540K4283K4001J2465l345M16J6251j889j3025r925
4393H22076j6028J857K6852L745K1028L3991o599j2913J8470K841J5613j669j0164
4380H99100K0655J9957J1474J8109J1065K0389L0592J4160J2531P403O768K0654
4368A092857J7332J7764J4056K5238J2038J4012L1456J7990J5160J3184J5828
4357A286915L0030J0035J0891J5277K7264K6898L3487K6676L5256M9534L5658
4346A587921N4902N2888L9408N0732O2573P2839P1808N2707N8234Q0722Q5026
4335B269760Q5570Q2961Q3303J07860J22721J14815J27267J31545J87902J97690
4325C511394K09172K47176L24187L68371M51135N65305P43965R14735J111267
$$ plain form
4316 8446707 9791905 11369217 13107575 14899746 16535900 17880395 18960029 19868624
4308 19868624 20864167 22174150 24009354 26567466 29821883 33123436 35819348 37124655
4300 37124655 37007575 36244967 35085819 33602703 32347562 31538900 31481179 32397518 33758748
4291 33758748 34840751 34782073 33328144 31411916 29390037 27010219 24680603 22540707
4283 22540707 20762766 19632165 19085446 18918653 18772796 18258328 17573398 17017773 16483885
4274 16483885 15982848 15552427 15100326 14674975 14305152 14088416 14046834 14119029 14259294 14407983
4264 14407983 14534275 14624009 14737931 14920653 15172097 15432825 15688262 15874271 15976266 16058393
4254 16058393 16168143 16286180 16430269 16485761 16400263 16173751 15866338 15542824 15249213 14984544
$$ packed form
4316H446707J345198J577312J738358J792171J636154J344495J079634R08595
4308A9868624R95543J309983J835204K558112L254417L301553K695912J305307
4300C7124655j17080p62608j159148j483116j255141q08662n7721R16339J361230
4291C3758748J082003n8678j453929j916228k021879k379818k329616k139896
4283B2540707j777941j130601n46719j66793j45857n14468o84930n55625n33888
4274A6483885n01037m30421m52101m25351l69823k16736m1582P2195J40265J48689
4264A4407983J26292Q9734J13922J82722K51444K60728K55437J86009J01995Q2127
4254A6058393J09750J18037J44089N5492q5498k26512l07413l23514k93611k64669
$$ plain form
4244 14984544 14724049 14463010 14185834 13900866 13662700 13466506 13289674 13101639 12803460
4235 12803460 12356291 11814666 11203627 10591023 10020334 9477832 8967107 8492861 8050988
4226 8050988 7665875 7329404 7045207 6778992 6509819 6215721 5861747 5476843 5073351 4682674
4216 4682674 4318355 3985117 3672823 3387901 3160326 2965100 2777824 2648757 2510423 2384680
4206 2384680 2257413 2155626 2028017 1907418 1821082 1727461 1628359 1540296 1481314 1414697 1354767
4195 1354767 1314893 1271934 1261174 1222892 1212968 1206191 1157073 1134626 1097605 1059328 1012169 991948
4183 991948 964807 950601 927228 915857 910460 875656 852953 826911 797052 780982 764843 720460
4171 720460 697985 694041 684614 664042 625545 602345 598523 590829 555399 535672 534177 522723 510501
$$ packed form
4244A4984544k60495k61039k77176k84968k38166j96194j76832j88035k98179
4235A2803460m47169n41625o11039o12604n70689n42502n10725m74246m41873
4226H050988l85113l36471k84197k66215k69173k94098l53974l84904m03492l90677
4216D682674l64319l33238l12294k84922k27575j95226j87276j29067j38334j25743
4206B384680j27267j01787j27609j20599q6336r3621r9102q8063n8982o6617n9930
4195A354767l9874m2959j0760l8282r924o777m9118k2447l7021l8277m7159k0221
4183I91948k7141j4206k3373j1371n397l4804k2703k6042k9859j6070j6139m4383
4171G20460k2475l944r427k0572l8497k3200l822p694l5430j9727j495j1454j2222
$$ plain form
4158 510501 492922 473029 462611 446913 444484 439887 431160 445211 451691 445390 427937 415102 407367
4145 407367 412423 403678 405321 405860 403497 391528 391397 385346 364297 358837 360749 364445 361195 368051
4131 368051 356393 351550 355666 340710 347977 357121 359105 339423 347657 363848 371909 371266 361282 356840
4117 356840 366995 380046 381985 404256 414899 403114 422438 411899 398717 411510 414157 412151
4105 412151 404413 405847 386370 367380 365165 373510 368941 386654 377384 365752 365111 372426 366893 353940
4091 353940 346771 357767 347608 326489 317786 311646 314687 305951 299972 292455 303495 302091 272683
4078 272683 279471 268185 255621 258995 271311 268476 266032 271570 268131 242053 243420 243531 261168
4065 261168 267252 244400 245929 252550 252373 247924 247722 244340 243547 228215 231771 231288 237878 244555 247155
$$ packed form
4158E10501j7579j9893j0418j5698k429m597q727J4051O480o301j7453j2835p735
4145D07367N056q745J643N39k363j1969j31o051k1049n460J912L696l250O856
4131C68051j1658m843M116j4956P267R144J984j9682Q234J6191Q061o43r984m442
4117C56840J0155J3051J939K2271J0643j1785J9324j0539j3182J2793K647k006
4105D12151p738J434j9477j8990k215Q345m569J7713r270j1632o41P315n533j2953
4091C53940p169J0996j0159k1119q703o140L041q736n979p517J1040j404k9408
4078B72683O788j1286j2564L374J2316k835k444N538l439k6078J367J11J7637
4065B61168O084k2852J529O621j77m449k02l382p93j5332L556m83O590O677K600
$$ plain form
4050 247155 230933 233553 226499 223890 235539 232752 246622 223103 219288 225238 229933 214246 210512
4037 210512 227907 232910 240785 240015 238322 226951 232117 228840 222644 240333 250835 253481 237119
4024 237119 241123 243474 246782 260562 252471 263624 255323 276335 269990 255851 257958 257239 249254 263366
4010 263366 285503 284117 304343 312673 309364 305551 315953 315165 316396 339131 344313 335177 344210 361490
3996 361490 345764 360704 342885 334212 344407 353516 340197 343232 337754 347823 353949 360878 367733
3983 367733 348145 347143 358574 369287 365364 381072 380622 383759 385463 399663 390432 395870 414670
3970 414670 409645 437747 478501 499339 489266 497828 506998 505067 502770 510403 528049 527829 532439
3957 532439 543046 564432 588566 611010 621892 644824 650866 652579 666176 676694 672922 682840
$$ packed form
4050B47155j6222K620p054k609J1649k787J3870k3519l815N950M695j5687l734
4037B10512J7395N003P875p70j693j1371N166l277o196J7689J0502K646j6362
4024B37119M004K351L308J3780q091J1153q301K1012o345j4139K107p19p985J4112
4010B63366K2137j386K0226Q330l309l813J0402p88J231K2735N182r136R033J7280
3996C61490j5726J4940j7819q673J0195R109j3319L035n478J0069O126O929O855
3983C67733j9588j002J1431J0713l923J5708m50L137J704J4200r231N438J8800
3970D14670n025K8102M0754K0838j0073Q562R170j931k297P633J7646k20M610
3957E32439J0607K1386K4134K2444J0882K2932O042J713J3597J0518l772R918
$$ plain form
3945 682840 682559 681437 691167 697314 712960 717852 709655 702419 712690 737025 734517 729714 725023 718424
3931 718424 715345 702555 688751 704605 703222 698364 713843 719417 726428 741022 753540 745408 750717
3918 750717 770074 778021 776784 774295 784900 808234 826619 827505 836134 853556 873728 873592 878927
3905 878927 890870 904282 912358 896976 894824 890934 875918 895315 910176 900422 908838 909891 923507
3892 923507 924471 928681 954016 976280 982134 983321 998335 1021543 1059643 1084973 1105282 1132668 1163868
3879 1163868 1205872 1226425 1221271 1238154 1256854 1264944 1271450 1290432 1336053 1366569 1376667 1389899
3867 1389899 1417457 1459204 1481694 1514396 1552285 1593143 1624118 1661640 1704644 1754599 1799943
3856 1799943 1848983 1894795 1936323 1997330 2061223 2145638 2248127 2355099 2461493 2591554 2728524
$$ packed form
3945F82840k81j122R730O147J5646M892q197p236J0271K4335k508m803m691o599
3931G18424l079j2790j3804J5854j383m858J5479N574P011J4594J2518q132N309
3918G50717J9357P947j237k489J0605K3334J8385Q86Q629J7422K0172j36N335
3905H78927J1943J3412Q076j5382k152l890j5016J9397J4861r754Q416J053J3616
3892I23507R64M210K5335K2264N854J187J5014K3208L8100K5330K0309K7386L1200
3879A163868M2004K0553n154J6883J8700Q090O506J8982M5621L0516J0098J3232
3867A389899K7558M1747K2490L2702L7889M0858L0975L7522M3004M9955M5344
3856A799943M9040M5812M1528O1007O3893Q4415J02489J06972J06394J30061J36970
$$ plain form
3845 2728524 2896943 3099670 3326572 3569382 3871831 4219656 4618090 5107528 5723000 6498042
3835 6498042 7429237 8544820 9809364 11220280 12763312 14387938 16000041 17541812
3827 17541812 18979360 20215422 21204246 21930825 22381132 22562043 22540913 22386038 22171180
3818 22171180 21930986 21746814 21649354 21635828 21715448 21836070 21944963 22006751 21931572 21658731
3808 21658731 21181675 20477671 19529183 18387229 17062558 15613291 14109864 12612887 11175845
3799 11175845 9844373 8669874 7632381 6746120 5993568 5345421 4794692 4337429 3972957
3790 3972957 3679953 3424751 3208061 3010195 2846010 2719467 2611403 2532307 2441101 2384517
3780 2384517 2335055 2293038 2273440 2268791 2260540 2265303 2259372 2272327 2306563 2312360 2307113 2326707 2342114
$$ packed form
3845B728524J68419K02727K26902K42810L02449L47825L98434M89438O15472P75042
3835F498042R31195J115583J264544J410916J543032J624626J612103J541771
3827A7541812J437548J236062R88824P26579M50307J80911k1130j54875k14858
3818B2171180k40194j84172r7460j3526P9620J20622J08893O1788p5179k72841
3808B1658731m77056p04004r48488j141954j324671j449267j503427j496977j437042
3799A1175845j331472j174499j037493q86261p52552o48147n50729m57263l64472
3790C972957k93004k55202k16690j97866j64185j26543j08064p9096r1206n6584
3780B384517m9462m2017j9598m649q251M763n931J2955L4236N797n247J9594J5407
$$ plain form
3767 2342114 2359514 2373322 2370367 2387097 2398062 2420228 2424423 2438562 2465874 2486330 2493564 2528927
3755 2528927 2543345 2538085 2534406 2509864 2491691 2477937 2471294 2449354 2416228 2387169 2355981 2347104
3743 2347104 2339951 2317083 2317947 2327938 2349990 2352080 2347389 2356758 2364647 2373579 2327582 2304021 2275967
3730 2275967 2263313 2256194 2244661 2250423 2253650 2257102 2275503 2276615 2266547 2282054 2316654 2329210
3718 2329210 2336111 2332187 2339760 2376482 2414729 2430719 2466264 2506497 2537673 2565839 2603085 2649379
3706 2649379 2682666 2761022 2845709 2925322 2988586 3052204 3135171 3234426 3325373 3449426 3583381
3695 3583381 3705659 3874317 4067018 4290696 4558916 4847932 5181748 5571240 6037923 6535906
3685 6535906 7101012 7734561 8430781 9190234 9974331 10764806 11531618 12262046 13008865 13772439
$$ packed form
3767B342114J7400J3808k955J6730J0965K2166M195J4139K7312K0456P234L5363
3755B528927J4418n260l679k4542j8173j3754o643k1940l3126k9059l1188q877
3743B347104p153k2868Q64R991K2052K090m691R369P889Q932m5997k3561k8054
3730B275967j2654p119j1533N762L227L452J8401J112j0068J5507L4600J2556
3718B329210O901l924P573L6722L8247J5990L5545M0233L1176K8166L7246M6294
3706B649379L3287P8356Q4687P9613O3264O3618Q2967R9255R0947J24053J33955
3695C583381J22278J68658J92701K23678K68220K89016L33816L89492M66683M97983
3685F535906N65106O33549O96220P59453P84097P90475P66812P30428P46819P63574
$$ plain form
3675 13772439 14601348 15536151 16559844 17677753 18916915 20249328 21610711 22966526
3667 22966526 24230896 25344065 26213023 26800365 27079965 27077978 26836513 26442974 25999626
3658 25999626 25601098 25361079 25279945 25391829 25671527 26011296 26390440 26679532 26785863 26631902
3648 26631902 26225039 25512362 24521676 23305815 21958530 20555663 19189013 17935431 16858511
3639 16858511 16024118 15488406 15289546 15431334 15961899 16853155 18073068 19564144 21255177
3630 21255177 23039179 24838073 26558331 28107865 29467212 30622334 31492791 32000072
3622 32000072 32051135 31639524 30772137 29570375 28115770 26524737 24854584 23158355 21481523
3613 21481523 19930518 18563663 17395218 16476077 15817741 15409461 15275998 15384705 15732102
$$ packed form
3675A3772439Q28909R34803J023693J117909J239162J332413J361383J355815
3667B2966526J264370J113169Q68958N87342K79600j987k41465l93539m43348
3658B5999626l98528k40019q1134J11884K79698L39769L79144K89092J06331j53961
3648B6631902m06863p12677r90686j215861j347285j402867j366650j253582j076920
3639A6858511q34393n35712j98860J41788N30565Q91256J219913J491076J691033
3630B1255177J784002J798894J720258J549534J359347J155122Q70457N07281
3622C2000072N1063m11611q67387j201762j454605j591033j670153j696229j676832
3613B1481523j551005j366855j168445r19141o58336m08280j33463J08707L47397
$$ plain form
3604 15732102 16319193 17112988 18052233 19154057 20363737 21667912 23027450 24343696 25577645
3595 25577645 26667135 27587785 28273281 28700609 28812023 28638640 28166191 27392987 26359626
3586 26359626 25119094 23728275 22226847 20678225 19100513 17555728 16103873 14746701
3578 14746701 13497813 12370486 11362867 10478203 9733428 9112866 8596445 8151779 7780385
3569 7780385 7469578 7208383 6981526 6821615 6707960 6616057 6550691 6530693 6514898 6526352
3559 6526352 6555968 6593025 6663501 6756996 6883808 7043162 7229852 7453478 7728445 8044491
3549 8044491 8397905 8810599 9264464 9754595 10278951 10800428 11299265 11768323 12192321 12586924
3539 12586924 12924474 13200256 13377992 13525176 13628266 13712087 13781607 13822646 13860546 13915140
$$ packed form
3604A5732102N87091P93795R39245J101824J209680J304175J359538J316246J233949
3595B5577645J089490R20650O85496M27328J11414j73383m72449p73204j033361
3586B6359626j240532j390819j501428j548622j577712j544785j451855j357172
3578A4746701j248888j127327j007619q84664p44775o20562n16421m44666l71394
3569G780385l10807k61195k26857j59911j13655r1903o5366j9998j5795J1454
3559F526352K9616L7057P0476R3495J26812J59354J86690K23626K74967L16046
3549H044491L53414M12694M53865M90131N24356N21477M98837M69058M23998L94603
3539A2586924L37550K75782J77736J47184J03090Q3821O9520M1039L7900N4594
$$ plain form
3529 13915140 14040376 14177933 14328766 14474184 14599056 14668076 14684211 14626140 14545123 14427601
3519 14427601 14267757 14032313 13760260 13481180 13201187 12955084 12730946 12567670 12489776 12476040
3509 12476040 12535993 12671485 12864379 13133004 13468597 13908895 14412271 15009352 15729431 16570148
3499 16570148 17582770 18798688 20255859 22003907 24170401 26808456 30004142 33730747
3491 33730747 37940138 42518587 47318556 52223840 57094874 61772829 66152922 70187570
3483 70187570 73855718 77275592 80596049 84063892 87906589 92194400 96934597 101935395
3475 101935395 106952360 111682857 115922378 119551539 122432617 124432112 125417709 125275337
3467 125275337 124021434 121852694 118994033 115739488 112262046 108663215 104968564 101193515
$$ packed form
3529A3915140J25236J37557J50833J45418J24872O9020J6135n8071q1017j17522
3519A4427601j59844k35444k72053k79080k79993k46103k24138j63276p7894j3736
3509A2476040N9953J35492J92894K68625L35593M40298N03376N97081P20079Q40717
3499A6570148J012622J215918J457171J748048K166494K638055L195686L726605
3491C3730747M209391M578449M799969M905284M871034M677955M380093M034648
3483G0187570L668148L419874L320457L467843L842697M287811M740197N000798
3475A01935395N016965M730497M239521L629161K881078J999495R85597j42372
3467A25275337j253903k168740k858661l254545l477442l598831l694651l775049
$$ plain form
3459 101193515 97375706 93550036 89686467 85824969 82006279 78142868 74267793 70360772
3451 70360772 66418371 62486353 58513159 54539093 50614484 46759466 43008622 39426394
3443 39426394 36016024 32821291 29901716 27262393 24902548 22826762 20994180 19410184
3435 19410184 18040771 16884437 15904395 15069470 14334392 13709840 13217687 12764375 12374842
3426 12374842 12036019 11754952 11518285 11320094 11166290 11049310 10977834 10902169 10824290 10722072
3416 10722072 10655559 10572286 10496245 10415310 10368447 10328234 10301541 10325331 10360747 10443068 10563731
3405 10563731 10719351 10875161 11024940 11166747 11295785 11361281 11412562 11380465 11260749 11082085
3395 11082085 10849571 10554525 10248166 9909182 9538360 9179428 8807153 8464910 8178629
$$ packed form
3459A01193515l817809l825670l863569l861498l818690l863411l875075l907021
3451G0360772l942401l932018l973194l974066l924609l855018l750844l582228
3443C9426394l410370l194733k919575k639323k359845k075786j832582j583996
3435A9410184j369413j156334r80042q34925p35078o24552m92153m53312l89533
3426A2374842l38823k81067k36667j98191j53804j16980p1476p5665p7879j02218
3416A0722072o6513q3273p6041q0935m6863m0213k6693K3790L5416Q2321J20663
3405A0563731J55620J55810J49779J41807J29038O5496N1281l2097j19716j78664
3395A1082085k32514k95046l06359l38984l70822l58932l72275l42243k86281
$$ plain form
3386 8178629 7943104 7772444 7645429 7525400 7434043 7343782 7274391 7231530 7196248 7162563 7163848
3375 7163848 7173511 7168442 7165382 7146061 7129765 7072964 7033999 6986122 6950486 6932324 6909416 6893515
3363 6893515 6873722 6848787 6862898 6920423 7000025 7079212 7130702 7161083 7125826 7022566 6889194
3352 6889194 6733888 6566690 6398342 6250408 6130919 6032015 5978460 5988959 6014366 6063118
3342 6063118 6156467 6272641 6424143 6639817 6868486 7154841 7499372 7941845 8494671 9161630
3332 9161630 9991935 10991122 12175216 13486633 14887414 16329571 17818023 19364647 21051504
3323 21051504 22902291 24857557 26881498 28916107 30906445 32855693 34674512 36363648
3315 36363648 37928813 39379903 40742082 42091863 43401499 44538008 45457644 46035711
$$ packed form
3386H178629k35525j70660j27015j20029r1357r0261o9391m2861l5282l3685J285
3375G163848R663n069l060j9321j6296n6801l8965m7877l5636j8162k2908j5901
3363F893515j9793k4935J4111N7525P9602P9187N1490L0381l5257j03260j33372
3352F889194j55306j67198j68348j47934j19489r8904n3555J0499K5407M8752
3342F063118R3349J16174J51502K15674K28669K86355L44531M42473N52826O66959
3332I161630Q30305R99187J184094J311417J400781J442157J488452J546624J686857
3323B1051504J850787J955266K023941K034609J990338J949248J818819J689136
3315C6363648J565165J451090J362179J349781J309636J136509R19636N78067
$$ plain form
3307 46035711 46193398 45971662 45416241 44558256 43429566 42018877 40385221 38571456 36626171
3298 36626171 34554726 32436985 30276979 28070204 25872033 23658232 21509383 19417578
3290 19417578 17436748 15590677 13907778 12393391 11043838 9873400 8870316 8000667
3282 8000667 7274931 6652699 6126543 5694961 5340409 5028337 4774452 4564349 4365417 4202629
3272 4202629 4047221 3930738 3822889 3744395 3681172 3613840 3566388 3540257 3532301 3551675 3588328
3261 3588328 3641146 3713768 3808515 3904859 3997765 4107914 4216427 4325382 4389391 4459488 4532409
3250 4532409 4555018 4563986 4540278 4494370 4427011 4361176 4281861 4191371 4110298 4024355 3910831
3239 3910831 3787916 3661501 3509453 3349431 3177926 3024311 2881166 2722343 2574196 2466753
$$ packed form
3307D6035711J57687k21736n55421q57985j128690j410689j633656j813765j945285
3298C6626171k071445k117741k160006k206775k198171k213801k148849k091805
3290A9417578j980830j846071j682899j514387j349553j170438j003084q69649
3282H000667p25736o22232n26156m31582l54552l12072k53885k10103j98932j62788
3272D202629j55408j16483j07849p8494o3223o7332m7452k6131p956J9374L6653
3261C588328N2818P2622R4747R6344R2906J10149J08513J08955O4009P0097P2921
3250D532409K2609Q968k3708m5908o7359o5835p9315r0490q1073q5943j13524
3239C910831j22915j26415j52048j60022j71505j53615j43145j58823j48147j07443
$$ plain form
3229 2466753 2373141 2286359 2204990 2139927 2086608 2064589 2050603 2034108 1996067 1987632 1976364 1976723
3217 1976723 1949680 1936317 1947075 1946503 1949056 1947646 1944763 1921780 1912339 1915401 1931407 1961968 1983218
3204 1983218 2011320 2071501 2128153 2164966 2184168 2218632 2218465 2236947 2260610 2286672 2313457 2365722
3192 2365722 2410243 2450490 2476568 2542815 2581176 2634617 2692802 2721417 2760526 2785571 2796349
3181 2796349 2813178 2832664 2849293 2854481 2883177 2913388 2938423 2982477 3008597 3045694 3078035 3119356
3169 3119356 3154357 3192833 3257773 3298381 3357618 3408120 3448211 3489731 3528623 3552168 3564131
3158 3564131 3585041 3570341 3591204 3601267 3603381 3639477 3683795 3724307 3772201 3825604 3920995 4021863
3146 4021863 4086105 4134050 4157277 4183980 4181555 4170278 4165415 4174949 4198741 4234109 4312574 4398847
$$ packed form
3229B466753r3612q6782q1369o5063n3319k2019j3986j6495l8041q435j1268L59
3217A976723k7043j3363J0758n72K553j410k883k2983r441L062J6006L0561K1250
3204A983218K8102O0181N6652L6813J9202L4464j67J8482K3663K6062K6785N2265
3192B365722M4521M0247K6078O6247L8361N3441N8185K8615L9109K5045J0778
3181B796349J6829J9486J6629N188K8696L0211K5035M4054K6120L7097L2341M1321
3169C119356L5001L8476O4940M0608N9237N0502M0091M1520L8892K3545J1963
3158C564131K0910j4700K0863J0063K114L6096M4318M0512M7894N3403R5391J00868
3146D021863O4242M7945K3227K6703k425j1277m863R534K3792L5368P8465Q6273
$$ plain form
3134 4398847 4501047 4615146 4738223 4871345 4999314 5115329 5204131 5294266 5373063 5456728
3124 5456728 5566441 5691437 5828921 5987076 6205593 6465442 6779170 7117721 7501983 7912330
3114 7912330 8357024 8806192 9266956 9694450 10118401 10520102 10887363 11250763 11637272 12037736
3104 12037736 12461596 12933389 13473023 14089452 14769478 15585862 16529698 17584184 18799140
3095 18799140 20174452 21748099 23587581 25752406 28386192 31606227 35447964 39964811
3087 39964811 45228187 51410689 58825196 68124983 80387752 97095253 119945789 149894005
3079 149894005 185599443 223110466 256260851 279177830 288683167 284458576 269188286
3072 269188286 247197730 221331205 193372438 165368673 138853343 115146695 95202228
$$ packed form
3134D398847J02200J14099J23077J33122J27969J16015Q8802R0135P8797Q3665
3124E456728J09713J24996J37484J58155K18517K59849L13728L38551L84262M10347
3114G912330M44694M49168M60764M27494M23951M01701L67261L63400L86509M00464
3104A2037736M23860M71793N39634O16429O80026Q16384R43836J054486J214956
3095A8799140J375312J573647J839482K164825K633786L220035L841737M516847
3087C9964811N263376O182502P414507R299787J2262769J6707501K2850536K9948216
3079A49894005L5705438L7511023L3150385K2916979R505337m224591j5270290
3072B69188286k1990556k5866525k7958767k8003765k6515330k3706648j9944467
$$ plain form
3065 95202228 79235188 66875574 57365442 49896378 43834492 38679999 34269875 30473381
3057 30473381 27226172 24454670 22127960 20144494 18465609 17021469 15768373 14693859
3049 14693859 13734730 12862975 12066500 11361073 10719178 10133504 9626403 9160351 8747101
3040 8747101 8375636 8074571 7821224 7601703 7435092 7334932 7208497 7091502 7015151 6931913
3030 6931913 6846283 6758556 6638925 6508650 6322512 6136894 5947428 5743052 5542630 5333696
3020 5333696 5131962 4968611 4821334 4670404 4546902 4418723 4303236 4185049 4048168 3884217
3010 3884217 3729173 3559901 3408074 3262168 3121204 2989493 2887322 2764411 2665343 2586124
3000 2586124 2511188 2460007 2396247 2340035 2277398 2224266 2160782 2096859 2032322 1961991 1901314
$$ packed form
3065I5202228j5967040j2359614r510132p469064o061886n154493m410124l796494
3057C0473381l247209k771502k326710j983466j678885j444140j253096j074514
3049A4693859r59129q71755p96475p05427o41895n85674n07101m66052m13250
3040H747101l71465l01065k53347k19521j66611j00160j26435j16995p6351q3238
3030F931913q5630q7727j19631j30275j86138j85618j89466k04376k00422k08934
3020E333696k01734j63351j47277j50930j23502j28179j15487j18187j36881j63951
3010C884217j55044j69272j51827j45906j40964j31711j02171j22911r9068p9219
3000B586124p4936n1181o3760n6212o2637n3132o3484o3923o4537p0331o0677
$$ plain form
2989 1901314 1847418 1798472 1743940 1693102 1664849 1637651 1601501 1558477 1526108 1506833 1493065
2978 1493065 1486704 1472472 1475652 1487436 1477193 1455129 1455798 1440289 1422611 1394097 1367586 1329022
2966 1329022 1314966 1291598 1259614 1242808 1247920 1236229 1231074 1227594 1229326 1237184 1221284 1188446
2954 1188446 1158727 1121989 1080476 1061239 1040596 1033827 1040132 1018457 988740 976688 957520 942813
2942 942813 901663 875582 861169 840601 821469 790824 768547 739968 721700 692702 686366 675751
2930 675751 687115 669682 658201 666021 638235 638852 650804 653558 662632 669908 665961 651657 641114
2917 641114 628526 601479 595837 580820 560730 532858 524224 539609 568774 554930 540613 555382
2905 555382 553472 536201 519976 498957 486664 455018 424077 410003 392674 370792 361981 352919
$$ packed form
2989A901314n3896m8946n4532n0838k8253k7198l6150m3024l2369j9275j3768
2978A493065o361j4232L180J1784j0243k2064O69j5509j7678k8514k6511l8564
2966A329022j4056k3368l1984j6806N112j1691n155l480J732P858j5900l2838
2954A188446k9719l6738m1513j9237k0643o769O305k1675k9717j2052j9168j4707
2942I42813m1150k6081j4413k0568j9132l0645k2277k8579j8268k8998o336j0615
2930F75751J1364j7433j1481P820k7786O17J1952K754R074P276l947j4304j0543
2917F41114j2588k7047n642j5017k0090k7872q634J5385K9165j3844j4317J4769
2905E55382j910j7271j6225k1019j2293l1646l0941j4074j7329k1882q811r062
$$ plain form
2893 352919 342654 355922 360716 360171 370485 378291 371903 355564 366696 352951 346556 339271 332499
2880 332499 309172 299463 292059 296471 298814 283651 305777 317765 321758 338007 342807 354567 351987
2867 351987 327861 335076 316371 298594 281471 290538 273628 251132 255624 257167 249426 245762 245856
2854 245856 240278 245113 255708 252162 252868 249142 230177 220424 206797 209970 225396 234021 233163 229617
2840 229617 233990 238082 229582 232442 249447 249589 240459 230122 228906 225165 218651 209339 217910 236364
2826 236364 227003 223805 215019 215178 214011 199341 183768 168136 170975 181089 189278 204454 196672
2813 196672 214850 233570 251883 260741 271406 275071 277763 283657 310754 345866 366458 414592
2801 414592 452605 500263 597046 706022 851844 1014166 1195056 1367870 1520235 1606879
$$ packed form
2893C52919j0265J3268M794n45J0314P806o388j6339J1132j3745o395p285o772
2880C32499k3327r709p404M412K343j5163K2126J1988L993J6249M800J1760k580
2867C51987k4126P215j8705j7777j7123R067j6910k2496M492J543p741l664R4
2854B45856n578M835J0595l546P06l726j8965r753j3627L173J5426Q625q58l546
2840B29617M373M092q500K860J7005J42r130j0337j216l741o514r312Q571J8454
2826B36364r361l198q786J59j167j4670j5573j5632K839J0114Q189J5176p782
2813A96672J8178J8720J8313Q858J0665L665K692N894K7097L5112K0592M8134
2801D14592L8013M7658R6783J08976J45822J62322J80890J72814J52365Q6644
$$ plain form
2791 1606879 1600741 1547985 1451898 1315224 1172825 1031789 874454 731964 620690 527376
2781 527376 458263 394535 352503 335271 288579 290278 279538 264379 259455 252853 233272 222684
2769 222684 217362 204136 181384 181620 199150 201961 196025 195667 185497 181726 171227 187680 193868
2756 193868 149665 123140 124586 144841 150672 143204 144417 128957 124297 129980 131145 126491 120357
2743 120357 131292 131576 114282 99825 74916 83821 93617 93007 114451 124336 92738 78841 70447
2730 70447 66567 66823 78080 82155 74595 55545 56330 56445 68741 51496 58374 86313 81029 78536
2716 78536 69064 67511 75573 72165 61500 57903 56445 57090 69839 57850 50954 61413 46833 61870
2702 61870 57768 75273 60007 52303 42522 31482 28248 32258 26813 18622 21822 10248 20679
$$ packed form
2791A606879o138n2756r6087j36674j42399j41036j57335j42490j11274r3314
2781E27376o9113o3728m2032j7232m6692J699j0740j5159m924o602j9581j0588
2769B22684n322j3226k2752K36J7530K811n936l58j0170l771j0499J6453O188
2756A93868m4203k6525J446K0255N831p468J213j5460m660N683J165m654o134
2743A20357J0935K84j7294j4457k4909Q905R796o10K1444R885l1598j3897q394
2730G0447l880K56J1257M075p560j9050P85J15J2296j7245O878K7939n284k493
2716G8536r472j553Q062l408j0665l597j458O45J2749j1989o896J0459j4580J5037
2702F1870m102J7505j5266p704r781j1040l234M010n445q191L200j1574J0431
$$ plain form
2689 20679 53122 44361 32216 22695 33256 35252 36637 40626 38776 37168 44286 53963 55237 36183
2675 36183 31126 29954 28815 15921 31675 26853 35121 49009 51137 50453 34094 43363 39077 27270
2661 27270 45188 35991 18571 18734 20436 17386 29265 43760 34146 35242 28819 13566 8889 2932
2647 2932 -3266 -5505 -1636 -8830 -17348 6339 23172 20403 8625 -357 11368 9335 -12573 -7887
2633 -7887 -12340 8310 4403 -9160 -18882 -66 3017 13973 35944 28916 7628 4599 5960
2620 5960 22037 9816 -2208 5011 9725 11213 -2587 -965 1058 7921 7635 -2270 478 5399
2606 5399 16928 11446 15859 28756 31659 25038 23729 24807 21978 10915 4685 12273 17270 28597
2592 28597 26320 21978 13667 13620 7897 2481 2135 19185 32989 32443 26765 19717 27302 34533 45436
$$ packed form
2689B0679L2443q761j2145r521J0561J996J385L989j850j608P118R677J274j9054
2675C6183n057j172j139j2894J5754m822Q268J3888K128o84j6359R269m286j1807
2661B7270J7918r197j7420J63J702l050J1879J4495r614J096o423j5253m677n957
2647B932o198k239L869p194q518K3687J6833k769j1778q982J1725k033k1908M686
2633g887m453K0650l907j3563r722J8816L083J0956K1971p028k1288l029J361
2620E960J6077j2221j2024P219M714J488j3800J622K023O863k86r905K748M921
2606E399J1529n482M413J2897K903o621j309J078k829j1063o230P588M997J1327
2592B8597k277m342q311m7n723n416l46J7050J3804n46n678p048P585P231J0903
$$ plain form
2577 45436 74391 76548 52673 57681 62271 58628 58693 37192 25550 11559 5446 -2081 18754 17811
2563 17811 14889 18626 12978 22721 -2487 -4623 13304 22810 15796 17538 14648 4755 -6349 -24751
2549 -24751 -29479 -15522 1148 19265 -3299 -17456 -29645 -30259 -21452 -24008 -10592 5263 -18715
2536 -18715 -19289 -9165 -12066 -7790 -7083 11937 2465 -232 6526 15559 26682 22123 -11084 -1745
2522 -1745 -8803 -4831 3888 -8372 -2082 2309 -3773 -10237 -1143 11719 22118 23600 29161 25354
2508 25354 9255 10515 6922 8425 10908 4604 16127 9950 14060 13808 15469 469 11969 2963
2494 2963 -6887 5823 8294 32850 22824 -1933 949 666 11119 13198 -5553 -14374 -13088 2926
2480 2926 -7338 -8397 -11703 -6374 7046 3225 10467 -108 -3108 7743 -6564 3601 9075
$$ packed form
2577D5436K8955K157k3875N008M590l643O5k1501j1642j3991o113p527K0835r43
2563A7811k922L737n648R743k5208k136J7927R506p014J742k890r893j1104j8402
2549b4751m728J3957J6670J8117k2564j4157j2189o14Q807k556J3416J5855k3978
2536a8715n74J0124k901M276P07J9020r472k697O758R033J1123m559l3207R339
2522a745p058L972Q719j2260O290M391o082o464R094J2862J0399J482N561l807
2508B5354j6099J260l593J503K483o304J1523o177M110k52J661j5000J1500r006
2494B963r850J2710K471K4556j0026k4757K882k83J0453K079j8751q821J286J6014
2480B926j0264j059l306N329J3420l821P242j0575l000J0851j4307J0165N474
$$ plain form
2467 9075 7234 9871 4572 -5141 -1122 -11217 -17164 -27697 -36039 -24914 -26841 -30028 -8278 8574
2453 8574 11572 1808 4719 -1143 -719 -6845 -6007 1472 -9118 5517 12024 -2459 -8703 17122
2439 17122 28203 24094 11184 1038 620 3224 16470 25522 20019 25581 26437 23949 19349 29871
2425 29871 29590 22309 34892 23465 26382 32519 10852 6741 3316 21575 29721 25458 35951 17337
2411 17337 20229 31622 42197 56714 58120 47496 49746 47918 29863 38324 48532 51880 42792
2398 42792 31846 34237 48211 46985 36610 45511 64739 68846 61128 40242 45890 70799 62796
2385 62796 61938 75384 71146 69886 74914 71807 66216 81404 77583 67175 70321 68388 63170 68020
2371 68020 56989 45450 39259 45411 61689 65661 65911 81556 92159 94453 98239 104371 96088 94171
$$ packed form
2467I075j841K637n299r713M019j0095n947j0533q342J1125j927l187K1750J6852
2453H574K998r764K911n862M24o126Q38P479j0590J4635O507j4483o244K5825
2439A7122J1081m109j2910j0146m18K604J3246R052n503N562Q56k488m600J0522
2425B9871k81p281J2583j1427K917O137k1667m111l425J8259Q146m263J0493j8614
2411A7337K892J1393J0575J4517J406j0624K250j828j8055Q461J0208L348r088
2398D2792j0946K391J3974j226j0375Q901J9228M107p718k0886N648K4909q003
2385F2796q58J3446m238j260N028l107n591J5188l821j0408L146j933n218M850
2371F8020j1031j1539o191O152J6278L972K50J5645J0603K294L786O132q283j917
$$ plain form
2357 94171 99904 90095 89158 105420 120540 134007 147167 156717 165447 183417 201336 212273 213581
2344 213581 209608 231625 228325 244574 255804 269911 268114 271346 288925 314005 341436 353930
2332 353930 356225 382127 425793 467239 529785 612193 688166 789884 879409 955366 1026808 1104839
2320 1104839 1212296 1317584 1465883 1669328 1977102 2388235 3032260 4016570 5667190
2311 5667190 7893424 10144279 11658296 11638557 10721583 9931076 8904761 7651303 6508697
2302 6508697 5292946 4199998 3271163 2544699 2046498 1768190 1610025 1482442 1366390
2293 1366390 1241110 1117561 998169 897326 796934 715562 654721 582340 526729 481940
2283 481940 449413 419276 393124 365796 344652 317438 301321 287298 272286 281422 266195 251119
$$ packed form
2357I4171N733r809r37J6262J5120J3467J3160R550Q730J7970J7919J0937J308
2344B13581l973K2017l300J6249J1230J4107j797L232J7579K5080K7431J2494
2332C53930K295K5902M3666M1446O2546Q2408P5973J01718Q9525P5957P1442P8031
2320A104839J07457J05288J48299K03445L07774M11133O44025R84310J650620
2311E667190K226234K250855J514017j9739r16974p90507j026315j253458j142606
2302F508697j215751j092948r28835p26464m98201k78308j58165j27583j16052
2293A366390j25280j23549j19392j00843j00392q1372o0841p2381n5611m4789
2283D81940l2527l0137k6152k7328k1144k7214j6117j4023j5012R136j5227j5076
$$ plain form
2271 251119 246517 242295 234313 235272 228961 211408 226799 226200 225783 238017 231367 215589 199181 199278
2257 199278 199359 197859 174607 161677 157633 161058 156636 161172 146961 137315 135112 140245 127925 114185
2243 114185 110971 102736 82605 77187 87078 87284 70156 73845 71546 84905 81641 78948 75981 81870
2229 81870 90450 84070 79821 66735 65357 53014 42351 44584 56925 42072 40128 42656 40470
2216 40470 36600 41321 45490 43142 40595 38118 20159 32779 43727 40027 28098 17193 36370
2203 36370 45286 35454 44960 51887 50649 51604 53120 36807 30015 23065 24214 20908 21864 32424 26255
2188 26255 25795 29273 35637 25609 14295 22789 26201 42569 35775 39288 43370 19404 15872 7970
2174 7970 2351 11524 11711 19923 24199 16524 12257 3533 20610 13753 -4755 3382 -419 1089 -13557
$$ packed form
2271B51119m602m222p982R59o311j7553J5391n99m17J2234o650j5778j6408R7
2257A99278Q1j500k3252j2930m044L425m422M536j4211r646k203N133j2320j3740
2243A14185l214q235k0131n418R891K06j7128L689k299J3359l264k693k967N889
2229H1870Q580o380m249j3086j378j2343j0663K233J2341j4853j944K528k186
2216D0470l870M721M169k348k547k477j7959J2620J0948l700j1929j0905J9177
2203C6370Q916r832R506O927j238R55J516j6313o792o950J149l306R56J0560o169
2188B6255m60L478O364j0028j1314Q494L412J6368o794L513M082k3966l532p902
2174G970n619R173J87Q212M276p675m267q724J7077o857j8508Q137l801J508j4646
$$ plain form
2159 -13557 -17423 17665 23459 12326 10190 6740 13859 16759 18465 10294 12065 21736 18599 23315
2145 23315 -2943 -20263 -11292 9486 9733 16119 10109 3501 -3646 -7221 -11943 3510 5532 -7633
2131 -7633 1308 -7096 -13216 -17571 -10261 -9964 -7235 -7066 -10041 -5885 13887 615 -7632 -4704 -8278
2116 -8278 -11770 418 5276 -8890 -12006 -8656 2646 17805 1155 -5140 -12926 -27162 -23511
2103 -23511 -14543 -9127 -5821 -7125 4969 11158 10270 3615 -12867 1639 -12098 -16072 -5777 -8551
2089 -8551 -22383 -17770 -15614 -9012 -17849 -9556 -15790 -24425 -10706 -66 5077 20782 8864 -5954
2075 -5954 1144 -7140 -16623 -10105 699 -8998 2077 -3897 13172 20438 6946 -8970 -22819
2062 -22819 -10872 -24511 -20858 -16956 -17482 2549 16416 7243 -15366 -6083 -5185 -5450 -2075 -9820
$$ packed form
2159a3557l866L5088N794j1133k136l450P119K900J706q171J771R671l137M716
2145B3315k6258j7320Q971K0778K47O386o010o608p147l575m722J5453K022j3165
2131g633Q941q404o120m355P310K97K729J69k975M156J9772j3272q247K928l574
2116h278l492J2188M858j4166l116L350J1302J5159j6650o295p786j4236L651
2103b3511Q968N416L306j304J2094O189q88o655j6482J4506j3737l974J0295k774
2089h551j3832M613K156O602q837Q293o234q635J3719J0640N143J5705j1918j4818
2075e954P098q284r483O518J0804r697J1075n974J7069P266j3492j5916j3849
2062b2819J1947j3639L653L902n26K0031J3867r173k2609R283Q98k65L375p745
$$ plain form
2048 -9820 -9343 -18172 -13274 -2373 16286 15768 31861 34665 50260 59864 50767 37398 33945 35639
2034 35639 35590 21371 -5741 -11955 -18941 -10196 -4881 -1451 884 -2565 -12376 -13295 -16787 -14989 -16339
2019 -16339 -21912 -20941 -10563 -26861 -10878 -24444 -23310 -20658 -17267 -13875 -14374 -8013 1160 -5163
2005 -5163 -5416 7545 401 -10401 -29687 -6545 -9043 -8014 915 9158 15341 6535 -11096 -14244
1991 -14244 -24400 -20564 -26613 -27328 -21415 -23039 -18818 -28317 -20301 -20763 -27171 -6434 16182 11789
1977 11789 12275 4192 -2266 -15401 -24977 -28032 -6040 6485 9463 6499 14302 -8565 -8866 799
1963 799 -3653 5521 -1176 -19611 -26089 -24992 -44391 -27067 -33480 -47486 -17239 -7021 3344
1950 3344 -6809 -2052 -12787 -12486 -25774 -30435 -19651 -12184 -8093 -19160 -16494 -20967 -24976 -33110
$$ packed form
2048i820M77q829M898J0901J8659n18J6093K804J5595R604r097j3369l453J694
2034C5639m9j4219k7112o214o986Q745N315L430K335l449r811r19l492J798j350
2019a6339n573R71J0378j6298J5983j3566J134K652L391L392m99O361R173o323
2005e163k53J2961p144j0802j9286K3142k498J029Q929Q243O183q806j7631l148
1991a4244j0156L836o049p15N913j624M221r499Q016m62o408K0737K2616m393
1977A1789M86q083o458j3135r576l055K1992J2525K978k964P803k2867l01R665
1963G99m452R174o697j8435o478J097j9399J7324o413j4006L0247J0218J0365
1950C344j0153M757j0735L01j3288m661J0784P467M091j1067K666m473m009q134
$$ plain form
1936 -33110 -33432 -36330 -16080 -21365 -26818 -28301 -29916 -24142 -19315 -17091 -11140 -20687 -30576 -25199 -5453
1921 -5453 -23672 -15991 -1263 3633 7302 -7887 -19065 -12197 -19481 -8844 6633 -8522 -14435
1908 -14435 2845 -7062 -21744 -32996 -20491 -19136 -28379 -24591 -24543 -15623 -28612 -45375 -32423
1895 -32423 -24443 -23945 -35472 -42737 -32514 -27821 -12857 -12081 -27768 -27701 -15731 -18199 -39111 -35077
1881 -35077 -27674 -23788 -18507 -8658 -23285 -25404 -26637 -34809 -15941 -10477 -16473 -22930 -17946 -28564
1867 -28564 -27540 807 -5874 -23414 -18416 -25674 -29237 -17557 -23884 -23779 -23379 -13800 -15974 -30682
1853 -30682 -15144 -5273 -10462 -20921 -12266 -19368 -13506 -11104 -12851 -2724 5031 -27671 -40413
1840 -40413 -38332 -20847 -4367 -2800 -2103 -24297 -39584 -20998 -33657 -22092 -13878 -22092 -32105
$$ packed form
1936c3110l22k898K0250n285n453j483j615N774M827K224N951r547r889N377J9746
1921e453j8219P681J4728M896L669j5189j1178O868p284J0637J5477j5155n913
1908a4435J7280r907j4682j1252J2505J355r243L788M8Q920j2989j6763J2952
1895c2423P980M98j1527p265J0223M693J4964P76j5687O7J1970k468k0912M034
1881c5077P403L886N281R849j4627k119j233q172J8868N464n996o457M984j0618
1867b8564J024K8347o681j7540M998p258l563J1680o327J05M00R579k174j4708
1853c0682J5538R871n189j0459Q655p102N862K402j747J0127P755l2702j2742
1840d0413K081J7485J6480J567O97k2194j5287J8586j2659J1565Q214q214j0013
$$ plain form
1827 -32105 -14451 -11786 -9539 -14219 -27761 -13053 -10860 -17557 -8772 -3453 2981 9985 -9212 -19943
1813 -19943 -25205 -8913 -6682 -30442 -27727 -23434 -24022 -11911 -15836 -17907 -15849 -21176 -21563 -20371
1799 -20371 -29844 -44985 -33005 -21811 -24637 -20736 -26646 -22172 -17142 -18338 -5254 -2333 -4099 -9820
1785 -9820 -3053 -1208 -22220 -13397 -1762 -9116 -21703 -19378 -11986 -13639 -37280 -25592 -38773
1772 -38773 -43194 -26486 -16494 -18997 -34621 -20049 -21302 -27889 -19912 -22053 -34591 -13501 -13839 -15243
1758 -15243 -33 -4406 -1605 -25216 -42915 -47545 -36180 -40096 -49661 -45558 -30703 -17045 -13490
1745 -13490 -26446 -43165 -45850 -42839 -30525 -24264 -36001 -18424 -20496 -30179 -29004 -25060 -20627
1732 -20627 -14799 -16380 -10664 -8653 -287 6952 1504 23545 -6574 -27311 -3172 -12566 -17382 -22676
$$ packed form
1827c2105J7654K665K247m680j3542J4708K193o697Q785N319O434P004j9197j0731
1813a9943n262J6292K231k3760K715M293n88J2111l925k071K058n327l87J192
1799b0371r473j5141J1980J1194k826L901n910M474N030j196J3084K921j766n721
1785i820O767J845k1012Q823J1635p354j2587K325P392j653k3641J1688j3181
1772c8773m421J6708R992k503j5624J4572j253o587P977k141j2538K1090l38j404
1758a5243J5210m373K801k3611j7699m630J1365l916r565M103J4855J3658L555
1745a3490j2956j6719k685L011J2314O261j1737J7577k072r683J175L944M433
1732b0627N828j581N716K011Q366P239n448K2041l0119k0737K4139r394m816n294
$$ plain form
1718 -22676 -35277 -29461 -21225 -627 -6233 -24655 -29643 -38016 -37917 -33662 -28328 -16829 -19504 -17768
1704 -17768 -3214 -13086 -23435 -25178 -16341 -27006 -39125 -45474 -39264 -23708 -24992 -28118 -27157 -23728
1690 -23728 -14651 -17365 -23270 -15579 -18393 -17457 -6080 -12562 -25639 -15999 -23007 -14469 -26922 -35637
1676 -35637 -32889 -12046 -12575 -31762 -45505 -25853 -21883 -8714 -3516 -15718 -15038 -10172 -13513 -29962
1662 -29962 -12346 2471 -13040 -21130 -13846 -13802 -8097 -20505 -25619 -16522 9296 -346 -7771 -18622
1648 -18622 -24849 -19326 -34457 -8722 -13720 -32214 -40699 -17112 -9841 -39842 -21094 -19828 -12612
1635 -12612 -24435 -6503 1755 -1766 -6881 -7367 -14140 -25258 -12231 -8846 -18645 -29830 -15440
1622 -15440 -21525 -5239 3132 -11295 -17177 -7765 -11043 -63 -20958 -16732 -6016 3860 -4014
$$ packed form
1718b2676j2601N816Q236K0598n606j8422m988q373R9M255N334J1499k675J736
1704a7768J4554r872j0349j743Q837j0665j2119o349O210J5556j284l126R61L429
1690b3728R077k714n905P691k814R36J1377o482j3077R640p008Q538j2453q715
1676c5637K748K0843n29j9187j3743J9652L970J3169N198j2202O80M866l341j6449
1662b9962J7616J4817j5511q090P284M4N705j2408n114R097K5818r642p425j0851
1648a8622o227N523j5131K5735m998j8494q485K3587P271l0001J8748J266P216
1635a2612j1823J7932Q258l521n115m86o773j1118J3027L385r799j1185J4390
1622a5440o085J6286Q371j4427n882R412l278J0980k0895M226J0716R876p874
$$ plain form
1609 -4014 -8627 -8580 -7781 -4437 -11881 -2485 2688 -355 -11278 -11516 -25372 -19989 -27427 -27380 -12786 -21651
1593 -21651 -18846 -11564 -12900 -1319 -1947 -14333 -23858 -44945 -31176 -24346 -12915 2849 -23478
1580 -23478 -25917 -35650 -25966 -19470 -27312 -28267 -12252 -5177 -3931 -17626 -33313 -24413 -27599 -18589
1566 -18589 -4978 -13300 -11403 -25052 -24998 -33626 -14194 -3158 -7660 -8925 4463 -10594 -19941 -20673
1552 -20673 -34542 -21358 -11135 -8521 -6432 -5824 -8742 -19407 -18060 -4799 -14883 -5525 -27059
1539 -27059 -23018 -13053 -1777 -4421 -15065 -6337 -11797 -10343 1175 -12760 -17475 -18532 -25523 -34803
1525 -34803 -36607 -19837 -7376 -8211 -18619 -14962 -11194 -10661 -34715 -43590 -21967 -23353 -42850 -29736
1511 -29736 -18223 -26983 -22344 -26007 -22373 -20021 -14748 -24439 -25590 -13583 -12402 -11154 -10726 -18192
$$ packed form
1609d014m613M7P99L344p444R396N173l043j0923k38j3856N383p438M7J4594q865
1593b1651K805P282j336J1581o28j2386r525k1087J3769O830J1431J5764k6327
1580b3478k439r733R684O496p842r55J6015P075J246j3695j5687Q900l186R010
1566a8589J3611q322J897j3649N4q628J9432J1036m502j265J3388j5057r347p32
1552b0673j3869J3184J0223K614K089O08k918j0665J347J3261j0084R358k1534
1539b7059M041R965J1276k644j0644Q728n460J454J1518j3935m715j057o991r280
1525c4803j804J6770J2461q35j0408L657L768N33k4054q875K1623j386j9497J3114
1511b9736J1513q760M639l663L634K352N273r691j151J2007J181J248M28p466
$$ plain form
1497 -18192 -5615 -7999 -21376 -23323 -15437 -14250 -10583 -17124 -17109 -6677 -15010 -35781 -25619 -17661
1483 -17661 -38831 -29721 -12793 -20658 -21150 -32240 -32548 -25083 -32080 -15606 -21519 -10410 -9049 -15385
1469 -15385 -15713 4099 -8045 -4652 3803 -16068 -14505 -14704 -18066 -13320 -16560 -12966 -26725 -42521
1455 -42521 -44907 -28357 -7242 -18455 -25359 -19211 -18729 -3511 3631 7002 1581 -8093 -7702 -14265
1441 -14265 -24570 -6318 3800 -9027 -20155 -24886 -29747 -15931 -6180 -18930 -13401 -5031 -7054
1428 -7054 -29953 -34561 -26477 -20558 -22968 -31564 -30494 -25635 -34457 -24991 -18140 -3526 -9105 -6539
1414 -6539 -9971 -10305 -11364 -18587 -11884 -16978 -20913 -2836 -1052 -7582 -9533 8977 -3686 2682
1400 2682 -1482 -17736 -15507 -23801 -22653 -24370 -14456 1779 -18365 -18601 -13018 -22615 -8879 -14908
$$ packed form
1497a8192J2577k384j3377j947P886J187L667o541J5J0432q333k0771J0162P958
1483a7661k1170R110J6928p865m92j1090l08P465o997J6474n913J1109J361o336
1469a5385l28J9812j2144L393Q455j9871J563j99l362M746l240L594j3759j5796
1455d2521k386J6550K1115j1213o904O148M82J5218P142L371n421r674L91o563
1441a4265j0305J8252J0118j2827j1128m731m861J3816R751j2750N529Q370k023
1428g054k2899m608Q084N919k410q596J070M859q822R466O851J4614n579K566
1414f539l432l34j059p223O703n094l935J8077J784o530j951J8510j2663O368
1400B682m164j6254K229q294J148j717R914J6235k0144k36N583r597J3736o029
$$ plain form
1386 -14908 -15901 -22194 -9768 -17777 -17807 -19127 -9067 -29418 -27938 -29138 -24121 -19556 -22672 -3701
1372 -3701 -9245 -24473 -29125 -23793 -7938 -5663 -14587 -8345 -21694 -22766 -26861 -25689 -20950 -18860
1358 -18860 -22597 -52315 -43849 -29362 -31183 -32849 -22327 -32126 -39872 -33477 -18825 -6876 -14069
1345 -14069 -4923 -24175 -38566 -22546 -12 -11827 -22759 -16503 -23542 -27506 -16959 -34205 -15055
1332 -15055 -14085 -22698 -26217 -27329 -21524 -4016 -14744 -17238 -15063 -12184 -17384 -14102 -7784 -17693
1318 -17693 -2138 -3886 -2252 -3958 -22395 -21544 -20724 -16278 6056 -14698 -11432 5042 -8321 -28148
1304 -28148 -29391 -27764 -22519 -21903 -36129 -36873 -21317 -23408 -8517 -8917 -17988 -29266 -27714 -19759
1290 -19759 -20452 -16775 -13420 -12232 -15884 -4101 11829 6503 -2463 -13211 -13801 -20024 -24042 -12941
$$ packed form
1386a4908r93o293J2426q009l0j320J0060k0351J480j200N017M565l116J8971
1372c701n544j5228m652N332J5855K275q924O242j3349j072m095J172M739K090
1358a8860l737k9718Q466J4487j821j666J0522r799p746O395J4652J1949p193
1345a4069R146j9252j4391J6020K2534j1815j0932O256p039l964J0547j7246J9150
1332a5055R70q613l519j112N805J7508j0728k494K175K879n200L282O318r909
1318a7693J5555j748J634j706j8437Q51Q20M446K2334k0754L266J6474j3363j9827
1304b8148j243J627N245O16j4226p44J5556k091J4891m00r071j1278J552P955
1290a9759o93L677L355J188l652J1783J5930n326q966j0748n90o223m018J1101
$$ plain form
1276 -12941 -14125 -35966 -28604 -21590 -17934 -10400 418 -14480 -22736 -21571 -27996 -32579 -37746 -26366
1262 -26366 -22241 -24411 -11230 -4886 -21116 -31063 -32029 -36301 -23896 -16229 -27326 -26611 -19343 -17442
1248 -17442 -27106 -11510 1506 -18491 -12247 -7105 1517 -8691 -23783 -21365 -32114 -20593 -15060
1235 -15060 -24547 -16196 -7027 -21712 -10830 -15524 -26364 -38246 -40411 -23669 -20114 -28240 -21949
1222 -21949 -14095 -6455 -12222 -16820 -10270 -7396 -8396 -12401 -26377 -21757 -16758 -19279 -14665 -22126
1208 -22126 -27637 -29193 -22603 -24283 -22976 -6416 -28198 -24409 -23947 -10307 -3751 1184 -6968 -27301
1194 -27301 -26170 -11478 -2547 774 -419 -9411 -10553 -14273 -7483 -32708 -23446 -16544 -20957 -3302
1180 -3302 -4140 -24391 -6045 -128 -13431 -22091 -23659 -26061 -34478 -12565 -12507 -27476 -35374 -28199
$$ packed form
1276a2941j184k1841P362P014L656P534J0818j4898q256J165o425m583n167J1380
1262b6366M125k170J3181O344j6230r947r66m272J2405P667j1097P15P268J901
1248a7442r664J5596J3016j9997O244N142Q622j0208j5092K418j0749J1521N533
1235a5060r487Q351R169j4685J0882m694j0840j1882k165J6742L555q126O291
1222b1949P854P640n767m598O550K874j000m005j3976M620M999k521M614p461
1208b2126n511j556O590j680J307J6560k1782L789M62J3640O556M935q152k0333
1194b7301J131J4692Q931L321j193q992j142l720O790k5225R262O902m413J7655
1180c302q38k0251J8346N917j3303q660j568k402q417K1913N8j4969p898P175
$$ plain form
1166 -28199 -19399 -8584 -1888 -22529 -33041 -24387 -26172 -31827 -31100 -26854 -32748 -29236 -16625 -5311
1152 -5311 -7297 -12740 -15841 -19513 -9862 -14008 -15008 -2093 1148 1043 -6801 -18546 -14505 -10796 -1016
1137 -1016 -2534 -9750 -9997 -22835 -5912 12242 -124 -18234 -16713 -16832 -20815 -7539 -8594 -2157
1123 -2157 -15420 -24864 -39699 -29780 -22267 -17733 -10475 -1198 -1135 -13235 -17570 -15848 -13343 -18397 -29645
1108 -29645 -29951 -18265 -21026 -6652 -2070 14232 15080 6608 -18023 -22694 -20235 -19520 -28085 -28568 -29230
1093 -29230 -17630 -22677 -29446 -28009 -27982 -32889 -46903 -21877 -26229 -27525 -23662 -36711 -40481 -28083
1079 -28083 -32365 -24947 -19816 -9368 -32788 -12137 -3398 -10569 -8776 -10764 -7171 -6722 -16311 -12776
1065 -12776 -13605 -19598 -28117 -34227 -32145 -34033 -20912 -21337 3419 3558 -14250 -15153 -18598 -16306 -17019
$$ packed form
1166b8199Q800J0815O696k0641j0512Q654j785n655P27M246n894L512J2611J1314
1152e311j986n443l101l672R651m146j000J2915L241j05p844j1745M041L709R780
1137a016j518p216k47j2838J6923J8154j2366j8110J521j19l983J3276j055O437
1123b157j3263r444j4835R919P513M534P258R277O3j2100m335J722K505n054j1248
1108b9645l06J1686k761J4374M582J6302Q48q472k4631m671K459P15q565m83o62
1093b9230J1600n047o769J437K7m907j4014K5026m352j296L863j3049l770J2398
1079b8083m282P418N131J0448k3420K0651Q739p171J793j988L593M49r589L535
1065a2776q29n993q519o110K082j888J3121m25K4756J39j7808r03l445K292p13
$$ plain form
1050 -17019 -27278 -7757 4645 937 -12026 -18441 -4708 -1673 -8327 3697 19054 824 -14921
1037 -14921 -12124 -7345 -1953 -15785 -13422 -18640 -1232 -10733 -31067 -28508 -21088 -7736 -7012 -16913
1023 -16913 -24375 -32166 5055 11955 -12280 -8424 2548 -2944 -3919 -4947 -10557 -15123 -34241 -16021
1009 -16021 -18615 -18678 -7722 -15331 -19981 -9128 -4844 -8685 -17335 1056 -499 6050 1594 -13388
995 -13388 -35064 -44584 -47732 -34315 -21803 -13123 -14193 -14671 -11223 -32424 -25316 -15863 5472 4106
981 4106 -13251 -5103 -6738 8207 17431 1494 8579 512 -8820 -6858 -12397 -8484 -9027 94 4637
966 4637 6925 -5645 -14520 -8648 -8550 -8852 -9386 -3105 -15086 -34374 -36919 -24293 -18203 -8908 -5263
951 -5263 2517 -21339 -38534 -41381 -23777 -10689 -10532 -11058 -22227 -29852 -20482 -18091 -17996 -12397 -10021
$$ packed form
1050a7019j0259J9521J2402l708j2963o415J3733L035o654J2024J5357j8230j5745
1037a4921K797M779N392j3832K363n218J7408r501k0334K559P420J3352P24r901
1023a6913p462p791L7221O900k4235L856J0972n492r75j028n610m566j9118J8220
1009a6021k594o3J0956p609m650J0853M284l841q650J8391j555O549m456j4982
995a3388k1676r520l148J3417J2512Q680j070m78L448k1201P108R453K1335j366
981D106j7357Q148j635J4945R224j5937P085q067r332J962n539L913n43R121M543
966D637K288j2570q875N872R8l02n34O281j1981j9288k545J2626O090R295L645
951e263P780k3856j7195k847J7604J3088J57n26j1169p625R370K391R5N599K376
$$ plain form
936 -10021 -33420 -18474 -11919 -22084 -17951 -21325 -25996 -19947 -20125 -16570 -12355 -13198 -1843 8769
922 8769 7374 -5344 -17964 -5787 -12675 -6361 -15844 -17684 -13239 -23730 -30449 -16921 -17952 -25674
908 -25674 -27616 -13146 -20935 -33526 -14183 -23776 -33180 -42805 -38077 -44790 -18046 -18522 -6826 -8664
894 -8664 -21285 -30849 -40993 -11576 -2053 -29729 -22217 -15105 -7915 -14487 1146 8559 -12424 -14383
880 -14383 -14971 -23605 -23476 -12100 -8844 -8127 -6923 -21913 377 -6490 -29700 -27129 -20309 -23619 -32818
865 -32818 -36332 -26424 -22366 -4599 -14259 -11558 -12598 -19338 -11948 -4312 6182 3082 -3076 -6444
851 -6444 348 -5098 -14422 -16416 -16263 -17756 -4603 -10739 -15282 -5232 -2515 4119 31125 16906
837 16906 10573 3700 -2504 -2011 -6941 -6305 -13501 -7974 -7159 -3553 -13460 -11981 -8033 -26740 -32652
$$ packed form
936a0021k3399J4946O555j0165M133l374m671O049j78L555M215q43J1355J0612
922H769j395j2718j2620J2177o888O314r483j840M445j0491o719J3528j031p722
908b5674j942J4470p789j2591J9343r593r404r625M728o713K6744m76J1696j838
894h664j2621r564j0144K9417R523k7676P512P112P190o572J5633P413k0983j959
880a4383n88q634J29J1376L256P17J204j4990K2290o867k3210K571O820l310r199
865c2818l514R908M058J7767r660K701j040o740P390P636J0494l100o158l368
851f444O792n446r324j994J53j493J3153o136m543J0050K717O634K7006j4219
837A6906o333o873o204M93m930O36p196N527Q15L606r907J479L948j8707n912
$$ plain form
822 -32652 -13217 4744 2256 -14262 -11862 -17567 -34450 -19973 -5167 -11383 -13285 5673 -1586
809 -1586 -6178 -5545 -8403 -16989 -21084 -18515 -19349 -7981 -3728 -4255 17883 9081 -3326 -8071 -3264
794 -3264 -8084 -5375 -8968 -5119 7149 -2491 3212 4850 -22031 -17282 7213 -1842 -22157 -17576
780 -17576 -4244 -2166 1696 -5015 -1726 3291 8158 -4883 -24409 -40387 -21767 -23995 -26450 -22824
766 -22824 -16496 -12711 -12167 -13790 -16149 -14132 -23430 -14673 -16545 -2937 -13346 -10577 -12763 -24128
752 -24128 -13232 -3766 5091 5992 3548 -7217 -26712 -28817 -20279 -22278 -21234 -7129 -4010 8663
738 8663 -10713 -15012 2972 10283 7812 -12402 -29882 -30694 -19899 -9057 -14781 -7844 -27796 -32521
724 -32521 -24605 -13967 -1353 -2944 -5913 -10606 -16633 -17491 -6284 -722 193 -21626 -29125 -27281
$$ packed form
822c2652J9435J7961k488j6518K400n705j6883J4477J4806o216j902J8958p259
809a586m592O33k858q586m095K569q34J1368M253n27K2138q802j2407m745M807
794c264m820K709l593L849J2268r640N703J638k6881M749K4495r055k0315M581
780a7576J3332K078L862o711L289N017M867j3041j9526j5978J8620k228k455L626
766b2824O328L785N44j623k359K017r298Q757j872J3608j0409K769k186j1365
752b4128J0896R466Q857R01k444j0765j9495k105Q538j999J044J4105L119J2673
738H663j9376m299J7984P311k471k0214j7480q12J0795J0842n724O937j9952m725
724c2521P916J0638J2614j591k969m693o027q58J1207N562R15k1819p499J844
$$ plain form
710 -27281 -25520 -12954 -22913 -36570 -21419 -21888 -8297 -15466 -6545 -6517 -16004 -29781 -5832 146
696 146 -16019 2793 4252 -4978 -2972 -5921 -1488 -1978 -2542 -8463 -5901 -7089 -6773 -9669 -10714 -2108
680 -2108 -6045 -8647 -9559 -11218 -5935 -2793 -14938 -7139 -885 -3858 -19213 -22612 -17831 -17536 -28969
665 -28969 -23900 -11935 -2087 -19963 -21062 -16354 -27193 -18146 -8784 -24598 -26512 -22502 -23657 -21543
651 -21543 -13496 -5089 -322 -9216 -13647 -14249 -8453 -21545 -18870 -9300 -19131 -9663 -2136 -6601 -6921
636 -6921 19437 10844 5699 11990 1797 -2707 -3518 993 -12116 -18019 -15772 -15690 -16734 -37678 -16432
621 -16432 -14227 -25302 -34942 -20757 -16029 -19179 -20727 -11639 -10461 -8461 1832 1331 -9673 -10307
607 -10307 -8551 -16925 -32696 -22847 -21938 -6234 -12772 -28053 -24102 4592 6963 -2576 -17932 -25795
$$ packed form
710b7281J761J2566r959j3657J5151m69J3591p169Q921K8r487j3777K3949N978
696A46j6165J8812J459r230K006k949M433m90n64n921K562j188L16k896j045Q606
680b108l937k602r12j659N283L142j2145P799O254k973j5355l399M781K95j1433
665b8969N069J1965R848j7876j099M708j0839R047R362j5814j914M010j155K114
651b1543Q047Q407M767q894m431o02N796j3092K675R570r831R468P527m465l20
636f921K6358q593n145O291j0193m504q11M511j3109n903K247Q2j044k0944K1246
621a6432K205j1075r640J4185M728l150j548R088J178K000J0293n01j1004o34
607a0307J756q374j5771R849R09J5704o538j5281L951K8694K371r539j5356p863
$$ plain form
593 -25795 -16073 -10801 -19984 -20070 -12498 -10243 -11765 -14609 -5130 -20618 -16161 -18332 -175 -4265 -13467
578 -13467 -1585 -20868 -17581 -18439 -16662 -17316 -18592 -16587 -17863 -28545 -20495 -11330 -7489 -13733 -30460
563 -30460 -30572 -26173 -1466 -3911 -5038 -13605 -16702 -28026 -10869 -14689 -16770 -10086 14507 -5458
549 -5458 1192 -20894 -13345 -11210 -17442 -14251 -11769 -10622 -27514 -24629 -26447 -20501 -10657 -10046 -4179
534 -4179 -24368 -7873 -1083 -11572 -7810 -29793 -35373 -30500 -13896 -21425 -32169 -28206 -29360 -24140
520 -24140 -25399 -14042 -24233 -23945 -22730 -15964 -24184 -14497 -25415 -26985 -17714 -13255 -5244 -20633
506 -20633 -18576 -12708 -5082 -15947 -11212 -17967 -16124 -9432 1426 -3391 10217 10782 5197 1859
492 1859 5484 -9952 175 -14446 -18799 -12088 -11146 10694 -3420 -9726 -2022 -16096 -2872 -16805
$$ packed form
593b5795R722N272r183q6P572K255j522k844R479j5488M457k171J8157m090r202
578a3467J1882j9283L287q58J777o54j276K005j276j0682Q050R165L841o244j6727
563c0460j12M399K4707k445j127q567l097j1324J7157l820k081O684K4593j9965
549e458O650k2086P549K135o232L191K482J147j6892K885j818N946R844O11N867
534d179k0189J6495O790j0489L762k1983n580M873J6604p529j0744L963j154N220
520b4140j259J1357j0191K88J215O766q220R687j0918j570R271M459Q011j5389
506b0633K057N868P626j0865M735o755J843O692J0858m817J3608N65n585l338
492A859L625j5436J0127j4621m353O711R42K1840j4114o306P704j4074J3224j3933
$$ plain form
478 -16805 -20164 -19026 -17078 -12884 -13770 -9837 -22079 -31909 -15794 -18767 -20666 -1329 6518 3741
464 3741 -19177 -22344 5384 14709 14542 5899 5021 4719 -3365 -16450 -26902 -19823 -10176 -2200 -1898
449 -1898 3614 6981 6379 -5790 -2834 -2613 -9308 -14339 -14501 -12191 -23077 -17731 -584 6231 -4970
434 -4970 -2468 -18670 -11222 2135 -5495 -19661 -15967 -10070 -20742 -22408 -13651 -5648 -17425 -23226
420 -23226 -11980 -39608 -28160 -14654 -21533 -11965 -4551 -2697 -15988 -3288 -5516 -5577 -22695 -26058
406 -26058 -17889 -20278 -17215 -26067 -36053 -19395 -6328 -12708 -26493 -13687 -5071 -7534 -14662 -13568
392 -13568 4306 6268 16000 4487 9304 4830 -3838 -19012 -19368 -29978 -20845 -17966 -17974 -10854 -1266
377 -1266 -907 -14739 -3752 -15158 -12958 -14365 -18868 -29493 -13303 -6870 -16015 -21887 -10291 -18412
$$ packed form
478a6805l359J138J948M194q86L933j2242r830J6115k973j899J9337P847k777
464C741k2918l167K7728R325j67q643q78l02q084j3085j0452P079R647P976L02
449a898N512L367o02j2169K956K21o695n031j62K310j0886N346J7147O815j1201
434d970K502j6202P448J3357p630j4166L694N897j0672j666Q757Q003j1777n801
420b3226J1246k7628J1448J3506o879R568P414J854j3291J2700k228o1j7118l363
406b6058Q169k389L063q852r986J6658J3067o380j3785J2806Q616k463p128J094
392a3568J7874J962R732j1513M817m474q668j5174l56j0610R133K879qP120R588
377a266L59j3832J0987j1406K200j407m503j0625J6190O433r145n872J1596q121
$$ plain form
363 -18412 -10871 -19678 -23656 -32463 -16476 -34085 -14892 -4387 -17025 -5805 -8700 -5565 -6080 -11468
349 -11468 -8641 -23821 -21531 -18740 -8932 -7094 -26614 -5593 6971 6542 2483 -5754 -28855 -19831
335 -19831 -9599 -24728 -20411 -7436 -2989 -10392 -7503 -11774 -23805 -12575 -9830 -10110 -2734 -4548
321 -4548 -17223 -22624 -34724 -19696 -23296 -31958 -16719 -4188 -9517 -9981 -9459 -9754 -14557 -21055 -5099
306 -5099 -7760 -11741 -4131 -10479 -16248 -24986 -28002 -22814 -11348 -6376 -7370 -9741 -10748 -17899 -19333
291 -19333 -16557 -15267 -20225 -20685 -22436 -14348 -19723 -24874 -17109 -18398 -7491 -5932 -4599 -20007 -23315
276 -23315 -11785 2734 -13006 -28872 -23996 -16749 -5665 -8337 -7231 -13933 -13859 -23347 -14384 -8945
262 -8945 -22850 -26590 -3993 -7677 -17714 -21926 -31263 -8359 17679 14965 -6268 -17267 -18439
$$ packed form
363a8412P541q807l978q807J5987j7609J9193J0505j2638J1220k895L135n15n388
349a1468K827j5180K290K791R808J838j9520K1021J2564m29m059q237k3101R024
335a9831J0232j5129M317J2975M447p403K889m271j2031J1230K745k80P376j814
321d548j2675n401j2100J5028l600q662J5239J2531n329m64N22k95m803o498J5956
306e099k661l981P610o348n769q738l016N188J1466M972r94k371j007p151j434
291a9333K776J290m958m60j751Q088n375n151P765j289J0907J559J333j5408l308
276b3315J1530J4519j5740j5866M876P247J1084k672J106o702P4r488Q963N439
262h945j3905l740K2597l684j0037m212r337K2904K6038k714k1233j0999j172
$$ plain form
249 -18439 -12220 -15899 -14376 -11833 -1569 -11040 -28683 -21948 -16317 -16 -14472 -34579 -21978
236 -21978 -23704 -32511 -33385 -20263 1779 10783 2327 -14741 -2700 11076 -5442 -7989 418 -21898
222 -21898 -21320 -19367 -20451 -18914 -23462 -16753 -11964 -7462 -5341 -15218 -16986 -22193 -14533 -5520 -15068
207 -15068 -9687 -14731 -25646 -20083 -30037 -40177 -26532 -5011 -2777 -4490 -19544 -26954 -6116
194 -6116 -2716 2063 -617 -9843 -12789 -9732 -14952 -10778 -7203 -10685 -10905 -143 16436 7976 -14170
179 -14170 -19047 -18602 -11417 -14007 -15918 -24752 -26586 -16037 -16992 -8444 -24574 -17129 -5978 -12904 -3699
164 -3699 -2762 -12867 -15709 -19770 -12945 -498 -2577 -6570 -2567 -1861 -17713 -8378 -918 -4969 -822
149 -822 1452 -5653 -629 13158 13436 2395 -2676 4286 1794 -13338 -10873 -13744 -14193 -14672 -17297
$$ packed form
249a8439O219l679J523K543J0264r471j7643O735N631J6301j4456k0107J2601
236b1978j726q807q74J3122K2042R004q456j7068J2041J3776j6518k547Q407k2316
222b1898N78J953j084J537m548O709M789M502K121r877j768n207P660R013r548
207a5068N381n044j0915N563r954j0140J3645K1521K234j713j5054p410K0838
194f116L400M779k680r226k946L057n220M174L575l482k20J0762J6579q460k2146
179a4170m877M45P185k590j911q834j834J0549r55Q548j6130P445J1151o926R205
164c699R37j0105k842m061O825J2447k079l993M003P06j5852R335P460m051M147
149h22K274p105N024J3787K78j1041n071O962k492j5132K465k871m49m79k625
$$ plain form
134 -17297 -14179 -13563 -10923 -17066 -22418 -23988 -37593 -34764 -25270 -23282 -23650 -16860 -9695 -14503 -25067
119 -25067 -27490 -22984 -12498 -17448 -24777 -27170 -18549 -12040 -6817 -7380 -15408 -16357 -19784 -23373 -21443
104 -21443 -21875 -18061 -10975 -10817 -5649 -1893 -3491 -5866 -8027 -14018 -5772 -2362 -11660 -22419 -17837
89 -17837 -10496 -14658 -28323 -36858 -34222 -23891 -12418 -14731 -18163 -10837 -15684 -24671 -27589 -20222
75 -20222 -13822 -15976 -8387 -5159 -13240 -14153 -21013 -21068 -17378 -7204 -6322 -8126 -7141 -7298 -8240 -16777 -5025
58 -5025 0 141 -3108 -18559 -17441 -12981 -16385 -10408 -3672 13667 12904 2877 6284 9233 10600
43 10600 1203 -7218 -1082 -1143 8585 404 -8406 -5959 -8220 -2788 9147 -2082 -13648 -5609 -13174
28 -13174 -6874 -4862 -1231 -10050 -15064 -11697 -3945 -27201 -29079 -21025 -14863 -11644 -17688 -10882 -7687
$$ packed form
134a7297L118O16K640o143n352j570j3605K829R494J988l68O790P165m808j0564
119b5067k423M506J0486m950p329k393Q621O509N223n63q028r49l427l589J930
104b1443m32L814P086J58N168L756j598k375k161n991Q246L410r298j0759M582
89a7837P341m162j3665q535K636J0331J1473k313l432P326m847q987k918P367
75b0222O400k154P589L228q081r13o860n5L690J0174Q82j804R85j57r42q537J1752
58e025N025J41l249j5451J118M460l404N977O736J7339p63j0027L407K949J367
43A0600r397q421O136o1R728q181q810K447k261N432J1935j1229j1566Q039p565
28a3174O300K012L631q819n014L367P752k3256j878Q054O162L219o044O806L195
$$ plain form
13 -7687 -13113 -6984 -12793 -14427 -15801 -13633 -6663 4671 -3775 -15995 -13805 -20729 -14977
0 -14977
$$ packed form
13g687n426O129n809j634j374K168O970J1334q446j2220K190o924N752
0a4977
$$ Imaginary data points
##PAGE= N=2
##DATA TABLE= (X++(I..I)), XYDATA
$$ plain form
16383 -621184 -621493 -602257 -600797 -600882 -592545 -590450 -581833 -570693 -558948 -554893 -544025 -527428 -522200 -518172
16369 -518172 -511799 -509656 -490384 -477727 -469085 -471338 -464156 -450776 -455365 -440375 -432592 -431941 -433659
16356 -433659 -424814 -422035 -405232 -388906 -377765 -367043 -368617 -369193 -360981 -342211 -335089 -327442 -315027
16343 -315027 -304411 -303088 -305859 -305458 -303895 -306154 -297466 -284902 -273127 -262793 -244504 -239396 -235237
16330 -235237 -223112 -212305 -201727 -185009 -176931 -175801 -190041 -179573 -166999 -164544 -169531 -162170
16318 -162170 -141586 -138725 -131546 -119169 -102219 -110674 -102215 -100853 -98725 -72889 -71226 -81815 -76284
16305 -76284 -62782 -56413 -43185 -40820 -39431 -28572 -16239 -10383 -968 5949 -3544 2969 26182
16292 26182 19854 26682 33134 35657 39920 35406 54975 59503 56212 74893 74938 79933 83705 87976
$$ packed form
16383f21184l09J9236J460q5Q337K095Q617J1140J1745M055J0868J6597N228M028
16369e18172O373K143J9272J2657Q642k253P182J3380m589J4990P783O51j718
16356d33659Q845K779J6803J6326J1141J0722j574n76Q212J8770P122P647J2415
16343c15027J0616J323k771M01J563k259Q688J2564J1775J0334J8289N108M159
16330b35237J2125J0807J0578J6718Q078J130j4240J0468J2574K455m987P361
16318a62170K0584K861P179J2377J6950q455Q459J362K128K5836J663j0589N531
16305g6284J3502O369J3228K365J389J0859J2333N856R415O917r493O513K3213
16292B6182o328O828O452K523M263m514J9569M528l291J8681M5M995L772M271
$$ plain form
16278 87976 95087 107688 117416 114151 117251 112267 117618 138662 145899 156060 147741 138971 152145
16265 152145 156478 171320 186888 193769 184050 190524 187622 204440 197452 212127 227873 232952 232497
16252 232497 231491 240710 236955 249207 248626 258286 270033 274547 278351 268650 271810 269045 277094 286642
16238 286642 297729 311731 303221 294073 302606 296205 311503 315970 322554 334041 344568 337991 321783
16225 321783 347669 355532 345021 353276 358537 362223 360522 356045 360861 371985 395901 382648 398995
16212 398995 403444 399947 389821 382752 389313 396827 409865 421629 421286 417032 427940 421765 408642
16199 408642 425696 421110 423072 428570 442973 435332 437525 436221 448214 464040 463552 461809 458501
16186 458501 467401 451417 464111 466896 465929 456440 469820 486658 476026 482163 474483 449831 449635
$$ packed form
16278H7976P111J2601R728l265L100m984N351K1044P237J0161q319q770J3174
16265A52145M333J4842J5568O881r719O474k902J6818o988J4675J5746N079m55
16252B32497j006R219l755J2252n81R660J1747M514L804r701L160k765Q049R548
16238B86642J1087J4002q510r148Q533o401J5298M467O584J1487J0527o577j6208
16225C21783K5886P863j0511Q255N261L686j701m477M816J1124K3916j3253J6347
16212C98995M449l497j0126p069O561P514J3038J1764l43m254J0908o175j3123
16199D08642J7054m586J962N498J4403p641K193j304J1993J5826m88j743l308
16186D58501Q900j5984J2694K785r67r489J3380J6838j0632O137p680k4652j96
$$ plain form
16173 449635 481376 498273 493736 483898 482759 482411 492076 501531 496341 485324 504372 530653 516716
16160 516716 511470 514508 503415 505533 518135 527260 522583 521985 549705 526013 512345 531188 530485
16147 530485 537567 537244 527942 530999 534662 546213 549863 556829 539642 531676 542206 530048 527204
16134 527204 531599 548541 546699 550384 551821 543243 529692 537093 537132 528498 536765 548362 554533 543071
16120 543071 555945 551656 545426 559806 556791 565102 555643 554052 569970 574095 579743 562402 567030
16107 567030 571570 563126 574210 577086 579201 572540 568145 567108 563492 563462 582640 586739 575133 567371
16093 567371 577038 580331 573507 576436 573508 579504 557066 559601 569253 570307 579527 568194 566911 591691
16079 591691 588803 574546 576116 591339 598704 595798 575977 573544 579893 578639 572707 571155 575941
$$ packed form
16173D49635L1741J6897m537r838j139l48R665R455n190j1017J9048K6281j3937
16160E16716n246L038j1093K118J2602R125m677n98K7720k3692j3668J8843p03
16147E30485P082l23r302L057L663J1551L650O966j7187p966J0530j2158k844
16134E27204M395J6942j842L685J437q578j3551P401L9q634Q267J1597O171j1462
16120E43071J2874m289o230J4380l015Q311r459j591J5918M125N648j7341M628
16107E67030M540q444J1084K876K115o661m395j037l616l0J9178M099j1606p762
16093E67371R667L293o824K929k928N996k2438K535R652J054R220j1333j283K4780
16079E91691k888j4257J570J5223P365k906j9821k433O349j254n932j552M786
$$ plain form
16066 575941 573660 575666 573535 579984 574872 573969 580384 573433 576422 578755 588518 581184 583837 577737
16052 577737 572046 572822 556170 565861 575532 581807 589341 583762 566085 573618 578713 580374 589410 588792
16038 588792 587668 594714 581832 591483 597174 591904 586071 576685 572499 570181 575062 571183 581841 586172
16024 586172 574177 579884 594830 594394 590099 587602 596477 588167 590037 580747 578212 579576 595935 609271
16010 609271 580879 578813 588841 593667 581064 578102 582177 588727 581811 580605 589987 580945 580006 577853
15996 577853 595761 596080 596644 597111 592775 593112 595510 595069 583406 580377 578340 588060 581602 592211 583659
15981 583659 573953 584503 591834 583415 577758 589354 589707 579988 582862 594517 593035 584131 582537 587767
15967 587767 601754 606534 606102 605431 586160 587368 592180 597009 595364 575765 599388 604682 584233
$$ packed form
16066E75941k281K006k131O449n112r03O415o951K989K333R763p334K653o100
16052E77737n691P76j6652R691R671O275P534n579j7677P533N095J661R036o18
16038E88792j124P046j2882R651N691n270n833r386m186k318M881l879J0658M331
16024E86172j1995N707J4946m36m295k497Q875q310J870r290k535J364J6359J3336
16010F09271k8392k066J0028M826j2603k962M075O550o916j206R382r042r39k153
15996E77853J7908L19N64M67m336L37K398m41j1663l029k037R720o458J0609q552
15981E83659r706J0550P331q419n657J1596L53r719K874J1655j482q904j594N230
15967E87767J3987M780m32o71j9271J208M812M829j645j9599K3623N294k0449
$$ plain form
15954 584233 588529 597738 598462 588362 569402 579750 599481 604935 590029 580064 602128 614855 603929
15941 603929 604958 602884 588932 597037 605004 609505 610754 580173 565791 576184 568936 576200 582352
15928 582352 588146 609454 612565 595073 605923 620617 620557 599369 593057 592036 603310 626833 598793
15915 598793 604989 607784 609609 612866 605729 601891 595906 598842 596184 586679 594937 597064 588489 618483
15901 618483 629266 623111 618951 607865 614119 606821 597776 603072 607188 617607 608715 613964 615869
15888 615869 622228 616786 596255 609741 605225 580237 588224 603413 600884 597088 603350 614001 596250
15875 596250 592951 608409 586386 592938 594787 609743 600602 589121 583268 583351 580231 579659 590239 592167
15861 592167 588751 594324 604784 597065 610543 608818 603934 588583 587992 597448 585580 592525 598570
$$ packed form
15954E84233M296R209P24j0100j8960J0348J9731N454j4906r965K2064J2727j0926
15941F03929J029k074j3952Q105P967M501J249l0581j4382J0393p248P264O152
15928E82352N794K1308L111j7492J0850J4694o0k1188o312j021J1274K3523k8040
15915E98793O196K795J825L257p137l838n985K936k658r505Q258K127q575K9994
15901F18483J0783o155m160j1086O254p298r045N296M116J0419q892N249J905
15888F15869O359n442k0531J3486m516k4988P987J5189k529l796O262J0651j7751
15875E96250l299J5458k2023O552J849J4956r141j1481n853Q3l120n72J0580J928
15861E92167l416N573J0460p719J3478j725m884j5351n91R456j1868O945O045
$$ plain form
15848 598570 569823 570172 575903 583100 596207 606976 605484 611737 613647 615755 610289 606319 612380 604679
15834 604679 605003 598374 603240 595947 586471 593151 590198 592890 598771 607277 607856 613670 610288 610625 613663
15819 613663 602058 607799 602566 602130 603124 606107 602476 602910 584259 569165 576473 591948 605348 614401
15805 614401 622438 616910 608511 617199 625636 627873 628348 605064 584674 593494 597621 591066 602420 608895
15791 608895 627196 616003 608271 611274 603654 590268 596014 598186 609231 612618 607715 598389 601811
15778 601811 602824 587137 586617 595790 604064 603186 588893 579286 594506 601077 602298 602757 611638 606725
15764 606725 609317 607956 625537 620041 617843 611360 595089 585082 587429 599404 604849 617830 610932
15751 610932 610209 607890 600715 596907 608676 612801 595600 593337 592277 607706 602229 602719 597367 592655
$$ packed form
15848E98570k8747L49N731P197J3107J0769j492O253J910K108n466l970O061p701
15834F04679L24o629M866p293r476O680k953K692N881Q506N79N814l382L37L038
15819F13663j1605N741n233m36R94K983l631M34j8651j5094P308J5475J3400R053
15805F14401Q037n528q399Q688Q437K237M75k3284k0390Q820M127o555J1354O475
15791F08895J8301j1193p732L003p620j3386N746K172J1045L387m903r326L422
15778F01811J013j5687n20R173Q274q78j4293r607J5220O571J221M59Q881m913
15764F06725K592j361J7581n496k198o483j6271j0007K347J1975N445J2981o898
15751F10932p23k319p175l808J1769M125j7201k263j060J5429n477M90n352m712
$$ plain form
15737 592655 607338 618039 611587 613773 623978 613229 623023 608490 605699 598817 600141 602657 602107
15724 602107 605768 614267 611004 611066 615268 610286 612297 617616 607876 607100 605658 602678 603433 611570 602828
15709 602828 612399 630456 602677 587659 601564 627794 614548 620855 615134 598308 592383 595812
$$ packed form
15737E92655J4683J0701o452K186J0205j0749R794j4533k791o882J324K516n50
15724F02107L661Q499l263O2M202m982K011N319r740p76j442k980P55Q137q742
15709F02828R571J8057k7779j5018J3905K6230j3246O307n721j6826n925L429
$$ [...]
##END NTUPLES=NMR SPECTRUM
##END=
