##TITLE=1H_TG-2410-C3`
 200.13Hz, DMSO+CCl4.
 8 sc
 18.8.2026
##JCAMPDX= 6.0         $$ Bruker NMR JCAMP-DX V2.0
##DATA TYPE= NMR SPECTRUM
##DATA CLASS= NTUPLES
##ORIGIN= UXNMR, Bruker Analytische Messtechnik GmbH
##OWNER= pz
$$ XWIN-NMR		Version 3.5
$$ Tue Aug 18 12:51:38 2026 Russian Standard Time (UT+4h)  she@DPX200
##.OBSERVE FREQUENCY= 200.1313
##.OBSERVE NUCLEUS= ^1H
##.ACQUISITION MODE= SIMULTANEOUS
##.ACQUISITION SCHEME= undefined
##.AVERAGES= 8
##.DIGITISER RES= 18
##SPECTROMETER/DATA SYSTEM= spect
##.PULSE SEQUENCE= zg30
##.SOLVENT NAME= D2O
##.SHIFT REFERENCE= (INTERNAL, D2O, 0, 15.5078)
##AUDIT TRAIL= $$ (NUMBER, WHEN, WHO, WHERE, WHAT)
$$ ##TITLE= Audit trail, XWIN-NMR		Version 3.5
$$ ##JCAMPDX= 5.01
$$ ##ORIGIN= Bruker BioSpin GmbH
$$ ##OWNER= she
$$ F:/spectra/data/she/nmr/H-C/1/pdata/1/auditp.txt
$$ ##AUDIT TRAIL=  $$ (NUMBER, WHEN, WHO, WHERE, WHAT)
(   1,<2026-08-18 12:49:58.31 +0400>,<she>,<DPX200>,
      <created by zg, POWCHK disabled, PULCHK disabled
       configuration hash MD5:
       00 E9 B6 7A A2 85 ED C7 34 08 36 98 17 FE 4E 26
       data hash MD5: 16K
       76 B2 6F 84 AA E6 53 A5 63 28 0A 49 98 9D B1 CA>)
(   2,<2026-08-18 12:50:00.59 +0400>,<she>,<DPX200>,
      <Start of raw data processing
       efp BC_mod = 2 LB = 0.25 FT_mod = 6 PKNL = 1 PHC0 = -4382.857 PHC1 = 15.3923 SI = 16K 
       data hash MD5: 16K
       1B F9 06 FF F6 EE 6A D0 EF E5 99 EB EE D3 B6 04>)
(   3,<2026-08-18 12:50:21.65 +0400>,<she>,<DPX200>,
      <pk PHC0 = 4.043327 PHC1 = -5 
       data hash MD5: 16K
       03 C2 D1 88 24 F9 BB AB 94 72 20 F3 38 25 8C 1C>)
(   4,<2026-08-18 12:50:25.12 +0400>,<she>,<DPX200>,
      <abs ABSG = 5 
       data hash MD5: 16K
       9B A7 72 6D F0 5E 46 87 60 B3 0B FB 7C 08 7F 86>)
$$ ##END=
$$ 
$$ hash MD5
$$ 4A CE 39 FA 31 AA B0 BE 7E 9F EB 7C 1C B8 1E FB
##$RELAX= 
##$RELAX= 
##$RELAX= 
##$RELAX= 
##$RELAX= 
##$RELAX= 
$$ Bruker specific parameters
$$ --------------------------
##$DU= <F:/spectra>
##$EXPNO= 1
##$NAME= <H-C>
##$PROCNO= 1
##$TYPE= <nmr>
##$USER= <she>
##$AMP= (0..31)
100 100 100 100 100 100 100 100 100 100 100 100 100 100 100 100 100 100 
100 100 100 100 100 100 100 100 100 100 100 100 100 100 
##$AQSEQ= 0
##$AQ_mod= 1
##$AUNM= <au_zg>
##$AUTOPOS= <>
##$BF1= 200.13
##$BF2= 200.13
##$BF3= 200.13
##$BF4= 200.13
##$BF5= 200.13
##$BF6= 200.13
##$BF7= 200.13
##$BF8= 200.13
##$BYTORDA= 1
##$CFDGTYP= 0
##$CFRGTYP= 5
##$CHEMSTR= <none>
##$CNST= (0..31)
1 1 145 1 1 1 1 1 1 1 1 1 1 1 1 1 1 1 1 1 1 1 1 1 1 1 1 1 1 1 1 1 
##$CPDPRG= <>
##$CPDPRG1= <>
##$CPDPRG2= <>
##$CPDPRG3= <>
##$CPDPRG4= <mlev>
##$CPDPRG5= <mlev>
##$CPDPRG6= <mlev>
##$CPDPRG7= <mlev>
##$CPDPRG8= <mlev>
##$CPDPRGB= <>
##$CPDPRGT= <>
##$D= (0..31)
0 0.7 0 0 0 0 0 0 0 0 0 0.03 0 0 0 0 0 0 0 0 0 0 0 0 0 0 0 0 0 0 0 0 
##$DATE= 1787042997
##$DBL= (0..7)
120 120 120 120 120 120 120 120 
##$DBP= (0..7)
150 150 150 150 150 150 150 150 
##$DBP07= 0
##$DBPNAM0= <>
##$DBPNAM1= <>
##$DBPNAM2= <>
##$DBPNAM3= <>
##$DBPNAM4= <>
##$DBPNAM5= <>
$$ [...]
##$SUBNAM3= <"">
##$SUBNAM4= <"">
##$SUBNAM5= <"">
##$SUBNAM6= <"">
##$SUBNAM7= <"">
##$SUBNAM8= <"">
##$SUBNAM9= <"">
##$SW= 18.0517328524113
##$SWIBOX= (0..15)
0 0 2 0 0 0 0 0 0 0 0 0 0 0 0 0 
##$SW_h= 3612.71676300578
##$TD= 16384
##$TD0= 1
##$TE= 0
##$TE2= 300
##$TE3= 300
##$TEG= 300
##$TL= (0..7)
0 120 120 120 120 120 120 120 
##$TP= (0..7)
150 150 150 150 150 150 150 150 
##$TP07= 0
##$TPNAME0= <>
##$TPNAME1= <>
##$TPNAME2= <>
##$TPNAME3= <>
##$TPNAME4= <>
##$TPNAME5= <>
##$TPNAME6= <>
##$TPNAME7= <>
##$TPOAL= (0..7)
0.5 0.5 0.5 0.5 0.5 0.5 0.5 0.5 
##$TPOFFS= (0..7)
0 0 0 0 0 0 0 0 
##$TUNHIN= 0
##$TUNHOUT= 0
##$TUNXOUT= 0
##$USERA1= <user>
##$USERA2= <user>
##$USERA3= <user>
##$USERA4= <user>
##$USERA5= <user>
##$V9= 5
##$VALIST= <valist>
##$VCLIST= <CCCCCCCCCCCCCCC>
##$VD= 0
##$VDLIST= <DDDDDDDDDDDDDDD>
##$VPLIST= <PPPPPPPPPPPPPPP>
##$VTLIST= <TTTTTTTTTTTTTTT>
##$WBST= 1024
##$WBSW= 4
##$XGAIN= (0..3)
0 0 0 0 
##$XL= 0
##$YL= 0
##$YMAX_a= 326997
##$YMIN_a= -273207
##$ZGOPTNS= <>
##$ZL1= 120
##$ZL2= 120
##$ZL3= 120
##$ZL4= 120
##$ABSF1= 15.5089
##$ABSF2= -2.54295
##$ABSG= 5
##$ABSL= 3
##$ALPHA= 0
##$AQORDER= 0
##$ASSFAC= 0
##$ASSFACI= 0
##$ASSFACX= 0
##$ASSWID= 0
##$AUNMP= <proc_1d>
##$AZFE= 0.1
##$AZFW= 0.1
##$BCFW= 0
##$BC_mod= 2
##$BYTORDP= 0
##$COROFFS= 0
##$CY= -3
##$DATMOD= 1
##$DC= 0
##$DFILT= <>
##$DTYPP= 0
##$F1P= 0
##$F2P= 0
##$FCOR= 1
##$FTSIZE= 16384
##$FT_mod= 6
##$GAMMA= 0
##$GB= 0
##$INTBC= 1
##$INTSCL= 3.241238e-09
##$ISEN= 128
##$LB= 0.25
##$LEV0= 0
##$LPBIN= 0
##$MAXI= 10000
##$MC2= 0
##$MEAN= 0
##$ME_mod= 0
##$MI= 1.114404
##$NCOEF= 0
##$NC_proc= -5
##$NLEV= 6
##$NOISF1= 3.799351
##$NOISF2= 2.8
##$NSP= 0
##$NTH_PI= 0
##$NZP= 0
##$OFFSET= 15.5078
##$PC= 1
##$PHC0= -4378.813
##$PHC1= 10.3923
##$PH_mod= 1
##$PKNL= yes
##$PPARMOD= 0
##$PSCAL= 0
##$PSIGN= 0
##$REVERSE= no
##$SF= 200.130002782452
##$SI= 16384
##$SIGF1= 3
##$SIGF2= 2
##$SINO= 0.751879
##$SIOLD= 32768
##$SREGLST= <19F.Aceton>
##$SSB= 0
##$STSI= 16384
##$STSR= 0
##$SW_p= 3612.71676300578
##$SYMM= 0
##$S_DEV= 0
##$TDeff= 16384
##$TDoff= 0
##$TI= <>
##$TILT= no
##$TM1= 0
##$TM2= 0
##$TOPLEV= 0
##$USERP1= <user>
##$USERP2= <user>
##$USERP3= <user>
##$USERP4= <user>
##$USERP5= <user>
##$WDW= 1
##$XDIM= 16384
##$YMAX_p= 311819558
##$YMIN_p= -325636
$$ End of Bruker specific parameters
$$ ---------------------------------
##NTUPLES= NMR SPECTRUM
##VAR_NAME=  FREQUENCY,     SPECTRUM/REAL,   SPECTRUM/IMAG
##SYMBOL=    X,             R,               I
##VAR_TYPE=  INDEPENDENT,   DEPENDENT,       DEPENDENT
##VAR_FORM=  AFFN,          ASDF,            ASDF
##VAR_DIM=   16384,         16384,           16384
##UNITS=     HZ,            ARBITRARY UNITS, ARBITRARY UNITS
##FACTOR=    0.220516191357247, 1,           1
##FIRST=     3103.57607760978, 0,            0
##LAST=      -509.140685396003, 0,           0
##MIN=       -509.140685396003, -325636,     0
##MAX=       3103.57607760978, 311819558,    0
$$ Real data points
##PAGE= N=1
##DATA TABLE= (X++(R..R)), XYDATA
$$ [...]
6308e289p222K5191P427n838j4699l7106P268q91J1658j9258L3384j3253M091
$$ -5289 -12511 12680 20107 14269 -430 -37536 -30268 -31159 -19501 -38759 -5375 -18628 -14537
6295a4537K3655m262M5728j4396j3427m2397p07j9581K7428p207k351j8628l876
$$ -14537 9118 4856 50584 36188 22761 -19636 -20343 -39924 -12496 -19703 -22054 -40682 -44558
6282d4558M9493P614j4865J5423K9180j9654n389k0204K5728j5526n98J9878O256
$$ -44558 4935 12549 -2316 13107 42287 22633 17244 -2960 22768 7242 6644 26522 32778
6269C2778l3733J1369k0398K0110Q184l6730N512l098N227O836O394J5613r206
$$ 32778 -955 10414 -9984 10126 18310 -18420 -12908 -16006 -10779 -3943 2451 18064 8858
6256H858P58l29K2142j2709k6714j1683k488k3805j3015K9317K7229M1764m966
$$ 8858 9616 9287 31429 18720 -7994 -19677 -22165 -45970 -58985 -29668 -2439 39325 34359
6243C4359r853l8511J852K9816j5338m26j3342j552K8835K2719j2940l9537J2710
$$ 34359 24506 -14005 -12153 17663 2325 1899 -11443 -12995 15840 38559 25619 -13918 -1208
6230a208o189j4026j0529J1295L2045j8676Q850K4710k3883K8878j630o465K1485
$$ -1208 -7397 -21423 -31952 -20657 11388 -7288 1562 26272 2389 31267 29637 23172 44657
6217D4657k2532o119j1723j2480J3546P507K6586r091O873j8143q809Q321j6704
$$ 44657 22125 16006 4283 -8197 5349 12856 39442 30351 37224 19081 10272 18593 1889
6204A889j0047J9928Q132n04j6862j0280L5392L4034q680l8775j5446L042J0109
$$ 1889 -8158 11770 19902 19398 2536 -7744 27648 61682 53002 14227 -1219 1823 11932
6191A1932k7708L0014p03R814J2068k2729J5170K3743j2614q554p048j7501P300
$$ 11932 -15776 14238 13535 23349 35417 12688 27858 51601 38987 30433 23385 5884 13184
6178A3184j1718j7557L307N0429m084k942l847K0823Q039j0707k3402r787K8076
$$ 13184 1466 -16091 -12784 37645 33561 30619 26772 47595 55634 44927 21525 11738 39814
6165C9814q166k030k9233m042J6007J0779k085K3927j0547j9339j6250J7055l7561
$$ 39814 31648 29618 385 -3657 12350 23129 21044 44971 34424 15085 -1165 15890 -21671
6152b1671J7194J0215L548M0410m4012K115j3948J0940k8950m7702K159J9910
$$ -21671 -4477 5738 9286 49696 5684 7799 -6149 4791 -24159 -71861 -69702 -49792
6140d9792N8328K8378j8596n132P119k4574K4744k1469k1645m70K7394J725J2224
$$ -49792 8536 36914 18318 13186 20305 -4269 20475 -994 -22639 -23109 4285 6010 18234
6127A8234N440n965j9271J6800j1324k0486J8565O729K5744l6843j2309J2105
$$ 18234 23674 17709 -1562 15238 3914 -16572 1993 8722 34466 -2377 -14686 -2581
6115b581M9270l0005Q10L096L2804j0528J498L465J4960j4065k7406N504K5994
$$ -2581 46689 16684 17494 20590 53394 42866 44364 47829 62789 48724 21318 26822 52816
6102E2816J6602k0960j2335l3966K6373m143L3859j358j0920j9116j6682L1952
$$ 52816 69418 48458 36123 2157 28530 24387 58246 56888 45968 26852 10170 42122
6090D2122m7243L7785J3048j8520P739L235r831J1592j4389l4842J2312R491r781
$$ 42122 -5121 32664 45712 27192 34931 38166 28335 39927 25538 -9304 3008 12499 2718
6077B718Q040M5939J1030J6730l2010r091N721k651m0187Q21j0097k454J3448
$$ 2718 10758 56697 67727 84457 52447 43356 49077 46426 6239 7060 -3037 -5491 7957
6064G957Q959J6784j3593J154K0645O004k6510j882m614k5546J2830J3986J4150
$$ 7957 16916 33700 20107 21261 41906 47910 21400 19518 14904 -10642 2188 16174 30324
6051C0324J1490m9408M215L2982K6586j2798k6785j8323q071L7981k554K3272
$$ 30324 41814 -7594 -3379 29603 56189 43391 16606 -1717 -9788 28193 25639 48911
6039D8911j9757J1263P666j1685R264k0759p476l790J9831l1664Q453j1741J2798
$$ 48911 29154 40417 48083 36398 45662 24903 17427 13637 33468 1804 10257 -1484 11314
6026A1314L648o515k4241K6426K5167j77l273j9004r314l9552O7095J9580k6131
$$ 11314 14962 8447 -15794 10632 35799 35622 32349 13345 4031 -35521 31574 51154 25023
6013B5023P968O308L905J1803k2448l4291m160K1916R575L1123p791j2856M609
$$ 25023 32991 39299 43204 55007 32559 -1732 -5892 16024 25599 56722 48931 36075 40684
6000D0684n813J6973n6614L5908K9342J0701j4997K1690j4087r306j057j630L0514
$$ 40684 34871 51844 -4770 31138 60480 71181 56184 77874 63787 54481 53424 51794 82308
5987H2308j3754M081o8302K7537P69K4885J0710J6361l1876j5260J3506K2948
$$ 82308 68554 72635 4333 31870 32639 57524 68234 84595 52719 37459 50965 73913
5975G3913O321N262k3804J4353L2069l0883L3378N416K1317k1768k4849N05L2050
$$ 73913 80234 85496 61692 76045 108114 77231 110609 116025 137342 115574 90725 91230 123280
5962A23280l4104J3228J6249J321q906J9860Q975k2387M975K6595K0958j9513
$$ 123280 89176 102404 118653 119974 111068 130928 139903 117516 122491 149086 170044 150531
5950A50531q551M8510K9886K7990L0499K8929M1395K8975j2890j2221L2748k4572
$$ 150531 141980 190490 220376 248366 278865 307794 349189 378164 365274 353053 385801 361229
5938C61229L7106j2026j7061p264K7404K555m599O084k6275j1164n2391k1609
$$ 361229 398335 386309 369248 361984 389388 391943 387344 393428 367153 355989 303598 281989
5926B81989J5185k3075m3529l8728J7992l6700m4424l148k0505Q580Q556K7121
$$ 281989 297174 274099 230570 191842 209834 173134 128710 125562 105057 113637 122193 149314
5914A49314q305l8612l1183L7583k6049k2064M856l784M9381L0490l2280k5067
$$ 149314 141009 102397 71214 108797 82748 60684 65540 61756 111137 141627 109347 84280
5902H4280m4q062J948k1062O675j2341L8675j4396k3737J5450Q343M1131k0294
$$ 84280 84236 76174 78122 57060 63735 51394 90069 75673 51936 67386 75729 116860 96566
5889I6566k8281J5283k164R6r706K9768L0923l1228k8948J3670j3078k4416J3977
$$ 96566 68285 83568 81404 81500 71794 101562 132485 101257 72309 85979 72901 48485 62462
5876F2462N559J9126n500k4768o021L559J0335k7866m579M712J5104L0235K0294
$$ 62462 68021 87147 81647 56879 50858 54417 64752 36886 32307 37019 52123 82358 102652
5863A02652K551k9004J2110k7038n241j0176K0530P554j1599p156J1327q260J4968
$$ 102652 105203 76199 88309 61271 56030 45854 66384 73938 62339 55183 66510 58250 73218
5850G3218q713K6484k907M807k0384j8784L3201R52M0797N041j0224l969O404
$$ 73218 64505 90989 88082 92889 72505 53721 86922 87874 128671 133712 123488 119519 125923
5837A25923j1657k9939J266N7419m3739k3206K8086J7431k398J7937J0757l2445
$$ 125923 114266 84327 85593 143012 99273 76067 104153 121584 119186 137123 147880 115435
5825A15435j6316J3303J3315j1599j1027N123n23J7030N771k987L5483N322R994
$$ 115435 99119 112422 125737 114138 103111 108234 107711 124741 130512 127525 163008 168330 178324
5812A78324j6261r369P56j6069J4288J6978j5970l8225M24K3273K8213L4386R444
$$ 178324 162063 152694 153450 137381 151669 168647 152677 114452 114876 138149 166362 200748 210192
5799B10192R898n8773l48P336J9368K8842L778q667j4808k1976N245N4678j2150
$$ 210192 220090 161317 160969 168305 187673 216515 220293 211626 196818 174842 180087 234765 222615
5786B22615l273j0458M0324K5934J0311J5879K0584K1847q0N137k2369J7110K3370
$$ 222615 219342 208884 249208 275142 285453 301332 321916 343763 343683 348820 326451 343561 366931
5773C66931J6174o546J3497N3718N4720K6506M8785R2685Q7279R9493J40270J65872
$$ 366931 383105 376559 390056 443774 498494 525000 573785 666470 753749 853242 993512 1159384
5761A159384J97387L55931P27876J263471J644341J853185J370742O40642J15448
$$ 1159384 1356771 1712702 2440578 3704049 5348390 7201575 8572317 9212959 9328407
5752I328407l36404p98842j043800j055679j044520r31819p71800p17949n79295
$$ 9328407 8992003 8193161 7149361 6093682 5049162 4117343 3345543 2627594 2048299
5743B048299l24699k06271j61837j66198j54278j49662p0326j08452k9984m1310
$$ 2048299 1723600 1517329 1355492 1189294 1035016 885354 815028 706576 676592 635282
5733F35282p5372k0253o963j5506p4310k0995k135j9829n7759n031j8106K3011
$$ 635282 559910 539657 532694 517188 442878 421883 419748 399919 342160 337129 319023 342034
5721C42034j1342J3337j4482Q236k4673k9572o155P05L5951k8497k5934m0323
$$ 342034 330692 344029 329547 337783 313110 283538 277383 278088 314039 285542 259608 219285
5709B19285N5269j8188n291M488N441l2448R21J8243p1330j4433O0271j8267m4596
$$ 219285 274554 256366 251075 255563 261004 228556 229477 247720 176390 161957 222228 203961 159365
5696A59365J7837j8668K5431K5001L3485k7140m0840m4135K0395K391j1218J3725
$$ 159365 177202 158534 183965 208966 242451 215311 174471 130336 150731 153122 141904 155629
5684A55629k3667Q829K3203K5911n913o109m3444k881r311J957j5418K6480O415
$$ 155629 131962 140791 163994 189905 183992 177883 134439 131558 122247 124204 108786 135266 141681
5671A41681P719K1697m271j715k6313J1208j761k0635K3867j3699K2129K0443
$$ 141681 149400 171097 166826 165111 138798 150006 148245 127610 151477 137778 159907 180350
5659A80350K0555J6647n5458M517q434k4793J0895K0367j5019j0133K8108j2670
$$ 180350 200905 217552 162094 166611 158177 133384 144279 164646 149627 139494 167602 154932
5647A54932K4275O864J959J6027k4547k6798Q268j7474o796J1377M9736j6849
$$ 154932 179207 186071 188030 204057 179510 152712 160980 143506 136710 148087 197823 180974
5635A80974n877K7492L735j738j8256J7039k7810K9093k0272N071k0968K895j5776
$$ 180974 175097 202589 206324 204586 186330 203369 175559 204652 184380 189451 168483 171378 155602
5622A55602j3699O519j2195N7377N664N615l7299k4978M032M8267R764k2852N418
$$ 155602 141903 148422 136227 193604 199268 204883 167584 142606 146638 194905 204669 181817 187235
5609A87235K4425L6100r97N8587M9830M8809K2684L4425m77N372k6136j945l429
$$ 187235 211660 247760 246763 305350 355180 403989 426673 461098 460621 465993 439857 437912 434483
5596D34483N690j6966j5757N0922J6833K9639n9589K5854k7191N958k9892n3742
$$ 434483 440173 423207 407450 458372 475205 504844 445255 471109 443918 449876 419984 366242
5584C66242l715l2110m8206j7206m7192j0546J9394k9885J8063j8376K7995o947
$$ 366242 362527 330417 282211 265005 217813 207267 226661 196776 214839 196463 224458 217511
5572B17511L1932m23k642l5359p156J3701j5584j0814J5864L844m8123J4772j5152
$$ 217511 249443 249020 246378 211019 203863 217564 201980 191166 207030 210874 162751 177523 162371
5559A62371M797q148N8338p502k8722k5898J421m955L962O1327k58r361k4205
$$ 162371 167168 159020 217358 209856 181134 155236 156657 151702 155664 216991 216733 207372 183167
5546A83167K4964p57J4963k6814j589K2372L3869r805K0399Q253J3510J858j5104
$$ 183167 208131 207374 222337 195523 193934 216306 250175 240370 260769 269022 282532 284390 269286
5533B69286k817J6712J7559J7066M3105J605Q793j3366J7287j003j2998j1501
$$ 269286 266469 283181 300740 317806 360911 362516 371309 357943 375230 374227 361229 349728
5521C49728L1072M914p504j3181J8112J141k0401J2792o8457J0327m3887k0364
$$ 349728 380800 385714 378210 365029 383141 384282 363881 376673 308216 318543 274656 254292
5509B54292M0633K4075k9656k3072j942l9984p603J3088J3386k9907K8108j3603
$$ 254292 294925 319000 289344 266272 264330 224346 216743 229831 243217 213310 241418 227815
5497B27815K9473l3890L766J3949L1594j9463n1512J0105o52j1605k1156M0369
$$ 227815 257288 223398 227164 241113 272707 253244 201732 211837 211185 199580 178424 218793
5485B18793j3442N735j6032L6577j9886Q73K9137n396j7382J5185Q332K0461k7291
$$ 218793 205351 211086 195054 231631 211745 212618 241755 236359 218977 234162 242494 262955 235664
5472B35664p597m478j2159O7899p530L6490j9313K3973j562r566K5114j866n2650
$$ 235664 228067 223589 211430 279329 271799 308289 288976 312949 311387 301821 326935 325069 272419
5459B72419j2723L9000m669N4951L716K680R752K129j6645j2874k9479N3101Q4761
$$ 272419 259696 298696 294027 348978 352694 355374 365126 367255 350610 337736 308257 361358 446119
5446D46119o1231M438m880J1298J7952k6013K3985m933l0507Q6540K6230K927
$$ 446119 384888 389326 384446 395744 413696 387683 411668 406735 376228 462768 488998 491925
5434D91925J3446j1787k9443J5714J3828J6808j237K628K3456o7457M9800L341
$$ 491925 505371 493584 464141 479855 493683 510491 509254 511882 535338 467881 517681 521022
5422E21022k231K4373M1245P783j4823J6710j4495L9697k0344j9194k1762j0354
$$ 521022 518791 543164 584409 592192 577369 594079 579584 619281 598937 579743 557981 547627
5410E47627n326L7617N275K0872O578M5717Q077p584k0703j862K3679k5812K6845
$$ 547627 542301 579918 585193 606065 612643 658360 666437 658853 638150 636288 659967 634155 661000
5397F61000l0094J8646N115N1357j8857j8634m511q367M293L1904K4331M3028
$$ 661000 630906 649552 654667 706024 687167 668533 664022 655655 659948 691852 716183 759211
5385G59211L5428J5746j2301j7461M0209K8879K1096j2365k856P440M7385M4333
$$ 759211 794639 810385 798084 780623 820832 849711 870807 858442 855586 863026 910411 954744
5373I54744K183K7682L9310J5872O675M8012M0292M0895k3646j0954k6383L0387
$$ 954744 956927 984609 1023919 1039791 1046466 1094478 1134770 1175665 1152019 1141065 1114682 1145069
5361A145069L0946N2597K8578k4726K870k070O9448N7970K3584M4310J6009l4858
$$ 1145069 1176015 1228612 1257190 1232464 1235334 1233264 1302712 1360682 1384266 1428576 1444585 1409727
5349A409727N5340N3601L6041K5762M0266J6276K3888R361N8042P8994O0263O3571
$$ 1409727 1465067 1518668 1554709 1580471 1620737 1637013 1660901 1670262 1728304 1807298 1867561 1931132
5337A931132N7461L6543K2713N9041N6122O1041J1018K5517O0405J19213J07258
$$ 1931132 1988593 2025136 2047849 2106890 2163012 2224053 2235071 2260588 2320993 2440206 2547464
5326B547464Q4808J06704J05788J27086J15103J47483J36446J29264J29454J57433
$$ 2547464 2632272 2738976 2844764 2971850 3086953 3234436 3370882 3500146 3629600 3787033
5316C787033J49547J52234K08239K17396K45740K89543K91777L10649L23902L85896
$$ 3787033 3936580 4088814 4297053 4514449 4760189 5049732 5341509 5652158 5976060 6361956
5306F361956N18756O38447P85531R08038J138972J411828J899908K823949M404260
$$ 6361956 6880712 7519159 8304690 9212728 10351700 11763528 13663436 16487385 20891645
5297B0891645O772288Q855259R712524Q412276N482014K621077K62205j860274
$$ 20891645 27663933 36519192 46231716 54643992 60126006 62747083 63009288 61149014
5289F1149014l343915l499841k406369m2208K865567M918524N165020L334088
$$ 61149014 57805099 54305258 51898889 51856681 54722248 59640772 64805792 68139880
5281F8139880Q43153j439801l627481n571742o717462o966458o715769o129085
$$ 68139880 68983033 67543232 63915751 58344009 51626547 44660089 37944320 31815235
5273C1815235n350659m516774l587818k666991k035490j628016j395000j139447
$$ 31815235 26464576 21947802 18359984 15692993 13657503 12029487 10634487 9495040
5265I495040r98889q25450o43018n00405m28670m29732l19984l32475k86691l04904
$$ 9495040 8496151 7670701 7027683 6527278 6098608 5668876 5348892 5016417 4729726 4424822
5255D424822k75917k50711j69999j60067j68873j12602j12081q0281j53012j08862
$$ 4424822 4148905 3898194 3728195 3568128 3399255 3286653 3174572 3094291 2941279 2832417
5245B832417p4891o3151r2084o5945j19836q6225q3305p2429p2404m9798n8242
$$ 2832417 2757526 2694375 2602291 2536346 2416510 2330285 2246980 2174551 2102147 2052349 1994107
5234A994107q1244p3235o3831k8021N765l6926q0880m0610n6373l1659k1638m8501
$$ 1994107 1912863 1839628 1775797 1747776 1753541 1716615 1635735 1595125 1538752 1507093 1485455 1436954
5222A436954k4793j5034o0026l3590Q942M107k9825l4582p784p1359l0845l5826
$$ 1436954 1412161 1397127 1337101 1303511 1312453 1316560 1286735 1252153 1244369 1173010 1142165 1106339
5210A106339p547j5498q412m9197n9378l9970m0735L315J811M051j9008k9559
$$ 1106339 1098792 1083294 1074882 1025685 966307 926337 885602 888917 890728 894779 875771 846212
5198H46212l4803L7809J5805J0352o6036k2000J2019q709r239j4455K7744k0158
$$ 846212 811409 849218 865023 875375 809339 787339 799358 790649 781410 766955 794699 774541
5186G74541j8948L7016m842L655l44J1754k7880l7695j6750j8963J7935k1875
$$ 774541 755593 792609 787767 791422 791078 802832 774952 737257 720507 701544 719479 697604
5174F97604j7872N912m8662l016J8157L1862j8606k7743n184m7348k0042L3955
$$ 697604 679732 685644 636982 633966 652123 683985 665379 637636 632452 585104 565062 599017
5162E99017L527Q89m1868m914m7883j2133l7325L227K7886k646j3109M867K9545
$$ 599017 602544 603433 561565 556651 508768 496635 459310 462537 490423 487777 474668 479535 509080
5149E09080R513P483k1552m606k0931j1043l3525P604K047J6872j6777k8282R016
$$ 509080 518593 526076 504524 499918 478987 467944 434419 442023 444070 460942 444165 415883 424899
5136D24899K1451j422J2247N337r126j003J4433K1954k6844j1189M430l9724j0350
$$ 424899 446350 444928 457175 462512 453386 452383 466816 488770 461926 450737 455167 415443 405093
5123D05093j1282J8445j0111M4884J6800j9772J1867J3534M394O7052m8064J8850
$$ 405093 393811 412256 402145 447029 463829 444057 455924 469458 473852 540904 492840 511690
5111E11690P646o4993M9893K1046k5318Q458r181k6269M1013l1383L7913L0614
$$ 511690 519336 454343 504236 525282 499964 508422 499241 472972 513985 482602 520515 551129
5099E51129j2511m6756j550J2604l6082L5435K2745K2137k8958J5254k9211l2822
$$ 551129 538618 491862 490312 502916 466834 502269 525014 547151 518193 533447 504236 471414
5087D71414O270K4364J2678l729k1839n833Q418l1782Q779L242J6323l4304j88
$$ 471414 477684 502048 514726 510997 489158 483325 491743 459961 468740 471982 488305 454001 453813
5074D53813o489l483J8994J8547k7430K2022L4052J8700J5940k353P48j2503Q634
$$ 453813 447324 443841 462835 481382 453952 475974 510026 528726 544666 542313 543061 530558 539192
5061E39192K7970j1043k027k5036J9325K9115K8483M7732j6555r718J5509r17
$$ 539192 567162 556119 554092 529056 548381 577496 605979 653711 637156 627438 642947 642030
5049F42030K8740k9400j7208p041K132J3855m3085k5599K0109M965j1183M903
$$ 642030 670770 641370 624162 617121 619253 633108 590023 564424 584533 589498 578315 583218
5037E83218m2609r995K9823J7026j111M2712l9554l9800J0966J7744M053K833
$$ 583218 540609 530614 560437 577463 576352 619064 579510 539710 550676 568420 572473 575306
5025E75306l1492J9262q946m059J060K3577M5924k8221j4028J0215p01k9716L9383
$$ 575306 543814 563076 554130 550071 551131 574708 620632 592411 578383 588598 587897 558181 597564
5012E97564n07j3104Q52K786n409j803N7435K8734k2280o690N611j7380j537J5510
$$ 597564 597057 583953 584805 587591 582182 580379 637814 666548 644268 637578 643189 625809 624272 639782
4998F39782K0175o444J4297j7726K6542N9145M1545P1612L9938L6893J6808J5020
$$ 639782 659957 653513 667810 650084 676626 735771 777316 848928 888866 925759 942567 957587
4986I57587M4779J3864R761m020J9877J7905k4399L2934P820O461o6577j9503
$$ 957587 1002366 1016230 1025991 1021971 1041848 1059753 1035354 1068288 1076108 1082569 1015992 996489
4974I96489l639k1290L0879o435J3857L3463K210J2799J1270l5312k6466l6448
$$ 996489 992850 971560 1002439 996004 1009861 1043324 1045534 1058333 1069603 1034291 1007825 971377
4962I71377k2148o7003o698j448j1292r521k7380J8631l71J9255k9193N635j6452
$$ 971377 949229 882226 875528 874080 862788 853267 825887 844518 844147 863402 834209 839844 823392
4949H23392j0467J2519J3133k474J3883O060r594l260m557K810n83L2979O623
$$ 823392 812925 825444 838577 836103 849986 856046 846452 843192 838635 841445 840862 873841 880464
4936H80464K7549J3651k501n929l5915P593Q4887R300k5100k0217l1666L1351
$$ 880464 908013 921664 919163 913234 877319 884912 969799 979099 953999 933782 902116 933467
4924I33467J7221K6422k528l020K9011K12r94L2567n949k2806J982j0396K5390
$$ 933467 950688 977110 974582 971562 1000573 1000785 999791 1032358 1026409 1003603 1005585 995189 1020579
4911A020579N1462R564N441Q268k9085K7259k059N8279J4459j0929J2342L0636
$$ 1020579 1072041 1081605 1087046 1095314 1066229 1093488 1091429 1149708 1164167 1153238 1165580 1196216
4899A196216J8993J5478J7995L467K3515k5608l2715K4249K3451K164M4794j3028
$$ 1196216 1215209 1230687 1248682 1252149 1275664 1250056 1217341 1241590 1265041 1267205 1311999 1298971
4887A298971J4719k1640O861L6198N3136l110Q795Q906l2653r69L7391M947K3780
$$ 1298971 1313690 1292050 1298911 1335109 1388245 1385135 1393930 1402836 1370183 1369214 1406605 1411552 1435332
4874A435332L4077l942j2580L4364L2577K9453N2134n8435j1375k8501L2156J4993
$$ 1435332 1469409 1465467 1452887 1487251 1519828 1549281 1601415 1542980 1531605 1503104 1535260 1550253
4862A550253J8581K6310P004K3799L1304M9280M4791J5438j1916P9691N0966L8866
$$ 1550253 1568834 1595144 1602148 1625947 1657251 1706531 1751322 1766760 1754844 1834535 1885501 1924367
4850A924367O0580N7872J06447P3684j0376K1639J7406K9311K1488m5052k5988
$$ 1924367 1984947 2042819 2149266 2222950 2212574 2234213 2251619 2280930 2302418 2257366 2231378
4839B231378k1775O759K2400K2042L3439O9949O4304K5340P4893Q9633P5957Q5652
$$ 2231378 2209603 2216362 2238762 2260804 2294243 2364192 2428496 2453836 2528729 2618362 2694319 2779971
4827B779971J21341J14823J42541K19439M55141P99685J143488J311273J138025
$$ 2779971 2901312 3016135 3158676 3378115 3833256 4632941 5776429 7087702 8225727
4818H225727O66924K06519j01184m04257o45834p11958o84415o93322n82797n04973
$$ 8225727 8892651 9099170 8997986 8593729 7947895 7235937 6551522 5858200 5275403 4770430
4808D770430l34900k91701j84625j40910r4580r4915o1139m0055k8220j9969n0386
$$ 4770430 4435530 4143829 3959204 3818294 3723714 3628799 3567660 3527605 3499385 3479416 3429030
4797C429030k2437j5405K1166Q724L1675M365L0922R497J6499M8521P6608K245
$$ 3429030 3406593 3391188 3412354 3421078 3452753 3457118 3488040 3497537 3514036 3562557 3639165 3641410
4785C641410K9745M2725J9931Q1648N6224M3224J3804K9853K2270O4715N1003
$$ 3641410 3671155 3713880 3733811 3815459 3871683 3914907 3928711 3958564 3980834 4045549 4096552
4774D096552N6650K7547M2268O7477J7579N5186N0831Q5536P4042O0068L1403
$$ 4096552 4153202 4180749 4223017 4290494 4308073 4363259 4414090 4499626 4573668 4633736 4665139
4763D665139Q9931N2081O6486O1054O3921L4826O4813Q8486M8294J13711Q9270
$$ 4665139 4755070 4807151 4873637 4934691 4998612 5033438 5098251 5186737 5235031 5348742 5438012
4752E438012R3950O9116M1619M7784O2781O2485Q4429P2331J07423R3592N4289
$$ 5438012 5531962 5601078 5642697 5690481 5753262 5815747 5900176 5972507 6079930 6173522 6227811
4741F227811J07261R6866R5576Q0877P2986N6732J27895J23253Q6171R7923Q5608
$$ 6227811 6335072 6431938 6527514 6608391 6681377 6738109 6866004 6989257 7075428 7173351 7258959
4730G258959Q1942J19160J39936J13602J26985J00729P2414Q4020J28478J14272
$$ 7258959 7340901 7460061 7599997 7713599 7840584 7941313 8013727 8097747 8226225 8340497
4720H340497J10564R1036J25826Q9802J14010J15012J42351J31829Q6809J08248
$$ 8340497 8451061 8542097 8667923 8757725 8871735 8986747 9129098 9260927 9347736 9455984
4710I455984Q8014J55897P7288J34996J38139J02846R8262J15415J04793J34258
$$ 9455984 9543998 9699895 9777183 9912179 10050318 10153164 10251426 10366841 10471634 10605892
4700A0605892J24198J16196J10453Q5566J15825J12175J31340J23047J08578M1283
$$ 10605892 10730090 10846286 10956739 11042305 11158130 11270305 11401645 11524692 11633270 11674553
4690A1674553J06453R0575R3349J15162J56235R3772P3235O4661O0650J01239
$$ 11674553 11781006 11871581 11964930 12080092 12236327 12330099 12403334 12467995 12528645 12629884
4680A2629884R5278J03542J01790O7544L7392Q9894Q4662N5674P7134Q9150Q7001
$$ 12629884 12725162 12828704 12930494 12998038 13035430 13125324 13209986 13265660 13342794 13431944 13518945
4669A3518945L4644R897N7058O5039P6195O3596J5897M8865J6000L3134L4272
$$ 13518945 13553589 13563486 13620544 13685583 13761778 13825374 13841271 13890136 13906136 13939270 13973542
4658A3973542M8684L5402J162O079P233O1550L212j0629J0025l3514o2673L1840
$$ 13973542 14022226 14057628 14058790 14064869 14072102 14133652 14136864 14126235 14136260 14102746 14040073 14071913
4646A4071913j6907K4856k9724J0296o4221n5532p346q251l7834o7642k5507k1700
$$ 14071913 14055006 14079862 14050138 14060434 13996213 13940681 13933335 13925084 13887250 13819608 13794101 13772401
4634A3772401l2267j106L1161J2771P2571J59260K47866K91639K77391J05567
$$ 13772401 13740134 13739028 13770189 13782960 13855531 14014791 14262657 14554296 14831687 14937254
4624A4937254K0689r6798k04528k85250l19396l03966k64871k38661k09470j72950
$$ 14937254 14957943 14861145 14656617 14371367 14051971 13748005 13483134 13244473 13035003 12862053
4614A2862053j26803j8341K5796O4732R7063M5517M1671L309J9970L1231R0397
$$ 12862053 12735250 12716909 12742705 12807437 12904500 12950017 12991688 12994997 13014967 13046198 13136595
4603A3136595J38591J97848J78542J51967J01964M0872K8977J190J9551Q9189
$$ 13136595 13275186 13473034 13651576 13803543 13905507 13946379 13975356 13976546 13996097 14085286
4593A4085286J43966J57459Q0602n4927j71076k47872k52820k20804k00292j82620
$$ 14085286 14229252 14386711 14467313 14412386 14241310 13993438 13740618 13519814 13319522 13136902
4583A3136902j75952k62388l41153l89338l55772l26945l14049k85541l03495
$$ 13136902 12960950 12698562 12357409 11968071 11612299 11285354 10971305 10685764 10382269
4574A0382269k66452l24350l36353l25912k65111k95452l03575k77589k67813
$$ 10382269 10115817 9791467 9455114 9129202 8864091 8568639 8265064 7987475 7719662
4565G719662k36041j83110j68611j31026j40134j36042r9200j34815o4352p0353
$$ 7719662 7483621 7300511 7131900 7000874 6860740 6724698 6625498 6490683 6426331 6355978
4555F355978p9561j44379p3177p2779p3449p1730m8154m9122l8916n9056m0892
$$ 6355978 6276417 6132038 6058861 5986082 5912633 5840903 5792749 5743627 5704711 5645655 5604763
4544E604763j1279o6514m7677n5366l3955n8174m0406p661J1255j5916n9873n7902
$$ 5604763 5593484 5526970 5479293 5423927 5389972 5331798 5291392 5283731 5294986 5279070 5219197 5161295
4532E161295o5807J4524j0031k9819j0136r197j7244l7186j2133J074L8953R028
$$ 5161295 5095488 5110012 5099981 5070162 5060026 5050829 5033585 4996399 4984266 4985340 5024293 5033321
4520E033321J0805J9848K1645M4747P9916O1696J06662Q8694J36418J50391K18939
$$ 5033321 5044126 5063974 5085619 5130366 5210282 5271978 5378640 5467334 5603752 5754143 5973082
4509E973082L24815M00486N81627Q86531J387940J943226K368776K518020K102879
$$ 5973082 6297897 6698383 7280010 8166541 9554481 11497707 13866483 16384503 18487382
4500A8487382J275232N70771j22812m96697l49087L1941Q08464J956715L066686
$$ 18487382 19762614 20333385 20210573 19713876 19364789 19396730 20205194 22161909 25228595
4491B5228595L777114L395706K006145L64748j136993k309283k638634k482282
$$ 25228595 29005709 32401415 34407560 34772308 33635315 31326032 28687398 26205116
4483B6205116k202775j626183q41581j83939J20072q141m51055j044618j578503
$$ 26205116 24002341 22376158 21534577 21350638 21470710 21462569 21011514 19966896 18388393
4474A8388393j857817j834332j858288j746179j517995j284785j069870q26359
$$ 18388393 16530576 14696244 12837956 11091777 9573782 8288997 7219127 6392768
4466F392768n90360m61743l72408l39761k69898k15598k20311k12358j81480j11665
$$ 6392768 5802408 5340665 4968257 4628496 4358598 4143000 3922689 3710331 3528851 3417186
4456C417186r4300q5719j21944j07216p1814n4905m0082n9254p0972l8159n2362
$$ 3417186 3322886 3237167 3115223 3008007 2936193 2881288 2841206 2781952 2710980 2672821 2620459
4445B620459n7410p1925o8038l0917k3657j7123l3578n4549m5114m0431l3753
$$ 2620459 2563049 2491124 2423086 2392169 2368512 2351389 2317811 2263262 2218148 2177717 2143964
4434B143964P459o3691o3323l6177q693k0113l1337l9082p292n0049M263j5100
$$ 2143964 2151423 2087732 2024409 1988232 1979539 1959426 1928089 1889007 1881715 1831666 1835929 1820829
4422A820829j9476j6653m855l1734p1225n1167p130P119j0991m8384k5071j4434
$$ 1820829 1801353 1784700 1779845 1748111 1676886 1625719 1618589 1625708 1614717 1566333 1541262 1526828
4410A526828m650m1508k8315l061K0011P643n0317k9073j0540K7505J2132Q754
$$ 1526828 1522178 1480670 1452355 1449294 1469305 1476948 1426631 1397558 1387018 1414523 1426655 1435409
4398A435409m5913n1300j4892R614L9405J7387L6583j2434j272j822j4376K104
$$ 1435409 1389496 1338196 1323304 1332918 1372323 1389710 1426293 1413859 1412587 1410765 1396389 1398493
4386A398493J213R51p140l6977j7629L3712N8485N161N93k1929k025q272j4167
$$ 1398493 1399706 1400657 1393517 1356540 1338911 1372623 1431108 1436269 1436862 1414933 1412908 1404636 1390469
4373A390469P177j1434n807n5154n3711j0331K4225q965P624j8878K8937J0953
$$ 1390469 1397646 1386212 1380405 1325251 1271540 1261209 1285434 1276469 1284093 1265215 1294152 1305105
4361A305105l8102k3755p426l9951j3005j400q470j2270K1870K5382m8746J780
$$ 1305105 1267003 1243248 1235822 1195871 1182866 1181466 1172996 1160726 1182596 1207978 1159232 1161012
4349A161012p301m709N897J7414q071r088j7823n2641K3638P340j2255K5719j354
$$ 1161012 1153711 1149002 1154899 1172313 1164242 1155154 1137331 1084690 1108328 1115668 1103413 1129132 1127778
4336A127778o2570K1334j1907L8237J5839k7925r880k0448k2638J434P974K7421
$$ 1127778 1065208 1086542 1074635 1112872 1128711 1100786 1090906 1070458 1047820 1049254 1057228 1084649
4324A084649K1212l5288m0769l935J8793J99Q384k278K5391J1295j386O759K1939
$$ 1084649 1105861 1070573 1029804 1025869 1044662 1044861 1053245 1050967 1076358 1087653 1086267 1093026 1114965
4311A114965R878p58L3491o82p875r158J4037M730J6515J2298R109J6419L3816
$$ 1114965 1124843 1124085 1157576 1156894 1149019 1139861 1153898 1158628 1175143 1187441 1196550 1212969 1246785
4298A246785K4941j1532J4108k3523o752P364N8691j2484O768L3192r131J7663
$$ 1246785 1271726 1260194 1274302 1250779 1244027 1251391 1310082 1297598 1304366 1337558 1328427 1346090
4286A346090J4478j8014n530P60K1208N8678O8999N2594L0246L3279M4329M4701
$$ 1346090 1360568 1342554 1337024 1337784 1358992 1417670 1486669 1539263 1569509 1602788 1647117 1691818
4274A691818L0701K3383L4937N6132P3602P5454P4893J50556J46826J12833J33875
$$ 1691818 1722519 1745902 1780839 1836971 1910573 1986027 2060920 2211476 2358302 2471135 2605010
4263B605010J25624J25265R6043P5031J34962K10144K42993L06149L16245M04372
$$ 2605010 2730634 2855899 2951942 3026973 3161935 3372079 3615072 3921221 4237466 4641838
4253D641838M72407M07479L99768L69324L37047K13218J78759J87293J91963K68660
$$ 4641838 5114245 5521724 5921492 6290816 6627863 6841081 7019840 7207133 7399096 7667756
4243G667756L79283M81082O45808P83253R00833Q62839Q10499O52971M00006K39934
$$ 7667756 8047039 8528121 9173929 9957182 10858015 11720854 12531353 13184324 13584330 13824264
4233A3824264J7134p2176r6470r7537Q336K39954M49425O81999P89749R53102
$$ 13824264 13841398 13769222 13672752 13575215 13583551 13823505 14272930 14954929 15744678 16697780
4223A6697780Q54464O15431L25640j2973l03943n69003o86420p60584o52032n15334
$$ 16697780 17552244 18167675 18493315 18480342 18176399 17607396 16920976 16160392 15508360 14993026
4213A4993026k72684n1202J97813L37443L19635K41027J6463k47203m67622p02019
$$ 14993026 14720342 14669140 14866953 15204396 15524031 15765058 15781521 15534318 15066696 14364677
4203A4364677q53490r14133r22389q35114p16879n00869l82166k21746j43347
$$ 14364677 13511187 12597054 11674665 10839551 10122672 9621803 9239637 9017891 8874544
4194H874544j24731j88107k55614l29745m69666n00526n68550n42788n19776m54757
$$ 8874544 8749813 8561706 8306092 7976347 7506681 7006155 6437605 5894817 5375041 4920284
4184D920284m28392l24021k36196j81049k10189j82557j63035j53098j82507j63081
$$ 4920284 4491892 4167871 3931675 3750626 3540437 3357880 3194845 3041747 2859240 2696159
4174B696159j35276k23499j28423j54422j23713j14602q1358q7161o3786p1265
$$ 2696159 2560883 2337384 2208961 2054539 1930826 1816224 1734866 1647705 1583919 1512654
4164A512654p5100q2793m7455n3437n1593k4538o7120j9576m2810M748M282j8528
$$ 1512654 1437554 1354761 1307306 1253869 1202276 1177738 1110618 1091042 1048232 1052980 1057262 1038734
4152A038734p4373m9880m3109j7868j2344k2063R411j8611m040j0562k1459k337
$$ 1038734 964361 914481 871372 853504 841160 819097 828508 809897 805857 795295 773836 771499
4140G71499J9885n4234j9146j6517j5726k5309M4421l632l9036j8009l1344m645
$$ 771499 791384 737150 718004 701487 685761 660452 704873 701241 662205 644196 612852 608207
4128F08207k1038K904O519j4731j7096J5239r693L488l7519K3723r247j6429k0299
$$ 608207 587169 590073 596592 581861 564765 580004 570311 573799 536280 560003 550756 534327 514028
4115E14028K1802Q666l8087J3925p683k0813K983L6439j7722R445k7045k727O931
$$ 514028 535830 544496 506409 520334 512651 491838 494821 531260 513538 522983 495938 493211 500142
4102E00142k5268k5166J0708K696j3044k3121K09L6564K6595J3286m2849j7741
$$ 500142 474874 449708 460416 463112 450068 426947 427156 463720 490315 503601 460752 443011
4090D43011K197k1063n390N5260j7942L418j7252J6751l973j7626M5044k2965
$$ 443011 445208 424145 418755 474015 456073 459491 442239 458990 455017 437391 482435 459470
4078D59470k1532p080J2089J7316K2731K1943l201k3804N290P648m45J3826j64
$$ 459470 437938 430858 442947 460263 482994 504937 501736 477932 483222 490870 490425 504251 504087
4065E04087l431k4271k39r634L4613M5379O121o878m4074N067K0096J5982j7056
$$ 504087 500656 476385 476146 466512 501125 546504 552625 545747 501673 506740 526836 542818 525762
4052E25762k5977k645O954r830N2906L5603J9328k5955J5155J7370l7220l412
$$ 525762 499785 497140 504094 494264 547170 582773 602101 576146 591301 608671 571451 568039
4040E68039L0497N871k5142P805m366J5301J0261J8721J0793O55l0543j7199l0764
$$ 568039 598536 604407 579265 587070 582704 598005 608266 626987 637780 638435 607892 590693 559929
4027E59929k0283J0078R765l7341p916J5032k927j708j2888R131n0840J9478o607
$$ 559929 539646 549724 559489 522148 514232 529264 526337 524629 511741 520872 470032 489510 482903
4014D82903j689K9544l727J7688k7478m542l1333n219m1343K509l9639M892K8050
$$ 482903 481214 510758 507031 524719 497241 492699 461366 456147 414804 417313 377674 382566 410616
4001D10616K4737j666n086k2997K4906J3822k9620J6428j9002j1851j9922J7543
$$ 410616 435353 433687 428601 405604 430510 444332 414712 431140 412138 400287 380365 397908
3989C97908l5445J9707M1873L6878j7212j7888l9927O714k4501j1211J664L0330
$$ 397908 362463 382170 424043 460921 443709 425821 385894 392608 368107 356896 358560 388890
3977C88890j3692l479J6172n6621L0285M3212M418l2685J0390J2132j238j2103
$$ 388890 375198 371719 387891 331270 361555 404767 409185 376500 386890 399022 397784 385681
3965C85681L443L1363m675j6225M5432J4465K206m391l678J4499l2604K9614M3210
$$ 385681 389124 420487 415812 399587 445019 459484 461690 457299 453621 468120 435516 465130 508340
3952E08340O1987J6215L880Q874K2036N6227J12994J65840J84077K03246J51063
$$ 508340 570327 586542 590422 599296 621332 677559 790553 956393 1140470 1343716 1494779
3941A494779J34706N3615M3019l0268l7501q6670j21673j07908q1380n0278p3356
$$ 1494779 1629485 1683100 1726119 1695851 1658350 1571680 1450007 1342099 1260719 1210441 1137085
3930A137085q132K4382J5858K6724M5177N8676O4361M662Q140j9759J3475J7003
$$ 1137085 1128953 1153335 1169193 1195917 1241094 1299770 1364131 1368793 1376933 1357174 1370649 1387652
3918A387652j7381Q487J4952L5489J23516J34604J43747J89251J13830J7758n565
$$ 1387652 1370271 1378758 1393710 1429199 1552715 1687319 1831066 2020317 2134147 2151905 2146340
3907B146340q3669j10804j16378j12204j41985j54104r2065j13951q6635m9401
$$ 2146340 2062671 1951867 1835489 1723285 1581300 1427196 1335131 1221180 1134545 1085144
3897A085144l5396o5229o3624j264k9552k1580l6860j8705j8010p467l0038m8067
$$ 1085144 1049748 984519 920895 919631 890079 868499 831639 812934 794924 787457 757419 709352
3885G09352K7265l4473j9729k0288P873l1179N613J2350j1505l4469j7649K5976
$$ 709352 736617 702144 682415 662127 670000 638821 644434 656784 645279 610810 593161 619137
3873F19137k9868l7581k3630P615M366k642n770j4025r113K7534M0601o254j9539
$$ 619137 589269 551688 528058 535673 540039 537397 531627 517602 508489 536023 576624 570370 550831
3860E50831n3714n6884J8228K9822K0821l0308K0615p781P592J6193l9347m056
$$ 550831 497117 440233 458461 488283 509104 478796 499411 491630 499222 515415 476068 472012
3848D72012j8899K132k5824N8229K4751o981O566p968J3949l4095M020L0101K4510
$$ 472012 453113 455245 429421 487650 512401 505420 511986 504018 517967 483872 487892 517993 542503
3835E42503k4716J2850K1019o051j2142J2837J5553R865Q690l7751K3273m1252
$$ 542503 517787 530637 551656 545605 533463 546300 561853 571718 580408 542657 565930 524678
3823E24678j0430J2595K9332k957K1355J0125K0666M8980J4732l1707J2623K4600
$$ 524678 514248 526843 556175 553218 574573 584698 605364 654344 669076 637369 649992 674592
3811F74592M632M2301J1891K0323o135K3017J5920P6851R500J4441K7598j8427
$$ 674592 679224 721525 733416 753739 747604 770621 786541 863392 872892 887333 914931 896504
3799H96504m1502M4297M8330R191J390j9324p991M8336P4555j9920K0801J7246
$$ 896504 855002 899299 947629 956820 958210 938886 930895 979231 1053786 1033866 1054667 1071913
3787A071913J089j4233l3693j6871M4469L5226M7452k4668m9070N1395m478J4786
$$ 1071913 1073002 1058769 1025076 1008205 1052674 1087900 1135352 1110684 1061614 1113009 1108531 1123317
3775A123317j3612J3253j7583L2090K4223O497M4874L7743J7653K1541M3097J2553
$$ 1123317 1109705 1122958 1105375 1137465 1161688 1168185 1213059 1250802 1268455 1289996 1333093 1345646
3763A345646L7978M2800N4343N0686P0759L6706Q2356P9474Q5263Q1846P3710
$$ 1345646 1383624 1426424 1480767 1531453 1602212 1638918 1721274 1800748 1886011 1967857 2041567
3752B041567Q2480N3450Q3488J48305R5598N6477N8593J5176K7729j8875N2506
$$ 2041567 2124047 2177497 2260985 2409290 2504888 2561365 2619958 2635134 2662863 2643988 2696494
3741B696494J3039j1137k2986m8225m5253n8923k0449l8575j2274l3645o9931
$$ 2696494 2709533 2698396 2675410 2627185 2581932 2523009 2502560 2463985 2451711 2418066 2348135
3730B348135m7958m4713j12635p3120n1189n2657k8647o548J6489O408j5006m2100
$$ 2348135 2300177 2255464 2142829 2069709 2018520 1965863 1937216 1930668 1947157 1953565 1938559 1896459
3718A896459l1557j4141J1442k090K0370J3500n82m92m69j1783J7813L2445k8614
$$ 1896459 1864902 1850761 1862203 1860113 1880483 1893983 1893401 1892909 1892440 1880657 1898470 1930915 1902301
3705A902301l429K1631K5991L0734O4585L0839J5867N6733Q397K4854M4006K1407
$$ 1902301 1898872 1920503 1946494 1977228 2041813 2072652 2088519 2145252 2153649 2178503 2222509 2243916
3693B243916J9696K0455K545M438j3655K5083K0027n394J9374N766j0800K2864
$$ 2243916 2263612 2284067 2286612 2291050 2277395 2302478 2322505 2317111 2336485 2342251 2331451 2354315
3681B354315K9670K3650J9658l9735J6738L238K9047K6131K8788K150K1536K4905
$$ 2354315 2383985 2407635 2427293 2387558 2404296 2407534 2436581 2462712 2491500 2493650 2515186 2540091
3669B540091M8113j1265K8736L3660N844L9921M3253P7402L1754L2699M1693Q6136
$$ 2540091 2588204 2576939 2605675 2639335 2645179 2685100 2728353 2805755 2837509 2870208 2911901 2998037
3657B998037M1557P6204L9678O7531Q9583R3621M1816J23446J30524R9739J27612
$$ 2998037 3039594 3115798 3155476 3223007 3312590 3406211 3448027 3571473 3701997 3801736 3929348
3646C929348J16610J66632J38956J63507R6461K26998K21254K51334L10633L27530
$$ 3929348 4045958 4212590 4351546 4515053 4611514 4838512 5059766 5311100 5621733 5949263
3636E949263L57746M61278N83138O81442Q01705R38688J110695J432473J818446
$$ 5949263 6307009 6768287 7351425 8032867 8834572 9773260 10883955 12316428 14134874
3627A4134874K190370K691359L115738L523306L713705L853233L755689L508051
$$ 14134874 16325244 19016603 22132341 25655647 29369352 33222585 36978274 40486325
3619D0486325L011250K466154J760312J042274L93754q1903l95865n78879m17804
$$ 40486325 43497575 45963729 47724041 48766315 49160069 49078166 48682301 48103422 47685618
3610D7685618k23607R4715M00155O26549O97317O23142L24817j32694o78046j299771
$$ 47685618 47462011 47556726 47956881 48583430 49280747 49903889 50228706 50096012 49417966 48118195
3600D8118195j942201k504450k916724l258414l398310l395726l276896l027937
$$ 48118195 46175994 43671544 40754820 37496406 34098096 30702370 27425474 24397537
3592B4397537k699615k405534k076651j789764j546218j264911r94538q62922
$$ 24397537 21697922 19292388 17215737 15425973 13879755 12614844 11620306 10757384
3584A0757384p29896o58079n94886m76702m27063l64773l08650k65613k43046
$$ 10757384 10027488 9369409 8774523 8297821 7870758 7505985 7197335 6931722 6688676
3575F688676k23555k13672j28827j37375j34126j33207p0732n8879r5305m9536
$$ 6688676 6465121 6251449 6122622 5985247 5851121 5717914 5647182 5588303 5492998 5443462
3565E443462k173n3084k2635j1986l3141J1106k47j0842j2452m4709k8212J4772
$$ 5443462 5441289 5388205 5365570 5353584 5320443 5331549 5331302 5320460 5308008 5263299 5235087 5249859
3553E249859M6008L4947N7393O7793J5953L3805J848P0481N0067O0170O8954j8457
$$ 5249859 5295867 5330814 5388207 5456000 5471953 5505758 5507606 5578087 5628154 5688324 5757278 5738821
3541E738821O9668Q5530R1757J30934J68143J82325J80625K52340K65984K33922
$$ 5738821 5808489 5894019 5985776 6116710 6284853 6467178 6647803 6900143 7166127 7400049
3531G400049K89848K86350K64624K40423K05933J80219J82114J35986J00798O0245
$$ 7400049 7689897 7976247 8240871 8481294 8687227 8867446 9049560 9185546 9286344 9346589
3521I346589L6424M9113R4078J16458R2321J06614J01660J08052J05394L6918
$$ 9346589 9383013 9432126 9526204 9642662 9734983 9841597 9943257 10051309 10156703 10193621
3511A0193621L9486k3691o7977m3273p6057o6408m8881j4942J6526O0658N8960
$$ 10193621 10233107 10209416 10141439 10098166 10022109 9955701 9906820 9891878 9908404 9969062 10028022
3500A0028022J04284J73453J88754K95363L40689L55559M81930N41317O30514
$$ 10028022 10132306 10305759 10494513 10789876 11130565 11486124 11968054 12509371 13139885
3491A3139885P70802R06285J024964J204349J331741J554475J726502J921472
$$ 13139885 13910687 14816972 15841936 17046285 18378026 19932501 21659003 23580475
3483B3580475K100073K337439K461022K636044K911471L116543L407464L670020
$$ 23580475 25680548 28017987 30479009 33115053 36026524 39143067 42550531 46220551
3475D6220551L943579M133642M275839M329871M308949M209414L961704L628141
$$ 46220551 50164130 54297772 58573611 62903482 67212431 71421845 75383549 79011690
3467G9011690L288495K874765K510472K237435J974787J750320J606385J382763
$$ 79011690 82300185 85174950 87685422 89922857 91897644 93647964 95254349 96637112
3459I6637112J191765R02069N89077J64112l65794q76406j487228k013953k544061
$$ 96637112 97828877 98730946 99320023 99484135 99118341 98241935 96754707 94740754 92196693
3450I2196693l021984l350497l636261l887752l971501l948409l924424l821486
$$ 92196693 89174709 85824212 82187951 78300199 74328698 70380289 66455865 62634379
3442F2634379l549252l226767k784360k235280j509284o13949K66900J171252
$$ 62634379 59085127 55858360 53074000 50838720 49329436 48715487 48982387 50153639
3434E0153639K072471K949851L618733M197534M541328M528121M251166L740034
$$ 50153639 52226110 55175961 58794694 62992228 67533556 72061677 76312843 80052877
3426H0052877L138705K356544J530802P97802J61825m50273q56203j093226j165563
$$ 80052877 83191582 85548126 87078928 87876730 88038555 87588282 86732079 85638853 84473290
3417H4473290j073119q66225n74249l37746j61685l8940K015j66651l61104p77037
$$ 84473290 83400171 82533946 81959697 81621951 81460266 81421326 81423341 81256690 80895586 80118549
3407H0118549j300524j940151k580065l146710l621051l966666m196137m268866
$$ 80118549 78818025 76877874 74297809 71151099 67530048 63563382 59367245 55098379
3399E5098379m254761m119702l933269l665765l380577l061209k751732k517407
$$ 55098379 50843618 46723916 42790647 39124882 35744305 32683096 29931364 27413957
3391B7413957k265296k038679j767408j596350j397228j241002j133459r49478
$$ 27413957 25148661 23109982 21342574 19746224 18348996 17107994 15974535 15025057
3383A5025057q58632o87700n87919n20688m83902m02615l40617k51976k33349
$$ 15025057 14166425 13478725 12890806 12370118 11886216 11483601 11142984 10891008 10657659
3374A0657659j89791j33109q0676o9893k6652R9410J81673J93867K99358L31575
$$ 10657659 10467868 10334759 10254083 10184190 10157538 10256948 10438621 10632488 10931846 11263421
3364A1263421M15983N20241O16967O24103N92903N96284N37679M89923M01214
$$ 11263421 11679404 12199645 12816612 13440715 14033618 14629902 15167581 15657504 16058718
3355A6058718L04710J51503O9957j31654k37898k98404l67939l93700m06721m74109
$$ 16058718 16363428 16514931 16584888 16453234 16215336 15916932 15548993 15155293 14748572 14274463
3345A4274463n45274n95300o62999o31302o26932o17745n70381n48272m75427
$$ 14274463 13729189 13133889 12470890 11839588 11212656 10594911 10024530 9476258 9000831
3336I000831m14353l24188k23820j93647j44701j05952p7946k5554k1461K3311
$$ 9000831 8586478 8262290 8038470 7844823 7700122 7594170 7516224 7490670 7469209 7492520
3326G492520N0349R3447J19387J91927J57556K13988K47249L03638M10112M43881
$$ 7492520 7542869 7636316 7755703 7947630 8105186 8319174 8566423 8870061 9280173 9724054
3316I724054N79890O86300Q79589J090646J299530J607890K019588K525339L003645
$$ 9724054 10303944 10990244 11869833 12960479 14260009 15867899 17887487 20412826 23416471
3307B3416471L539131M007084M405952M726774M935470N067291M981449M750372
$$ 23416471 26955602 30962686 35368638 40095412 45030882 50098173 55079622 59829994
3299E9829994M285779L575477K609112J494539L07758q77296k003921l023224
$$ 59829994 64115773 67691250 70300362 71794901 72102659 71225363 69221442 66198218
3291F6198218l853535m446470m876896n024046m951475m777832m488991m062418
$$ 66198218 62344683 57898213 53021317 47997271 43045796 38267964 33778973 29716555
3283B9716555l599386l193825k761682k387687j990275j688734j517544j252984
$$ 29716555 26117169 22923344 20161662 17773975 15783700 14094966 12577422 11324438
3275A1324438j068580r20511p29035o29312n39832n27193m20489l40135l21376
$$ 11324438 10255858 9335347 8606312 7977000 7437168 6909975 6489486 6149351 5827975
3266E827975k94978k39370k05431j77719j68596k01504j52124r9638r7468j21051
$$ 5827975 5532997 5293627 5088196 4910477 4741881 4540377 4388253 4288615 4191147 4070096
3256D070096j22045j20565p9615p3900k5233o7861p9985n0254l4681k350o88J4486
$$ 4070096 3948051 3827486 3747871 3673971 3648738 3580877 3500892 3450638 3415957 3413607 3412919 3427405
3244C427405j93j0186j436Q3448M4748N0264M4505l417m708l5467p9705m1063
$$ 3427405 3427212 3417026 3415590 3499038 3543786 3594050 3638555 3635138 3630430 3594963 3515258 3474195
3232C474195n7975j12928m7101p8045j11937n8255m1225j15713l8607p8214n4665
$$ 3474195 3416220 3303292 3256191 3178146 3066209 3007954 2966729 2851016 2812409 2734195 2679530
3221B679530k8902r1209q5320p0477o4526l5983p5851q5814o8360l8456K1897
$$ 2679530 2650628 2559419 2474099 2403622 2339096 2303113 2227262 2141448 2073088 2034632 2056529
3210B056529j44l934j265J7821K984N1138O8838P7716P0709N1185J9431M940N3645
$$ 2056529 2056385 2052451 2051186 2069007 2071991 2123129 2191967 2269683 2340392 2391577 2411008 2415948 2469593
3197B469593M9826K6884l6204r003J1452J8032j907O5106J7020j343j5355m6292
$$ 2469593 2519419 2546303 2510099 2501096 2512548 2530580 2528673 2593779 2610799 2609456 2594101 2547809
3185B547809j5856k5883J218r215Q159j0684N1661O4383K9315M2920J5238J3352
$$ 2547809 2531953 2506070 2507288 2498073 2506232 2495548 2547209 2611592 2640907 2683827 2699065 2712417
3173B712417P3319K4290L1272o338l082k450m7212j0984J6174K1419K3512M6998
$$ 2712417 2785736 2810026 2841298 2834960 2831878 2829428 2782216 2771232 2787406 2808825 2832337 2879335
3161B879335J0038J1077N5130N3210Q9111Q8608J19561J29234J13647J04571J57450
$$ 2879335 2889373 2900450 2955580 3008790 3097901 3186509 3306070 3435304 3548951 3653522 3810972
3150C810972J96658K07777K10956K37772K65969K97489K54924J90472J33242L7411
$$ 3810972 4007630 4215407 4426363 4664135 4930104 5227593 5482517 5672989 5806231 5843642
3140E843642p142r6929j11110o8985q7566j53670o1014m2578k4214L1060J04536
$$ 5843642 5836500 5739571 5628461 5559476 5471910 5318240 5257226 5214648 5190434 5221494 5326030
3129E326030J87461K10049K11842K00774J63333J49338J38214J32819J11184P1013
$$ 5326030 5513491 5723540 5935382 6136156 6299489 6448827 6587041 6719860 6831044 6902057
3119F902057N0357N7842P0095M2078R3116J03306J48911J23132J38587J32090
$$ 6902057 6952414 7010256 7080351 7122429 7215545 7318851 7467762 7590894 7729481 7861571
3109G861571P7596J44520J00696J22992J65028K02960J98852K59336K52082K80479
$$ 7861571 7939167 8083687 8184383 8307375 8472403 8675363 8874215 9133551 9385633 9666112
3099I666112L61510M56469N82832O59130P23538P00746O72871N87824N50901N26865
$$ 9666112 10027622 10484091 11066923 11726053 12449591 13150337 13823208 14411032 14961933 15488798
3089A5488798M91906N01800N78728O58773Q27806J048757J317801J623266K029923
$$ 15488798 15980704 16482504 17061232 17720005 18547811 19596568 20914369 22537635 24567558
3080B4567558K504189L082228L684706M308727M920667N579456O586821Q333886
$$ 24567558 27071747 30153975 33838681 38147408 43068075 48647531 55234352 63568238
3072F3568238J1337283J6472017K4226989L3723197M1709558M3989823L8351513
$$ 63568238 74905521 91377538 115604527 149327724 191037282 235027105 273378618
3065B73378618K6297266J2143674j195072j3184953k2656409k8415259l0725024
$$ 273378618 299675884 311819558 310624486 297439533 274783124 246367865 215642841
3058B15642841l0508881k8475600k5349929k1528250j7335951j3490578j0560111
$$ 215642841 185133960 156658360 131308431 109780181 92444230 78953652 68393541
3051F8393541q583155p268580o298278n394999m630091l897496l290114k748687
$$ 68393541 59810386 52541806 46243528 40848529 36218438 32320942 29030828 26282141
3043B6282141k335479k010928j750009j555272j333920j210283j048077q88492
$$ 26282141 23946662 21935734 20185725 18630453 17296533 16086250 15038173 14149681
3035A4149681p33631n58623m93053m77510m32757m06525l51841l69028l15457
$$ 14149681 13416050 12857427 12364374 11886864 11454107 11047582 10695741 10326713 10011256
3026A0011256k93838l51939l28108l10884l13179k89375k28066k36219k25690
$$ 10011256 9717418 9365479 9037371 8726487 8413308 8123933 7895867 7659648 7433958
3017G433958k17986j92464k25015j84063k53024k23084k10247k09144j85051j82091
$$ 7433958 7215972 7023508 6798493 6614430 6361406 6138322 5928075 5718931 5533880 5351789
3007E351789j79902j63384j31451j40600j27481j23326q6650r6777r9387j32305
$$ 5351789 5171887 5008503 4877052 4736452 4608971 4485645 4398995 4302218 4202831 4070526
2997D070526j36258j18466j07347j49728j50045r8116p5191j19708j32884j00972
$$ 4070526 3934268 3815802 3708455 3558727 3408682 3310566 3235375 3115667 2982783 2881811
2987B881811j14154r0348o0091j09381j16873p5003p2549n5183o4236l7328l1922
$$ 2881811 2767657 2677309 2617218 2507837 2390964 2315961 2243412 2188229 2123993 2086665 2054743
2976B054743l5099n958L4124j6226K7371J6142q466l632N02M2950j3659l2303
$$ 2054743 2019644 2013686 2047810 2031584 2058955 2075097 2066631 2062999 2063501 2106451 2092792 2060489
2964B060489m1800q3183m7598m9189n9261n1042k5490j4702j9457l8267l7906
$$ 2060489 2018689 1935506 1887908 1838719 1779458 1728416 1702926 1688224 1668767 1630500 1592594
2953A592594k5412k2382j2654j0068k5047o666p027m6062k3401k2066m7958r6103
$$ 1592594 1567182 1544800 1532146 1522078 1497031 1490365 1483338 1437276 1413875 1391809 1343851 1247748
2941A247748j16134o8252k7420l7194k0171m6790l0756n5171n0897j3306k6924
$$ 1247748 1131614 1063362 1035942 998748 978577 931787 901031 845860 794963 781657 754733
2930G54733j7614m2613j9972K2765L4714j7317j7005M4832M2344L8466Q280K1539
$$ 754733 737119 694506 674534 697299 732013 714696 697691 742523 784867 823333 831613 853152
2918H53152L2488j2679k0498L228m1578l7425n3880j9707l3692o86o7085n6540
$$ 853152 885640 872961 852463 855691 814113 776688 722808 703101 669409 668723 601638 545098
2906E45098l4962l9078J2422j6938j1784J0595r571L0098J5983j3235P0563m589
$$ 545098 510136 471058 483480 466542 454758 465353 455782 485880 501863 488628 559191 554602
2894E54602k2493m1760N2631K8912L3685L8001n062L5669N1468j8145p306M3392
$$ 554602 532109 490349 542980 571892 605577 643578 638516 674185 725653 707508 700202 743594
2882G43594p413k5176m2596J319o0653J3965k8213O527l1561j1146l0068O77L687
$$ 743594 736181 711005 668409 669728 609075 623040 594827 601354 569793 558647 528579 529256 532943
2869E32943m3007j0790k8240J1950j5564L0745N1097m46l5409O669l4208J9074
$$ 532943 489936 479146 450906 462856 447292 478037 529134 528688 493279 499948 465740 484814
2857D84814K8423o655l1169o1097l0714k2715q577j444k4565n0189O267k4050
$$ 484814 513237 506582 475413 414316 383602 360887 352310 350866 326301 276112 282379 258329
2845B58329m4305j7869j1207l8377J1790K7441j8703J2631J1021K1622K3751J3112
$$ 258329 214024 196155 184948 146571 158361 185802 167099 179730 190751 212373 236124 249236
2833B49236k0354l8814j6737j0639K5889M8190j7162P481L0438N253m970l724
$$ 249236 228882 190068 173331 162692 188581 236771 219609 227090 257528 262781 257811 254087
2821B54087m4965k0233R80k218k8694j638K9500L029l5963k2608k8603K5256N5544
$$ 254087 209122 188889 189869 187651 158957 157319 186819 189848 153885 131277 102674 127930 183474
2808A83474J8879j2498J0339L537M8409L9493Q499k9241J5618M5322l5008j3757
$$ 183474 202353 189855 200194 203731 252140 291633 300132 270891 286509 331831 296823 283066
2796B83066J7149K3772J9229K3454J5877k5304M3921J37365O9649J11733J93909
$$ 283066 300215 323987 343216 366670 382547 357243 401164 538529 608178 719911 913820
2785I13820K15955J86698J56610J45180Q2863J8170o7995j10533j55900j63945
$$ 913820 1129775 1316473 1473083 1618263 1701126 1719296 1651301 1540768 1384868 1220923
2775A220923j71559j46598j49496q1114j26835p0377m4106n6778n207M228n3621
$$ 1220923 1049364 902766 753270 672156 545321 474944 430838 374060 368853 373081 319460
2764C19460n4592o370k1003k9407k2106j7886k4779j6369j8243O924j3699J3302
$$ 319460 264868 258498 237495 208088 185982 168096 143317 126948 108705 115629 101930 115232
2752A15232J0251J3103l2911J2415L4596l8220m676q983l1507J791K20P908n488
$$ 115232 125483 138586 105675 118090 152686 114466 109790 100807 69300 71091 71311 79219 73731
2739G3731P813Q674J592j3943r536k0996K5054j2151N245J9614m93n0519J7137
$$ 73731 81544 90218 91810 77867 68331 47335 72389 60238 65483 85097 84604 34085 51222
2726E1222K6383K6166k6074k3261j4386N77N081k9409k8127k5862O936Q421K2719
$$ 51222 77605 103771 77697 54436 40050 40627 45708 16299 -11828 -37690 -30754 -22333 386
2713C86L2487l293k5490r512p239K4330j4631K6926L0039L21K8306m189l093k0001
$$ 386 32873 29580 4090 -5422 -12661 11669 -2962 23964 54003 54324 82630 78441 75348 55347
2699E5347J11q754P933l7027J7675j2203M256J9580j2376P564j5072p331m356
$$ 55347 55458 46704 54637 17610 35285 23082 27338 46918 34542 42106 27034 19703 15347
2686A5347N0751j5308J2488k9043O900L6968R384k2645J5806O412J3473l0064
$$ 15347 66098 50790 63278 34235 41135 78103 87487 64842 80648 87060 100533 70469
2674G0469n1248K4329M119L3865k8309J6435O924p601j4883J2895K6688P004P419
$$ 70469 19221 43550 47669 81534 53225 69660 76584 68983 54100 66995 93683 100687 108106
2661A08106k626R94k5433K8699j8249J045P373K5916n17K7179l1771m0102k1899
$$ 108106 105480 106474 81041 109740 91491 92536 99909 125825 125308 152487 120716 80614 58715
2648E8715j6213L8213j4130j6129L5514k6991l4222R102j5380K1405K0931J4317
$$ 58715 42502 80715 66585 50456 85970 58979 24757 33859 18479 39884 60815 75132
2636G5132j4522m0712j6436O687j2884K563L8990k6413M954K1222L3588L079k4736
$$ 75132 60610 19898 3462 10149 -2735 -172 38818 12405 17359 38581 72169 75248 50512
2623E0512l3224k4446o980K0110J5588J4993M4064l256j3246j0094J1721r577
$$ 50512 17288 -7158 -14138 5972 21560 36553 80617 77361 64115 54021 65742 56165
2611E6165j3959O016j316k7192N384M5116j2253K6251p800m0408Q265j8152j2847
$$ 56165 42206 48222 46906 19714 25098 70214 57961 84212 76412 36004 44269 26117 13270
2598A3270k457l474n661k8170M8822K8834m995L0056J7149j3481k7891j6103l7380
$$ 13270 10813 7339 1678 -26492 22330 51164 46169 76225 93374 79893 52002 35899 -1481
2585a481L7661L5022M8085N074M4358L6585J2988L5106L334j9787j9173l4075
$$ -1481 36180 71202 119287 124361 168719 205304 218292 253398 256732 236945 217772 183697
2573A83697k9412l1648k347J3390j2490m746k8396p62l6020m411P567k494m2653
$$ 183697 154285 122637 120290 133680 121190 116444 88048 87286 51266 46855 54422 51928 9275
2560I275l417L1791J3189J9534p064l158l117L4703n1041k3729o967Q036L9955
$$ 9275 5858 37649 50838 70372 63308 60150 57033 91736 40695 16966 9999 18035 57990
2547E7990j1938k3183o302J411L8939J8734j0829Q592q742j7858M614J5768P590
$$ 57990 46052 22869 16567 17978 56917 75651 64822 73414 64672 46814 51428 67196 74786
2534G4786r681l805Q30L2073k467k1596O029o189l0843k2910K4936L5967l4942
$$ 74786 65105 61300 62130 94203 91736 70140 76169 69980 39137 16227 41163 77130 42188
2521D2188R625J842K036J3235Q166L852k4739k4554m7421n704R710L8818L853
$$ 42188 51813 53655 55691 68926 77092 80944 56205 31651 -15770 -21474 -11764 27054 30907
2508C0907L5114j2286L877J4728m6271J0932J2908m1562K911j1374j2363J4984
$$ 30907 66021 53735 57612 72340 26069 37001 49909 8347 11258 -116 -12479 2505
2496B505M7975N5495k7179l1690k02J58p171o171j6807K5079J1490n1391L6112
$$ 2505 50480 105975 78796 47106 46904 47062 39891 33720 16913 41992 53482 2091 38203
2483C8203M830L2778K2794n2750k7344J9883l318M23Q292K5704k49K3258L423
$$ 38203 43033 75811 98605 45855 18511 38394 35076 35499 43791 69495 69246 92504 95927
2470I5927l9239K6519K2847N89n6214j480l941l05J3694M2810j1317k093r774
$$ 95927 56688 83207 106054 106643 50429 48949 45008 44703 58397 101207 89890 87797 78023
2457G8023l3812K5425K3888K27j8197m1310m5678N6238l463J2937R731M618K9616
$$ 78023 44211 69636 93524 93751 75554 34244 -11434 44804 41341 54278 64009 68627 98243
2444I8243J2192j7333j8096K5971J5251l5297ML1602l230L1099N030K1864k3263
$$ 98243 110435 93102 75006 100977 116228 80931 80935 112537 109307 140406 145436 167300 144037
2431A44037k782l6848r829N71n536J5014m346l483K3413N2794k2310N226J046
$$ 144037 141255 104407 94578 95149 89613 104627 100281 96798 120211 173005 150695 155921 156967
2418A56967N248k3201l7464k0158k293N5933J4421J6964p162n461K902L0070l645
$$ 156967 162215 139014 101550 81392 79099 135032 149453 166417 159255 153794 156696 186766 183121
2405A83121n5317k7836K3342O684Q658M1569L1273L831R964J4344L45j7114J2312
$$ 183121 127804 99968 123310 129994 138652 180221 211494 215325 225289 239633 239978 222864 235176
2392B35176o876j650j1154r24Q320J1689Q877j0629J1193L4845j837m5287j0985
$$ 235176 228300 226650 215496 214572 222892 234581 243458 232829 244022 278867 277030 231743 220758
2379B20758L953N004j8404K6250J0006Q163N4041L4916j9281M4356J3341L0333
$$ 220758 224711 229715 211311 237561 247567 255730 309771 344687 325406 369762 383103 413436
2367D13436l2812M0016L4774l4551M428J7393J9314K0992J9263J8148l1651j0523
$$ 413436 380624 420640 455414 420863 425291 442684 461998 482990 502253 520401 488750 478227
2355D78227K8065l1114J8900K4611M6996M2264P783n22J8693M0952K0675P45m346
$$ 478227 506292 475178 494078 518689 565685 607949 615732 615210 633903 674855 695530 696275 691929
2342F91929P0405Q7704M9061M2479Q9314P9456L1319J5543L2732L223N4686R6674
$$ 691929 762334 850038 899099 941578 1030892 1110348 1141667 1157210 1189942 1193165 1247851 1344525
2330A344525J95853K23558K76127K88687J82074J68514K03738K26642K27978K53289
$$ 1344525 1540378 1763936 2040063 2328750 2510824 2679338 2883076 3109718 3337696 3590985
2320C590985M24846O09269R04588J474292K745626M890770O413827P092364N339902
$$ 3590985 4015831 4625100 5529688 7003980 9749606 14640376 21054203 28146567 33486469
2311C3486469K428545M98147j012450k792534l967627m114948m014013l670464
$$ 33486469 35915014 36413161 35400711 32608177 28640550 24525602 20511589 16841125
2303A6841125l244011k756098k184491j432298q79448n53533m80916n04637m60456
$$ 16841125 13597114 10841016 8656525 7224227 6344779 5791246 5310330 4805693 4345237
2294D345237m39150l80807l59250k58425k52116k47998j94050k03877k02231j49246
$$ 4345237 3906087 3525280 3166030 2907605 2655489 2407491 2213441 2009564 1807333 1658087
2284A658087r3665p4156j01798j03562l5353j8873j4228j5481j5458n3755n9721
$$ 1658087 1564422 1490266 1388468 1284906 1249553 1230680 1216452 1200971 1185513 1131758 1072037
2273A072037m0036p6455j8566l8286n3353k7729j1089J0855k3251J4141l6188
$$ 1072037 1032001 955546 936980 898694 845341 817612 806523 817378 794127 808268 772080
2262G72080m8270m4530n5473o6956L381k006m6760k3945L52N489r058O369j2617
$$ 772080 723810 679280 623807 556851 560232 558226 511466 487521 487873 493362 484304 490673 478056
2249D78056o9887o39K6705k9946N358L1749K6897j3184l215J1382n1880l4686
$$ 478056 408169 407530 434235 404289 409647 441396 468293 455109 451894 463276 411396 376710
2237C76710j4793j2552l4013k2639P120k1248k7724K6383j5567j3721k2384n902
$$ 376710 361917 349365 315352 292713 299833 278585 250861 277244 261677 247956 225572 219670
2225B19670J0780j4811K0161q796k2556J5027k1461R469L9181M0819K0647l6667
$$ 219670 230450 215639 235800 227004 204448 219475 198014 207483 246664 287483 308130 271463
2213B71463Q611o74j0032n5566j5065j0685m867M274J8234N819k6103M4993N648
$$ 271463 280074 279400 269368 213802 198737 188052 183185 187459 205693 211512 185409 230402 236050
2200B36050k9424m9100K6617J0946k1463K8317p288J2286R405n0789l266l7330
$$ 236050 206626 157526 184143 195089 173626 201943 194655 206941 216346 165557 162291 124961
2188A24961m2774j7191K7829k0690L867j7807J9065M1319j1683N618j5142k7575
$$ 124961 82187 64996 92825 72135 76002 58195 77260 118579 106896 112514 97372 69797
2176F9797j3907J6713K1407l283p839M4919j7557j5766j1205L1222N675r907l5579
$$ 69797 55890 72603 94010 90727 82888 127807 110250 94484 83279 114501 120176 110269 74690
2163G4690j5327J2883K1082j2446k4011l4093m062N7920L1148j8775O896k408
$$ 74690 59363 72246 93328 80882 56871 22778 18716 76636 107784 89009 95905 93497
2151I3497l7728j8792o996K6385J0860j0995k1706K390J6973l5538K1965N871
$$ 93497 55769 36977 29981 56366 67226 56231 34525 36915 53888 18350 40315 46186
2139D6186j8649j3750n138Q707K4909L8302J4464k502J6899k7566J1048J580k4729
$$ 46186 27537 13787 8649 17356 42265 80567 95031 92529 109428 81862 92910 94490 69761
2126F9761r904j7573L3657m115P910l5780m814M4649p582k2025r115N7431J5805
$$ 69761 59857 42284 75941 71826 79736 43956 39142 83791 76209 54184 45069 102500 118305
2113A18305n308l091k7050k215k8651K6480J8225m1149J3835k5082K3853j715
$$ 118305 112997 109906 82856 80641 51990 78470 96695 55546 69381 44299 68152 66437
2101F6437j3370K4793n163J83j2385k4061K7564J344m9475J3848k780j2524r530
$$ 66437 53067 77860 72697 72880 60495 36434 63998 65342 15867 29715 26935 14411 4881
2088D881L3695J7686k7673L5488K3339k8173J790j302k2905k4156j2382J6827
$$ 4881 38576 56262 28589 64077 87416 59243 61033 59731 36826 12670 288 17115
2076A7115J1235J9620J1691l6133m876L432l0040M3010Q477l6382N481k0268p980
$$ 17115 28350 47970 59661 23528 18652 22084 -7956 35054 43531 7149 12630 -7638 -15618
2063a5618K4325r050k4123L8243K451k585j2466o161k7589O616J3816K4270m987
$$ -15618 8707 -343 -24466 13777 16228 13643 1177 -4984 -32573 -25957 -12141 12129 7142
2050G142O216M1172K5316q287p032J2646M5246M2455m16P151M598L57r816k0620
$$ 7142 13358 54530 79846 71559 64527 77173 122419 164874 164458 171609 176207 176564 166748 146128
2036A46128n657k4902j1480j2332k1772n4072Q48n35J4512J8095k2047J107j7762
$$ 146128 140471 115569 104089 91757 69985 15913 16761 16226 30738 48833 26786 27893 10131
2023A0131r640J117j4317R115J2044j0343K2995J3943m912q178K215l927J7844
$$ 10131 491 1608 -12709 -3594 8450 -1893 21102 35045 30133 21955 24170 20243 38087
2010C8087R70q516J3830m7241k4784j0308K9482o636J4782l117J942K9448J3278
$$ 38087 39057 30541 44371 -2870 -27654 -37962 -8480 -15116 -334 -3451 -1509 27939 41217
1997D1217l4123k9718J7077k3333r323J8686L2117R641K0524m7536J4379j889
$$ 41217 7094 -22624 -5547 -28880 -38203 -19517 12600 22241 42765 -4771 9608 7719
1985G719J3623l4227m071j1613N0369J4941k4288j6151n836L998j7932l1234N412
$$ 7719 21342 -12885 -16956 -28569 21800 36741 12453 -3698 -9534 -5536 -23468 -54702 -49290
1972d9290L5653K4260p871l4027J9962J013m586J0634j5663k9992k8237L0544
$$ -49290 -13637 10623 2752 -31275 -11313 -10300 -14886 -4252 -19915 -49907 -78144 -47600
1960d7600M303P34L203j2130K3694K8389l0850K2836q296m107K9755l784K749
$$ -47600 -43297 -42563 -39360 -51490 -27796 593 -30257 -7421 -15717 -19824 9931 6147 8896
1947H896j6215o897m1411J9619K8954Q286K751J3146J441J9571l646l3429l7506
$$ 8896 -7319 -14216 -55627 -36008 -7054 1232 3983 17129 18570 38141 34495 1066 -36440
1934c6440n578K7615M2790o667j0844L411J7668R490j8543L0116l3255p082K6995
$$ -36440 -42018 -14403 28387 21720 10876 14287 31955 41445 22902 53018 19763 12681 39676
1921C9676j4523o421k7744m824J5887K3532q230j3424j7680l748m514L3601k7209
$$ 39676 25153 18732 -9012 -13836 2051 25583 17353 3929 -13751 -17499 -22013 11588 -15621
1908a5621o503Q616Q482K9725J4491K0851l8939l5743k3891r050K0966L3371Q420
$$ -15621 -22124 -13508 -5026 24699 39190 60041 21102 -14641 -38532 -47582 -26616 6755 15175
1895A5175K201J2507j559k9126k2212j5147q369J1463k1019R668K4057P03J0028
$$ 15175 17376 29883 28324 -802 -23014 -38161 -46530 -35067 -56086 -46418 -22361 -21658 -11630
1882a1630L0270p564J2853m57j8787j4039j4083K4040M400p932J5638j0358o203
$$ -11630 18640 11076 23929 23472 4685 -9354 -23437 603 5003 -2929 12709 2351 -3852
1869c852M157K9999j3189l3638K107J4923P765N846j7281P854j3098R06J0098
$$ -3852 305 30304 17115 -16523 -14416 507 8272 14118 -3163 4691 -8407 -7501 2597
1856B597k2582J4757J1276l0577k6720K240r133Q015l466L7530p11n415L3068
$$ 2597 -19985 -5228 6048 -24529 -51249 -49009 -58142 -50127 -53593 -16063 -16774 -22189 10879
1843A0879J080j3555l219k4320J3313j654K5100k6624O549j8500K931K9628r364
$$ 10879 11959 -1596 -4815 -29135 -15822 -17476 7624 -19000 -12451 -30951 -28020 1608 -7756
1830g756m514J4083l728j3993M491K1357J1326K655q68L7Q013k1007j6027j2752
$$ -7756 -12270 1813 -1915 -15908 -11417 9940 21266 23921 23053 23090 31103 10096 -5931 -18683
1816a8683K3443J435k8978L96L3017j207j4857J9925J210j3261k1769L5368j4468
$$ -18683 4760 6195 -22783 -22387 10630 9423 -5434 14491 15701 2440 -19329 16039 1571
1803A571l2875K7517L238M3502j218l317q341j5617p491N340r887m8517J1003
$$ 1571 -31304 -3787 -549 42953 41735 38418 30077 14460 6969 12309 2422 -46095 -35092
1790c5092L0179R090K7688K4542k1788j3807q520O559M701n6627k2528K4898K6294
$$ -35092 -4913 4177 31865 56407 34619 20812 12292 18851 23552 -33075 -55603 -30705 -4411
1777d411K0465j0601J6826k0734r31M832J5968j3714m9809J9774Q060k4607J4832
$$ -4411 16054 5453 22279 1545 614 5446 21414 7700 -42109 -22335 -14275 -38882 -24050
1764b4050L6294o913M1332m798k244m4381j0562J7172k6846k7533J3485J0292
$$ -24050 12244 5331 46663 41865 39621 -4760 -15322 1850 -24996 -52529 -39044 -28752
1752b8752L1481M223n130K9279r449j2092l9018J1136J2377r950J0226R474L6548
$$ -28752 2729 6952 1822 31101 21652 9560 -29458 -18322 -5945 -15895 -5669 3805 40353
1739D0353m1912O58M995K3165P914k5657o9m445l130J0134k0627q152L492J2515
$$ 40353 -1559 -901 4094 27259 35173 9516 9447 5002 1872 12006 -8621 -16773 -13281 -766
1725g66K7074j852j416k0726j0677l7045K8199K0741J2130M459j2362Q004N181
$$ -766 26308 24456 23040 2314 -8363 -45408 -17209 3532 15662 20121 7759 15763 20944
1712B0944K823j1008j1255R366J7741k1368K378K665n0308K8135M3634k2127j186
$$ 20944 23767 12759 1504 10870 28611 7243 9621 12286 -38022 -9887 33747 11620 10434
1699A0434m003O587L486k7832K2369K2929j6237k5164N257j3697j4556J4841O33
$$ 10434 6431 13018 16504 -11328 11041 33970 17733 -7431 -2174 -15871 -30427 -15586 -14953
1686a4953M369m518N347j3194k2671j624L1168k55J1569l1250l9614K0815J553
$$ -14953 -10584 -15102 -9755 -22949 -45620 -47244 -16076 -16331 -4762 -36012 -75626 -54811 -53258
1673e3258M921J133l0605N474N0374J8127L8390m8216K7976p12k9858k7062j1798
$$ -53258 -48337 -47204 -77809 -72335 -21961 -3834 34556 -13660 14316 13604 -16254 -43316 -55114
1660e5114j144J5192K0997N077M2677k1882j5778J0820M2521r705m2878m4471
$$ -55114 -56258 -41066 -20069 -14992 27685 5803 -9975 845 43366 33661 -9217 -53688
1648e3688J3071K1356M209J2448j9276N333K231L3163o266j4123n978Q345l0516
$$ -53688 -40617 -19261 -15052 -2604 -21880 -16547 -14316 18847 12581 -1542 -7520 825 -29691
1635b9691K9777K0740P014l5260j680K9384j660n572k047j4545r797k0952k1405
$$ -29691 86 20826 27840 -7420 -9100 20284 18624 13052 11005 -3540 -13337 -34289 -55694
1622e5694L0289R46R563L1989m422q576j8050K72j0318k5416k626K9249k8161
$$ -55694 -25405 -24459 -14896 17093 12671 4095 -13955 -13683 -24001 -49417 -52043 -22794 -50955
1609e0955o358M9917o389k3634J0352N0209O377o4747m8418P249Q576N0265M630
$$ -50955 -57313 -7396 -13785 -37419 -27067 23142 29519 -35228 -83646 -76397 -67821 -17556 -12926
1596a2926J5302M814k5352J6737K1810j3186L742l6261k0976O745K5454k1071
$$ -12926 2376 7190 -18162 -1425 20385 7199 10941 -25320 -46296 -39551 -14097 -35168
1584c5168M6886J1393q928K4960k2R575j9553m7224j0329K6086K6552k438j5758
$$ -35168 11718 23111 14183 39143 39121 48696 29143 -18081 -28410 -2324 24228 21790 6032
1571F032l1868L5040J2064J0024R348L644j1291j5026m6382K0597j54m074k9261
$$ 6032 -25836 9204 21268 31292 40640 44284 32993 17967 -28415 -7818 -7972 -12046 -41307
1558d1307M4431l545K3789j699k9827P531k4779j915k4836o843J364K6969k2778
$$ -41307 3124 -421 23368 21669 -8158 -627 -25406 -27321 -52157 -59000 -57636 -30667 -53445
1545e3445J8544L9589K9925j9045k4260k9563l0146L817L3916P5753r690J2233
$$ -53445 -34901 4688 34613 15568 -8692 -38255 -68401 -64584 -30668 45085 35395 47628
1533D7628k8229j3916K1071k70l1087k838M770k9182l786j1891N5138L625J5254
$$ 47628 19399 5483 26554 26284 -4803 -7641 -2871 -32053 -35839 -47730 7408 11033 26287
1520B6287k7631M2881k6083j0494j9207Q710l2775q699l892m673N0229K8086k4832
$$ 26287 -1344 41537 15454 4960 -14247 -5537 -38312 -47011 -50903 -55576 -5347 22739 -2093
1507b093j4367N274j4146j9119l9237L89K4731O7945J3928j4320l2219j2631J0861
$$ -2093 -16460 -11186 -25332 -44451 -83688 -83299 -58568 9377 23305 8985 -23234 -35865 -25004
1494b5004j1256K0880j1341o250j5327K6744J2765P693k8278L3052J9322m035
$$ -25004 -36260 -15380 -26721 -32971 -48298 -21554 -8789 -1096 -29374 3678 23000 18965
1482A8965k0452l0152N882K587K2170j8225K0062L4313L033j5340l230k6562j8123
$$ 18965 -1487 -31639 -25757 -23170 -1000 -19225 837 35150 38183 22843 19613 -6949 -25072
1469b5072L0921l8993j6272k1326K9311J7868R521m222K200J4853j304j5690K8124
$$ -25072 5849 -33144 -49416 -70742 -41431 -23563 -14042 -18264 -16064 -1211 -2515 -18205 9919
1456I919J7068k6857m930l4056J1909J8038J9576J700K1161j575K883l9684J8168
$$ 9919 26987 130 -4800 -38856 -26947 -8909 10667 12367 33528 31953 34836 -4848 13320
1443A3320J528J5367P734r649k0875K0217K9686j9276P655k5053r688m6836O519
$$ 13320 14848 30215 37949 28300 7425 27642 57328 38052 45707 20654 10966 -35870 -29351
1430b9351K3194J0702J2137J8206j9066j146j2446k023R114L590N923o5737L0318
$$ -29351 -6157 4545 16682 34888 15822 14676 2230 207 9321 12911 18834 -46903 -16585
1417a6585K3509P861k4732J2031k0684k13N724L4649l8531k3616K6805M5212M90
$$ -16585 6924 14785 -9947 2084 -18600 -18813 -13089 21560 -16971 -40587 -13782 31430 31920
1404C1920m9515K7789J8014l0355m8903P040l220J1008J6191J7998J2639j7538
$$ 31920 -17595 10194 28208 -2147 -51050 -44010 -47230 -36222 -20031 -2033 10606 -6932
1392f932j2882K5241M4037m1851M048N099Q204m7546j3921L4117J0427K910J4150
$$ -6932 -19814 5427 49464 7613 11661 16760 24964 -22582 -36503 -2386 8041 10951 25101
1379B5101m226J0136k327m1758Q677k6231j9838j806O4254k0778M225K0050O052
$$ 25101 20875 31011 28684 -13074 -4397 -30628 -50466 -52272 11982 -8796 -4571 15479 21531
1366B1531N440j1819j0195k3051j5125n673P010M594R037j4846P788k905M1068
$$ 21531 26971 15152 4957 -18094 -33219 -38892 -31882 -27288 -18251 -33097 -25309 -28214 12854
1353A2854r11N831j8542p326j1915j2964K3565j171j6267j1511M4465J2249J8274
$$ 12854 11943 17774 -768 -8094 -20009 -32973 -9408 -10579 -26846 -38357 6108 18357 36631
1340C6631m370n520j1094k5470j7633J9156j7602l180K0264L2319n669j5633J3506
$$ 36631 32261 26741 15647 -9823 -27456 -8300 -25902 -29082 -8818 23501 17832 2199 15705
1327A5705Q75O017m1125m1871l0418L2158K5787K5537P6188j9063l5266m4505
$$ 15705 16580 22597 -18528 -60399 -90817 -58659 -32872 -7335 68853 49790 14524 -29981
1315b9981K5248O789J8642l5374L522k3466J9892R950j875K6127m134k6735Q439
$$ -29981 -4733 2056 20698 -14676 -11154 -34620 -14728 -4778 -6653 19474 15340 -11395 -2956
1302b956p889k6710M27L2374J0535m3337P730K4903J9932j9045L8395k2763k2929
$$ -2956 -10845 -37555 -37128 -4754 5781 -37556 -29826 -4923 15009 -4036 34359 11596 -11333
1289a1333J2103K842j2554J9998J6362l4500k6994J5515J4643K1701j5101k980
$$ -11333 770 3612 -8942 11056 27418 -7082 -34076 -18561 -3918 17783 2682 -298
1277b98m159N888j2307J0757J0372O023J5928k308m4561j0763O379J7785l3546
$$ -298 -4457 1431 -10876 -119 10253 16276 32204 29896 -14665 -25428 -19049 -1264 -34810
1264c4810k1267J317J6460M194L9936L8233J0108m1220j6863j8027m1965K2200
$$ -34810 -56077 -54760 -38300 -34106 5830 44063 54171 12951 -3912 -21939 -63904 -41704
1252d1704J5159L2295j9262L785j8173J8612K602J063L885J7537k6594n3942K0503
$$ -41704 -26545 5750 -13512 -9727 -27900 -9288 -6686 -5623 -1738 15799 -10795 -64737 -44234
1239d4234K1708K7215k245K6171k3376m638n128P561J8291k4615n345l95r440
$$ -44234 -22526 4689 2444 28615 5239 601 -4527 3034 21325 -3290 -8635 -9030 -18470
1226a8470j9190L2408M370P186k1779q638j3314k85m653J8715n2052K965N7307
$$ -18470 -37660 -5252 -882 6304 -15475 -24113 -37427 -37712 -42365 -23650 -75702 -72737 -15430
1213a5430k004L8843m465j0283K8332r503o363m1812k7651J898J7895K4736j2544
$$ -15430 -17434 21409 16944 6661 34993 25490 19127 -22685 -50336 -48438 -30543 -5807 -18351
1200a8351j0174J3216K6506J6916k0500J507j7868p050K0320M6768k0729k1491
$$ -18351 -28525 -15309 11197 28113 7613 9120 -8748 -15798 4522 51290 30561 9070
1188I070m0251j0883J2338L5403K2391j0006j0631k3974j8258j9427K5813R114
$$ 9070 -31181 -42064 -29726 5677 28068 18062 7431 -16543 -34801 -54228 -28415 -19301
1176a9301L1086p337K1496l7541K0089P272l7257K8809N085l7417K2924J2547
$$ -19301 11785 4448 25944 -11597 8492 15764 -21493 7316 12401 -25016 -2092 10455
1164A0455k596J734j4556K3659j6652k4217L1963j4606q515j0584K5980l0594
$$ 10455 7859 9593 -4963 18696 2044 -22173 9790 -4816 -13331 -23915 2065 -28529
1152b8529L504n591p199P432K2635p048j835Q734j459N47J6629L8762k2489J161
$$ -28529 -25025 -30616 -37815 -30383 -7748 -14796 -16631 -7897 -9356 -8809 7820 46582 24093 25254
1138B5254l54j2278O339J3318l3404P326m4724J4822M1605j779L43j5387J0111
$$ 25254 24900 12622 18961 32279 -1125 6201 -38523 -23701 17904 16125 16468 1081 11192
1125A1192j0067R105J6943L169m6007J2419n0584P351j435M3109J3114j0856K5324
$$ 11192 1125 10230 27173 30342 -15665 -3246 -53830 -46479 -47914 -4805 8309 -2547 22777
1112B2777j8308j6938N3739K7521m1320k2415o0546J095R185O5913J1406Q989
$$ 22777 4469 -12469 41270 68791 27471 5056 -55490 -54395 -45210 20703 32109 41098
1100D1098k4817r603l4354j9840J2572M0296J0556N351J141l1691j3740K1640
$$ 41098 16281 6678 -27676 -47516 -34944 5352 15908 21259 22400 -9291 -23031 -1391
1088a391K2391J3879l2512k6930M2366R094N243k8393J6934p408k0256Q191n891
$$ -1391 21000 34879 2367 -24563 17803 26897 32140 3747 20681 13273 -6983 1208 -4683
1075d683L1514n749L272J1916k1464l0761K5994J6504J2163j8622l1061m1711
$$ -4683 26831 21082 24354 36270 14806 -15955 10039 26543 38706 20084 -10977 -52688
1063e2688K9999P162j4941j0446J6913k5799R927M8817p21L9739j4704k6363k7829
$$ -52688 -22689 -15527 -30468 -40914 -24001 -49800 -39873 8944 8223 47962 33258 6895 -20934
1050b0934L247K3485j8456J3860J6121l0205o27J1848Q524J8275j8072j3106k1158
$$ -20934 -17687 5798 -12658 1202 17323 -12882 -13509 -1661 6863 25138 7066 -6040 -27198
1037b7198q229m568J7090o14k040J4639l4031p613L6652K3442j6188k3160m321
$$ -27198 -35427 -39995 -22905 -23519 -25559 -10920 -44951 -52564 -15912 7530 -8658 -31818 -36139
1024c6139J3420j4733O296j66J4520K7560l1764j6699O493o355M7838n769n379
$$ -36139 -22719 -37452 -31156 -31322 -16802 10758 -21006 -37705 -31212 -37567 10271 4502 -877
1011h77n3468L4729M5896Q643j6557l092l7921r543p336k6816J7042J5337L9018
$$ -877 -54345 -19616 26280 34923 18366 15274 -22647 -32190 -39526 -66342 -49300 -33963 5055
998E055K7090n6165n730M2212K9579J3512j7870o3648l0739K5625J3693J9751
$$ 5055 32145 -24020 -29750 12462 42041 55553 37683 -25965 -56704 -31079 -17386 2365
986B365j3210j410P686Q135j0079K2945J6476K4144k8320l5778j9727J4777J7117
$$ 2365 -10845 -12255 -4569 3566 -6513 16432 32908 57052 28732 -7046 -26773 -11996 5121
973E121K2018L997j9403k2705K3644m916j0080K0749l2757q532R530N896L29L8077
$$ 5121 27139 31136 11733 -10972 12672 7756 -2324 18425 -14332 -22864 -13334 -7438 -7109 30968
959C0968J0246M357j0546j4969J7751J6801j0556n5801k4143J4774L7669l3381
$$ 30968 41214 45571 35025 20056 37807 54608 44052 -11749 -35892 -21118 16551 -16830
947a6830J5922J2141K0751J8502n1686j3656J7658m7910L736N0959k513J4309
$$ -16830 -908 11233 31984 50486 -1200 -14856 2802 -45108 -41372 9587 7074 21383
935B1383j2420l2767J3292K3678J4645m4632k8370j6671L3724L6018j0196J5038
$$ 21383 8963 -23804 -10512 13166 27811 -16821 -45191 -61862 -28138 7880 -2316 12722
923A2722Q125k8076J4197J590k5676l51J12j9854N960L0344L031M0440P878j794
$$ 12722 20847 -7229 6968 8558 -17118 -17469 -17357 -37211 -31251 -907 2124 42564 50442 48648
909D8648m2751q024j0530O1317k4085j3888j1195j9811j7973J5142L2980j2439
$$ 48648 5897 -2127 -12657 48660 24575 10687 -508 -20319 -38292 -23150 9830 -2609
897b609k2000k2287K7178Q610j7941k5051O4427K1008l9438m915M5788l3574J9565
$$ -2609 -24609 -46896 -19718 -11108 -29049 -54100 10327 31335 -8103 -13018 32770 -804 18761
884A8761J7461k3884K056l1604J2435n57j0485R621J8622r581r069J89j953k6269
$$ 18761 36222 12338 14394 -17210 -4775 -5332 -15817 -6196 12426 2845 -6224 -6035 -7988 -34257
870c4257j1940j2507j9951O182N0149L9358J9783J7819m439n0255l9261K9147
$$ -34257 -46197 -58704 -78655 -72473 -22324 17034 36817 54636 50197 -58 -39319 -10172
858a0172k6864j3776K8617J9651K3037j4503K853L6940k6143r074l0164k1016
$$ -10172 -37036 -50812 -22195 -2544 20493 5990 8843 45783 19640 10566 -19598 -40614
846d0614j2378L1467N1379J2049j2850j3160L423j3977K5179L2396K1682n3983
$$ -40614 -52992 -21525 29854 41903 29053 15893 19316 5339 30518 62914 84596 30613
834C0613m1647n358O114n803L822M6129j3536l1028J840l1700J5754L637K6450
$$ 30613 -11034 -16392 -10278 -16081 -12259 33870 20334 -10694 -8854 -40554 -24800 -21163 5287
821E287J596j1366l3426J0079O5938J793k0241l8015k8985Q055K1653J8957J4491
$$ 5287 6883 -4483 -37909 -27830 38108 39901 19660 -18355 -47340 -39285 -17632 1325 15816
808A5816m2492Q119J0836k5651N463J5981J0706l7629J1991q847Q032K9718k3484
$$ 15816 -26676 -18557 -7721 -33372 -27909 -11928 -1222 -38851 -26860 -35707 -27675 2043 -21441
795b1441l89k580k91J9773J9973k0897j67K7615j5164k7807l1031J5734N2731
$$ -21441 -21830 -24410 -24701 -4928 15045 -5852 -6019 21596 6432 -21375 -52406 -36672 16059
782A6059J9093n479k3379j2135o856K572p524m751p517J4027j2879L6053J5526
$$ 16059 35152 29673 6294 -5841 -12697 -10125 -17649 -22400 -29917 -15890 -28769 7284 22810
769B2810K8229k9340P8K0617m3309k4815L5042j1179m544n897J5310J456l5223
$$ 22810 51039 21699 21777 42394 -915 -25730 9312 -1867 -6411 -12308 3002 4458 -30765
756c0765K7184J7794j2571q567n6542J7357R097K0342j2406M326J4091j2394J3431
$$ -30765 -3581 14213 1642 -6925 -63467 -46110 -37013 -16671 -29077 -24751 -10660 -23054 -9623
743i623L2307n68k1378k2399j0204J8591J6852K6095R817K0078Q114m0357m0375
$$ -9623 22684 22116 738 -21661 -31865 -13274 3578 29673 39490 59568 67682 27325 -13050
730a3050J3875j5944p599j3442O500p424j2112K9617J6165j4042J7145j0102k640
$$ -13050 825 -15119 -22718 -36160 -29660 -37084 -49196 -19579 -3414 -17456 -311 -10413 -13053
717a3053l0572K0591K613o983k632N807j2706L1272N447J6204K48k020k6490k9578
$$ -13053 -43625 -23034 -20421 -27404 -30036 -24229 -36935 -5663 -216 15988 16236 14216 -12274 -41852
703d1852L5370o88K2464P633j9662j3793O019L3464J8461l335k0293j3289k8385
$$ -41852 -6482 -7170 15294 22927 3265 -10528 -4509 28955 47416 44081 23788 10499 -17886
690a7886m1955m860M5993O949K1117O771j3063k1298K2009P114J8165k2091o251
$$ -17886 -59841 -64701 -18708 -11759 9358 16129 3066 -18232 3777 10891 29056 6965 714
677G14j23k6887K6529K4243n280j6888Q935m0067J986j0134O443k54j1286K6351
$$ 714 591 -26296 233 24476 19196 2308 11243 -28824 -26838 -36972 -30529 -30783 -42069 -15718
663a5718k3467K4398L9920o835J9261j8473k3785M1817k5091K612o106P034k3499
$$ -15718 -39185 -14787 25133 18298 37559 19086 -4699 37118 12027 14639 8533 15567 -7932
650g932L4198L2067P226J6329j2155l169k0096n2492P759K3253j0374L3521j9099
$$ -7932 26266 58333 65559 81888 69733 66564 46468 -6024 1735 24988 14614 48135 29036
637B9036P077N158j4252j8626K0696J900j4430r854j4676j4699R811N8410J4717
$$ 29036 36113 41271 27019 8393 29089 30989 16559 6705 -7971 -22670 -12859 45551 60268
624F0268m2274O196m2487j1560k154L6591j8318k05j6970j2477M0092K5203l535
$$ 60268 17994 24190 -18297 -29857 -32011 4580 -13738 -13943 -30913 -43390 -3298 21905 18370
611A8370K5449k9690k2928j4845R041L0764j1244J5010j2036j2037L045K0764
$$ 18370 43819 14129 -8799 -23644 -14603 16161 4917 19927 7891 -4146 -1101 19663
599A9663O283k382j1013l0842Q206l455n839K970M024R837j838J1366K2038L7822
$$ 19663 25946 23564 12551 -18291 -10085 -13540 -19379 -16409 -12385 -2548 -4386 6980 29018 66840
585F6840K3690m6555n3038k8610q29O821M2480N044j0403k5870k1794K3107L4274
$$ 66840 90530 43975 -9063 -37673 -38502 -31681 10799 15843 5440 -20430 -42224 -19117 15157
572A5157r459k8008l598j3696K3250O717J5977L2020o008O755j1802j4147j5140
$$ 15157 5698 -22310 -25908 -39604 -16354 -9637 6340 38360 32352 39107 27305 13158 -1982
559a982m4789K9748K0111n213n726n298L0990L7605J1652J058j3715m7418n3388
$$ -1982 -46771 -17023 3088 -2125 -7851 -13149 17841 55446 67098 68156 54441 7023 -46365
546d6365l767L3983K2224k3865N2339j7558L370L2984m470k7233k5546k9039m4916
$$ -46365 -50132 -16149 6075 -17790 34549 16991 20361 53345 48875 21642 -3904 -32943 -77859
533g7859K6427J5153N0802j1088J0260J5722p977n466J8765N300n2542j9648l0655
$$ -77859 -51432 -36279 14523 3435 13695 29417 21440 15974 34739 40039 -12503 -32151 -62806
520f2806J8743J9076K1357M8633J8404k0683L98k2836J3852k0163J6984m300k7932
$$ -62806 -44063 -24987 -3630 45003 63407 42724 43122 20286 34138 13975 30959 26659 -1273
507a273l6535M5208L1975j234J6170k1750j501n0417N831K2193q226j6391L804
$$ -1273 -37808 7400 39375 38141 54311 32561 31060 -19357 -13526 8667 441 -15950 -12146
494a2146K9356j9789n852J648J0183K5098j9256j7619j9832k4056M4405K0957
$$ -12146 17210 -2579 -8431 -6783 3400 28498 9242 -8377 -28209 -52265 -7860 13097
482A3097j262p279J2071O026L1891P100k1075l4931n8522J5635q747K543L6567
$$ 13097 11835 4556 16627 22653 54544 61644 40569 5638 -52884 -37249 -45996 -43453 -6886
469f886J9711J141N1233l9540j2257J9981L8393q355n3446k2170L934N301j3617
$$ -6886 12825 13966 65199 25659 13402 33383 71776 63421 9975 -12195 -8261 -2960 -16577
456a6577L6237K8081j4802j4539J4480j6016Q969l9847m1535J0588j2461K4441
$$ -16577 19660 47741 32939 18400 32880 16864 25833 -14014 -55549 -44961 -57422 -32981
444c2981k082N8749L7179Q24o9725n7159K7106K7173J6777M0351q687k5113J7481
$$ -32981 -35063 23686 60865 61689 -8036 -65195 -38089 -10916 5861 46212 37525 12412 29893
431B9893q070j0944J1028M5573k9888k7522O591J141j5077K679J0492K0944k433
$$ 29893 21823 10879 21907 67480 37592 10070 16661 17802 2725 5404 15896 36840 34407
418C4407k718j3054m3689J1691J6036l6216m638J8030J9283K7778R460j4651k7931
$$ 34407 31689 18635 -25054 -13363 2673 -33543 -38181 -20151 -868 26910 36370 21719 -6212
405f212j4377M6500J0369k0095K6071l355j9456k71k7611K1209J8102K3350r328
$$ -6212 -20589 25911 36280 16185 42256 38901 19445 19174 -8437 12772 30874 54224 44896
392D4896j5798P116l3587L169K0368l6016q485j0925K264L5775L730L3105L59
$$ 44896 29098 36214 2627 5796 26164 -9852 -18337 -29262 -26998 8777 12507 45612 45971
379D5971K743j4466k0947j1960J355O422L7746j8704m8512J0807L9299J7598j0006
$$ 45971 48714 34248 13301 1341 2696 9118 46864 28160 -20352 -9545 29754 47352 37346
366C7346l4248m2142k8269J3629M0814K9707P66J915J5328J5595J3599k0636j2312
$$ 37346 3098 -39044 -67313 -53684 -12870 16837 17603 19518 34846 50441 64040 43404 31092
353C1092j2592j6504M1299j9657K2810m0439L9678J8093k04j9437k3114K8621
$$ 31092 18500 1996 43295 23638 46448 6009 45687 63780 63576 44139 21025 49646
341D9646k7867n401l4900J2962J6774K2517Q932L3357j5212K6528n1228k4457
$$ 49646 21779 16378 -18522 -5560 11214 33731 42663 76020 60808 87336 36108 11651
329A1651j5042o80O760k29j1845o348L6409k1603J4028K0182K2773m4580l3001
$$ 11651 -3391 -4071 2689 2460 -9385 -15733 20676 -927 13101 33283 56056 11476 -21525
316b1525k6048J748L2906L5013p132J8315R987n397K7443k1568j0838l5923J431
$$ -21525 -47573 -45825 -12919 22094 14962 33277 43264 37867 65310 43742 32904 -3019 -1588
303a588l398M786p839J1640L405K5793L563j2357l9503p030L7844j0011J0440
$$ -1588 -4986 -200 -8039 3601 7006 32799 36362 24005 -15498 -22528 15316 5305 15745
290A5745o4017j3113K0112P9055N4841k3807j5922k2204j6327k6888L6623J3904
$$ 15745 -48272 -61385 -41273 37782 92623 68816 52894 30690 14363 -12525 24098 38002
278C8002Q988k2174j1844K2157K0359L086j1043k2115k2328j69j4007J7155N7517
$$ 38002 46990 24816 12972 35129 55488 58574 47531 25416 3088 2919 -11088 6067 63584
265F3584J4782k2849K4789l5293l0667j1756L7209K3460l9626j9910j4396l547
$$ 63584 78366 55517 80306 45013 14346 2590 39799 63259 23633 3723 -10673 -14220
253a4220K8512M1100J0452k8341p326j6602k1237n765L3881j8378J4756j435k7260
$$ -14220 14292 55392 65844 37503 30177 13575 -7662 -13427 20454 2076 16832 15397 -11863
240a1863J6098Q2017K0741k6495k5849k4573j5178k888q153j5991L6186l2522
$$ -11863 4235 86252 106993 80498 54649 30076 14898 12010 3857 -12134 24052 -8470
228h470K5565J2671O483o911J6655n92k5411k5136K1684K6784L0667l9904J4280
$$ -8470 17095 29766 36249 29338 45993 45401 19990 -5146 16538 43322 73989 34085 48365
215D8365m4811j9574k943L1280K5163k3609J5073j8406K91j6451P03J9509L7136
$$ 48365 3554 -16020 -18963 12317 37480 13871 28944 10538 10829 -5622 -4919 14590 51726
202E1726l916j8399l8836J5963M2982J2056o396j7077l8279l255M7465J5630J3156
$$ 51726 47810 29411 -9425 6538 49520 61576 55180 38103 -176 -3431 44034 59664 72820
189G2820l0564j0733j5787l460M43K6406J4217l8653Q749l4218J4713m669L4969
$$ 72820 42256 31523 15736 12276 12719 39125 53342 14689 23438 -10780 3933 -736 34233
176C4233K5781J5720k8786n0163m652L3917M564l998q247J5624J624j3524J7663
$$ 34233 60014 75734 46948 -3215 -7867 26050 30614 26616 18369 33993 35617 22093 39756
163C9756j1061P080k6917j1778k7864J4278K1220L5468j2431k8001j9763n011
$$ 39756 28695 35775 8858 -2920 -30784 -16506 4714 40182 27751 -250 -20013 -25024
151b5024K2257L3385P017j9928P129k7568J4615J5815J4879k1002K1644n1637
$$ -25024 -2767 30618 37635 17707 24836 -2732 11883 27698 42577 21575 43219 -8418
139h418J9621L497L6841j6731n030R109r215p761m784L4176J3586M217P946m12
$$ -8418 11203 14700 51541 34810 29780 38889 29674 21913 17129 51305 64891 69108 77054 76642
125G6642n8368N868Q931J1789n002j6288k6148K3683j2308K6227J9278l7834n644
$$ 76642 18274 24142 33073 44862 39860 23572 -2576 21107 8799 35026 54304 16470 10826
112A0826j2140O10K8353J4668q550k3035j0296J7379P894l7671L8170j3870J3449
$$ 10826 -1314 -704 27649 42317 33767 10732 436 17815 25709 -11962 26208 12338 25787
99B5787k2056j7728K7708P566R615Q948k340j6666Q282J7760J1181k9416L402
$$ 25787 3731 -13997 13711 21277 30892 39840 37500 20834 29116 46876 58057 28641 32043
86C2043J9410j7659n569K2544J617N866k0816j0506j950K464R389j3856j836L452
$$ 32043 51453 33794 28225 50769 52386 58252 37436 26930 24980 27444 36833 22977 21141 24593
72B4593L4652j1366m251j3213J8993j75k6812k8482j1688p071J0025M8684L87
$$ 24593 59245 47879 43628 30415 49408 49233 22421 -6061 -17749 -24820 -14795 33889 34276
59C4276K876j7626K7381K925Q131k9392R68j9706k234P833Q535J909P614R888
$$ 34276 37152 19526 46907 49832 57963 28571 29539 9833 7599 15432 23967 25876 33490 43378
45D3378k5237K15k375K6655J538J0985j7822k0414J849j865J2308K4809M505j4282
$$ 43378 18141 18356 15981 42636 44174 55159 37337 16923 18772 16907 29215 54024 58529 44247
31D4247l5376J1621p070j6386J3743J3117L0496M225K4797k9225r04N262k1424
$$ 44247 8871 20492 13422 -2964 10779 23896 54392 58617 83414 54189 53285 58547 37123
18C7123l0438j332j9088L519K2159Q598K6805k796n80j807j0145o000p784J4486
$$ 37123 6685 5353 -13735 -10216 11943 20541 47346 44550 43970 42163 32018 26018 18234 32720
4C2720l395k1720J8493N711
$$ 32720 29325 7605 26098 31809
0C1809
$$ 31809
$$ Imaginary data points
##PAGE= N=2
##DATA TABLE= (X++(I..I)), XYDATA
16383g87410q941N788r514M6783L5143j8671O17Q345J3641L5872J8603L5936K16
$$ -787410 -796351 -790563 -800077 -753294 -718151 -736822 -736205 -727860 -714219 -678347 -659744 -623808 -623592
16370f23592k5742Q647j6903J5894L8982L1774J4505K9557n55j8741O993M542
$$ -623592 -649334 -640687 -657590 -641696 -602714 -570940 -556435 -526878 -527433 -546174 -539181 -534639
16358e34639K5988M679P857j7771K8842P450K0163o419o354j7083L7316K1192
$$ -534639 -508651 -503972 -496115 -513886 -485044 -477594 -457431 -463850 -470204 -487287 -449971 -428779
16346d28779k1561L5144J5302L541M09K9565K077J6657R459J7847N332k1879Q567
$$ -428779 -450340 -415196 -399894 -396353 -395944 -366379 -364302 -347645 -338186 -320339 -315007 -336886 -328319
16333c28319J0427J9819N484l152P336K9424L1317Q301J3906P545n4835M15J7458
$$ -328319 -317892 -298073 -292589 -295741 -288405 -258981 -227664 -219363 -205457 -197912 -252747 -252332 -234874
16320b34874K2641O831J1471J7208M6398P013r76J7236j6629K4311J1200j5345
$$ -234874 -212233 -205402 -193931 -176723 -130325 -123312 -124288 -107052 -123681 -99370 -88170 -103515
16308a03515j2537P072N1124L0673j6705k6668O445j9535L8788K9111j2626j6548
$$ -103515 -116052 -108980 -57856 -27183 -43888 -70556 -64111 -83646 -44858 -15747 -28373 -44921
16296d4921L693J4420J0299N1587J3449J5719j0442j1482k720j2076J349K5106
$$ -44921 -41228 -26808 -16509 35078 48527 64246 53804 42322 39602 27526 28875 53981
16284E3981K2554K162o088j248O276L0754J3752J4206J1145j985K497J4010L966
$$ 53981 76535 78697 72609 71361 77637 108391 122143 136349 147494 145509 148006 162016 165982
16271A65982n794N762K9467J1699J1650n3838M2135j857K8593j1413k9749L9174
$$ 165982 160188 165950 195417 207116 218766 164928 207063 205206 233799 222386 192637 231811
16259B31811R487j3321p1p252K7426L5512l879N174J605K4225P842j562l6485
$$ 231811 241298 227977 227906 220654 248080 283592 279713 284887 286492 310717 318559 316997 280512
16246B80512J3570j5302R460K5712J9393K2423N677l366j94K721j4908K2561k2643
$$ 280512 294082 278780 288240 313952 333345 355768 361445 358079 357885 360606 345698 368259 345616
16233C45616l651K8762L4742p919R542J6481J0525m584l2907n84l2557J1293O592
$$ 345616 341965 370727 405469 397550 407092 423573 434098 429514 396607 396023 363466 374759 381351
16220C81351K5631L876L8590J5424K5280l369J245m7019Q704L6769j2970j268
$$ 381351 406982 410858 449448 464872 490152 486783 488028 441009 449713 486482 473512 472244
16208D72244l4070K3773J0756L2388J1243J8957Q29P47k3120j1248j3718M355
$$ 472244 438174 461947 472703 505091 516334 535291 536120 536867 513747 502499 488781 493136
16196D93136L4617K7668Q67k9409j9979L0776L6476l5992k3122j5561L1615J3691
$$ 493136 527753 555421 556288 526879 506900 537676 574152 538160 515038 499477 531092 544783
16184E44783K6052j0690k068N113L1462k1373n737k713k2577J349P048K294l252
$$ 544783 570835 560145 558077 563190 594652 573279 567542 564829 542252 543601 550649 552943 549691
16171E49691L5917K5020K2059o2355J930M1428J8835j553k0944K3117l6718k5857
$$ 549691 585608 610628 632687 570332 572262 613690 632525 630972 610028 633145 596427 570570
16159E70570L7563N5526j2013j9640k361o187k1846j3835J7867J2191K308O374
$$ 570570 608133 663659 651646 632006 629645 623458 601612 587777 605644 617835 620143 626517
16147F26517N6355k5933K05J9689o662n7730K7935o020k7005J0307R978l095k444
$$ 626517 682872 656939 657144 676833 670171 612441 640376 634356 607351 617658 627636 624541 622097
16134F22097L1027M6054m388l2148K8681J7331j698J6785q160n2096R107k1222
$$ 622097 653124 699178 694790 662642 691323 708654 706956 723741 715581 663485 672592 651370
16122F51370R0M5418j1493J694j4534M816j7783N568j7660M2687o616k6813R851
$$ 651370 651460 696878 685385 687079 672545 677361 659578 665146 647486 690173 683557 656744 666595
16109F66595O338Q878J4527L065m577K7758m6658o202j7J7716m244L4025J727
$$ 666595 672933 681811 696338 699403 694826 722584 675926 669724 669707 687423 683179 717204 718931
16096G18931L5079j8283k9882m0809N306K721j1986R975M016M756K0738J7408
$$ 718931 754010 735727 705845 665036 670342 673063 661077 671052 675068 679824 700562 717970
16084G17970j5562K735m897M2422k154l5297k6600K4437j0070j5338K5033M4432
$$ 717970 702408 705143 700246 742668 740514 705217 678617 703054 692984 677646 702679 747111
16072G47111k5153m894K1142l912J4260p324K362l9231j4691J9660n931l1371
$$ 747111 721958 717064 738206 734294 748554 741230 743592 704361 689670 709330 703399 672028
16060F72028N6626M701k0795M832J4114j1758k9259p23M858K9104m1215L8935
$$ 672028 728654 733355 712560 717392 731506 719748 690489 689766 694624 723728 682513 721448
16048G21448K5335O964K0254l389k8543l2546J8799J1145L1399n5793P21k4557
$$ 721448 746783 753747 774001 770612 742069 709523 728322 739467 770866 715073 715794 691237
16036F91237R235M1623j9160l207o749k9080j45L5206K0539K5591o010m1106m079
$$ 691237 700472 742095 722935 719728 712979 683899 683754 718960 739499 765090 759080 717974 713895
16023G13895j1081P571K460k1556J8392j6260J737j1743l879J9587O4153j6266
$$ 713895 702814 710385 712845 691289 709681 693421 695158 683415 679536 699123 763276 747010
16011G47010k8397L3487J0162j6920j1413m218m9691Q924j4280r386K5245J4112
$$ 747010 718613 752100 762262 745342 733929 729711 680020 688944 674664 665278 690523 704635
15999G04635K4311K6971j7225N76l3854j2819L4791J798q145j155O907m4770J3794
$$ 704635 728946 755917 738692 739268 705414 692595 727386 729184 721039 719884 726791 682021 695815
15986F95815Q987K5436k7977Q142J540j2139l2018L1773M0344J5402J5776j4262
$$ 695815 704802 730238 702261 710403 711943 699804 667786 699559 739903 755305 771081 756819
15974G56819M572p919j0348L168j5836q629J2967J0086K1922l0730l538j2750
$$ 756819 761391 753472 743124 746292 730456 721827 734794 744880 766802 736072 732534 719784
15962G19784M023K8810j8030K6155m4882N705Q751P292k8700k1670L3645J303
$$ 719784 723807 752617 734587 760742 715860 721565 730316 737608 708908 687238 720883 722186
15950G22186L7250j7599N402k6389R679k414n866K688J1378k3993J8835N2045
$$ 722186 759436 741837 747239 720850 730529 728115 722249 724937 736315 712322 731157 783202
15938G83202L872j9066j3408K9106p2543p212j7358L2670J2514R481n5782J352
$$ 783202 787074 768008 754600 783706 711163 703951 686593 719263 731777 741258 685476 686828
15926F86828K9234M7146O146k4020p849q059j5354k7575j3238o096O7277j0893
$$ 686828 716062 763208 769354 745334 737485 729426 714072 686497 673259 667163 734440 723547
15914G23547L0124r424L8969m7707J2601k0964j4470k3310K68q562K2852K0654
$$ 723547 753671 744247 783216 735509 748110 727146 712676 689366 689634 681072 703924 724578
$$ [...]
##END NTUPLES=NMR SPECTRUM
##END=
