##TITLE=1H_TG-2410-C3`
 200.13Hz, DMSO+CCl4.
 8 sc
 18.8.2026
##JCAMPDX= 6.0         $$ Bruker NMR JCAMP-DX V2.0
##DATA TYPE= NMR SPECTRUM
##DATA CLASS= NTUPLES
##ORIGIN= UXNMR, Bruker Analytische Messtechnik GmbH
##OWNER= pz
$$ XWIN-NMR		Version 3.5
$$ Tue Aug 18 12:40:55 2026 Russian Standard Time (UT+4h)  she@DPX200
##.OBSERVE FREQUENCY= 200.1313
##.OBSERVE NUCLEUS= ^1H
##.ACQUISITION MODE= SIMULTANEOUS
##.ACQUISITION SCHEME= undefined
##.AVERAGES= 8
##.DIGITISER RES= 18
##SPECTROMETER/DATA SYSTEM= spect
##.PULSE SEQUENCE= zg30
##.SOLVENT NAME= D2O
##.SHIFT REFERENCE= (INTERNAL, D2O, 0, 15.5089)
##AUDIT TRAIL= $$ (NUMBER, WHEN, WHO, WHERE, WHAT)
$$ ##TITLE= Audit trail, XWIN-NMR		Version 3.5
$$ ##JCAMPDX= 5.01
$$ ##ORIGIN= Bruker BioSpin GmbH
$$ ##OWNER= she
$$ F:/spectra/data/she/nmr/H-C/1/pdata/1/auditp.txt
$$ ##AUDIT TRAIL=  $$ (NUMBER, WHEN, WHO, WHERE, WHAT)
(   1,<2026-08-18 12:39:31.26 +0400>,<she>,<DPX200>,
      <created by zg, POWCHK disabled, PULCHK disabled
       configuration hash MD5:
       00 E9 B6 7A A2 85 ED C7 34 08 36 98 17 FE 4E 26
       data hash MD5: 16K
       18 E8 E2 E8 1B 5A 1E 9E E0 9F 7D 2F D1 0E B6 0B>)
(   2,<2026-08-18 12:39:34.43 +0400>,<she>,<DPX200>,
      <Start of raw data processing
       efp BC_mod = 2 LB = 0.25 FT_mod = 6 PKNL = 1 PHC0 = -4225.426 PHC1 = 16.7923 SI = 16K 
       data hash MD5: 16K
       82 3C AE E8 68 C7 99 48 E2 FE 93 98 E4 DE 00 1A>)
(   3,<2026-08-18 12:39:53.71 +0400>,<she>,<DPX200>,
      <pk PHC0 = -157.431 PHC1 = -1.4 
       data hash MD5: 16K
       7F F6 DF 8B 7E 2B 29 1B A4 07 01 9D AA 4A 29 18>)
(   4,<2026-08-18 12:39:57.93 +0400>,<she>,<DPX200>,
      <abs ABSG = 5 
       data hash MD5: 16K
       32 67 A4 DA 48 78 5E 5C 06 6D 6F C3 2F D4 68 9D>)
$$ ##END=
$$ 
$$ hash MD5
$$ 8C 2B 3F 5C 36 E1 BA B6 20 E8 AB D4 D2 62 AD 97
##$RELAX= 
##$RELAX= 
##$RELAX= 
##$RELAX= 
##$RELAX= 
##$RELAX= 
$$ Bruker specific parameters
$$ --------------------------
##$DU= <F:/spectra>
##$EXPNO= 1
##$NAME= <H-C>
##$PROCNO= 1
##$TYPE= <nmr>
##$USER= <she>
##$AMP= (0..31)
100 100 100 100 100 100 100 100 100 100 100 100 100 100 100 100 100 100 
100 100 100 100 100 100 100 100 100 100 100 100 100 100 
##$AQSEQ= 0
##$AQ_mod= 1
##$AUNM= <au_zg>
##$AUTOPOS= <>
##$BF1= 200.13
##$BF2= 200.13
##$BF3= 200.13
##$BF4= 200.13
##$BF5= 200.13
##$BF6= 200.13
##$BF7= 200.13
##$BF8= 200.13
##$BYTORDA= 1
##$CFDGTYP= 0
##$CFRGTYP= 5
##$CHEMSTR= <none>
##$CNST= (0..31)
1 1 145 1 1 1 1 1 1 1 1 1 1 1 1 1 1 1 1 1 1 1 1 1 1 1 1 1 1 1 1 1 
##$CPDPRG= <>
##$CPDPRG1= <>
##$CPDPRG2= <>
##$CPDPRG3= <>
##$CPDPRG4= <mlev>
##$CPDPRG5= <mlev>
##$CPDPRG6= <mlev>
##$CPDPRG7= <mlev>
##$CPDPRG8= <mlev>
##$CPDPRGB= <>
##$CPDPRGT= <>
##$D= (0..31)
0 0.7 0 0 0 0 0 0 0 0 0 0.03 0 0 0 0 0 0 0 0 0 0 0 0 0 0 0 0 0 0 0 0 
##$DATE= 1787042370
##$DBL= (0..7)
120 120 120 120 120 120 120 120 
##$DBP= (0..7)
150 150 150 150 150 150 150 150 
##$DBP07= 0
##$DBPNAM0= <>
##$DBPNAM1= <>
##$DBPNAM2= <>
##$DBPNAM3= <>
##$DBPNAM4= <>
$$ [...]
##$SUBNAM3= <"">
##$SUBNAM4= <"">
##$SUBNAM5= <"">
##$SUBNAM6= <"">
##$SUBNAM7= <"">
##$SUBNAM8= <"">
##$SUBNAM9= <"">
##$SW= 18.0517328524113
##$SWIBOX= (0..15)
0 0 2 0 0 0 0 0 0 0 0 0 0 0 0 0 
##$SW_h= 3612.71676300578
##$TD= 16384
##$TD0= 1
##$TE= 0
##$TE2= 300
##$TE3= 300
##$TEG= 300
##$TL= (0..7)
0 120 120 120 120 120 120 120 
##$TP= (0..7)
150 150 150 150 150 150 150 150 
##$TP07= 0
##$TPNAME0= <>
##$TPNAME1= <>
##$TPNAME2= <>
##$TPNAME3= <>
##$TPNAME4= <>
##$TPNAME5= <>
##$TPNAME6= <>
##$TPNAME7= <>
##$TPOAL= (0..7)
0.5 0.5 0.5 0.5 0.5 0.5 0.5 0.5 
##$TPOFFS= (0..7)
0 0 0 0 0 0 0 0 
##$TUNHIN= 0
##$TUNHOUT= 0
##$TUNXOUT= 0
##$USERA1= <user>
##$USERA2= <user>
##$USERA3= <user>
##$USERA4= <user>
##$USERA5= <user>
##$V9= 5
##$VALIST= <valist>
##$VCLIST= <CCCCCCCCCCCCCCC>
##$VD= 0
##$VDLIST= <DDDDDDDDDDDDDDD>
##$VPLIST= <PPPPPPPPPPPPPPP>
##$VTLIST= <TTTTTTTTTTTTTTT>
##$WBST= 1024
##$WBSW= 4
##$XGAIN= (0..3)
0 0 0 0 
##$XL= 0
##$YL= 0
##$YMAX_a= 523738
##$YMIN_a= -439976
##$ZGOPTNS= <>
##$ZL1= 120
##$ZL2= 120
##$ZL3= 120
##$ZL4= 120
##$ABSF1= 15.50229
##$ABSF2= -2.54956
##$ABSG= 5
##$ABSL= 3
##$ALPHA= 0
##$AQORDER= 0
##$ASSFAC= 0
##$ASSFACI= 0
##$ASSFACX= 0
##$ASSWID= 0
##$AUNMP= <proc_1d>
##$AZFE= 0.1
##$AZFW= 0.1
##$BCFW= 0
##$BC_mod= 2
##$BYTORDP= 0
##$COROFFS= 0
##$CY= -3
##$DATMOD= 1
##$DC= 0
##$DFILT= <>
##$DTYPP= 0
##$F1P= 0
##$F2P= 0
##$FCOR= 1
##$FTSIZE= 16384
##$FT_mod= 6
##$GAMMA= 0
##$GB= 0
##$INTBC= 1
##$INTSCL= 3.241238e-09
##$ISEN= 128
##$LB= 0.25
##$LEV0= 0
##$LPBIN= 0
##$MAXI= 10000
##$MC2= 0
##$MEAN= 0
##$ME_mod= 0
##$MI= 1.114404
##$NCOEF= 0
##$NC_proc= -5
##$NLEV= 6
##$NOISF1= 3.799351
##$NOISF2= 2.8
##$NSP= 0
##$NTH_PI= 0
##$NZP= 0
##$OFFSET= 15.5089
##$PC= 1
##$PHC0= -4382.857
##$PHC1= 15.3923
##$PH_mod= 1
##$PKNL= yes
##$PPARMOD= 0
##$PSCAL= 0
##$PSIGN= 0
##$REVERSE= no
##$SF= 200.130002562272
##$SI= 16384
##$SIGF1= 3
##$SIGF2= 2
##$SINO= 0.751879
##$SIOLD= 32768
##$SREGLST= <19F.Aceton>
##$SSB= 0
##$STSI= 16384
##$STSR= 0
##$SW_p= 3612.71676300578
##$SYMM= 0
##$S_DEV= 0
##$TDeff= 16384
##$TDoff= 0
##$TI= <>
##$TILT= no
##$TM1= 0
##$TM2= 0
##$TOPLEV= 0
##$USERP1= <user>
##$USERP2= <user>
##$USERP3= <user>
##$USERP4= <user>
##$USERP5= <user>
##$WDW= 1
##$XDIM= 16384
##$YMAX_p= 477038213
##$YMIN_p= -439869
$$ End of Bruker specific parameters
$$ ---------------------------------
##NTUPLES= NMR SPECTRUM
##VAR_NAME=  FREQUENCY,     SPECTRUM/REAL,   SPECTRUM/IMAG
##SYMBOL=    X,             R,               I
##VAR_TYPE=  INDEPENDENT,   DEPENDENT,       DEPENDENT
##VAR_FORM=  AFFN,          ASDF,            ASDF
##VAR_DIM=   16384,         16384,           16384
##UNITS=     HZ,            ARBITRARY UNITS, ARBITRARY UNITS
##FACTOR=    0.220516191357247, 1,           1
##FIRST=     3103.79613444169, 0,            0
##LAST=      -508.920628564086, 0,           0
##MIN=       -508.920628564086, -439869,     0
##MAX=       3103.79613444169, 477038213,    0
$$ Real data points
##PAGE= N=1
##DATA TABLE= (X++(R..R)), XYDATA
$$ [...]
$$ plain form
6160 70580 69952 55022 75360 62466 42159 41684 145295 151535 116869 94150 67798 103982 53837
6147 53837 2842 23379 88949 83584 87312 84037 68483 53548 76646 87707 91573 91996 57716
6134 57716 30861 13079 123107 115294 65013 42402 57826 79527 78989 42217 99346 141237
6122 141237 89949 70940 100591 127173 68873 51713 37214 102068 100469 23201 46030 84167
6110 84167 95117 130744 35766 24297 67753 52722 89704 118245 172554 128732 52538 22257
6098 22257 39896 106220 112319 87931 118408 121126 68817 31767 51201 98245 54578 30568
6086 30568 39892 89184 99723 41759 5744 57715 95272 103168 38659 43261 47993 109231 73571
6073 73571 95981 131270 43693 23478 43618 121340 153714 39808 -27054 51822 93720 84328
$$ packed form
6160G0580o28j4930K0338j2894k0307m75J03611O240l4666k2719k6352L6184n0145
6147E3837n0995K0537O5570n365L728l275j5554j4935K3098J1061L866M23l4280
6134E7716k6855j7782J10028p813n0281k2611J5424K1701n38l6772N7129M1891
6122A41237n1288j9009K9651K6582n8300j7160j4499O4854j599p7268K2829L8137
6110H4167J0950L5627r4978j1469M3456j5031L6982K8541N4309m3822p6194l0281
6098B2257J7639O6324O099k4388L0477K718n2309l7050J9434M7044m3667k4010
6086C0568R324M9292J0539n7964l6015N1971L7557P896o4509M602M732O1238l5660
6073G3571K2410L5289q7577k0215K0140P7722L2374j13906o6862P8876M1898r392
$$ plain form
6061 84328 71216 85615 103069 94215 97030 56256 107008 75124 41387 44605 82826 71849
6049 71849 66787 32229 35483 64050 99162 93819 127001 139870 97582 58486 25822 102797
6037 102797 145588 112273 95784 92252 86105 29595 -1466 50435 52842 133188 128460 102386
6025 102386 109072 47904 34827 34676 76854 88004 79171 69080 77706 116001 139949 86963 97266
6012 97266 74202 114710 108853 84842 121099 83563 102784 117066 102434 123010 106262 76267
6000 76267 112822 72338 111172 57511 76120 132294 167962 142522 76350 107786 98617 83801
5988 83801 83534 70942 63698 40659 9095 69430 97116 111751 114767 111360 170337 222597 184799
5975 184799 127457 178408 99762 86792 152529 171816 184515 203310 168537 202942 176456 161008
$$ packed form
6061H4328j3112J4399J7454q854K815m0774N0752l1884l3737L218L8221j0977
6049G1849n062l4558L254K8567L5112n343L3182J2869m2288l9096l2664P6975
6037A02797M2791l3315j6489l532o147n6510l1061N1901K407Q0346m728k6074
6025A02386O686o1168j3077j51M2178J1150q833j0091Q626L8295K3948n2986J0303
6012I7266k3064M0508n857k4011L6257l7536J9221J4282j4632K0576j6748k9995
6000G6267L6555m0484L8834n3661J8609N6174L5668k5440o6172L1436r169j4816
5988H3801k67j2592p244k3039l1564O0335K7686J4635L016l407N8977N2260l7798
5975A84799n7342N0951p8646j2970O5737J9287J2699J8795l4773L4405k6486j5448
$$ plain form
5963 161008 166183 172382 201458 219673 171091 113557 133195 176652 186994 172102 174058 168913
5951 168913 141139 104234 157973 217496 172805 129307 103720 127336 152760 177718 124911 146445
5939 146445 149736 188506 122166 129144 115288 143504 138078 139236 151277 147643 132574 56717 82177
5926 82177 145727 138330 84757 60752 37744 80011 113921 140919 106178 69241 41983 87136
5914 87136 193204 185141 151407 96751 108702 152011 185992 107533 93297 78660 51573 106402
5902 106402 113984 153211 153355 170455 98538 136188 152633 109559 112510 123270 127617 191577 169227
5889 169227 128038 77550 130376 73803 90366 123001 127494 171358 143537 112126 156040 160860
5877 160860 96174 92228 138099 167800 172158 178258 167039 158682 122657 86052 168283 166859 172210
$$ packed form
5963A61008N175O199K9076J8215m8582n7534J9638M3457J0342j4892J956n145
5951A68913k7774l6905N3739N9523m4691m3498k5587K3616K5424K4958n2807K1534
5939A46445L291L8770o6340O978j3856K8216n426J158J2041l634j5069p5857K5460
5926H2177O3550p397n3573k4005k3008M2267L3910K6998l4741l6937k7258M5153
5914H7136J06068q063l3734n4656J1951M3309L3981p8459j4236j4637k7087N4829
5902A06402P582L9227J44J7100p1917L7650J6445m3074K951J0760M347O3960k2350
5889A69227m1189n0488N2826n6573J6563L2635M493M3864k7821l1411M3914M820
5877A60860o4686l946M5871K9701M358O100j1219q357l6025l6605Q2231j424N351
$$ plain form
5864 172210 123253 103536 146389 176509 174359 176128 97197 128441 134557 150952 171346 158166
5852 158166 136177 137857 155553 197833 182824 142565 190672 238848 212294 140300 138516 156661
5840 156661 224469 275122 231499 228637 238238 219817 226452 289159 270878 266063 246079 176386
5828 176386 225607 246019 233975 252709 238748 295213 277009 191623 210895 227446 187047 225629
5816 225629 248193 241634 280270 288299 285855 244463 201721 146022 246006 222274 289043 312922
5804 312922 212847 190038 220742 184002 226108 278899 262989 276544 281827 266763 293842 342081
5792 342081 314189 359823 367479 332607 396577 328360 356184 348734 340399 336484 398025 401084 415197
5779 415197 430650 447877 449280 516963 473055 499025 538249 601672 675126 582886 559176 629986
$$ packed form
5864A72210m8957j9717M2853L0120k150J769p8931L1244O116J6395K0394j3180
5852A58166k1989J680J7696M2280j5009m0259M8107M8176k6554p1994j784J8145
5840A56661O7808N0653m3623k862R601j8421O635O2707j8281m815j9984o9693
5828A76386M9221K0412j2044J8734j3961N6465j8204q5386J9272J6551m0399L8582
5816B25629K2564o559L8636Q029k444m1392m2742n5699R9984k3732O6769K3879
5804C12922j00075k2809L0704l6740M2106N2791j5910J3555N283j5064K7079M8239
5792C42081k7892M5634P656l4872O3970o8217K7824p450q335l915O1541L059J4113
5779D15197J5453J7227J403O7683m3908K5970L9224O3423P3454r2240k3710P0810
$$ plain form
5767 629986 717980 885400 1070477 1105738 1242102 1424147 1708979 2196257 2953911 3984151
5757 3984151 5259363 6622709 7724027 8405205 8343857 7859248 7377090 6989038 6272413
5748 6272413 5250602 4151926 3323743 2710181 2191753 1802306 1537113 1305944 1150730
5739 1150730 1110153 990190 998662 897306 745579 667947 617311 576559 663497 690386 601488
5728 601488 556810 536265 501998 514391 527657 529289 505605 462096 486136 459301 432702 409553
5716 409553 339991 340369 383424 462604 493512 494563 337089 362584 381498 392034 398892 408976
5704 408976 288949 359881 376133 298196 311646 326818 297237 330733 324733 298198 389239 323494
5692 323494 250131 306062 315807 334670 344619 287118 282017 336186 299601 303781 315253 311916 303461
$$ packed form
5767F29986Q7994J67420J85077L5261J36364J82045K84832M87278P57654J030240
5757C984151J275212J363346J101318O81178o1348m84609m82158l88052p16625
5748F272413j021811j098676q28183o13562n18428l89447k65193k31169j55214
5739A150730m0577j19963Q472j01356j51727p7632n0636m0752Q6938K6889q8898
5728F01488m4678k0545l4267J2393J3266J632k3684m3509K4040k6835k6599k3149
5716D09553o9562L78M3055P9180L0908J051j57474K5495J8914J0536O858J0084
5704D08976j20027P0932J6252p7937J3450J5172k9581L3496o000k6535R1041o5745
5692C23494p3363N5931R745J8863R949n7501n101N4169l6585M180J1472l337q455
$$ plain form
5679 303461 338468 322623 330831 287639 264580 253905 225369 266772 307699 300895 341534 331641
5667 331641 274063 294335 297806 318366 355311 353306 301182 301581 275457 303569 321181 306173
5655 306173 330406 385031 356095 394371 457551 399166 399065 419030 353519 398530 407620 361161
5643 361161 378184 357289 357532 398658 351420 339792 410729 386125 365676 409650 365673 367317
5631 367317 363571 371863 368414 371370 325336 345574 353778 327434 378480 442230 370339 425749 432920
5618 432920 466247 492598 490271 484988 482988 470960 509577 542102 531389 569213 568566 568422 652553
5605 652553 699109 742332 839538 850841 942082 1035939 1004529 953129 946826 946020 959001 1009957
5593 1009957 985322 1016215 990664 1090335 1113902 1103624 1069408 1060372 986464 960276 1020337 1003234
$$ packed form
5679C03461L5007j5845Q208m3192k3059j0675k8536M1403M0927o804M0639r893
5667C31641n7578K0272L471K0560L6945k005n2124L99k6124K8112J7612j5008
5655C06173K4233N4625k8936L8276O3180n8385j01J9965o5511M5011R090m6459
5643C61161J7023k0895K43M1126m7238j1628P0937k4604k0449M3974m3977J644
5631C67317l746Q292l449K956m6034K0238Q204k6344N1046O3750p1891N5410P171
5618D32920L3327K6351k327n283k000j2028L8617L2525j0713L7824o47j44Q4131
5605F52553M6556M3223R7206J1303R1241R3857l1410n1400o303q06J2981N0956
5593A009957k4635L0893k5551R9671K3567j0278l4216r036p3908k6188O0061j7103
$$ plain form
5581 1003234 947278 799661 745420 790197 828569 814779 859819 797068 786909 825438 841962
5570 841962 846500 900862 886466 803253 848298 825153 861001 892750 884296 909154 963749 1015299
5558 1015299 1019776 992524 995179 1058955 1109503 1180997 1210280 1225923 1196347 1287463 1334102 1412524
5546 1412524 1473875 1529700 1563468 1708345 1846363 2046142 2181300 2323734 2527588 2830057
5536 2830057 3317357 3756114 4341308 4971790 5653934 6432239 7161943 7704039 8017595 8270646
5526 8270646 8357147 8343886 8318726 8259886 8294703 8463033 8516980 8608663 8492267 8271428 7892129
5515 7892129 7390024 6684574 5914413 5193067 4488776 3889849 3428555 2976111 2612084 2337989
5505 2337989 2069478 1895101 1726686 1563949 1446000 1395039 1287754 1218759 1171745 1060767
$$ packed form
5581A003234n5956j47617n4241M4777L8372j3790M5040o2751j0159L8529J6524
5570H41962M538N4362j4396q3213M5045k3145L5848L1749q454K4858N4595N1550
5558A015299M477k7252K655O3776N0548P1494K9283J5643k9576R1116M6639P8422
5546A412524O1351N5825L3768J44877J38018J99779J35158J42434K03854L02469
5536B830057M87300M38757N85194O30482O82144P78305P29704N42096L13556K53051
5526H270646Q6501j3261k5160n8840L4817J68330N3947R1683j16396k20839l79299
5515G892129n02105p05450p70161p21346p04291n98927m61294m52444l64027k74095
5505B337989k68511j74377j68415j62737j17949n0961j07285o8995m7014j10978
$$ plain form
5495 1060767 1041983 1046866 1065436 1008938 984653 924294 914555 932777 892912 872904 893512 876070
5483 876070 756495 817466 825031 815569 829663 793434 786139 827196 853333 860682 864132 850218
5471 850218 809171 797846 804910 869858 890001 857516 783115 798621 865073 831532 790031 836234
5459 836234 814480 783633 822041 882305 830778 820342 773463 858872 892036 867005 833670 831963
5447 831963 826656 883197 948349 894136 931190 961103 963381 976466 959935 996280 1020151 1014016
5435 1014016 1052975 1152138 1102194 1054390 1018371 1054880 1048567 1117672 1115310 1173769 1163204 1133062
5423 1133062 1112857 1080760 1092578 1120659 1146795 1147500 1216449 1211532 1167042 1106612 1121485 1171060
5411 1171060 1275713 1276919 1289889 1354460 1299310 1309900 1332143 1357599 1346527 1357715 1368888
$$ packed form
5495A060767j8784M883J8570n6498k4285o0359r739J8222l9865k0008K0608j7442
5483H76070j19575O0971P565r462J4094l6229p295M1057K6137P349L450j3914
5471H50218m1047j1325P064O4948K0143l2485p4401J5506O6452l3541m1501M6203
5459H36234k1754l0847L8408O0264n1527j0436m6879Q5409L3164k5031l3335j707
5447H31963n307N6541O5152n4213L7054K9913K278J3085j6531L6345K3871o135
5435A014016L8959R9163m9944m7804l6019L6509o313O9105k362N8459j0565l0142
5423A133062k0205l2097J1818K8081K6136P05O8949m917m4490o0430J4873M9575
5411A171060J04653J206J2970O4571n5150J0590K2243K5456j1072J1188J1173
$$ plain form
5400 1368888 1429363 1455594 1483039 1467456 1444528 1478866 1503652 1514843 1498065 1526954 1521658 1548444
5388 1548444 1535696 1581895 1565312 1658351 1661875 1716218 1755403 1763309 1781519 1816520 1831241 1851194
5376 1851194 1938418 1963180 2002920 1995911 2021679 2088522 2166562 2253767 2271515 2319422 2424593
5365 2424593 2496896 2543806 2655766 2623978 2715204 2734541 2850948 2944299 3025199 3030748 3057427
5354 3057427 3114433 3182807 3271368 3394408 3447405 3506974 3664758 3668900 3803105 3941011 3932164
5343 3932164 3955280 4051975 4136534 4205970 4305330 4356634 4472356 4603344 4695643 4813525 5013766
5332 5013766 5109419 5227784 5350941 5541325 5664520 5785180 5934709 6024333 6232491 6456907
5322 6456907 6694030 6939617 7221397 7493574 7817459 8137401 8465087 8809947 9206258 9553894
$$ packed form
5400A368888O0475K6231K7445j5583k2928L4338K4786J1191j6778K8889n296K6786
5388A548444j2748M6199j6583R3039L524N4343L9185P906J8210L5001J4721J9953
5376A851194Q7224K4762L9740p009K5768O6843P8040Q7205J7748M7907J05171
5365B424593P2303M6910J11960l1788R1226J9337J16407R3351Q0900N549K6679
5354C057427N7006O8374Q8561J23040N2997N9569J57784M142J34205J37906q847
5343C932164K3116R6695Q4559O9436R9360N1304J15722J30988R2299J17882K00241
5332E013766R5653J18365J23157J90384J23195J20660J49529Q9624K08158K24416
5322F456907K37123K45587K81780K72177L23885L19942L27686L44860L96311L47636
$$ plain form
5312 9553894 10033309 10542722 10924470 11482276 12062612 12637773 13313863 14177218 15271185
5303 15271185 16637437 18270217 20172745 22478773 25317104 28964064 33988478 40913789
5295 40913789 50202946 61920470 74840165 87103701 95406859 99011009 99781676 98176463
5287 98176463 93864409 88441864 84293996 83178803 85649282 90983912 97509619 102280377
5279 102280377 102879080 100278498 95585060 87784801 77281555 65821407 54965183 45391518
5271 45391518 37159698 30298747 24828738 20722593 17698197 15393992 13535297 12042437
5263 12042437 10662778 9474464 8521237 7756834 7026138 6518964 6080920 5609294 5228564
5254 5228564 4796964 4373480 4083866 3779089 3542547 3409909 3268510 3087670 2940874 2834304
$$ packed form
5312I553894M79415N09413L81748N57806N80336N75161O76090Q63355J093967
5303A5271185J366252J632780J902528K306028K838331L646960N024414O925311
5295D0913789R289157J1717524J2919695J2263536Q303158L604150P70667j605213
5287I8176463m312054n422545m147868j115193K470479N334630O525707M770758
5279A02280377N98703k600582m693438p800259j0503246j1460148j0856224r573665
5271D5391518q231820o860951n470009m106145l024396k304205j858695j492860
5263A2042437j379659j188314r53227p64403p30696n07174m38044m71626l80730
5254E228564m31600m23484k89614l04777k36542j32638j41399j80840j46796j06570
$$ plain form
5244 2834304 2645125 2527764 2414797 2250478 2197042 2146250 2025334 1929322 1856431 1772829
5234 1772829 1667839 1599916 1561878 1526103 1534107 1439348 1407574 1365997 1276092 1173432 1115103
5223 1115103 1107174 1093827 1149829 1046157 957352 1033802 980157 950928 953971 922111 898529 962058
5211 962058 973028 944646 908978 823112 838999 942188 973974 974056 1035554 908393 877693 881637
5199 881637 875744 837145 906424 956807 973701 989721 953367 899818 877696 876451 936163 957806
5187 957806 946723 970644 927374 871378 834651 838232 881354 865729 859180 841310 834892 765881
5175 765881 840687 817989 752358 722375 749535 744975 768230 725981 731147 701230 653002 668125
5163 668125 699291 724122 721739 741461 684700 726425 694409 723682 720227 656854 722310 772820
$$ packed form
5244B834304j89179j17361j12967j64319n3436n0792j20916r6012p2891q3602
5234A772829j04990o7923l8038l5775Q004r4759l1774m1577q9905j02660n8329
5223A115103p929j3347N6002j03672q8805P6450n3645k9229L043l1860k3582O3529
5211I62058J0970k8382l5668q5866J5887J03189L1786Q2O1498j27161l0700L944
5199H81637n893l8599O9279N0383J6894J6020l6354n3549k2122j245N9712K1643
5187I57806j1083K3921m3270n5996l6727L581M3122j5625o549j7870o418o9011
5175G65881P4806k2698o5631k9983K7160m560K3255m2249N166k9917m8228J5123
5163F68125L1166K4831k383J9722n6761M1725l2016K9273l455o3373O5456N0510
$$ plain form
5151 772820 706106 666556 688685 607796 603976 638179 651322 632152 640495 618986 622180 581680
5139 581680 502652 540709 550929 521772 507277 518150 510600 513754 564989 591043 539846 604800
5127 604800 602585 564459 532938 523905 541467 559866 620642 561315 586462 609965 544218 583173
5115 583173 666113 667796 699132 624693 573102 628425 675052 657061 636845 675310 649082 624740
5103 624740 601772 616632 655463 683410 605795 601742 655714 678410 615799 710927 697213 660096
5091 660096 720866 663773 702732 747799 769362 748491 768323 760674 679659 719147 701708 740242
5079 740242 847356 824888 789912 819829 745273 783586 827248 893359 841014 839135 857621 901048
5067 901048 923567 936337 928040 898314 949819 1026128 1041946 1119570 1117986 1121076 1225491 1169305
$$ packed form
5151G72820o6714l9550K2129q0889l820L4203J3143j9170Q343k1509L194m0500
5139E81680p9028L8057J0220k9157j4495J0873p550L154N1235K6054n1197O4954
5127F04800k215l8126l1521r033J7562J8399O0776n9327K5147K3503o5747L8955
5115E83173Q2940J683L1336p4439n1591N5323M6627j7991k0216L8465k6228k4342
5103F24740k2968J4860L8831K7947p7615m053N3972K2696o2611R5128j3714l7117
5091F60096O0770n7093L8959M5067K1563k0871J9832p649q1015L9488j7439L8534
5079G40242J07114k2468l4976K9917p4556L8313M3662O6111n2345j879J8486M3427
5067I01048K2519J2770q297k9726N1505P6309J5818P7624j584L090J04415n6186
$$ plain form
5055 1169305 1197590 1324511 1215022 1255195 1301264 1269755 1314682 1352589 1305361 1332379 1383155
5044 1383155 1297032 1324141 1347126 1308686 1400242 1319025 1281480 1364218 1326874 1372944 1412961
5033 1412961 1398662 1432641 1403572 1305740 1301688 1386713 1430253 1495323 1546741 1456944 1509818 1497972
5021 1497972 1495585 1580076 1603121 1588868 1565525 1547756 1695803 1669569 1709181 1760133 1748515
5010 1748515 1761048 1844211 1822873 1837652 1934294 1884786 1945331 2055113 1992712 2047485 2078889
4999 2078889 2068067 2278236 2336414 2178978 2172325 2227807 2258699 2381870 2499632 2525899 2708737
4988 2708737 2661643 2648737 2822740 2908916 2891493 2987295 3002597 3122378 3218399 3303081 3268407
4977 3268407 3302767 3329813 3293511 3322161 3345373 3461527 3410106 3391610 3450723 3543467 3684623
$$ packed form
5055A169305K8285J26921j09489M0173M6069l1509M4927L7907m7228K7018N0776
5044A383155q6123K7109K2985l8440R1556q1217l7545Q2738l7344M6070M0017
5033A412961j4299L3979k9069r7832m052Q5025M3540O5070N1418q9797N2874j1846
5021A497972k387Q4491K3045j4253k3343j7769J48047k6234L9612N0952j1618
5010A748515J2533Q3163k1338J4779R6642m9508O0545J09782o2401N4773L1404
4999B078889j0822K10169N8178j57436o653N5482L0892J23171J17762K6267J82838
4988B708737m7094j2906J74003Q6176j7423R5802J5302J19781R6021Q4682l4674
4977C268407L4360K7046l6302K8650K3212J16154n1421j8496N9113R2744J41156
$$ plain form
4966 3684623 3746597 3697283 3743842 3765855 3697734 3725880 3694549 3665822 3643132 3658441 3677648
4955 3677648 3777608 3850221 3826513 3816979 3791675 3846836 3871454 3842373 3968445 4087870 4041650
4944 4041650 4109135 4090794 4109976 4104301 4155943 4233511 4373482 4326159 4311398 4387165 4363256
4933 4363256 4415859 4537272 4542595 4602634 4629905 4528760 4552197 4609320 4660997 4738396 4763621
4922 4763621 4710467 4763850 4898368 4884941 4955197 4944750 4897271 4910287 4937194 4967743 5009335
4911 5009335 4989532 5050691 5029517 5059312 5058889 5115751 5082732 5116227 5189912 5177092 5197808 5163793
4899 5163793 5144438 5174185 5162540 5173938 5200582 5142542 5155303 5156651 5144456 5156100 5140383 5110364
4887 5110364 5101580 5174362 5159858 5202522 5159131 5057137 5098423 5079996 5102074 5149895 5101406
$$ packed form
4966C684623O1974m9314M6559K2013o8121K8146l1331k8727k2690J5309J9207
4955C677648R9960P2613k3708r534k5304N5161K4618k9081J26072J19425m6220
4944D041650O7485j8341J9182n675N1642P7568J39971m7323j4761P5767k3909
4933D363256N2603J21413N323O0039K7271j01145K3437N7123N1677P7399K5225
4922D763621n3154N3383J34518j3427P0256j0447m7479J3016K6907L0549M1592
4911E009335j9803O1159k1174K9795m23N6862l3019L3495P3685j2820K0716l4015
4899E163793j9355K9747j1645J1398K6644n8040J2761J348j2195J1644j5717l0019
4887E110364q784P2782j4504M2664m3391j01994M1286j8427K2078M7821m8489
$$ plain form
4876 5101406 5083962 5047346 5006078 5065827 5061596 5002000 5021394 4990029 4856435 4983070 4990451
4865 4990451 4935471 5005481 4913845 4851867 4917355 4847126 4860986 4930310 4862636 4847817 4934978
4854 4934978 4835833 4804559 4912218 4922210 4942350 5042404 4956927 4983351 4995575 4996611 5083954
4843 5083954 5119474 5102909 4983922 4950351 4936603 4923890 4956084 4901006 4840926 4816164 4835255
4832 4835255 4825435 4880368 4980264 4929849 4928184 5058953 5042790 5192832 5355857 5503343 5798310
4821 5798310 6217527 6829262 7699067 8589853 9456209 10085697 10211628 9939573 9663369 9302614
4811 9302614 8772219 8193908 7469035 6903508 6417063 5959540 5649097 5435243 5250963 5137298
4801 5137298 5078209 4924464 4832475 4832448 4786651 4778356 4801031 4681050 4632154 4557519 4605414 4606594
$$ packed form
4876E101406j7444l6616m1268N9749m231n9596J9394l1365j33594J26635P381
4865D990451n4980P0010r1636o1978O5488p0229J3860O9324o7674j4819Q7161
4854D934978r9145l1274J07659R992K0140J00054q5477K6424J2224J036Q7343
4843E083954L5520j6565j18987l3571j3748j2713L2194n5078o0080k4762J9091
4832D835255r820N4933R9896n0415j665J30769j6163J50042J63025J47486K94967
4821E798310M19217O11735Q69805Q90786Q66356O29488J25931k72055k76204l60755
4811I302614n30395n78311p24873n65527m86445m57523l10443k13854j84280j13665
4801E137298n9089j53745r1989k7m5797q295K2675j19981m8896p4635M7895J180
$$ plain form
4789 4606594 4557247 4550711 4504276 4480380 4473046 4562135 4561152 4492467 4349486 4320678 4352640 4426063
4777 4426063 4433453 4498244 4434399 4411675 4391933 4348827 4367509 4324148 4325520 4311187 4279172 4273323
4765 4273323 4267338 4256220 4269512 4334312 4375186 4300682 4352598 4320529 4251258 4306771 4279878 4301771
4753 4301771 4300336 4275408 4231979 4301521 4350930 4369705 4337445 4249647 4157897 4231668 4227275 4322343
4741 4322343 4346092 4271557 4253658 4217615 4261788 4272110 4261114 4285086 4270635 4235257 4199220
4730 4199220 4263269 4302988 4303991 4302344 4247969 4285622 4310124 4266449 4295099 4237051 4239530 4242477
4718 4242477 4283149 4352476 4389728 4416485 4297581 4272957 4274602 4260764 4332865 4323461 4342645 4361670
4706 4361670 4306114 4308144 4279875 4298561 4303986 4307043 4349899 4345666 4298515 4331304 4342266 4349460
$$ packed form
4789D606594m9347o536m6435k3896p334Q9089r83o8685j42981k8808L1962P3423
4777D426063P390O4791o3845k2724j9742m3106J8682m3361J372j4333l2015n849
4765D273323n985j1118J3292O4800M0874p4504N1916l2069o9271N5513k6893K1893
4753D301771j435k4928m3429O9542M9409J8775l2260q7798r1750P3771m393R5068
4741D322343K3749p4535j7899l6043M4173J0322j0996K3972j4451l5378l6037
4730D199220O4049L9719J003j647n4375L7653K4502m3675K8650n8048K479K947
4718D242477M0672O9327L7252K6757j18904k4624J645j3838P2101r404J9184J9025
4706D361670n5556K030k8269J8686N425L057M2856m233m7151L2789J0962P194
$$ plain form
4694 4349460 4365716 4396051 4285855 4302182 4387447 4350849 4384526 4377340 4304994 4350881 4315442
4683 4315442 4411405 4460324 4475131 4452683 4424777 4371206 4305671 4386495 4415885 4431464 4463246
4672 4463246 4422017 4431628 4418691 4427979 4476855 4481587 4460106 4454439 4432070 4464606 4481986 4571498
4660 4571498 4563086 4569018 4511465 4498018 4508308 4525876 4663539 4623009 4578775 4600814 4613249 4692861
4648 4692861 4756695 4753717 4786642 4706119 4708688 4741585 4796507 4777173 4800787 4805475 4794075 4892833
4636 4892833 4935631 4956245 5040740 5031679 5093298 5283553 5423685 5678329 5944510 6234390 6584025
4625 6584025 6777125 6760587 6669946 6618084 6517953 6435821 6251546 6093456 5926831 5864023
4615 5864023 5901780 5956616 6038425 6200533 6270837 6414595 6670645 6868321 7089800 7287264
$$ packed form
4694D349460J6256L0335j10196J6327Q5265l6598L3677p186p2346M5887l5439
4683D315442R5963M8919J4807k2448k7906n3571o5535Q0824K9390J5579L1782
4672D463246m1229R611j2937R288M8876M732k1481n667k2369L2536J7380Q9512
4660D571498q412N932n7553j3447J0290J7568J37663m0530m4234K2039J2435P9612
4648D692861O3834k978L2925q0523K569L2897N4922j9334K3614M688j1400R8758
4636D892833M2798K0614Q4495r061O1619J90255J40132K54644K66181K89880L49635
4625F584025J93100j6538r0641n1862j00131q2132j84275j58090j66625o2808
4615E864023L7757N4836Q1809J62108P0304J43758K56050J97676K21479J97464
$$ plain form
4605 7287264 7422352 7608121 7893122 8168666 8557200 8884167 8986415 9132626 9186654 9289336
4595 9289336 9606652 9841028 10055683 10263677 10349397 10375834 10349892 10306385 10167829 10115072
4585 10115072 9976650 9894460 9891345 9721980 9551544 9293023 9010273 8830155 8613176 8369742
4575 8369742 8248485 8041311 7890413 7721408 7535837 7328867 7142256 6956331 6822954 6804849
4565 6804849 6717775 6651942 6532106 6479515 6559672 6614640 6718151 6867431 6919500 7005973 7147633
4554 7147633 7379761 7633787 7765036 7871341 7976213 8200343 8387026 8726024 9028720 9251227
4544 9251227 9522461 9645897 9805649 10004519 10038023 10123668 10157683 10177804 10305966 10425373
4534 10425373 10445578 10444280 10351793 10147415 9970019 9792047 9605593 9596223 9451389 9398482 9418216
$$ packed form
4605G287264J35088J85769K85001K75544L88534L26967J02248J46211N4028J02682
4595I289336L17316K34376K14655K07994Q5720K6437k5942m3507j38556n2757
4585A0115072j38422q2190l115j69365j70436k58521k82750j80118k16979k43434
4575H369742j21257k07174j50898j69005j85571k06970j86611j85925j33377j8105
4565F804849q7074o5833j19836n2591Q0157N4968J03511J49280N2069Q6473J41660
4554G147633K32128K54026J31249J06305J04872K24130J86683L38998L02696K22507
4544I251227K71234J23436J59752J98870L3504Q5645L4015K0121J28162J19407
4534A0425373K0205j298r2487k04378j77396j77972j86454r370j44834n2907J9734
$$ plain form
4523 9418216 9366205 9318925 9273311 9284111 9281361 9274922 9370468 9507760 9778136 10100589 10564949
4512 10564949 11134803 11768803 12773615 14238564 16457293 18715579 20273926 21615156
4504 21615156 22738896 23490926 24273382 25409066 26967444 29127112 32228381 36864681
4496 36864681 41772541 44222208 44745659 44639916 43542731 42018606 41291036 41248323 41906575
4487 41906575 43340518 45592139 48253146 49009905 46869692 43549186 39782678 35897876
4479 35897876 32580300 30299040 28610550 27406250 26473033 25710146 24758824 23087452 20912009
4470 20912009 18590471 16267863 14242345 12652615 11478133 10563372 9781338 9093297 8498481
4461 8498481 8057494 7736980 7476789 7306104 7029778 6805994 6637798 6585550 6508321 6428603
$$ packed form
4523I418216n2011m7280m5614J0800k750o439R5546J37292K70376L22453M64360
4512A0564949N69854O34000J004812J464949K218729K258286J558347J341230
4504B1615156J123740P52030P82456J135684J558378K159668L101269M636300
4496C6864681M907860K449667N23451j05743j097185j524125p27570m2713O58252
4487D1906575J433943K251621K661007P56759k140213l320506l766508l884802
4479C5897876l317576k281260j688490j204300r33217p62887r51322j671372k175443
4470B0912009k321538k322608k025518j589730j174482r14761p82034o88041n94816
4461H498481m40987l20514k60191j70685k76326k23784j68196n2248p7229p9718
$$ plain form
4451 6428603 6356611 6252335 6194640 6151366 6141691 6142556 6142539 6056072 6003738 5970652 6002279 5982149
4439 5982149 5955785 5930778 5927077 5884027 5804978 5841400 5840340 5817337 5902195 5918253 5886155 5850069
4427 5850069 5813026 5808376 5871757 5931443 5885245 5859283 5868642 5850815 5882488 5893885 5926572 5888493
4415 5888493 5863380 5795419 5871276 6028683 6053514 5992306 5917652 5802431 5894961 5975588 6003790
4404 6003790 6066493 6027400 5951114 5946065 5993998 6009535 6157457 6221780 6154884 6178495 6187345 6205589
4392 6205589 6244686 6267681 6251260 6280843 6292957 6375139 6402318 6427140 6380897 6408031 6416434 6486474
4380 6486474 6464613 6498164 6561027 6553674 6582398 6542611 6530719 6557528 6570777 6625533 6709869 6688425
4368 6688425 6613334 6507910 6460812 6519466 6595394 6601668 6582378 6615575 6586986 6623326 6637315
$$ packed form
4451F428603p1992j04276n7695m3274r675Q65j7q6467n2334l3086L1627k0130
4439E982149k6364k5007l701m3050p9049L6422j060k3003Q4858J6058l2098l6086
4427E850069l7043m650O3381N9686m6198k5962R359j7827L1673J1397L2687l8079
4415E888493k5113o7961P5857J57407K4831o1208p4654j15221R2530Q0627K8202
4404F003790O2703l9093p6286n049M7933J5537J47922O4323o6896K3611Q850J8244
4392F205589L9097K2995j6421K9583J2114Q2182K7179K4822m6243K7134Q403P0040
4380F486474k1861L3551O2863p353K8724l9787j1892K6809J3249N4756Q4336k1444
4368F688425p5091j05424m7098N8654P5928O274j9290L3197k8589L6340J3989
$$ plain form
4357 6637315 6597349 6666393 6635816 6564789 6631318 6689696 6712714 6746722 6665521 6610444 6632644
4346 6632644 6670110 6719221 6866576 6828997 6809033 6789426 6720195 6775665 6836401 6826625 6842726
4335 6842726 6870200 6896524 6902783 6888315 6901698 6993216 7008409 6978487 6989625 6979684 6991579 7009940
4323 7009940 7033785 7136354 7086313 7065964 7115381 7121673 7186196 7267569 7225463 7189814 7192569 7173308
4311 7173308 7202949 7311747 7351124 7417744 7330510 7236659 7313225 7365499 7354422 7406537 7406933 7450721
4299 7450721 7490323 7493814 7509091 7573702 7557053 7551484 7570545 7563568 7622299 7641141 7598169 7673616
4287 7673616 7719099 7726127 7761033 7765862 7882740 7965832 7973073 7900452 7944604 8024773 8067340 8143660
4275 8143660 8199832 8231148 8321141 8379968 8457203 8644026 8744906 8874957 8912375 9077369 9248657
$$ packed form
4357F637315l9966O9044l0577p1027O6529N8378K3018L4008q1201n5077K2200
4346F632644L7466M9111J47355l7579j9964j9607o9231N5470O0736r776J6101
4335F842726K7474K6324O259j4468J3383R1518J5193k9922J1138r941J1895J8361
4323G009940K3845J02569n0041k0349M9417O292O4523Q1373m2106l5649K755j9261
4311G173308K9641J08798L9377O6620q7234r3851P6566N2274j1077N2115L96M3788
4299G450721L9602L491J5277O4611j6649n569J9061o977N8731J8842m2972P5447
4287G673616M5483P028L4906M829J16878Q3092P241p2621M4152Q0169M2567P6320
4275H143660N6172L1316Q9993N8827P7235J86823J00880J30051L7418J64994J71288
$$ plain form
4264 9248657 9456790 9686152 9843405 10054757 10211044 10365658 10629211 11006706 11301156 11642805
4254 11642805 12110164 12652672 13217066 13864834 14446614 15094466 15658330 16057669 16443270
4245 16443270 16809373 17165719 17533896 17985649 18556448 19276516 20152633 21175527 22395490
4236 22395490 23661120 24812598 25770178 26386170 26659703 26843070 26771705 26591816 26474985
4227 26474985 26471021 26570497 27020506 27809553 28880682 30105227 31189311 31960194 32402156
4218 32402156 32374932 31930755 31207945 30130441 28881755 27724136 26729196 26037156 25785540
4209 25785540 25822893 26072276 26468800 26642349 26596144 26293574 25509644 24401092 23133450
4200 23133450 21633800 20159968 18784549 17589460 16603090 15895628 15384637 15023818 14767239
$$ packed form
4264I248657K08133K29362J57253K11352J56287J54614K63553L77495K94450L41649
4254A1642805M67359N42508N64394O47768N81780O47852N63864L99339L85601
4245A6443270L66103L56346L68177M51753N70799P20068Q76117J022894J219963
4236B2395490J265630J151478R57580O15992K73533J83367p1365j79889j16831
4227B6474985l964R9476M50009P89047J071129J224545J084084P70883M41962
4218C2402156k7224m44177p22810j077504j248686j157619r94940o92040k51616
4209B5785540L7353K49383L96524J73549m6205l02570p83930j108552j267642
4200B3133450j499650j473832j375419j195089r86370p07462n10991l60819k56579
$$ plain form
4191 14767239 14406800 13959838 13423723 12731231 11934677 11053918 10206361 9368335 8620664
4182 8620664 8002230 7361919 6882978 6543744 6116654 5849308 5708715 5496553 5269741 4978742
4172 4978742 4630927 4356025 4090574 3821213 3736777 3570867 3329795 3176926 3013206 2862449
4162 2862449 2864507 2803719 2719298 2655878 2490212 2473549 2546090 2458198 2372360 2311524 2178222
4151 2178222 2097623 2118607 2140656 2189243 2150856 2096807 2066172 1966712 1872417 1929957 1926473 1933143
4139 1933143 1924992 1889567 1838403 1794984 1762791 1768467 1760617 1700368 1716768 1675278 1612703 1639959
4127 1639959 1662969 1641661 1652520 1626197 1638736 1593737 1543297 1595781 1587784 1524923 1489000 1469957
4115 1469957 1491492 1517656 1478585 1462698 1437551 1391602 1395809 1463991 1404300 1434173 1387740 1284725
$$ packed form
4191A4767239l60439m46962n36115o92492p96554q80759q47557q38026p47671
4182H620664o18434o40311m78941l39234m27090k67346j40593k12162k26812k90999
4172D978742l47815k74902k65451k69361q4436j65910k41072j52869j63720j50757
4162B862449K058o0788q4421o3420j65666j6663P2541q7892q5838o0836j33302
4151B178222q0599K0984K2049M8587l8387n4049l0635r9460r4295N7540l484O670
4139A933143q151l5425n1164m3419l2193N676p850o0249J6400m1490o2575K7256
4127A639959K3010k1308J0859k6323J2539m4999n0440N2484p997o2861l5923j9043
4115A469957K1535K6164l9071j5887k5147m5949M207O8182n9691K9873m6433j03015
$$ plain form
4103 1284725 1289524 1326556 1274739 1313203 1286880 1233813 1257212 1228850 1192780 1253683 1267401 1193608
4091 1193608 1200152 1161411 1173377 1231190 1215678 1199861 1135794 1128718 1065821 1124916 1177466 1209228
4079 1209228 1183562 1110323 1066072 1075651 1099870 1111390 1112068 1069146 1016523 955193 994283 1036477
4067 1036477 1048756 1050408 1006186 983514 944961 889342 930434 989317 1005072 1006736 981301 968336
4055 968336 956969 959370 995358 1034266 1042459 995952 1005579 997712 994629 1021087 1054862 1044888 1018059
4042 1018059 946131 997171 995465 989148 988935 972501 904094 919089 990790 1031190 1064507 1125427
4030 1125427 1056550 1012766 1015198 973080 1021892 1042434 928325 960705 1030190 1003502 978284
4019 978284 1003161 922317 901322 889919 860403 891741 962585 886079 900213 914853 885671 884557
$$ packed form
4103A284725M799L7032n1817L8464k6323n3067K3399k8362l6070O0903J3718p3793
4091A193608O544l8741J1966N7813j5512j5817o4067p076o2897N9095N2550L1762
4079A209228k5666p3239m4251R579K4219J1520O78m2922n2623o1330L9090M2194
4067A036477J2279J652m4222k2672l8553n5619M1092N8883J5755J664k5435j2965
4055I68336j1367K401L5988L8908Q193m6507R627p867l083K6458L3775r974k6829
4042A018059p1928N1040j706o317k13j6434o8407J4995P1701M0400L3317O0920
4030A125427o8877m3784K432m2118M8812K0542j14109L2380O9485k6688k5218
4019I78284K4877q0844k0995j1403k9516L1338P0844p6506J4134J4640k9182j114
$$ plain form
4007 884557 906398 847856 833172 911448 823800 827273 917143 918834 873184 880201 880242 839601 842086
3994 842086 839542 842102 869125 837308 799713 804055 720197 719550 824807 870617 842936 864298
3982 864298 837065 778846 842355 869247 885681 921188 853382 777680 787927 757148 819517 847958
3970 847958 794997 739757 753652 812462 816694 823479 776406 767242 770756 724119 796715 794279 735307
3957 735307 784303 744666 777946 828945 858571 894474 885639 945130 912338 894117 890429 882156
3945 882156 954896 1062028 1164572 1366832 1494597 1654401 1763994 1822237 1810584 1758534
3935 1758534 1748989 1739890 1716799 1655879 1535353 1482668 1399881 1312928 1267865 1256850 1305381 1371582
3923 1371582 1319358 1266163 1233372 1308019 1355035 1412132 1396502 1394775 1395369 1387489 1408080 1498072
$$ packed form
4007H84557K1841n8542j4684P8276q7648L473Q9870J691m5650P017M1m0641K485
3994H42086k544K560K7023l1817l7595M342q3858o47J05257M5810k7681K1362
3982H64298k7233n8219O3509K6892J6434L5507o7806p5702J0247l0779O2369K8441
3970H47958n2961n5240J3895N8810M232O785m7073r164L514m6637P2596k436n8972
3957G35307M8996l9637L3280N0999K9626L5903q835N9491l2792j8221l688q273
3945H82156P2740J07132J02544K02260J27765J59804J09593N8243j1653n2050
3935A758534r545r099k3091o0920j20526n2685q2787q6953m5063j1015M8531O6201
3923A371582n2224n3195l2791P4647M7016N7097j5630j727N94p880K0591Q9992
$$ plain form
3911 1498072 1612594 1718045 1830603 1979842 2128822 2208761 2180637 2145544 2119149 1960344
3901 1960344 1848817 1783474 1701603 1664722 1590437 1533194 1440947 1380654 1400686 1387343 1371683
3890 1371683 1366191 1368198 1367289 1304002 1298981 1373652 1332637 1261004 1243160 1210627 1108410 1089341
3878 1089341 1051443 1015280 1030936 950980 950609 974788 929767 925162 951433 895203 896168 927285
3866 927285 881030 840675 894507 921793 898480 905687 891806 932814 880394 924303 960712 997438
3854 997438 959377 930815 954849 1001902 938465 982046 1005241 957760 983842 994604 956853 968245
3842 968245 1006457 955985 996371 1016274 1078699 1146200 1103067 1040990 1053855 1040634 1029785 1096160
3830 1096160 1131951 1143237 1106094 1120694 1138757 1202275 1176022 1214805 1207865 1207066 1208120 1210870
$$ packed form
3911A498072J14522J05451J12558J49239J48980P9939k8124l5093k6395j58805
3901A960344j11527o5343q1871l6881p4285n7243r2247o0293K0032j3343j5660
3890A371683n492K007r09o3287n021P4671m1015p1633j7844l2533j02217j9069
3878A089341l7898l6163J5656p9956l71K4179m5021m605K6271n6230R65L1117
3866I27285m6255m0355N3832K7286k3313P207j3881M1008n2420M3909L6409L6726
3854I97438l8061k8562K4034M7053o3437M3581K3195m7481K6082J0762l7751J1392
3842I68245L8212n0472M0386J9903O2425O7501m3133o2077J2865j3221j0849O6375
3830A096160L5791J1286l7143J4600J8063O3518k6253L8783o940p99J054K750
$$ plain form
3818 1210870 1218380 1258995 1309343 1306619 1327955 1338099 1380412 1373523 1355863 1360419 1398786 1442574
3806 1442574 1450450 1473386 1504950 1560862 1603662 1706682 1685400 1738781 1831656 1892655 1975223
3795 1975223 2140913 2220861 2330287 2493802 2579010 2790394 3070036 3247941 3508272 3719107
3785 3719107 3845930 4051370 4230581 4314160 4417463 4505427 4497042 4574708 4563142 4505972 4527457
3774 4527457 4494595 4446884 4520853 4569436 4614355 4643215 4614532 4544984 4495745 4441081 4362141
3763 4362141 4265071 4155115 3986401 3835753 3743814 3598160 3398526 3296541 3250622 3152808
3753 3152808 3118320 3067463 2938507 2933981 2806163 2817336 2877157 2838320 2877730 2919453 2865356
3742 2865356 2901437 2920534 2888249 2825791 2835277 2784508 2872836 2917951 2894539 2902832 2817128 2732044
$$ packed form
3818A210870P510M0615N0348k724K1336J0144M2313o889j7660M556L8367M3788
3806A442574P876K2936L1564N5912M2800J03020k1282N3381R2875O0999Q2568
3795A975223J65690P9948J09426J63515Q5208K11384K79642J77905K60331K10835
3785C719107J26823K05440J79211Q3579J03303Q7964q385P7666j1566n7170K1485
3774D527457l2862m7711P3969M8583M4919K8860k8683o9548m9239n4664p8940
3763D362141r7070j09956j68714j50648r1939j45654j99634j01985m5919r7814
3753C152808l4488n0857j28956m526j27818J1173N9821l8837L9410M1723n4097
3742B865356L6081J9097l2285o2458R486n0769Q8328M5115k3412Q293q5704q5084
$$ plain form
3730 2732044 2835775 2827714 2818958 2812218 2749744 2756448 2703580 2718545 2745280 2775798 2787584 2823964
3718 2823964 2851021 2816989 2875637 2884078 2899187 2960091 2991533 3054760 3125687 3109406 3168581 3195846
3706 3195846 3172205 3182874 3238011 3305851 3374219 3397141 3412872 3477422 3488148 3580860 3699528
3695 3699528 3765824 3866114 4001430 4039807 4128950 4181937 4249783 4342146 4327600 4388340 4489966
3684 4489966 4482583 4505412 4584009 4532782 4567882 4722481 4806831 4854707 4960968 4984115 5105351
3673 5105351 5168002 5196691 5366508 5403035 5485845 5621189 5716612 5774396 5862200 5926433 6062120
3662 6062120 6164100 6245333 6403785 6543505 6580599 6788115 6959320 7109832 7380070 7513009
3652 7513009 7697166 7927221 8036443 8287362 8585379 8852592 9174465 9526989 9779602 10236541
$$ packed form
3730B732044J03731q061q756o740o2474O704n2868J4965K6735L0518J1786L6380
3718B823964K7057l4032N8648Q441J5109O0904L1442O3227P0927j6281N9175K7265
3706C195846k3641J0669N5137O7840O8368K2922J5731O4550J0726R2712J18668
3695C699528O6296J00290J35316L8377Q9143N2987O7846R2363j4546O0740J01626
3684D489966p383K2829P8597n1227L5100J54599Q4350M7876J06261K3147J21236
3673E105351O2651K8689J69817L6527Q2810J35344R5423N7784Q7804O4233J35687
3662F062120J01980Q1233J58452J39720L7094K07516J71205J50512K70238J32939
3652G513009J84157K30055J09222K50919K98017K67213L21873L52524K52613M56939
$$ plain form
3642 10236541 10676329 11030333 11488716 12030588 12500539 13128133 13715501 14396843 15233105
3633 15233105 16095446 17090749 18320553 19714413 21529662 23632987 26148625 29365097
3625 29365097 33153727 37514768 42538318 47992141 53683720 59472292 64874672 69736588
3617 69736588 73855959 76859220 78819072 79782183 79790457 79208729 78306509 77323292 76571907
3608 76571907 76169340 76185917 76702030 77380634 78094160 78589085 78498203 77624891 75989346 73295446
3598 73295446 69704379 65372206 60451199 55329934 50092104 44944893 40222067 35887788
3590 35887788 32029432 28888451 26211657 24023561 22181590 20590188 19297487 18185174
3582 18185174 17238980 16364029 15533915 14710144 14097132 13415513 12760764 12266449 11836652
$$ packed form
3642A0236541M39788L54004M58383N41872M69951O27594N87368O81342Q36262
3633A5233105Q62341R95303J229804J393860J815249K103325K515638L216472
3625B9365097L788630M361041N023550N453823N691579N788572N402380M861916
3617F9736588M119371L003261J959852R63111Q274n81728r02220r83217p51385
3608G6571907m02567J6577N16113O78604P13526M94925r0882q73312j635545k693900
3598G3295446l591067m332173m921007n121265n237830n147211m722826m334279
3590C5887788l858356l140981k676794k188096j841971j591402j292701j112313
3582A8185174r46194q74951q30114q23771o13012o81619o54749m94315m29797
$$ plain form
3573 11836652 11347946 10906812 10484522 10225968 10014573 9740118 9514094 9400678 9262631
3564 9262631 9138418 9153839 9105796 9098462 9124820 9195569 9329657 9423323 9535839 9683380 9799271
3553 9799271 10051399 10372628 10581264 10879284 11132721 11380143 11557546 11747087 11959067 12150387
3543 12150387 12204456 12252629 12304954 12407250 12418244 12440932 12469966 12545798 12711009 12845708 13105266
3532 13105266 13345386 13677321 14043637 14425836 14823635 15244899 15596616 15890046 16190132
3523 16190132 16480715 16683559 16867410 16992910 17139993 17363289 17496447 17715322 17987367
3514 17987367 18265949 18545825 18740390 18915502 19101201 19246513 19411930 19484965 19549535 19661214
3504 19661214 19756658 19875786 20012625 20255310 20560941 20924232 21343194 21895967 22573222 23281820
$$ packed form
3573A1836652m88706m41134m22290k58554k11395k74455k26024j13416j38047
3564I262631j24213J5421m8043p334K6358P0749J34088R3666J12516J47541J15891
3553I799271K52128L21229K08636K98020K53437K47422J77403J89541K11980J91320
3543A2150387N4069M8173N2325J02296J0994K2688K9034P5832J65211J34699K59558
3532A3105266K40120L31935L66316L82199L97799M21264L51717K93430L00086
3523A6190132K90583K02844J83851J25500J47083K23296J33158K18875K72045
3514A7987367K78582K79876J94565J75112J85699J45312J65417P3035O4570J11679
3504A9661214R5444J19128J36839K42685L05631L63291M18962N52773O77255P08598
$$ plain form
3494 23281820 24090671 24988236 26036959 27281183 28640651 30155646 31885954 33830117
3486 33830117 35976526 38425628 41170230 44211704 47497286 51047421 54863994 58993170
3478 58993170 63385848 68183667 73327951 78813211 84715972 90970868 97467609 104192894
3470 104192894 111001719 117697901 124082571 130074495 135635997 140580519 144806847 148515688
3462 148515688 151834315 154708177 157171824 159368398 161225947 162763433 163728940 164117557
3454 164117557 163796425 162649716 160642793 157778844 154078694 149648944 144541825 138921683
3446 138921683 132931879 126716357 120431961 114192917 108093303 102269633 96981082 92198824
3438 92198824 88171603 85168951 83367036 82815486 83705998 85968058 89573708 94334141
$$ packed form
3494B3281820Q08851Q97565J048723J244224J359468J514995J730308J944163
3486C3830117K146409K449102K744602L041474L285582L550135L816573M129176
3478E8993170M392678M797819N144284N485260N902761O254896O496741O725285
3470A04192894O808825O696182O384670N991924N561502M944522M226328L708841
3462A48515688L318627K873862K463647K196574J857549J537486R65507L88617
3454A64117557l21132j146709k006923k863949l700150m429750n107119n620142
3446A38921683n989804o215522o284396o239044o099614n823670n288551m782258
3438I2198824m027221l002652j801915n51550Q90512K262060L605650M760433
$$ plain form
3430 94334141 99970994 106338157 112913288 119259628 125056696 130009380 133794603 136380246
3422 136380246 137764231 137953118 137141214 135626990 133690780 131539916 129451202 127624082
3414 127624082 126103492 124927971 124229404 123824665 123624291 123296890 122717295 121678431 119918807
3405 119918807 117301878 113756102 109349898 104074885 98081077 91689873 85032090 78330023
3397 78330023 71770374 65365849 59348324 53778538 48747637 44234622 40122690 36457101
3389 36457101 33171155 30260942 27634636 25334813 23276100 21509891 19929573 18658618
3381 18658618 17573839 16642038 15829787 15135601 14579575 14164872 13879056 13650775 13517800
3372 13517800 13390784 13335443 13372186 13558552 13789493 14147647 14572182 15138485 15772612 16525297
$$ packed form
3430I4334141N636853O367163O575131O346340N797068M952684L785223K585643
3422A36380246J383985J88887q11904j514224j936210k150864k088714j827120
3414A27624082j520590j175521o98567m04739k00374l27401n79595j038864j759624
3405A19918807k616929l545776m406204n275013n993808o391204o657783o702067
3397G8330023o559649o404525o017525n569786n030901m513015m111932l665589
3389C6457101l285946k910213k626306k299823k058713j766209j580318j270955
3381A8658618j084779r31801q12251o94186n56026m14703k85816k28281j32975
3372A3517800j27016n5341L6743J86366K30941L58154M24535N66303O34127P52685
$$ plain form
3362 16525297 17354027 18254972 19238181 20177426 21125464 22093834 22938222 23618512 24209457
3353 24209457 24597605 24737578 24700673 24487890 24039374 23545604 22952173 22241223 21510807 20722015
3343 20722015 19926368 19036833 18164151 17246722 16376617 15561669 14750706 14060051 13483392
3334 13483392 12951732 12640799 12471552 12363072 12321453 12328071 12368955 12418901 12588643 12744043
3324 12744043 12967829 13348206 13669208 14024688 14532111 15011901 15606882 16352792 17188340
3315 17188340 18124717 19333726 20700844 22294317 24348947 26815861 29799565 33390159
3307 33390159 37650172 42755628 48576094 55051787 62095286 69612818 77471224 85301107
3299 85301107 92950297 100029361 106193912 111184001 114625112 116318805 116091901 113995960
$$ packed form
3362A6525297Q28730R00945R83209R39245R48038R68370Q44388O80290N90945
3353B4209457L88148J39973l6905k12783m48516m93770n93431p10950p30416p88792
3343B0722015p95647q89535q72682r17429q70105q14948q10963o90655n76659
3334A3483392n31660l10933j69247j08480m1619O618M0884M9946J69742J55400
3324A2744043K23786L80377L21002L55480N07423M79790N94981P45910Q35548
3315A7188340R36377J209009J367118J593473K054630K466914K983704L590594
3307C3390159M260013N105456N820466O475693P043499P517532P858406P829883
3299H5301107P649190P079064O164551M990089L441111J693693k26904k095941
$$ plain form
3291 113995960 110154654 104751861 98148789 90627327 82522280 74259410 66040085 58264988
3283 58264988 51039153 44465203 38667063 33645497 29283569 25520370 22380439 19740304
3275 19740304 17449187 15636185 14104857 12768425 11684039 10697071 9883997 9081344 8453098
3266 8453098 7908096 7457845 7135452 6803973 6497124 6222088 5962858 5749517 5590300 5402220
3256 5402220 5228716 5067858 4950499 4793992 4784851 4743236 4649637 4653070 4645037 4697994 4727246
3245 4727246 4766211 4794877 4824341 4847465 4886391 5022264 5134566 5127600 5159475 5103440 5007844
3234 5007844 4852705 4718243 4642833 4491725 4355570 4223245 4098141 4038739 3938650 3783819
3224 3783819 3692277 3594621 3545260 3574046 3583960 3588196 3610571 3542786 3490877 3537215 3564348 3584674
$$ packed form
3291A13995960l841306n402793o603072p521462q105047q262870q219325p775097
3283E8264988p225835o573950n798140n021566m361928l763199l139931k640135
3275A9740304k291117j813002j531328j336432j084386r86968q13074q02653o28246
3266H453098n45002m50251l22393l31479l06849k75036k59230k13341j59217j88080
3256E402220j73504j60858j17359j56507r141m1615r3599L433q033N2957K9252
3245D727246L8965K8666K9464K3124L8926J35873J12302o966L1875n6035r5596
3234E007844j55139j34462p5410j51108j36155j32325j25104n9402j00089j54831
3224C783819r1542r7656m9361K8786R914M236K2375o7785n1909M6338K7133K0326
$$ plain form
3212 3584674 3569595 3567454 3612022 3668771 3657464 3667447 3667212 3742959 3684121 3673847 3691821 3702912
3200 3702912 3660962 3639153 3700469 3704549 3703350 3677647 3687822 3783429 3851572 3852057 3972236 3980721
3188 3980721 3976433 4053513 4134865 4305515 4471119 4610918 4659937 4788515 4922907 5014301 5053689
3177 5053689 5110477 5125268 5111790 5093367 5138376 5250601 5245477 5227750 5224563 5287377 5273268 5291297
3165 5291297 5309746 5313784 5331033 5317891 5349340 5445191 5522968 5618911 5725144 5809418 5883717
3154 5883717 5988997 6117386 6235828 6373997 6496801 6582953 6739878 6856607 7041445 7218305
3144 7218305 7356675 7525878 7722069 7927332 8177147 8410417 8670675 8895414 9130890 9412355
3134 9412355 9691656 10003256 10248136 10484844 10745783 10969599 11189462 11372898 11654901 11895155
$$ packed form
3212C584674j5079k141M4568N6749j1307R983k35P5747n8838j0274J7974J1091
3200C702912m1950k1809O1316M080j199k5703J0175R5607O8143M85J20179Q485
3188C980721m288P7080Q1352J70650J65604J39799M9019J28578J34392R1394L9388
3177E053689N6788J4791j3478j8423M5009J12225n124j7727l187O2814j4109J8029
3165E291297J8449M038J7249j3142L1449R5851P7777R5943J06233Q4274P4299
3154E883717J05280J28389J18442J38169J22804Q6152J56925J16729J84838J76860
3144G218305J38370J69203J96191K05263K49815K33270K60258K24739K35476K81465
3134I412355K79301L11600K44880K36708K60939K23816K19863J83436K82003K40254
$$ plain form
3124 11895155 12190158 12468423 12672582 12963586 13225656 13380648 13651889 13882372 14081024
3115 14081024 14332366 14489960 14688726 14988628 15337016 15578084 15855819 16153110 16470777
3106 16470777 16906071 17337809 17849621 18494335 19051579 19596771 20149865 20731317 21336772
3097 21336772 21898862 22549325 23282717 24123186 25093972 26144699 27290072 28525647 29781016
3088 29781016 31145558 32780237 34500806 36375916 38509846 40720916 43236842 46217410
3080 46217410 49646354 53902183 59210339 65710675 73678692 83120244 93775824 105602005
3072 105602005 118794568 134228586 153795972 179939274 214851777 259797534 313392223
3065 313392223 370809166 423355653 460386038 477038213 476303892 461725037 433603200
$$ packed form
3124A1895155K95003K78265K04159K91004K62070J54992K71241K30483J98652
3115A4081024K51342J57594J98766K99902L48388K41068K77735K97291L17667
3106A6470777M35294M31738N11812O44714N57244N45192N53094N81452O05455
3097B1336772N62090O50463P33392Q40469R70786J050727J145373J235575J255369
3088B9781016J364542J634679J720569J875110K133930K211070K515926K980568
3080D6217410L428944M255829N308156O500336P968017R441552J0655580J1826181
3072A05602005J3192563J5434018J9567386K6143302L4912503M4945757N3594689
3065C13392223N7416943N2546487L7030385J6652175p34321j4578855k8121837
$$ plain form
3058 433603200 392787105 344109602 294068893 247432101 206203597 171024269 142096172
3051 142096172 119298130 101779299 88038000 76824329 67384490 59058110 51685260
3044 51685260 45401915 40100592 35713818 32005252 28854452 26291321 24109351 22204674
3036 22204674 20555179 19131930 17883217 16798582 15825600 14968192 14281367 13502224 12695606
3027 12695606 12038034 11353093 10763156 10226970 9690006 9311002 8959240 8629451 8397274
3018 8397274 8213720 8014290 7802910 7522436 7239428 7068512 6811493 6499080 6280116 6075994
3008 6075994 5846813 5585258 5284177 5084055 4917904 4688166 4500522 4281626 4113970 3926517
2998 3926517 3713330 3599566 3526013 3381082 3188848 3016190 2926171 2898018 2835763 2768456
$$ packed form
3058D33603200m0816095m8677503n0040709m6636792m1228504l5179328k8928097
3051A42096172k2798042j7518831j3741299j1213671r439839q326380p372850
3044E1685260o283345n301323m386774l708566l150800k563131k181970j904677
3036B2204674j649495j423249j248713j084635r72982q57408o86825p79143q06618
3027A2695606o57572o84941n89937n36186n36964l79004l51762l29789k32177
3018H397274j83554j99430k11380k80474k83008j70916k57019l12413k18964k04122
3008F075994k29181k61555l01081k00122j66151k29738j87644k18896j67656j87453
2998C926517k13187j13764p3553j44931j92234j72658r0019k8153o2255o7307
$$ plain form
2988 2768456 2772131 2795354 2753012 2753262 2753557 2776914 2771914 2716055 2698928 2727770 2695363 2602905 2620100
2975 2620100 2642745 2586196 2575825 2550012 2560465 2653646 2658457 2655690 2623036 2609521 2628670 2567571
2963 2567571 2580649 2599952 2612193 2597933 2452712 2428472 2384785 2250036 2160341 2113405 2059801
2952 2059801 1976234 1931685 1846795 1791475 1738155 1591653 1484214 1433187 1395610 1419159 1424290
2941 1424290 1404217 1458148 1542560 1532408 1509840 1612064 1616568 1584817 1583847 1504956 1476606 1433235
2929 1433235 1358012 1376758 1378607 1269995 1163841 1096365 1057044 1011917 1003539 890179 767867
2918 767867 788194 747420 720262 716125 701265 626184 588240 591550 583991 583251 599615 558678 613587
2905 613587 645204 603042 620958 658662 719188 705733 666041 652660 676278 716144 681356 682808
$$ packed form
2988B768456L675K3223m2342K50K95K3357n000n5859j7127K8842l2407r2458J7195
2975B620100K2645n6549j0371k5813J0453R3181M811k767l2654j3515J9149o1099
2963B567571J3078J9303J2241j4260j45221k4240m3687j34749q9695m6936n3604
2952B059801q3567m4549q4890n5320n3320j46502j07439n1027l7577K3549N131
2941A424290k0073N3931Q4412j0152k2568J02224M504l1751r70p8891k8350m3371
2929A433235p5223J8746J849j08612j06154o7476l9321m5127q378j13360j22312
2918G67867K0327m0774k7158m137j4860p5081l7944L310p559p40J6364m0937N4909
2905F13587L1617m2162J7916L7704O0526j3455l9692j3381K3618L9866l4788J452
$$ plain form
2893 682808 761240 741268 686723 648850 577781 582449 494000 391708 370105 394715 341513 294742
2881 294742 280447 297532 324409 270580 195092 239455 313677 324704 312823 279682 311233 304702
2869 304702 282898 272830 332028 309127 235143 219542 268811 287985 286681 255524 237716 275711
2857 275711 245734 212530 236679 311647 292795 231049 161973 187677 237378 223014 238323 284179
2845 284179 317573 290051 289460 285886 346328 326964 341564 292124 325575 346667 293913 338047
2833 338047 323841 308559 315477 284525 259603 340708 367222 368862 394685 476842 498242 452313
2821 452313 459325 447144 470358 418886 378637 373029 395071 366495 340631 370738 355974 362950
2809 362950 380473 327229 321592 372460 322931 273331 348411 427153 431099 413902 439339 438040
$$ packed form
2893F82808P8432j9972n4545l7873p1069M668q8449j02292k1603K4610n3202m6771
2881B94742j4295J7085K6877n3829p5488M4363P4222J1027j1881l3141L1551o531
2869C04702k1804j0068N9198k2901p3984j5601M9269J9174j304l1157j7808L7995
2857B75711k9977l3204K4149P4968j8852o1746o9076K5704M9701j4364J5309M5856
2845B84179L3394k7522n91l574O0442j9364J4600m9440L3451K1092n2754M4134
2833C38047j4206j5282O918l0952k4922Q1105K6514J640K5823Q2157K1400m5929
2821D52313P012j2181K3214n1472m0249n608K2042k8576k5864L0107j4764O976
2809C62950J7523n3244n637N0868m9529m9600P5080P8742L946j7197K5437j299
$$ plain form
2797 438040 450986 434094 482140 577692 605047 597160 662522 748686 852557 992100 1128620
2786 1128620 1223505 1373506 1623210 1835760 2135855 2400655 2554036 2598950 2604741 2513617
2776 2513617 2353740 2163885 1876338 1652326 1464509 1162345 975229 887228 773798 752235
2766 752235 672784 575584 505684 428297 379203 333599 307932 286468 290305 256152 219111 211188
2754 211188 214715 217389 210159 186046 252741 253842 225885 219539 243333 264465 260379 253159 244682
2741 244682 259037 244139 218148 184616 210820 166726 117032 144919 213929 241213 251009 269162
2729 269162 245454 260617 203078 225368 227837 236367 200478 271260 283461 280855 346618 339609
2717 339609 238874 274178 319382 293588 298180 246491 221382 188369 191051 206834 244296 225632
$$ packed form
2797D38040J2946j6892M8046R5552K7355p887O5362Q6164J03871J39543J36520
2786A128620R4885J50001K49704K12550L00095K64800J53381M4914N791r1124
2776B513617j59877j89855k87547k24012j87817l02164j87116q8001j13430k1563
2766G52235p9451r7200o9900p7387m9094m5604k5667k1464L837l4153l7041p923
2754B11188L527K674p230k4113O6695J101k7957o346K3794K1132m086p220q477
2741B44682J4355j4898k5991l3532K6204m4094m9694K7887O9010K7284R796J8153
2729B69162k3708J5163n7539K2290K469Q530l5889P0782J2201k606O5763p009
2717C39609j00735L5304M5204k5794M592n1689k5109l3013K682J5783L7462j8664
$$ plain form
2705 225632 138410 102759 129113 112351 136210 141070 151234 157009 146557 140628 106119 187148
2693 187148 167978 99907 153240 146041 97021 63619 87584 144091 152178 132432 163449 238716
2681 238716 241982 184088 246653 219508 189877 191046 137685 142005 212973 301001 271141 209577
2669 209577 167520 131369 105183 146239 170747 164022 140427 107878 143927 145831 134774 87260
2657 87260 134626 104683 117182 92413 105965 97536 117260 125207 156491 127217 153151 114080
2645 114080 91495 57799 13290 76235 73449 100177 96377 62842 -7189 -21143 33327 -1468
2633 -1468 -19545 -12586 4696 -26468 -27286 -8378 -12662 -31950 -15552 6953 8293 11841 42652
2620 42652 31559 7891 101622 93808 123621 77756 82435 79377 73494 54170 88261 81994 58029
$$ packed form
2705B25632q7222l5651K6354j6762K3859M860J0164N775j0452n929l4509Q1029
2693A87148j9170o8071N3333p199m9020l3402K3965N6507Q087j9746L1017P5267
2681B38716L266n7894O2565k7145k9631J169n3361M320P0968Q8028k9860o1564
2669B09577m2057l6151k6186M1056K4508o725k3595l2549L6049J904j1057m7514
2657H7260M7366k9943J2499k4769J3552q429J9724P947L1284k9274K5934l9071
2645A14080k2585l3696m4509O2945k786K6728l800l3535p0031j3954N4470l4795
2633a468j8077O959J7282l1164q18J8908m284j9288J6398K2505J340L548L0811
2620D2652j1093k3668R3731p814K9813m5865M679l058n883j9324L4091o267k3965
$$ plain form
2607 58029 118966 130045 67737 97418 103867 62884 63409 15916 23825 84823 59729 36091 18893
2594 18893 -15104 -39928 -3196 30439 79493 76267 84997 43823 58995 48530 55337 30275
2582 30275 106031 144481 126729 156395 147637 167220 199425 151511 152529 245083 236872 178919
2570 178919 206268 146099 95847 118296 62140 32008 157029 101899 67363 84962 74665
2559 74665 54078 31494 32585 62132 122631 47562 23330 46758 20679 8128 6758 12223
2547 12223 99771 59762 57945 25539 -1155 45926 -13486 -30913 44948 112767 126229 95026
2535 95026 28543 10410 6504 -34333 10721 94640 44942 37668 77301 18172 94326 66856
2523 66856 84933 57362 44554 -2719 31797 24656 35102 51748 -8429 -33013 87647 50173
$$ packed form
2607E8029O0937J1079o2308K9681O449m0983N25m7493P909O0998k5094k3638j7198
2594A8893l3997k4824L6732L3635M9054l226Q730m1174J5172j0465O807k5062
2582C0275P5756L8450j7752K9666q758J9583L2205m7914J018R2554q211n7953
2570A78919K7349o0169n0252K2449n6156l0132J25021n5130l4536J7599j0297
2559G4665k0587k2584J091K9547O0499p5069k4232K3428k6079j2551j370N465
2547A2223Q7548m0009j817l2406k6694M7081n9412j7427P5861O7819J3462l1203
2535I5026o6483j8133l906m0837M5054Q3919m9698p274L9633n9129P6154k7470
2523F6856J8077k7571j2808m7273L4516p141J0446J6646o0177k4584J20660l7474
$$ plain form
2511 50173 18 46039 5896 20638 -10617 10512 99211 68926 22675 28955 58609 24860
2499 24860 85996 33832 28589 70673 104559 87238 108843 62896 113218 103460 92970 118058
2487 118058 155331 134559 63783 82743 74927 39500 -5965 13507 -551 -24128 32751 119242
2475 119242 19424 13624 5830 -45160 -32230 -40525 21269 36025 7695 47582 73587 78691
2463 78691 80018 87330 58953 55307 64020 69020 60729 74838 59959 102754 -6215 4095 17811
2450 17811 67353 76396 123473 57903 66125 99661 82219 86065 104094 74249 108133 109630 57207
2437 57207 28948 40547 -8560 17789 42273 25450 49617 94650 105539 130485 182578 176751
2425 176751 125052 106036 112583 214120 198444 157184 112617 120857 123867 124218 120357 61789 59226
$$ packed form
2511E0173n0155M6021m0143J4742l1255K1129Q8699l0285m6251O280K9654l3749
2499B4860O1136n2164n243M2084L3886j7321K1605m5947N0322r758j0490K5088
2487A18058L7273k0772p0776J8960p816l5427m5465J9472j4058k3577N6879Q6491
2475A19242r9818n800p794n0990J2930q295O1794J4756k8330L9887K6005N104
2463G8691J327P312k8377l646Q713N000q291J4109j4879M2795j08969J0310J3716
2450A7811M9542R043M7077o5570Q222L3536j7442L846J8029k9845L3884J497n2423
2437E7207k8259J1599m9107K6349K4484j6823K4167M5033J0889K4946N2093n827
2425A76751n1699j9016O547J01537j5676m1260m4567Q240L010L51l861n8568k563
$$ plain form
2412 59226 86750 53776 37670 99786 58396 22907 36190 46424 84798 104114 51527 55756
2400 55756 122580 86684 80789 159257 161940 154272 148429 119139 68739 100366 123142 160084 139612
2387 139612 155959 160265 181636 158004 163248 163323 159239 193137 259166 251991 221486 281805 230581
2374 230581 181327 188420 195006 240105 259864 313027 362827 408627 309203 307505 326144 349947
2362 349947 373629 362907 375547 403055 354403 361930 335769 365128 397593 476235 515456 508703
2350 508703 586211 574526 528917 539438 595529 581953 560806 606205 637082 685304 656061 684914
2338 684914 723346 760126 808997 962043 978755 1022200 1093096 1204166 1275389 1428120 1635425
2327 1635425 1791581 2023601 2323322 2496191 2608148 2889066 3171391 3534474 3924970 4585298
$$ packed form
2412E9226K7524l2974j6106O2116m1390l5489J3283J0234L8374J9316n2587M229
2400E5756O6824l5896n895P8468K683p668n843k9290n0400L1627K2776L6942k0472
2387A39612J6347M306K1371k3632N244P5m084L3898O6029p175l0505O0319n1224
2374B30581m9254P093O586M5099J9759N3163M9800M5800r9424j698J8639K3803
2362C49947K3682j0722J2640K7508m8652P527k6161K9359L2465P8642L9221o753
2350E08703P7508j1685m5609J0521N6091j3576k1147M5399L0877M8222k9243K8853
2338F84914L8432L6780M8871J53046J6712M3445P0896J11070P1223J52731K07305
2327A635425J56156K32020K99721J72869J11957K80918K82325L63083L90496O60328
$$ plain form
2317 4585298 5448417 6689789 8635521 11698561 15984113 21088881 26899230 31570120
2309 31570120 32568753 31644990 30722846 28567498 24937582 20804238 16959576 13688950 11099619
2300 11099619 9013803 7261264 6089661 5378793 4995380 4683797 4364222 3997557 3705599
2291 3705599 3341574 2935307 2619933 2430741 2233319 2079455 1899431 1745976 1619339 1504646
2281 1504646 1442760 1398035 1345283 1310095 1207635 1111015 1119548 1045555 1009342 926528 881272
2270 881272 903447 857372 795301 794353 810810 697030 709117 706576 708471 730284 722874 653777
2258 653777 643682 563127 544308 525290 466897 511106 544536 502252 480049 495408 433741 403195
2246 403195 414091 418916 419822 405146 362136 353496 301463 254475 287916 275585 297614 310305
$$ packed form
2317D585298Q63119J241372J945732L063040M285552N104768N810349M670890
2309C1570120R98633r23763r22144k155348l629916m133344l844662l270626k589331
2300A1099619k085816j752539j171603p10868l83413l11583l19575l66665k91958
2291C705599l64025m06267l15374j89192j97422j53864j80024j53455j26637j14693
2281A504646o1886m4725n2752l5188j02460r6620Q533p3993l6213q2814m5256
2270H81272K2175m6075o2071r48J6457j13780J2087k541J895K1813p410o9097
2258F53777j0095q0555j8819j9018n8393M4209L3430m2284k2203J5359o1667l0546
2246D03195J0896M825R06j4676m3010q640n2033m6988L3441j2331K2029J2691
$$ plain form
2234 310305 343101 341471 288811 270995 248388 174513 223856 333900 310432 310036 310572 198521
2222 198521 184428 244922 203556 276711 315912 246805 300557 255793 159721 218723 214092 180385
2210 180385 251188 301662 274318 270741 192784 142661 167730 152017 140826 239183 205431 272855
2198 272855 216467 157696 106100 67193 100579 91240 153623 210708 224655 183059 130089 112004
2186 112004 110874 113365 141866 143902 202382 144798 129083 174482 62744 84932 146435 124875
2174 124875 178151 194543 99018 117810 88697 40690 99890 124405 53785 151234 148553 41989
2162 41989 94597 31582 2707 55837 119932 158952 152959 89622 79223 50036 38318 49894
2150 49894 24958 71060 76232 70090 43072 101224 21800 34357 12756 -4917 143010 171948
$$ packed form
2234C10305L2796j630n2660j7816k2607p3875M9343J10044k3468l96N36j12051
2222A98521j4093O0494m1366P3155L9201o9107N3752m4764r6072N9002m631l3707
2210A80385P0803N0474k7344l577p7957n0123K5069j5713j1191R8357l3752O7424
2198B72855n6388n8771n1596l8907L3386r339O2383N7085J3947m1596n2970j8085
2186A12004j130K491K8501K036N8480n7584j5715M5399j11738K2188O1503k1560
2174A24875N3276J6392r5525J8792k9113m8007N9200K4515p0620R7449k681j06564
2162D1989N2608o3015k8875N3130O4095L9020n993o3337j0399k9187j1718J1576
2150D9894k4936M6102N172o142k7018N8152p9424J2557k1601j7673J47927K8938
$$ plain form
2138 171948 101501 85196 3322 -71336 37013 44702 52609 100323 83070 -6980 4858 -44915
2126 -44915 -32446 -35756 -50846 12111 18894 -30702 -1552 54342 -3534 -18140 -13076 -21795 -10623
2113 -10623 689 -6654 8598 19028 16282 51950 -3490 20942 33347 35051 22264 -14108
2101 -14108 -28828 521 -31466 -34307 6459 9366 6752 -30913 -14188 -26263 15863 31645
2089 31645 33377 -25536 -20427 23468 25553 -4212 36213 -1919 -12780 24223 27184 39084 -37331
2076 -37331 -48418 -5706 27418 24657 61372 75445 18515 -51507 -43155 -65861 -19957 91683
2064 91683 57848 51124 31095 24593 6668 -3835 -12198 5971 23120 10054 26097 64776
2052 64776 46364 -19686 32250 67392 70077 28994 32532 64395 84237 110173 95719 137214
$$ packed form
2138A71948p0447j6305q1874p4658J08349P689P907M7714j7253r0050J1838m9773
2126d4915J2469l310j5090O2957O783m9596K9150N5894n7876j4606N064q719J1172
2113a0623J1312p343J5252J0430k746L5668n5440K4432J2405J704j2787l6372
2101a4108j4720K9349l1987k841M0766K907k614l7665J6725j2075M2126J5782
2089C1645J732n8913N109M3895K085k9765M0425l8132j0861L7003K961J1900p6415
2076c7331j1087M2712L3124k761L6715J4073n6930p0022Q352k2706M5904J11640
2064I1683l3835o724k0029o502j7925j0503q363J8169J7149j3066J6043L8679
2052F4776j8412o6050N1936L5142K685m1083L538L1863J9842K5936j4454M1495
$$ plain form
2040 137214 169454 189896 206834 192543 177525 115867 53914 43895 91557 192920 142317
2029 142317 65719 119153 28402 -20996 -38921 -21413 21527 62469 19252 16252 19273 -17957
2017 -17957 -42780 25265 67543 102399 100739 58209 100885 31081 -38226 -90785 -92804 22002
2005 22002 60126 74419 97573 54504 -16727 -59927 -50893 -39344 43332 68389 33338 87650
1993 87650 14876 -8494 12054 -54109 16349 58501 -3452 65143 76410 5482 -2559 -13549
1981 -13549 -39861 20799 50483 8972 74210 -4140 -64309 21761 -31410 -29774 40060 40972
1969 40972 49660 64428 39872 -39193 -88569 -60143 37065 46886 -1633 -3978 7137 -31606
1957 -31606 31651 5142 32957 49664 25337 47287 7250 13366 36990 10867 -36334 13879
$$ packed form
2040A37214L2240K0442J6938j4291j5018o1658o1953j0019M7662J01363n0603
2029A42317p6598N3434r0751m9398j7925J7508M2940M0942m3217l000L021l7230
2017a7957k4823O8045M2278L4856j660m2530M2676o9804o9307n2559k019J14806
2005B2002L8124J4293K3154m3069p1231m3200R034J1549Q2676K5057l5051N4312
1993H7650p2774k3370K0548o6163P0458M2152o1953O8595J1267p0928q041j0990
1981a3549k6312O0660K9684m1511O5238p8350o0169Q6070n3171J636O9834R12
1969D0972Q688J4768k4556p9065m9376K8426R7208R821m8519k345J1115l8743
1957c1606O3257k6509K7815J6707k4327K1950m0037O116K3624k6123m7201N0213
$$ plain form
1945 13879 34835 49390 39970 -6808 -43017 -15219 -75016 -40885 73956 -2080 59383 88213
1933 88213 1252 -4347 -3569 -51820 -26791 -5275 -6024 3999 24308 -15018 44024 9703 -74897
1920 -74897 10414 37684 44318 72570 4849 -40360 -45479 -61740 -48528 17505 37999 33200
1908 33200 9687 1846 -19345 -36645 -44233 10407 16597 48154 47139 39763 21152 -18651 -49636
1895 -49636 22778 38833 -19177 -27725 -33954 14559 80471 59281 -37691 16150 -48942 -57369
1883 -57369 -16395 -35484 -3289 20705 -52309 -5481 51705 36709 30321 19351 -15954 -3457
1871 -3457 40570 -19456 10371 60859 43262 50874 21579 -36925 -31238 -25861 -25881 -333 -9357
1858 -9357 38159 13080 -2112 -12963 8112 -39185 -6022 39965 -1701 -6458 -9565 -46066
$$ packed form
1945A3879K0956J4555r420m6778l6209K7798n9797L4131J14841p6036O1463K8830
1933H8213q6961n599P78m8251K5029K1516p49J0023K0309l9326N9042l4321q4600
1920g4897Q5311K7270O634K8252o7721m5209n119j6261J3212O6033K0494m799
1908C3200k3513p841k1191j7300p588N4640O190L1557j015p376j8611l9803l0985
1895d9636P2414J6055n8010q548o229M8513O5912k1190r6972N3841o5092q427
1883e7369M0974j9089L2195K3994p3014M6828N7186j4996o388j0970l5305J2497
1871c457M4027o0026K9827N0488j7597P612k9295n8504N687N377k0K5548r024
1858i357M7516k5079j5192j0851K1075m7297L3163M5987m1666m757l107l6501
$$ plain form
1846 -46066 -102580 -75166 -22604 28891 -3673 33376 37897 -14678 -18226 -33348 -50043 -30620
1834 -30620 -13581 -32854 6501 -5766 11195 10984 -22897 -49092 -4065 -37502 -37560 28994 -24482
1821 -24482 -21847 -1563 -52893 -31207 -25444 -32298 24401 22303 -81460 -66395 -65498 -69559 16077
1808 16077 29942 25199 -11190 -55531 -39637 -23884 -52896 -25892 20539 17327 59171 -10319
1796 -10319 -56921 -51487 -29872 -37908 -13063 -28728 -9816 33244 -34588 -19405 56625 -23435
1784 -23435 -41772 10036 25078 56581 30667 -12653 -48832 -46799 -47198 -23848 23732 76831
1772 76831 69518 26764 -57366 -81104 -66983 -82523 -120263 -54393 39993 -22440 -41028 37
1760 37 -70087 -97918 -84844 -37429 8168 16062 -8309 42451 39048 909 35714 61686 15954
$$ packed form
1846d6066n6514K7414N2562N1495l2564L7049M521n2575l548j5122j6695J9423
1834c0620J7039j9273L9355j2267J6961k11l3881k6195M5027l3437n8O6554n3476
1821b4482K635K0284n1330K1686N763o854N6699k098j03763J5065Q97m061Q5636
1808A6077J3865m743l6389m4341J5894J5753k9012K7004M6431l212M1844o9490
1796a0319m6602N434K1615q036K4845j5665J8912M3060o7832J5183P6030q0060
1784b3435j8337N1808J5042L1503k5914m3320l6179K033l99K3350M7580N3099
1772G6831p313m2754q4130k3738J4121j5540l7740O5870R4386o2433j8588M1065
1760C7p0124k7831J3074M7415M5597P894k4371N0760l403l8139L4805K5972m5732
$$ plain form
1747 15954 52986 -6156 -44880 -36069 4165 9136 25512 39396 59585 79546 33872 -36063
1735 -36063 25916 25108 -31420 4683 15081 40513 22201 36795 -29892 -38894 12819 -27611
1723 -27611 17153 19582 -36582 -29640 -17038 -43411 -21192 -62100 -20246 59257 106349 -2985
1711 -2985 22371 32480 -69458 -58256 -41573 -2919 77709 62661 26032 31140 -10955 -30240
1699 -30240 -64084 -51884 -25120 43476 32779 9480 25366 2099 -19293 -18396 -22300 -22034 -20954
1686 -20954 5099 66992 -2603 -31553 -52810 4834 4832 29189 55551 4360 -45743 -45028 -22658
1673 -22658 -55604 12825 26963 25547 1851 69236 10739 28854 -20788 -5553 18320 22358
1661 22358 50105 68514 8502 -37205 -44878 -11673 -3227 -16156 25906 7495 197 -5238 58323
$$ packed form
1747A5954L7032n9142l8724Q811M0234M971J6376J3884K0189J9961m5674o9935
1735c6063O1979q08n6528L6103J0398K5432j8312J4594o6687r002N1713m0430
1723b7611M4764K429n6164O942J2602k6373K2219m0908M1854P9503M7092j09334
1711b985K5356J0109j01938J1202J6683L8654Q0628j5048l6629N108m2095j9285
1699c0240l3844J2200K6764O8596j0697k3299J5886k3267k1392Q97l904K66J080
1686b0954K6053O1893o9595k8950k1257N7644kK4357K6362n1191n0103P15K2370
1673b2658l2946O8429J4138j416k3696O7385n8497J8115m9642J5235K3873M038
1661B2358K7747J8409o0012m5707p673L3205Q446j2929M2062j8411p298n435O3561
$$ plain form
1648 58323 53854 -16972 1754 47766 47955 22535 9784 -51364 -42767 -35701 46219 28118 42963
1635 42963 11500 22567 -49065 -20780 34023 -20792 -47539 -14525 44482 27155 -29132 -41489
1623 -41489 8980 -9919 -1611 -8323 26079 40754 41516 39628 -46009 5721 -3234 -27434 -30371
1610 -30371 21296 76285 31985 -40402 -31434 -54671 -48652 -35175 58626 76753 5743 -12711
1598 -12711 -1156 58012 -15930 -40065 -27144 -295 25868 38699 -16225 31922 8139 -10639
1586 -10639 -18362 5090 36109 11947 -70107 -48269 23429 27404 -28663 21997 59561 13366
1574 13366 -19001 -60212 -47624 -38099 -68579 -24979 20710 36739 19871 6823 -65565 -15021
1562 -15021 2824 -40414 -42500 35903 17803 51462 20289 34220 18558 50583 6863 30632
$$ packed form
1648E8323m469p0826J8726M6012J89k5420j2751o1148Q597P066Q1920j8101J4845
1635D2963l1463J1067p1632K8285N4803n4815k6747L3014N9007j7327n6287j2357
1623d1489N0469j8899Q308o712L4402J4675P62j888q5637N1730q955k4200k937
1610c0371N1667N4989m4300p2387Q968k3237O019J3477R3801J8127p1010j8454
1598a2711J1555N9168p3942k4135J2921K6849K6163J2831n4924M8147k3783j8778
1586a0639p723K3452L1019k4162q2054K1838P1698L975n6067N0660L7564m6195
1574A3366l2367m1211J2588R525l0480M3600M5689J6029j6868j3048p2388N0544
1562a5021J7845m3238k086P8403j8100L3659l1173J3931j5662L2025m3720K3769
$$ plain form
1550 30632 70617 30662 -16711 30076 -19334 -38761 -31878 -43158 48310 60057 14767 -63295
1538 -63295 -28180 15874 -3999 22215 -4355 22410 33733 10109 33670 54227 -7183 -29434
1526 -29434 -3657 39884 46936 80319 4690 5019 66183 18375 10350 8059 -21835 -57884 -55501
1513 -55501 -103079 -54001 -18995 290 5456 92327 29139 -26413 -76531 -87172 -73113 -12685
1501 -12685 39376 54421 14134 5993 -16572 -14475 -33304 -16116 34669 -11353 30545 71466
1489 71466 45014 5944 -42491 -18242 -11429 37509 72623 75057 28058 -15941 -39333 -4520
1477 -4520 -75617 -2 4552 242 10801 67346 -21444 -93276 -117538 -54102 -2368 -3225 -50470
1464 -50470 -60513 -30685 -74805 -19693 20977 -3691 -26915 -32369 30424 43127 4849 -58799
$$ packed form
1550C0632L9985l9955m7373M6787m9410j9427O883j1280R1468J1747m5290p8062
1538f3295L5115M4054j9873K6214k6570K6765J1323k3624K3561K0557o1410k2251
1526b9434K5777M3541P052L3383p5629L29O1164m7808q025k291k9894l6049K383
1513e5501m7578M9078L5006J9285N166Q6871o3188n5552n0118j0641J4059O0428
1501a2685N2061J5045m0287q141k2565K097j8829J7188N0785m6022M1898M0921
1489G1466k6452l9070m8435K4249O813M8938L5114K434m6999m3999k3392L4813
1477d520p1097P5615M554m310J0559N6545q8790p1832k4262O3436N1734q57m7245
1464e0470j0043K9828m4120N5112M0670k4668k3224n454O2793J2703l8278o3648
$$ plain form
1452 -58799 -54144 -24983 3886 -2560 22209 43560 64538 -63137 -86532 -4400 37487 -16168
1440 -16168 -14267 9091 15015 -7437 -63948 -47737 -45577 -18556 -26080 3300 11008 57550 -19703
1427 -19703 -63546 -11638 22626 -34051 -31042 14035 65397 7288 -58991 -73603 -39045 -27849
1415 -27849 -40617 11379 102278 57999 -26946 -81099 -68714 -28115 -12009 -32395 13187 59982
1403 59982 29636 -72629 -12348 -53394 -26777 -65963 -62050 48719 133728 24164 -3921
1392 -3921 18667 -40026 -67222 -714 -2966 45848 65317 -73879 -73603 -43455 -45427 1042 -15664
1379 -15664 7272 35601 4710 -11264 9570 2014 -58652 -23359 40709 21262 40893 -36315
1367 -36315 -19438 -1066 -5606 26352 12899 25407 33326 4462 29976 12131 -10289 -3984
$$ packed form
1452e8799M655K9161K8869o446K4769K1351K0978j27675k3395Q2132M1887n3655
1440a6168J901K3358N924k2452n6511J6211K160K7021p524K9380P708M6542p7253
1427a9703m3843N1908L4264n6677L009M5077N1362n8109o6279j4612L4558J1196
1415b7849j2768N1996R0899m4279q4945n4153J2385M0599J6106k0386M5582M6795
1403E9982l0346j02265O0281m1046K6617l9186L913J10769Q5009j09564k8085
1392c921K2588n8693k7196O6508k252M8814J9469j39196K76L0148j972M6469j6706
1379a5664K2936K8329l0891j5974K0834p556o0666L5293O4068j9447J9631p7208
1367c6315J6877J8372m540L1958j3453J2508P919k8864K5514j7845k2420O305
$$ plain form
1355 -3984 -60307 -46208 45069 31580 -98251 -94175 -46328 -21384 30403 33238 27211 55314
1343 55314 -47960 -20814 17267 -25185 -37759 -5209 4046 -5264 65545 19721 -39992 -54268
1331 -54268 -82160 9123 -4043 17007 65208 -31534 -62384 -47369 -41752 -42300 -60972 -986
1319 -986 -3213 24239 -14200 -23437 -10831 -30938 52955 57781 -15123 -2648 -49664 -34397 -15047
1306 -15047 3526 38053 -22874 -31856 -70731 -51952 -2428 -25783 6028 -50362 -17499 450
1294 450 -42899 -16351 -37487 -48573 14757 -8985 74891 50925 14762 2551 20581 -7525
1282 -7525 -33982 -39372 -9387 61849 65432 14772 24585 -30284 -48821 -8276 -7897 57847 65159
1269 65159 29770 9650 15140 48700 14878 -8400 -13654 34678 53085 4860 -4161 -16343
$$ packed form
1355c984n6323J4099R1277j3489j29831M076M7847K4944N1787K835o027K8103
1343E5314j03274K7146L8081m2452j2574L2550R255r310P0809m5824n9713j4276
1331e4268k7892R1283j3166K1050M8201r6742l0850J5015N617n48j8672N9986
1319i86k227K7452l8439r237J2606k0107Q3893M826p2904J2475m7016J5267J9350
1306a5047J8573L4527o0927q982l8875J8779M9524k3355L1811n6390L2863J7949
1294D50m3349K6548k1136j1086O3330k3742Q3876k3966l6163j2211J8030k8106
1282g525k6457n390K9985P1236L583n0660R813n4869j8537M0545L79O5744P312
1269F5159l5389k0120N490L3560l3822k3278n254M8332J8407m8225r021j2182
$$ plain form
1257 -16343 -52041 -70556 -93281 -23181 38855 50829 63422 43610 16712 -29478 -32044 -6261
1245 -6261 14698 13262 -28371 -32455 -20514 -9241 -29629 -22340 43353 -4992 -39399 11413 25094
1232 25094 25460 885 -33408 -17931 -30091 -64466 -25857 51272 15559 -2179 3263 -37501
1220 -37501 -19942 28541 3981 3887 15454 14989 -60241 -62060 -22910 75238 66667 25666 9746
1207 9746 -2930 -20406 -7036 11523 45093 -21552 -6514 51789 43518 51581 28310 -30252
1195 -30252 -42648 -14280 13751 17169 9790 10185 20853 -55704 -40473 20855 20917 -14049 50964
1182 50964 -307 31581 -7470 -20097 6058 -22822 1025 32924 45701 12731 56576 12827
1170 12827 16331 17419 -56821 -114507 -70129 3775 73642 72571 32319 29584 -43852 -39468 215
$$ packed form
1257a6343l5698j8515k2725P0100O2036J1974J2593j9812k6898m6190k566K5783
1245f261K0959j436m1633m084J1941J1273k0388P289O5693m8345l4407N0812J3681
1232B5094L66k4575l4293J5477j2160l4375L8609P7129l5713j7738N442m0764
1220c7501J7559M8483k4560r4J1567m65p5230j819L9150R8148q571m1001j5920
1207I746j2676j7476J3370J8559L3570o6645J5038N8303q271Q063k3271n8562
1195c0252j2396K8368K8031L418p379L95J0668p6557J5231O1328O2l4966O5013
1182E0964n1271L1888l9051j2627K6155k8880K3847L1899J2777l2970M3845m3749
1170A2827L504J088p4240n7686M4378P3904O9867j071m0252k735p3436M384L9683
$$ plain form
1157 215 13834 2309 -6924 -60510 5591 22196 -30180 -33392 -9714 -32578 -27935 -57199 -52047
1144 -52047 18048 -25265 5171 557 -23720 3735 530 -10124 25413 28948 -34516 -71540
1132 -71540 -15917 -4977 75070 55868 17569 42716 -2199 -13103 -15750 9583 17670 -44848
1120 -44848 -201 37963 29708 55365 20909 52457 24717 38039 42915 12013 80831 -19942
1108 -19942 -7582 -18730 -15201 34176 28005 -24003 -25931 -58744 -50821 -30495 -1028 -33218 22235
1095 22235 56467 5579 59041 26121 16166 37869 -31410 -39418 -88759 -70187 11370 25591
1083 25591 29810 2759 1032 -57864 -77194 -19562 -26764 37179 -2204 -1141 -36066 -100300 -6663
1070 -6663 26734 -20137 47778 10675 21751 -29637 -42719 -31133 -28647 -47794 -43679 7854
$$ packed form
1157B15J3619j1525r233n3586O6101J6605n2376l212K3678k2864M643k9264N152
1144e2047P0095m3313L0436m614k4277K7455l205j0654L5537L535o3464l7024
1132g1540N5623J0940Q0047j9202l8299K5147m4915j0904k647K5333Q087o2518
1120d4848M4647L8164q255K5657l4456L1548k7740J3322M876l0902O8818j00773
1108a9942J2360j1148L529M9377o171n2008j928l2813P923K0326K9467l2190N5453
1095B2235L4232n0888N3462l2920r955K1703o9279q008m9341J8572Q1557J4221
1083B5591M219k7051j727n8896j9330N7632p202O3943l9383J063l4925o4234R3637
1070f663L3397m6871O7915l7103J1076n1388j3082J1586K486j9147M115N1533
$$ plain form
1058 7854 -11833 9911 79838 -7186 -66147 -51587 -78364 -39202 -55959 25042 121176 56985
1046 56985 -10624 -40801 -54817 -112858 -49312 -11189 -9019 23621 36023 27480 26938 -18758 23757
1033 23757 14882 -49457 2728 -13048 6247 -3016 47941 24988 31884 53030 40554 41097 14249
1020 14249 3200 16069 -92240 -65356 -3997 47211 44380 -29845 1112 25730 16244 29285
1008 29285 -33973 -49816 -36272 -41409 -2814 71078 97783 67463 47987 20586 -22503 21081
996 21081 -38068 -5557 14584 20074 -38767 -14521 -11071 1947 55281 77610 -9357 -19467
984 -19467 -88017 -75636 16646 66707 117720 28666 -1707 -35844 -42990 -27618 -17257 26293
972 26293 2099 -24367 -21710 56867 33817 29180 20479 -21155 -51247 -38291 -95531 -65989 1287
$$ packed form
1058G854j9687K1744O9927q7024n8961J4560k6777L9162j6757Q1001R6134o4191
1046E6985o7609l0177j4016n8041O3546L8123K170L2640J2402q543n42m5696M2515
1033B3757q875o4339N2185j5776J9295r263N0957k2953O896K1146j2476N43k6848
1020A4249j1049J2869j08309K6884O1359N1208k831p4225L0957K4618r486J3041
1008B9285o3258j5843J3544n137L8595P3892K6705l0320j9476k7401m3089M3584
996B1081n9149L2511K0141N490n8841K4246L450J3018N3334K2329q6967j0110
984a9467o8550J2381R2282N0061N1013q9054l0373l4137p146J5372J0361M3550
972B6293k4194k6466K657P8577k3050m637q701m1634l0092J2956n7240K9542O7276
$$ plain form
959 1287 31460 14240 47335 16444 13467 -26416 -69940 -9876 33695 4424 -20829 -12274 8388
946 8388 30700 -34202 6682 -14145 14998 21267 -8897 -77260 -50231 -26361 -71945 28843
934 28843 78580 38739 25364 -15491 -12340 37498 -23258 -22398 -17801 -23449 -26768 39146 124003
921 124003 49011 26777 -20484 25934 -28797 -19859 7595 11107 10245 75164 -22372 -18447 -66226
908 -66226 -53457 -34102 -38575 24410 39402 -18265 -77690 14371 55254 -4645 33381 29348
896 29348 -16193 232 -20120 -1676 -16539 -72805 -12916 -49907 280 36068 44885 29104
884 29104 -11491 -18790 -1674 -10314 -12144 -35151 67828 -7846 -20414 -9280 -15976 6515 27042
871 27042 40711 19474 13774 -27594 -7235 42277 49807 55795 74599 1468 72816 33418 -66137
$$ packed form
959A287L0173j7220L3095l0891k977l9883m3524O0064M3571k9271k5253Q555K0662
946H388K2312o4902M0884k0827K9143O269l0164o8363K7029K3870m5584J00788
934B8843M9737l9841j3375m0855L151M9838o0756Q60M597n648l319O5914Q4857
921A24003p4992k2234m7261M6418n4731Q938K7454L512q62O4919r7536L925m7779
908f6226J2769J9355m473O2985J4992n7667n9425R2061M0883n9899L8026m033
896B9348m5541J6425k0352J8444j4863n6266N9889l6991N0187L5788Q817j5781
884B9104m0595p299J7116q640j830k3007J02979p5674j2568J1134o696K2491K0527
871B7042J3669k1237n700m1368K0359M9512P530N988J8804p3131P1348l9398r9555
$$ plain form
858 -66137 -105082 -86391 -3640 -13897 28824 71532 34980 -2182 -20967 -24663 19159 13070
846 13070 47960 52727 84151 67775 16308 60665 8641 31701 6116 -62283 -88057 21125
834 21125 50014 95676 97037 83198 14444 1203 -10239 57882 73356 -997 -67488 -115343
822 -115343 -120824 -58012 7726 37874 74141 76528 10004 -37215 -20446 -39440 -38361 -10976
810 -10976 -39249 1054 -13245 12173 1756 17839 42070 10309 -63167 -3771 -21227 -5134
798 -5134 -17128 33829 12611 19879 1580 -39452 21218 -41978 -87062 -25646 -17576 37711 96085
785 96085 9923 15284 -25577 -42849 -45913 5798 28178 24161 2758 -24512 -1489 -22938 -40409
772 -40409 -48515 30290 59110 23752 -15194 23757 -20363 -71759 -14547 -17240 -35919 -1184
$$ packed form
858f6137l8945J8691Q2751j0257M2721M2708l6552l7162j8785l696M3822o089
846A3070L4890M767L1424j6376n1467M4357n2024K3060k5585o8399k5774J09182
834B1125K8889M5662J361j3839o8754j3241j1442O8121J5474p4353o6491m7855
822a15343n481O2812O5738L0148L6267K387o6524m7219J6769j8994J079K7385
810a0976k8273M0303j4299K5418j0417J6083K4231l1761p3476N9396j7456J6093
798e134j1994N0957k1218P268j8299m1032O0670o3196m5084O1416Q070N5287N8374
785I6085q6162N361m0861j7272l064N1711K2380m017k1403k7270K3023k1449j7471
772d0409q106P8805K8820l5358l8946L8951m4120n1396N7212k693j8679L4735
$$ plain form
760 -1184 8526 18890 55373 14266 -20727 -53097 -71940 -35793 112589 55837 26461 -2513
748 -2513 -72159 -17189 27968 55726 77057 -18253 -55158 -5170 21277 -13503 8366 36033
736 36033 18383 -1249 -31408 3732 -2861 -103827 -23519 -3940 -32348 40599 27026 -6996
724 -6996 18012 15896 24382 -44939 -37236 -17457 58364 36693 -10567 -36761 -103012 -79998 -5884
711 -5884 31142 75346 23806 -6403 13797 -26787 31019 -27135 -35549 -424 -13581 14909
699 14909 -14441 -5388 -28097 -34712 -59021 -39295 47807 40592 42199 128312 -10818 -91744 -93351
686 -93351 -120389 -16201 48954 112923 90544 18530 -13777 -50765 19334 34809 106 33741
674 33741 -9464 -4425 -30979 21858 33586 -5449 -14212 -14016 27140 25432 22894 54537 7759
$$ packed form
760a184R710J0364L6483m1107l4993l2370j8843L6147J48382n6752k9376k8974
748b513o9646N4970M5157K7758K1331r5310l6905M9988K6447l4780K1869K7667
736C6033j7650j9632l0159L5140o593j00966Q0308J9579k8408P2947j3573l4022
724f996K5008k116Q486o9321P703J9779P5821k1671m7260k6194o6251K3014P4114
711e884L7026M4204n1540l0209K0200m0584N7806n8154q414L5125j3157K8490
699A4909k9350R053k2709o615k4309J9726Q7102p215J607Q6113j39130q0926j607
686i3351k7038J04188O5155O3969k2379p2014l2307l6988P0099J5475l4703L3635
674C3741m3205N039k6554N2837J1728l9035q763J96M1156j708k538L1643m6778
$$ plain form
661 7759 -26524 -2295 28573 45434 -12441 -15356 -1812 -23474 -14799 -48603 -28176 -29040 26660
648 26660 43035 2339 -21086 10865 16175 20482 2707 43716 22145 -33742 -36241 -23211 -1819
635 -1819 -43613 -51017 27371 24052 22331 17975 -45466 -36889 -59777 -25430 -6512 79032 100128
622 100128 40936 13539 -76188 -59929 -37888 -56655 8592 54399 18253 -14517 -47282 -2983
610 -2983 12476 5033 -31277 -19399 -104 -15580 25283 30718 27826 16403 -26649 -4882 1151
597 1151 -17364 38213 -36335 -21387 27498 3131 -20548 32648 42254 27801 32836 21795 25218
584 25218 21291 -45453 1871 76280 7061 41706 28937 -4479 4314 23185 45337 -3971
572 -3971 -52296 -57933 8445 16663 -9924 -11544 20280 32651 67248 36196 39943 -67521 -111443
$$ packed form
661G759l4283K4229L0868J6861n7875k915J3544k1662Q675l3804K0427q64N5700
648B6660J6375m0696k3425L1951N310M307j7775M1009k1571n5887k499J3030K1392
635a819m1794p404P8388l319j721m356o3441Q577k2888L4347J8918Q5544K1096
622A00128n9192k7397q9727J6259K2041j8767O5247M5807l6146l2770l2765M4299
610b983J5459p443l6310J1878J9295j5476M0863N435k892j1423m3052K1767O033
597A151j8515N5577p4548J4948M8885k4367k3679N3196R606j4453N035j1041L423
584B5218l927o6744M7324P4409o9219L4645j2769l3416Q793J8871K2152m9308
572c971m8325n637O6378Q218k6587j620L1824J2371L4597l1052L747j07464m3922
$$ plain form
559 -111443 -32309 -44225 31560 57520 -5919 2959 10780 -17568 -18223 -7081 -45545 -51185 -28176
546 -28176 -67971 -10970 -4383 -41136 4055 4127 -14765 330 922 49354 8277 -3698 48037
533 48037 11603 -53287 -36982 31698 46326 34389 30518 -34802 -36642 -49609 333 62612
521 62612 32176 33616 1370 -35886 -11315 10293 16431 9109 859 42679 14652 -15530 -27026
508 -27026 -34374 5422 4792 23555 9341 -37583 -48926 -62181 -28529 24757 4709 54447 31628
495 31628 14618 21592 26304 -25732 -52162 -24299 -18655 14413 20952 2363 40515 7757 -3179
482 -3179 16187 -12918 4623 22674 62208 45594 32018 -5638 -46673 -736 -26851 -17629
470 -17629 76923 35413 50531 80671 -29920 -45523 -36316 -17614 11153 17292 33804 24461
$$ packed form
559a11443P9134j1916P5785K5960o3439Q878P821k8348o55J1142l8464n640K3009
546b8176l9795N7001O587l6753M5191P2j8892J5095N92M8432m1077j1975N1735
533D8037l6434o4890J6305O8680J4628j1937l871o5320j840j2967M9942O2279
521F2612l0436J440l2246l7256K4571K1608O138p322q250M1820k8027l0182j1496
508b7026p348L9796o30J8763j4214m6924j1343j3255L3652N3286k0048M9738k2819
495C1628j7010O974M712n2036k6430K7863N644L3068O539j8589L8152l2758j0936
482c179J9366k9105J7541J8051L9534j6614j3576l7656m1035M5937k6115R222
470a7629R4552m1510J5118L0140j10591j5603R207J8702K8767O139J6512r343
$$ plain form
458 24461 1689 -55278 -39415 30811 37089 16820 -32336 -21155 -48540 -56721 7544 -36009
446 -36009 -1259 -20885 -71566 -37964 -45934 -39479 50156 31009 -19796 -37860 -41562 -66865 -10379
433 -10379 15443 -81019 -38288 -32432 -14641 33957 19517 71875 44765 -31862 3536 28330
421 28330 2168 11464 15746 11705 -24778 -14158 -45595 22592 1762 4388 66066 45228 44323
408 44323 30498 -76351 -29928 -15590 54365 61062 16263 -11498 -8343 -24225 -35210 45320
396 45320 36489 6426 13942 101 20952 14573 -30163 1400 -2234 -12439 63505 30126 -38507
383 -38507 -21248 -4964 46356 85977 93895 43702 -15106 -63652 -37965 29737 15013 19846
371 19846 59197 20233 11656 9346 24973 21733 -748 12843 44010 11819 34767 58702 37447
$$ packed form
458B4461k2772n6967J5863P0226O278k0269m9156J1181k7385q181O4265m3553
446c6009L4750j9626n0681L3602p970O455Q9635j9147n0805j8064l702k5303N6486
433a0379K5822r6462M2731N856J7791M8598j4440N2358k7110p6627L5398K4794
421B8330k6162R296M282m041l6483J0620l1437O8187k0830K626O1678k0838r05
408D4323j3825j06849M6423J4338O9955O697m4799k7761L155j5882j0985Q0530
396D5320q831l0063P516j3841K0851o379m4736L1563l634j0205P5944l3379o8633
383c8507J7259J6284N1320L9621P918n0193n8808m8546K5687O7702j4724M833
371A9846L9351l8964q577k310J5627l240k2481J3591L1167l2191K2948K3935k1255
$$ plain form
358 37447 24532 28969 -49209 -29494 -133 -3986 68326 30392 19347 19073 -56286 -47965 -24285
345 -24285 11362 44659 55314 -4189 10252 -6103 22395 1414 -12094 -11017 33954 10919
333 10919 42516 60906 17409 10689 30914 18644 19107 -6074 -29107 520 -4753 6608 -11424
320 -11424 -51201 -35889 18045 20057 -3566 25478 40286 50055 43472 28505 44224 32643 4565
307 4565 28205 9148 -1641 -27314 -8786 -42491 -2287 27189 21259 -16864 -15684 18518 -35358
294 -35358 -30266 30772 40325 -44441 -7438 -5480 126 5029 31560 61444 91161 28945 12241
281 12241 33677 47586 18615 -4090 -5822 -29289 17998 18519 14476 50109 53008 41280 -29765
268 -29765 -31247 15097 37504 61910 58775 72528 56686 -29147 -18673 4566 34452 -9631
$$ packed form
358C7447j2915M437p8178J9715K9361l853P2312l7934j1045k74p5359Q321K3680
345b4285L5647L3297J0655n9503J4441j6355K8498k0981j3508J077M4971k3035
333A0919L1597J8390m3497o720K0225j2270M63k5181k3033K9627n273J1361j8032
320a1424l9777J5312N3934K012k3623K9044J4808R769o583j4967J5719j1581k8078
307D565K3640j9057j0789k5673J8528l3705M0204K9476n930l8123J180L4202n3876
294c5358N092O1038R553q4766L7003J958N606M903K6531K9884K9717o2216j6704
281A2241K1436J3909k8971k2705j732k3467M7287N21m043L5633K899j1728p1045
268b9765j482M6344K2407K4406l135J3753j5842q5833J0474K3239K9886m4083
$$ plain form
256 -9631 -3160 75866 53932 40136 -4900 -56418 23743 31111 49150 -20123 -10833 33775 -19035
243 -19035 -41544 -47207 -2206 15581 -18145 69274 100740 5008 -27550 -23202 1481 -7106 -33251
230 -33251 -18795 -35680 36222 4419 20585 32394 -17168 -4660 432 2462 36267 57190
218 57190 7758 -45428 51072 6331 -41926 5128 -16019 29463 20537 -14891 32296 115097
206 115097 66758 16008 64702 60489 25505 325 -57346 -505 34920 33267 46789 27824
194 27824 27062 -43043 -28795 20098 20539 72862 37352 -21535 -16116 27198 1174 -4759 9608
181 9608 14897 -22725 7643 1545 1035 6094 -20004 12696 61585 68847 7870 -3116 43655
168 43655 33239 15288 -24999 -34289 18202 -27510 11698 30125 60987 70175 29426 22333 8448
$$ packed form
256i631O471P9026k1934j3796m5036n1518Q0161P368J8039o9273R290M4608n2810
243a9035k2509n663M5001J7787l3726Q7419L1466r5732l2558M348K4683q587k6145
230c3251J4456j6885P1902l1803J6166J1809m9562J2508N092K030L3805K0923
218E7190m9432n3186R6500m4741m8257M7054k1147M5482q926l5428M7187Q2801
206A15097m8339n0750M8694m213l4984k5180n7671N6841L5425j653J3522j8965
194B7824p62p0105J4248M8893M41N2323l5510n8887N419M3314k6024n933J4367
181I608N289l7622L0368o098n10N059k6098L2700M8889P262o0977j0986M6771
168D3655j0416j7951m0287r290N2491m5712L9208J8427L0862R188m0749p093j3885
$$ plain form
155 8448 55701 -2924 -6299 7014 -1632 -3284 -6582 -5598 66768 20256 27644 27117 -13345 -3964
141 -3964 -11762 -15246 -23630 29500 46501 19074 22920 -5339 21050 20686 -33893 48955 42947 27350
127 27350 37256 23075 61984 19926 -18278 -10670 42784 15061 -14035 2451 -15797 -26720
115 -26720 -2135 -52874 -2602 25049 60355 64257 13037 37475 16003 -28316 -1970 58787
103 58787 99040 36667 -14607 -6011 71672 43235 -30581 47569 55040 9801 29182 -1331
91 -1331 47643 61256 -5390 -30578 3871 9179 -13229 7984 -2460 39512 74597 -28376
79 -28376 -35166 43343 27134 37528 512 62717 38956 -30169 -65547 -27842 -6951 17785
67 17785 29615 37948 54060 58686 -31990 14296 28464 35505 21616 -51876 -34652 37019 1114
$$ packed form
155H448M7253n8625l375J3313q646j652l298R84P2366m6512P388n27m0462R381
141c964p798l484q384N3130J7001k7427L846k8259K6389l64n4579Q2848o008j5597
127B7350R906j4181L8909m2058l8204P608N3454k7723k9096J6486j8248j0923
115b6720K4585n0739N0272K7651L5306L902n1220K4438k1472m4319K6346O0757
103E8787M0253o2373n1274Q596P7683k8437p3816P8150P471m5239J9381l0513
91a331M8974J3613o6646k5188L4449N308k2408K1213j0444M1972L5085j02973
79b8376o790P8509j6209J0394l7016O2205k3761o9125l5378L7705K0891K4736
67A7785J1830Q333J6112M626r0676M6286J4168P041j3889p3492J7224P1671l5905
$$ plain form
54 1114 -31084 -12544 23429 17104 -22257 -21066 17609 26127 -7198 16959 22938 41603 32787
41 32787 -63 56901 41893 351 -5347 -2468 -17717 13363 26555 28945 68606 72585 -4690
28 -4690 -17535 -11401 -17549 22754 7689 26429 24096 12902 -5989 -2499 31520 32226 29362 51174
14 51174 51814 37354 -19831 -18234 5632 -14343 33350 27989 34358 6945 7331 29049 10697 20900
0 20900
$$ packed form
54A114l2198J8540L5973o325l9361J191L8675Q518l3325K4157N979J8665q816
41C2787l2850N6964j5008m1542n698K879j5249L1080J3192K390L9661L979p7275
28d690j2845O134o148M0303j5065J8740k333j1194j8891L490L4019P06k864K1812
14E1174O40j4460n7185J597K3866j9975M7693n361O369k7413L86K1718j8352J0203
0B0900
$$ Imaginary data points
##PAGE= N=2
##DATA TABLE= (X++(I..I)), XYDATA
$$ plain form
16383 -1174279 -1143746 -1133169 -1116117 -1103852 -1128707 -1113418 -1102214 -1060668 -1054051 -1011739 -1000860
16372 -1000860 -989595 -956888 -970857 -961630 -971892 -970373 -957133 -912257 -900596 -857527 -841966 -816878
16360 -816878 -841682 -794921 -760795 -823316 -811693 -816852 -776202 -752419 -691325 -669820 -649111 -675934
16348 -675934 -729853 -717361 -634375 -656255 -595821 -554968 -596674 -561907 -551308 -554017 -580270 -498744
16336 -498744 -518035 -499588 -454867 -474964 -462781 -458561 -471217 -414960 -372625 -377900 -377849 -364371
16324 -364371 -346887 -343455 -292318 -304305 -318196 -306800 -276159 -250695 -248338 -243701 -231962 -230808
16312 -230808 -193944 -186149 -151987 -159418 -196998 -110243 -127853 -122176 -74993 -64436 -95784 -75474
16300 -75474 -31910 -10491 25502 48470 -12956 -6493 -6636 36563 110862 85659 107639 79001
$$ packed form
16383a174279L0533J0577J7052J2265k4855J5289J1204M1546O617M2312J0879
16372a000860J1265L2707j3969R227j0262J519J3240M4876J1661M3069J5561K5088
16360h16878k4804M6761L4126o2521J1623n159M0650K3783O1094K1505K0709k6823
16348f75934n3919J2492Q2986k1880O0434M0853m1706L4767J0599k709k6253Q1526
16336d98744j9291J8447M4721k0097J2183M220j2656N6257M2335n275N1J3478
16324c64371J7484L432N1137j1987j3891J1396L0641K5464K357M637J1739J154
16312b30808L6864P795L4162p431l7580Q6755j7610N677M7183J0557l1348K0310
16300g5474M3564K1419L5993K2968o1426O463j43M3199P4299k5203K1980k8638
$$ plain form
16288 79001 79224 47084 65254 125442 117151 119643 164860 186633 169135 161988 191870 215635 236463
16275 236463 280540 241453 257259 215368 217406 227325 260691 311632 345513 354659 372381 336789
16263 336789 346734 370010 366185 364583 380710 434353 412509 453982 461932 461480 427077 379893 397341
16250 397341 459020 459730 465402 506824 494727 541374 521375 533417 509846 537281 543608 561602
16238 561602 575624 567730 566400 558241 580048 595395 627385 635630 601503 570129 623286 577524
16226 577524 631683 647635 671575 698351 701930 696982 690965 678112 656652 677502 707249 725194
16214 725194 711150 709729 733461 746867 752118 762942 737561 764604 757254 775111 795085 796560
16202 796560 783378 739639 785852 824818 844051 863104 857866 860707 814376 750394 788022 809816
$$ packed form
16288G9001K23l2140J8170O0188q291K492M5217K1773j7498p147K9882K3765K0828
16275B36463M4077l9087J5806m1891K038R919L3366N0941L3881R146J7722l5592
16263C36789R945K3276l825j602J6127N3643k1844M1473P950m52l4403m7184J7448
16250C97341O1679P10N672M1422j2097M6647j9999J2042k3571K7435O327J7994
16238E61602J4022p894j330q159K1807J5347L1990Q245l4127l1374N3157m5762
16226E77524N4159J5952K3940K6776L579m948o017j2853k1460K0850K9747J7945
16214G25194j4044j421K3732J3406N251J0824k5381K7043p350J7857J9974J475
16202G96560j3182m3739M6213L8966J9233J9053n238K841m6331o3982L7628K1794
$$ plain form
16190 809816 833608 905457 934680 930204 897450 850653 800843 810675 836624 923406 967088 936628
16178 936628 938759 928240 837511 824033 839652 916675 913712 884179 937742 940231 914104 887727
16166 887727 900799 933736 978527 1000084 1040363 1011490 951396 917967 944301 968399 987310
16155 987310 969765 1030948 1031187 1040295 1034844 1009765 981885 985758 993075 976421 994560 1026067 1001798
16142 1001798 1006832 985217 992501 1063004 1077785 1069875 1051578 1045426 1022929 975192 1001803 1028281
16130 1028281 1044398 1054083 1093051 1061545 1030694 987888 976994 1016774 1087174 1106482 1095928
16119 1095928 1118877 1024807 995596 1019654 1032284 1024432 1046032 1007716 1048761 1090949 1087543 1092610
16107 1092610 1073323 1083355 1095366 1106625 1105297 1106168 1092343 1070894 1062027 1080882 1072378 1069268
$$ packed form
16190H09816K3792P1849K9223m476l2754m6797m9810R832K5949Q6782M3682l0460
16178I36628K131j0519r0729j3478J5619P7023k963k9533N3563K489k6127k6377
16166H87727J3072L2937M4791K1557M0279k8873o0094l3429K6334K4098J8911
16155I87310j7545O1183K39R108n451k5079k7880L873P317j6654J8139L1507k4269
16142A001798N034k1615P284P0503J4781p910j8297o152k2497m7737K6611K6478
16130A028281J6117R685L8968l1506l0851m2806j0894L9780P0400J9308j0554
16119A095928K2949r4070k9211K4058J2630p852K1600l8316M1045M2188l406N067
16107A092610j9287J0032J2011J1259j328Q71j3825k1449q867J8855q504l110
$$ plain form
16095 1069268 1150675 1136314 1079139 1080001 1070881 1022185 1076670 1073836 1064530 1120585 1092283 1054192
16083 1054192 1091818 1078570 1042904 1087346 1094371 1051154 1075809 1028832 1010417 1108449 1148374
16072 1148374 1137144 1118883 1095335 1117959 1132619 1071876 1060842 1092564 1150069 1208411 1211724
16061 1211724 1205405 1173485 1093575 1044823 1073286 1070302 1142941 1157700 1173908 1153410 1159464 1080301
16049 1080301 1042549 1060994 1129279 1185932 1146368 1185177 1201437 1108066 1036802 1072139 1095348
16038 1095348 1149137 1132626 1131220 1172448 1105154 1089762 1083645 1076028 1085969 1151557 1141990 1151675
16026 1151675 1205046 1156950 1044953 1004544 1030249 1113307 1166229 1098152 1128589 1104053 1108538
16015 1108538 1074861 1116213 1119975 1145404 1145509 1123763 1151862 1093485 1080321 1096750 1140384 1196738
$$ packed form
16095A069268Q1407j4361n7175Q62r120m8696N4485k834r306N6055k8302l8091
16083A054192L7626j3248l5666M4442P025m3217K4655m6977j8415R8032L9925
16072A148374j1230j8261k3548K2624J4660o0743j1034L1722N7505N8342L313
16061A211724o319l1920p9910m8752K8463k984P2639J4759J6208k0498O054p9163
16049A080301l7752J8445O8285N6653l9564L8809J6260r3371p1264L5337K3209
16038A095348N3789j6511j406M1228o7294j5392o117p617R941O5588r567R685
16026A151675N3371m8096j11997m0409K5705Q3058N2922o8077L0437k4536M485
16015A108538l3677M1352L762K5429J05k1746K8099n8377j3164J6429M3634N6354
$$ plain form
16003 1196738 1163920 1140294 1104186 1135241 1095208 1085140 1089962 1122416 1164321 1194366 1205402
$$ packed form
16003A196738l2818k3626l6108L1055m0033j0068M822L2454M1905L0045J1036
$$ [...]
##END NTUPLES=NMR SPECTRUM
##END=
