##TITLE=1H_TG-2410-C2`
 200.13Hz, DMSO+CCl4.
 8 sc
 18.8.2026
##JCAMPDX= 6.0         $$ Bruker NMR JCAMP-DX V2.0
##DATA TYPE= NMR SPECTRUM
##DATA CLASS= NTUPLES
##ORIGIN= UXNMR, Bruker Analytische Messtechnik GmbH
##OWNER= pz
$$ XWIN-NMR		Version 3.5
$$ Tue Aug 18 12:33:24 2026 Russian Standard Time (UT+4h)  she@DPX200
##.OBSERVE FREQUENCY= 200.1313
##.OBSERVE NUCLEUS= ^1H
##.ACQUISITION MODE= SIMULTANEOUS
##.ACQUISITION SCHEME= undefined
##.AVERAGES= 8
##.DIGITISER RES= 18
##SPECTROMETER/DATA SYSTEM= spect
##.PULSE SEQUENCE= zg30
##.SOLVENT NAME= D2O
##.SHIFT REFERENCE= (INTERNAL, D2O, 0, 15.5023)
##AUDIT TRAIL= $$ (NUMBER, WHEN, WHO, WHERE, WHAT)
$$ ##TITLE= Audit trail, XWIN-NMR		Version 3.5
$$ ##JCAMPDX= 5.01
$$ ##ORIGIN= Bruker BioSpin GmbH
$$ ##OWNER= she
$$ F:/spectra/data/she/nmr/H-C/1/pdata/1/auditp.txt
$$ ##AUDIT TRAIL=  $$ (NUMBER, WHEN, WHO, WHERE, WHAT)
(   1,<2026-08-18 12:31:10.42 +0400>,<she>,<DPX200>,
      <created by zg, POWCHK disabled, PULCHK disabled
       configuration hash MD5:
       00 E9 B6 7A A2 85 ED C7 34 08 36 98 17 FE 4E 26
       data hash MD5: 16K
       C8 1F 2F DC 8A 27 04 97 69 B6 49 F5 7D FA 46 6E>)
(   2,<2026-08-18 12:31:12.93 +0400>,<she>,<DPX200>,
      <Start of raw data processing
       efp BC_mod = 2 LB = 0.25 FT_mod = 6 PKNL = 1 PHC0 = -4226.462 PHC1 = 14.9923 SI = 16K 
       data hash MD5: 16K
       45 EE D0 C7 F5 8C 16 7D 7C E1 40 D6 47 D5 8F 1D>)
(   3,<2026-08-18 12:31:36.56 +0400>,<she>,<DPX200>,
      <pk PHC0 = 0.659123 PHC1 = 1.8 
       data hash MD5: 16K
       1D CB 57 68 E6 D9 68 C4 C6 AB B3 88 43 CC 38 B2>)
(   4,<2026-08-18 12:31:42.98 +0400>,<she>,<DPX200>,
      <abs ABSG = 5 
       data hash MD5: 16K
       19 3D 0E C5 C6 D5 77 C9 D1 A4 AA B7 56 07 46 EF>)
$$ ##END=
$$ 
$$ hash MD5
$$ 36 1B F8 8B 69 A1 7F FF 8B CF 6B BD E9 8A 59 7A
##$RELAX= 
##$RELAX= 
##$RELAX= 
##$RELAX= 
##$RELAX= 
##$RELAX= 
$$ Bruker specific parameters
$$ --------------------------
##$DU= <F:/spectra>
##$EXPNO= 1
##$NAME= <H-C>
##$PROCNO= 1
##$TYPE= <nmr>
##$USER= <she>
##$AMP= (0..31)
100 100 100 100 100 100 100 100 100 100 100 100 100 100 100 100 100 100 
100 100 100 100 100 100 100 100 100 100 100 100 100 100 
##$AQSEQ= 0
##$AQ_mod= 1
##$AUNM= <au_zg>
##$AUTOPOS= <>
##$BF1= 200.13
##$BF2= 200.13
##$BF3= 200.13
##$BF4= 200.13
##$BF5= 200.13
##$BF6= 200.13
##$BF7= 200.13
##$BF8= 200.13
##$BYTORDA= 1
##$CFDGTYP= 0
##$CFRGTYP= 5
##$CHEMSTR= <none>
##$CNST= (0..31)
1 1 145 1 1 1 1 1 1 1 1 1 1 1 1 1 1 1 1 1 1 1 1 1 1 1 1 1 1 1 1 1 
##$CPDPRG= <>
##$CPDPRG1= <>
##$CPDPRG2= <>
##$CPDPRG3= <>
##$CPDPRG4= <mlev>
##$CPDPRG5= <mlev>
##$CPDPRG6= <mlev>
##$CPDPRG7= <mlev>
##$CPDPRG8= <mlev>
##$CPDPRGB= <>
##$CPDPRGT= <>
##$D= (0..31)
0 0.7 0 0 0 0 0 0 0 0 0 0.03 0 0 0 0 0 0 0 0 0 0 0 0 0 0 0 0 0 0 0 0 
##$DATE= 1787041869
##$DBL= (0..7)
120 120 120 120 120 120 120 120 
##$DBP= (0..7)
150 150 150 150 150 150 150 150 
##$DBP07= 0
##$DBPNAM0= <>
##$DBPNAM1= <>
##$DBPNAM2= <>
##$DBPNAM3= <>
##$DBPNAM4= <>
##$DBPNAM5= <>
$$ [...]
##$SUBNAM3= <"">
##$SUBNAM4= <"">
##$SUBNAM5= <"">
##$SUBNAM6= <"">
##$SUBNAM7= <"">
##$SUBNAM8= <"">
##$SUBNAM9= <"">
##$SW= 18.0517328524113
##$SWIBOX= (0..15)
0 0 2 0 0 0 0 0 0 0 0 0 0 0 0 0 
##$SW_h= 3612.71676300578
##$TD= 16384
##$TD0= 1
##$TE= 0
##$TE2= 300
##$TE3= 300
##$TEG= 300
##$TL= (0..7)
0 120 120 120 120 120 120 120 
##$TP= (0..7)
150 150 150 150 150 150 150 150 
##$TP07= 0
##$TPNAME0= <>
##$TPNAME1= <>
##$TPNAME2= <>
##$TPNAME3= <>
##$TPNAME4= <>
##$TPNAME5= <>
##$TPNAME6= <>
##$TPNAME7= <>
##$TPOAL= (0..7)
0.5 0.5 0.5 0.5 0.5 0.5 0.5 0.5 
##$TPOFFS= (0..7)
0 0 0 0 0 0 0 0 
##$TUNHIN= 0
##$TUNHOUT= 0
##$TUNXOUT= 0
##$USERA1= <user>
##$USERA2= <user>
##$USERA3= <user>
##$USERA4= <user>
##$USERA5= <user>
##$V9= 5
##$VALIST= <valist>
##$VCLIST= <CCCCCCCCCCCCCCC>
##$VD= 0
##$VDLIST= <DDDDDDDDDDDDDDD>
##$VPLIST= <PPPPPPPPPPPPPPP>
##$VTLIST= <TTTTTTTTTTTTTTT>
##$WBST= 1024
##$WBSW= 4
##$XGAIN= (0..3)
0 0 0 0 
##$XL= 0
##$YL= 0
##$YMAX_a= 691915
##$YMIN_a= -705054
##$ZGOPTNS= <>
##$ZL1= 120
##$ZL2= 120
##$ZL3= 120
##$ZL4= 120
##$ABSF1= 15.59541
##$ABSF2= -2.456441
##$ABSG= 5
##$ABSL= 3
##$ALPHA= 0
##$AQORDER= 0
##$ASSFAC= 0
##$ASSFACI= 0
##$ASSFACX= 0
##$ASSWID= 0
##$AUNMP= <proc_1d>
##$AZFE= 0.1
##$AZFW= 0.1
##$BCFW= 0
##$BC_mod= 2
##$BYTORDP= 0
##$COROFFS= 0
##$CY= -3
##$DATMOD= 1
##$DC= 0
##$DFILT= <>
##$DTYPP= 0
##$F1P= 0
##$F2P= 0
##$FCOR= 1
##$FTSIZE= 16384
##$FT_mod= 6
##$GAMMA= 0
##$GB= 0
##$INTBC= 1
##$INTSCL= 3.241238e-09
##$ISEN= 128
##$LB= 0.25
##$LEV0= 0
##$LPBIN= 0
##$MAXI= 10000
##$MC2= 0
##$MEAN= 0
##$ME_mod= 0
##$MI= 1.114404
##$NCOEF= 0
##$NC_proc= -5
##$NLEV= 6
##$NOISF1= 3.799351
##$NOISF2= 2.8
##$NSP= 0
##$NTH_PI= 0
##$NZP= 0
##$OFFSET= 15.50229
##$PC= 1
##$PHC0= -4225.803
##$PHC1= 16.7923
##$PH_mod= 1
##$PKNL= yes
##$PPARMOD= 0
##$PSCAL= 0
##$PSIGN= 0
##$REVERSE= no
##$SF= 200.130003885417
##$SI= 16384
##$SIGF1= 3
##$SIGF2= 2
##$SINO= 0.751879
##$SIOLD= 32768
##$SREGLST= <19F.Aceton>
##$SSB= 0
##$STSI= 16384
##$STSR= 0
##$SW_p= 3612.71676300578
##$SYMM= 0
##$S_DEV= 0
##$TDeff= 16384
##$TDoff= 0
##$TI= <>
##$TILT= no
##$TM1= 0
##$TM2= 0
##$TOPLEV= 0
##$USERP1= <user>
##$USERP2= <user>
##$USERP3= <user>
##$USERP4= <user>
##$USERP5= <user>
##$WDW= 1
##$XDIM= 16384
##$YMAX_p= 402760233
##$YMIN_p= -187989
$$ End of Bruker specific parameters
$$ ---------------------------------
##NTUPLES= NMR SPECTRUM
##VAR_NAME=  FREQUENCY,     SPECTRUM/REAL,   SPECTRUM/IMAG
##SYMBOL=    X,             R,               I
##VAR_TYPE=  INDEPENDENT,   DEPENDENT,       DEPENDENT
##VAR_FORM=  AFFN,          ASDF,            ASDF
##VAR_DIM=   16384,         16384,           16384
##UNITS=     HZ,            ARBITRARY UNITS, ARBITRARY UNITS
##FACTOR=    0.220516191357247, 1,           1
##FIRST=     3102.47331230996, 0,            0
##LAST=      -510.243450695817, 0,           0
##MIN=       -510.243450695817, -187989,     0
##MAX=       3102.47331230996, 402760233,    0
$$ Real data points
##PAGE= N=1
##DATA TABLE= (X++(R..R)), XYDATA
$$ [...]
$$ plain form
6042 113898 103690 62560 2605 102015 134933 136753 135000 108140 150341 158443 184799 191105
6030 191105 136976 133230 120470 147784 94810 180991 177888 218358 181970 209915 211702 125410
6018 125410 187449 167919 179330 248975 212322 192530 209581 181571 190755 182298 183796 249583
6006 249583 240787 181594 103934 129088 160364 112977 154720 232228 210331 216632 186494 154913
5994 154913 165461 175580 192767 169852 229713 219353 194647 215909 240223 218442 187375 163825
5982 163825 112360 154976 177977 207333 197032 165546 179215 247275 263705 221529 216801 197460
5970 197460 226800 200420 214785 234219 221900 157146 156473 149602 163774 145682 174915 236919
5958 236919 230001 161450 159154 173357 136488 106314 102833 150985 158968 123059 73910 90165
$$ packed form
6042A13898j0208m1130n9955R9410L2918J820j753k6860M2201Q102K6356O306
6030A91105n4129l746j2760K7314n2974Q6181l103M0470l6388K7945J787q6292
6018A25410O2039j9530J1411O9645l6653j9792J7051k8010R184q457J498O5787
6006B49583q796n9193p7660K5154L1276m7387M1743P7508k1897O301l0138l1581
5994A54913J0548J0119J7187k2915N9861j0360k4706K1262K4314k1781l1067k3550
5982A63825n1465M2616K3001K9356j0301l1486J3669O8060J6430m2176m728j9341
5970A97460K9340k6380J4365J9434j2319o4754o73o871J4172j8092K9233O2004
5958B36919o918o8551k296J4203l6869l0174l481M8152P983l5909m9149J6255
$$ plain form
5946 90165 117793 169302 147236 142965 165587 160620 177274 240975 210206 154628 170565 193406
5934 193406 189462 174712 172621 172778 173632 220567 238881 209248 183456 150173 197257 260106 217784
5921 217784 201664 206736 159737 188849 213712 188726 192824 268489 172949 171954 183132 159230
5909 159230 188651 229238 174934 182422 209072 245645 291492 280017 257961 259108 174939 194876
5897 194876 206927 245084 326239 286784 302260 304543 317902 324552 356364 320887 329164 326834
5885 326834 340284 305469 327313 358717 386641 401279 377514 392842 415424 351547 310440 313242
5873 313242 369928 357803 300739 260867 285556 376510 407744 362286 352245 331936 346569 339095
5861 339095 321132 332529 335107 449270 498641 495223 541666 606488 640209 668349 732820 817633
$$ packed form
5946I0165K7628N1509k2066m271K2622m967J6654O3701l0769n5578J5937K2841
5934A93406l944j4750k091J57Q54M6935J8314k9633k5792l3283M7084O2849m2322
5921B17784j6120N072m6999K9112K4863k4986M098P5665r5540r95J1178k3902
5909A59230K9421M0587n4304P488K6650L6573M5847j1475k2056J147q4169J9937
5897A94876J2051L8157Q1155l9455J5476K283J3359O650L1812l5477Q277k330
5885C26834J3450l4815K1844L1404K7924J4638k3765J5328K2582o3877m1107K802
5873C13242N6686j2125n7064l9872K4689R0954L1234m5458j0041k0309J4633p474
5861C39095j7963J1397K578J14163M9371l418M6443O4822L3721K8140O4471Q4813
$$ plain form
5849 817633 889508 924745 961634 1038143 1003107 1012918 1045109 1054792 1066301 1096598 1032643 1031790
5837 1031790 1085204 1031985 1007828 951674 881963 823826 791588 748822 734277 718893 711427 662002
5825 662002 686136 661247 637153 612612 610115 591807 521104 465707 515515 533206 526719 534145
5813 534145 491888 503543 520167 533353 465491 475629 563748 536739 488699 508831 501686 586281
5801 586281 563732 520614 610921 578761 629520 647200 738383 720872 644441 733372 710436 754375
5789 754375 798261 786338 767145 791735 822407 835900 820847 854816 931832 1037662 1080717
5778 1080717 1159132 1114531 1071442 1127059 1171505 1252659 1300619 1366278 1492258 1669869 1878691
5767 1878691 2119760 2383231 2739739 3255813 3997957 5411246 7869277 11243463 14814572
$$ packed form
5849H17633P1875L5237L6889P6509l5036R811L2191R683J1509L0297o3955q53
5837A031790N3414n3219k4157n6154o9711n8137l2238m2766j4545j5384p466m9425
5825F62002K4134k4889k4094k4541k497j8308p0703n5397M9808J7691o487P426
5813E34145m2257J1655J6624J3186o7862J0138Q8119k7009m8040K0132p145Q4595
5801E86281k2549m3118R0307l2160N0759J7680R1183j7511p6431Q8931k2936M3939
5789G54375M3886j1923j9193K4590L0672J3493j5053L3969P7016J05830M3055
5778A080717P8415m4601m3089N5617M4446Q1154M7960O5659J25980J77611K08822
5767A878691K41069K63471L56508N16074P42144J413289K458031L374186L571109
$$ plain form
5758 14814572 17261943 17913400 17592039 17010904 15427524 13372494 11368313 9535349 7859227
5749 7859227 6134629 4789609 3790839 3177202 2810429 2600670 2370697 2152077 1988080
5740 1988080 1759381 1646719 1551172 1464618 1384361 1311057 1228278 1115267 1091176 1063666 1112294
5729 1112294 1058605 1016825 1001068 1012405 972335 969456 1028118 1028762 993968 994054 999704 1020836 1073904
5716 1073904 1022989 1057498 1046189 1005020 1017754 985426 956218 973957 983262 1016884 1007900 1017123
5704 1017123 1027670 1012207 976348 993245 1022898 1037194 1005172 1069799 1049023 1017610 1038424
5693 1038424 1086651 1098761 1041325 1105874 1094341 1113906 1080401 1104832 1061492 1135288 1113352
5682 1113352 1093057 1087928 1081343 1085738 1050554 1096948 1133336 1181290 1086393 1060987 1114295 1167242
$$ packed form
5758A4814572K447371O51457l21361n81135j583380k055030k004181j832964j676122
5749G859227j724598j345020r98770o13637l66773k09759k29973k18620j63997
5740A988080k28699j12662r5547q6554q0257p3304q2779j13011k4091k7510M8628
5729A112294n3689m1780j5757J1337m0070k879N8662O44l4794Q6N650K1132N3068
5716A073904n0915L4509j1309m1169J2734l2328k9208J7739R305L3622q984R223
5704A017123J0547j5463l5859J6897K9653J4296l2022O4627k0776l1413K0814
5693A038424M8227J2110n7436O4549j1533J9565l3505K4431m3340P3796k1936
5682A113352k0295n129o585M395l5184M6394L6388M7954r4897k5406N3308N2947
$$ plain form
5670 1167242 1179594 1158443 1146486 1219618 1278990 1278940 1279139 1266557 1290620 1363855 1407796 1414048 1400574
5657 1400574 1425868 1426629 1418525 1440023 1414155 1431169 1474438 1578728 1555065 1531064 1526471 1547851
5645 1547851 1548971 1586704 1595872 1552291 1581901 1611860 1680634 1633590 1705561 1695718 1699119 1665053
5633 1665053 1647335 1642820 1677324 1691781 1726353 1779197 1824064 1783241 1808989 1827730 1813858 1878290
5621 1878290 1845543 1944127 2023223 1993558 2075623 2157981 2159558 2228619 2302581 2366751 2423326 2592252
5609 2592252 2653712 2693281 2782121 2806658 2907883 2901114 2927849 2944308 3016207 3018433 3074410 3154761
5597 3154761 3257477 3348775 3399128 3469067 3440308 3468649 3506777 3531514 3614309 3687065 3712942
5586 3712942 3785302 3909497 3967649 4029927 4118548 4161456 4302183 4441638 4555229 4634272 4815572
$$ packed form
5670A167242J2352k1151j1957P3132N9372n0J99j2582K4063P3235M3941O252j3474
5657A400574K5294P61q104K1498k5868J7014M3269J04290k3663k4001m593K1380
5645A547851J120L7733R168m3581K9610K9959O8774m7044P1971r843L401l4066
5633A665053j7718m515L4504J4457L4572N2844M4867m0823K5748J8741j3872O4432
5621A878290l2747R8584P9096k9665Q2065Q2358J577O9061P3962O4170N6575J68926
5609B592252O1460L9569Q8840K4537J01225o769K6735J6459P1899K226N5977Q0351
5597C154761J02716R1298N0353O9939k8759K8341L8128K4737Q2795P2756K5877
5586C712942P2360J24195N8152O2278Q8621M2908J40727J39455J13591P9043J81300
$$ plain form
5575 4815572 4935398 5139215 5305734 5484702 5686267 5872141 6042674 6255842 6524454 6764788
5565 6764788 7032345 7361966 7715261 8042351 8429703 8876682 9365976 9888545 10379446 10908410
5555 10908410 11540449 12185315 12876242 13702028 14725221 15848181 17090281 18575397 20300341
5546 20300341 22394481 24802766 27769777 31541924 36272458 42262782 50089179 60009272
5538 60009272 72091075 85755836 99544183 111814072 121053428 127098546 130079475 130730989
5530 130730989 130217210 129870824 130593753 132866999 136227769 139225208 140539677 139182301
5522 139182301 134941160 128030209 118910475 108043554 96368050 84530798 73094631
5515 73094631 62697062 53549955 45793055 39411108 34266903 30193246 26828615 24032344
$$ packed form
5575D815572J19826K03817J66519J78968K01565J85874J70533K13168K68612K40334
5565F764788K67557L29621L53295L27090L87352M46979M89294N22569M90901N28964
5555A0908410O32039O44866O90927Q25786J023193J122960J242100J485116J724944
5546B0300341K094140K408285K967011L772147M730534N990324P826397R920093
5538F0009272J2081803J3664761J3788347J2269889R239356O045118K980929O51514
5530A30730989n13779l46386P22929K273246L360770K997439J314469j357376
5522A39182301m241141o910951r119734j0866921j1675504j1837252j1436167
5515G3094631j0397569r147107p756900o381947n144205m073657l364631k796271
$$ plain form
5507 24032344 21699946 19636391 17854169 16332760 14920882 13752688 12763054 11881704
5499 11881704 11104984 10383235 9802080 9324824 8872226 8433844 8017215 7685748 7356841
5490 7356841 7099948 6823493 6551254 6318961 6117733 5886529 5681393 5586533 5386517 5237017
5480 5237017 5097997 4956603 4777242 4675295 4559748 4434799 4342496 4256050 4102378 4017042
5470 4017042 3924156 3822674 3778187 3669249 3572068 3449677 3371881 3225310 3156848 3121205 2983597
5459 2983597 2831556 2843456 2808575 2754799 2646027 2554695 2538586 2487151 2471375 2361118 2345437
5448 2345437 2300580 2220788 2164719 2200999 2132607 2111254 2061665 2107433 2074190 2053396 1993297
5437 1993297 1962262 1942138 1948810 1941137 1925932 1851052 1810247 1794521 1741019 1741511 1739701 1721627
$$ packed form
5507B4032344k332398k063555j782222j521409j411878j168194r89634q81350
5499A1881704p76720p21749n81155m77256m52598m38382m16629l31467l28907
5490G356841k56893k76455k72239k32293k01228k31204k05136r4860k00016j49500
5480E237017j39020j41394j79361j01947j15547j24949r2303q6446j53672q5336
5470D017042r2886j01482m4487j08938r7181j22391p7796j46571o8462l5643j37608
5459B983597j52041J1900l4881n3776j08772r1332j6109n1435j5776j10257j5681
5448B345437m4857p9792n6069L6280o8392k1353m9589M5768l3243k0794o0099
5437A993297l1035k0124O672p673j5205p4880m0805j5726n3502M92j810j8074
$$ plain form
5425 1721627 1685468 1603634 1594878 1619623 1576637 1588119 1530730 1511781 1488757 1474184 1444842 1439378
5413 1439378 1392052 1366218 1345920 1329040 1342527 1340621 1260262 1220590 1249774 1268742 1217272 1277511
5401 1277511 1239352 1206732 1198822 1261903 1276857 1257624 1210012 1209294 1206729 1215738 1200212 1169859
5389 1169859 1266689 1273394 1247003 1280030 1313216 1335093 1325435 1314593 1237567 1232922 1272278 1269657
5377 1269657 1288477 1323855 1345316 1315361 1296341 1241877 1300513 1334079 1345205 1360757 1353730 1382280
5365 1382280 1391973 1391036 1383547 1375005 1415832 1473811 1440899 1427232 1521536 1577460 1558876 1535852
5353 1535852 1536937 1530926 1633896 1730986 1721251 1734105 1815549 1798821 1834563 1837031 1804541 1884142
5341 1884142 1972993 2018888 2047006 2170565 2260628 2367181 2379890 2371628 2363654 2473410 2630317
$$ packed form
5425A721627l6159q1834q756K4745m2986J1482n7389j8949k3024j4573k9342n464
5413A439378m7326k5834k0298j6880J3487j906q0359l9672K9184J8968n1470O0239
5401A277511l8159l2620p910O3081J4954j9233m7612p18k565R009j5526l0353
5389A169859R6830O705k6391L3027L3186K1877r658j0842p7026m645L9356k621
5377A269657J8820L5378K1461k9955j9020n4464N8636L3566J1126J5552p027K8550
5365A382280R693r37p489q542M0827N7979l2912j3667R4304N5924j8584k3024
5353A535852J085o011J02970R7090r735J2854Q1444j6728L5742K468l2490P9601
5341A884142Q8851M5895K8118J23559R0063J06553J2709q262p974J09756J56907
$$ plain form
5330 2630317 2773886 2854893 2940342 3061964 3145249 3334027 3500118 3634919 3750594 3930013
5320 3930013 4164439 4301693 4497471 4722195 4942624 5234704 5496099 5857175 6318460 6863899
5310 6863899 7559642 8350040 9300518 10414547 11732079 13400678 15803654 19344467 24645813
5301 24645813 32138889 40793580 48665452 53903864 56140143 56502072 55332140 52755710
5293 52755710 49789919 47601439 47136608 48981781 52858895 57455537 60656176 61196993
5285 61196993 59702365 56755772 52264949 46643386 40720611 34828126 29286557 24252868
5277 24252868 19930320 16494972 13914498 12036762 10637253 9546508 8591190 7776579
5269 7776579 7083623 6449041 5938465 5494652 5073391 4742624 4464514 4193487 4036351 3801757
$$ packed form
5330B630317J43569Q1007Q5449J21622Q3285J88778J66091J34801J15675J79419
5320C930013K34426J37254J95778K24724K20429K92080K61395L61076M61285N45439
5310F863899O95743P90398R50478J114029J317532J668599K402976L540813N301346
5301B4645813P493076Q654691P871872N238412K236279L61929j169932k576430
5293E2755710k965791k188480m64831J845173L877114M596642L200639N40817
5285F1196993j494628k946593m490823n621563n922775n892485n541569n033689
5277B4252868m322548l435348k580474j877736j399509j090745r55318q14611
5269G776579o92956o34582n10576m43813m21261l30767k78110k71027j57136k34594
$$ plain form
5259 3801757 3573653 3466945 3296743 3041533 2960121 2897625 2845015 2734233 2636759 2575682
5249 2575682 2489036 2423933 2379114 2308307 2290525 2145366 2133352 2065169 2005882 2028503 2013590
5238 2013590 1944942 1912424 1885724 1828777 1833850 1792989 1730488 1686518 1666429 1629241 1673088 1655486
5226 1655486 1579860 1541930 1637006 1624017 1642548 1585049 1613515 1620266 1646310 1680796 1761524 1715961
5214 1715961 1664221 1705064 1738643 1683785 1652066 1594234 1619358 1640025 1657881 1628370 1581629
5203 1581629 1523665 1492738 1472188 1408371 1303529 1179591 1151727 1168694 1194186 1129913 1109167
5192 1109167 1096309 1084224 1080139 1073446 989427 935423 975648 888661 907743 944439 931391 900886
5180 900886 783233 804977 791949 829409 814756 797524 737755 742349 753795 815804 745606 735175
$$ packed form
5259C801757k28104j06708j70202k55210q1412o2496n2610j10782r7474o1077
5249B575682q6646o5103m4819p0807j7782j45159j2014o8183n9287K2621j4913
5238B013590o8648l2518k6700n6947N073m0861o2501m3970k0089l7188M3847j7602
5226A655486p5626l7930R5076j2989J8531n7499K8466O751K6044L4486Q0728m5563
5214A715961n1740M0843L3579n4858l1719n7832K5124K0667J7856k9511m6741
5203A581629n7964l0927k0550o3817j04842j23938k7864J6967K5492o4273k0746
5192A109167j2858j2085m085o693q4019n4004M0225q6987J9082L6696j3048l0505
5180I00886j17653K1744j3028L7460j4653j7232n9769M594J1446O2009p0198j0431
$$ plain form
5168 735175 757354 752756 714675 658065 716905 706296 741721 754171 740881 739279 745631 793112
5156 793112 807956 844703 831431 749986 799329 817192 806044 793385 814703 831682 809630 797433
5144 797433 831205 807249 777199 788824 775811 802048 759843 776828 835125 842630 778016 795803
5132 795803 844305 795788 795031 833973 914397 931732 921929 886395 861779 886405 936205 930362
5120 930362 949849 982226 995809 1034945 1010562 1052173 1090618 1151443 1187776 1148940 1118587 1127109
5108 1127109 1220350 1277923 1277370 1221341 1237617 1266324 1314275 1291933 1277533 1289100 1240779 1224210
5096 1224210 1230065 1207504 1190268 1211144 1273100 1275046 1223437 1140248 1099448 1103043 1106410 1110403
5084 1110403 1134433 1123412 1053263 1064309 1098319 1053873 1042392 1072184 1071279 1093206 1085742 1153134
$$ packed form
5168G35175K2179m598l8081n6610N8840j0609L5425J2450j3290j602O352M7481
5156G93112J4844L6747j3272q1445M9343J7863j1148j2659K1318J6979k2052j2197
5144G97433L3772k3956l0050J1625j3013K6237m2205J6985N8297P505o4614J7787
5132G95803M8502m8517p57L8942Q0424J7335r803l5534k4616K4626M9800n843
5120I30362J9487L2377J3583L9136k4383M1611L8445O0825L6333l8836l0353Q522
5108A127109R3241N7573n53n6029J6276K8707M7951k2342j4400J1567m8321j6569
5096A224210N855k2561j7236K0876O1956J946n1609q3189m0800L595L367L993
5084A110403K4030j1021p0149J1046L4010m4446j1481K9792r05K1927p464O7392
$$ plain form
5072 1153134 1204197 1194355 1140140 1126753 1110552 1179182 1206959 1175918 1183315 1253788 1288727 1311645
5060 1311645 1312177 1259753 1219136 1236192 1270006 1235392 1283398 1322923 1333141 1338098 1248665 1209692
5048 1209692 1237534 1292068 1251982 1221359 1254178 1324274 1296084 1257721 1297540 1328343 1338823
5037 1338823 1356988 1362274 1337701 1364138 1356849 1407555 1425135 1442767 1410885 1367103 1391023 1435543
5025 1435543 1490237 1519959 1509211 1511150 1543786 1552032 1532464 1542536 1550545 1567688 1585150 1669741
5013 1669741 1682544 1669391 1665169 1675907 1661283 1721254 1776457 1745695 1779755 1857725 1902454 1913284
5001 1913284 1928474 1880216 1867349 1889084 2003613 2096850 2093181 2168668 2335554 2418683 2484294
4990 2484294 2560695 2613449 2654410 2686628 2717495 2657941 2653735 2629361 2614317 2591690 2563320 2549182
$$ packed form
5072A153134N1063r842n4215j3387j6201O8630K7777l1041P397P0473L4939K2918
5060A311645N32n2424m0617J7056L3814l4614M8006L9525J0218M957q9433l8973
5048A209692K7842N4534m0086l0623L2819P0096k8190l8363L9819L0803J0480
5037A338823J8165N286k4573K6437p289N0706J7580J7632l1882m3782K3920M4520
5025A435543N4694K9722j0748J939L2636Q246j9568J0072Q009J7143J7462Q4591
5013A669741J2803j3153m222J0738j4624N9971N5203l0762L4060P7970M4729J0830
5001A913284J5190m8258j2867K1735J14529R3237l669P5487J66886Q3129O5611
4990B484294P6401N2754M0961L2218L0867n9554m206k4374j5044k2627k8370j4138
$$ plain form
4978 2549182 2497443 2459558 2523472 2512944 2602601 2693621 2662157 2699040 2690894 2670913 2640887 2652038
4966 2652038 2603315 2615493 2673148 2680108 2637968 2675067 2731435 2749516 2756944 2762675 2722949 2788766
4954 2788766 2864459 2884447 2972066 2963318 3025168 3081882 2985988 3003472 3129352 3196394 3258766
4943 3258766 3308351 3340788 3383068 3407504 3376789 3395750 3519646 3524287 3558957 3594288 3664636
4932 3664636 3697793 3762855 3814477 3865077 3929238 3966795 4030504 4107213 4133916 4154136 4219304
4921 4219304 4280172 4336445 4382696 4518010 4582449 4667242 4724053 4771188 4801782 4870395 4938588
4910 4938588 5037902 5188741 5228760 5242081 5260324 5364700 5507208 5603513 5727897 5863631
4900 5863631 5922703 5930242 6003906 6107480 6154611 6292944 6424860 6506136 6587222 6653868 6745990
$$ packed form
4978B549182n1739l7885O3914j0528Q9657R1020l1464L6883q146j9981l0026J1151
4966B652038m8723J2178N7655O960m2140L7099N6368J8081P428N731l9726O5817
4954B788766P5693J9988Q7619q748O1850N6714r5894J7484J25880O7042O2372
4943C258766M9585L2437M2280K4436l0715J8961J23896M641L4670L5331P0348
4932C664636L3157O5062N1622N0600O4161L7557O3709P6709K6703K0220O5168
4921D219304O0868N6273M6251J35314O4439Q4793N6811M7135L0594O8613O8193
4910D938588R9314J50839M0019J3321J8243J04376J42508R6305J24384J35734
4900E863631N9072P539P3664J03574M7131J38333J31916Q1276Q1086O6646R2122
$$ plain form
4889 6745990 6892779 7025871 7146964 7237087 7321365 7451613 7553981 7711553 7868998 8036665
4879 8036665 8112867 8216865 8299963 8506442 8622914 8768257 8934334 9025457 9165427 9308686
4869 9308686 9423853 9562518 9726657 9880416 10077006 10226122 10401842 10617371 10782698 10908385
4859 10908385 11035353 11253409 11509654 11750705 11991751 12188214 12405789 12666029 12971711
4850 12971711 13241816 13507581 13669807 13815187 13990300 14102850 14299044 14491595 14620025
4841 14620025 14768592 14909906 15061269 15263634 15459543 15690721 15923755 16205915 16510233
4832 16510233 16852647 17194163 17518245 17958798 18486790 19198117 20509326 22658445 25276818
4823 25276818 27729275 29255717 29688655 29599607 29191438 28027166 26754501 25483677 24306908
$$ packed form
4889F745990J46789J33092J21093R0123Q4278J30248J02368J57572J57445J67667
4879H036665P6202J03998Q3098K06479J16472J45343J66077R1123J39970J43259
4869I308686J15167J38665J64139J53759J96590J49116J75720K15529J65327J25687
4859A0908385J26968K18056K56245K41051K41046J96463K17575K60240L05682
4850A2971711K70105K65765J62226J45380J75113J12550J96194J92551J28430
4841A4620025J48567J41314J51363K02365J95909K31178K33034K82160L04318
4832A6510233L42414L41516L24082M40553N27992P11327J311209K149119K618373
4823B5276818K452457J526442M32938q9048m08169j164272j272665j270824j176769
$$ plain form
4814 24306908 23164899 22124226 21406762 20852316 20578643 20425592 20242578 20201868 20090118
4805 20090118 19965825 19927084 19834490 19773564 19712989 19645121 19525039 19434631 19423261 19444342 19433311
4794 19433311 19352456 19330227 19284339 19191389 19155401 19050762 18989253 18880046 18817923 18801047 18659212
4783 18659212 18548181 18435744 18373213 18280491 18152653 18058114 17890178 17739924 17659757 17460186
4773 17460186 17238899 17197331 17030636 16824297 16677189 16583562 16432950 16257050 16068779 15920944
4763 15920944 15794957 15589779 15345446 15160497 15034070 14863945 14746845 14571254 14398861
4754 14398861 14224057 13982664 13812984 13679518 13478493 13301939 13120563 12860631 12684919
4745 12684919 12501286 12281471 12123246 12003822 11859405 11703063 11531217 11339880 11160577
$$ packed form
4814B4306908j142009j040673p17464n54446k73673j53051j83014m0710j11750
4805B0090118j24293l8741r2594o0926o0575o7868j20082r0408j1370K1081j1031
4794A9433311q0855k2229m5888r2950l5988j04639o1509j09207o2123j6876j41835
4783A8659212j11031j12437o2531r2722j27838r4539j67936j50254q0167j99571
4773A7460186k21287m1568j66695k06339j47108r3627j50612j75900j88271j47835
4763A5920944j25987k05178k44333j84949j26427j70125j17100j75591j72393
4754A4398861j74804k41393j69680j33466k01025j76554j81376k59932j75712
4745A2684919j83633k19815j58225j19424j44417j56342j71846j91337j79303
$$ plain form
4736 11160577 11004186 10838565 10670638 10503505 10346675 10238824 10053342 9893110 9772073
4727 9772073 9629189 9510280 9340865 9178344 9035806 8969951 8887778 8711268 8502841 8343231
4717 8343231 8294091 8197652 8037262 7908946 7763892 7753028 7688208 7534741 7403000 7197225
4707 7197225 7114739 7153730 7006756 6854189 6773451 6668353 6568770 6435727 6380481 6368198 6188593
4696 6188593 6097991 6042043 5949367 5866345 5784532 5738018 5637554 5559721 5535106 5499111 5415002
4685 5415002 5405357 5330800 5256110 5235855 5220881 5080747 5027711 4975895 4968659 4920756 4827256 4846842
4673 4846842 4848695 4735802 4690481 4691831 4610041 4617437 4641421 4630474 4591895 4560401 4456548 4385823
4661 4385823 4366018 4345563 4414533 4403388 4390538 4418883 4438671 4419309 4383324 4339452 4284246
$$ packed form
4736A1160577j56391j65621j67927j67133j56830j07851j85482j60232j21037
4727I772073j42884j18909j69415j62521j42538o5855q2173j76510k08427j59610
4717H343231m9140r6439j60390j28316j45054j0864o4820j53467j31741k05775
4707G197225q2486L8991j46974j52567q0738j05098r9583j33043n5246j2283j79605
4696F188593r0602n5948r2676q3022q1813m6514j00464p7833k4615l5995q4109
4685E415002r645p4557p4690k0255j4974j40134n3036n1816p236m7903r3500J9586
4673D846842J853j12893m5321J350q1790P396K3984j0947l8579l1494j03853p0725
4661D385823j9805k0455O8970j1145j2850K8345J9788j9362l5985m3872n5206
$$ plain form
4650 4284246 4255678 4300704 4268401 4185598 4157704 4136360 4117325 4052495 4083528 4023451 4043277
4639 4043277 4080092 4053125 4029382 4027672 4136973 4264241 4239762 4296824 4454598 4780619 5300408
4628 5300408 5987650 6763760 7334192 7594478 7567102 7452398 7208890 6899719 6542229 6195234
4618 6195234 5957756 5676638 5468138 5303566 5374848 5510788 5704896 6067771 6412528 6873439
4608 6873439 7254073 7540909 7761728 7991315 8368733 8845826 9476102 10134856 10669635 11030050
4598 11030050 11261570 11542516 11796774 12096746 12526487 13111048 13664584 13967609 13999991 13882175
4588 13882175 13661309 13431292 13278665 13225653 13237577 13107016 12807495 12487317 12130148 11680206
4578 11680206 11275943 10983097 10843499 10622934 10325004 10102249 9849715 9556681 9376186
$$ packed form
4650D284246k8568M5026l2303q2803k7894k1344j9035o4830L1033o0077J9826
4639D043277L6815k6967k3743j710J09301J27268k4479N7062J57774L26021N19789
4628E300408O87242P76110N70432K60286k7376j14704k43508l09171l57490l46995
4618F195234k37478k81118k08500j64572P1282J35940J94108L62875L44757M60911
4608F873439L80634K86836K20819K29587L77418M77093O30276O58754N34779L60415
4598A1030050K31520K80946K54258K99972M29741N84561N53536L03025L2382j17816
4588A3882175k20866k30017j52627n3012J1924j30561k99521l20178l57169m49942
4578A1680206m04263k92846j39598k20565k97930k22755k52534k93034j80495
$$ plain form
4569 9376186 9303222 9242581 9367496 9492088 9763379 10257656 10969761 11868418 13146417 14985317
4559 14985317 17210896 19864457 23115037 26822955 30664641 34362043 37615321 40254614
4551 40254614 42494460 44669580 47110695 50135368 54128666 59033774 64022958 68040474
4543 68040474 70412869 71002293 70199053 68107871 65161828 61894261 58754916 55887100
4535 55887100 53111281 50356982 47499297 44572835 41529534 38388277 34985432 31452450
4527 31452450 27974052 24596669 21509454 18874549 16647340 14769055 13320858 12169571
4519 12169571 11372192 10766420 10242700 9943956 9840908 9942789 10278897 11188527 12753400
4510 12753400 14877161 17035374 18608675 19274147 19502366 19451693 19175043 18904535 18775082
$$ packed form
4569I376186p2964o0641J24915J24592K71291M94277P12105Q98657J277999J838900
4559A4985317K225579K653561L250580L707918L841686L697402L253278K639293
4551D0254614K239846K175120K441115L024673L993298M905108M989184M017516
4543F8040474K372395N89424q03240k091182k946043l267567l139345k867816
4535E5887100k775819k754299k857685k926462l043301l141257l402845l532982
4527C1452450l478398l377383l087215k634905k227209j878285j448197j151287
4519A2169571p97379o05772n23720k98744j03048J01881L36108R09630J564873
4510A2753400K123761K158213J573301O65472K28219n0673k76650k70508j29453
$$ plain form
4501 18775082 19419584 21207733 24204021 27769348 30400370 31242180 30930469 30025438 28498384
4492 28498384 26532537 24381673 22361406 20823483 20025256 19776894 19812037 19454914 18705278
4483 18705278 17667189 16404440 15000914 13432842 11824125 10289621 8843607 7536999
4475 7536999 6464669 5746133 5153131 4697148 4410807 4084594 3837331 3582266 3394779
4466 3394779 3268359 3113750 3007879 2869110 2769800 2635730 2548708 2488677 2466236 2445027
4456 2445027 2301304 2300366 2287312 2245957 2198148 2183070 2111781 2086000 2171828 2100808 2080306 2130418
4444 2130418 2060930 2043112 2030845 2012534 2044713 2003287 1936106 1900610 1887506 1926524 1993260
4433 1993260 1973164 1901502 1874903 1859082 1803957 1788595 1749780 1703667 1703350 1625403 1613837 1532520
$$ packed form
4501A8775082O44502J788149K996288L565327K631022Q41810l11711r05031j527054
4492B8498384j965847k150864k020267j537923p98227k48362L5143l57123p49636
4483A8705278j038089j262749j403526j568072j608717j534504j446014j306608
4475G536999j072330p18536n93002m55983k86341l26213k47263k55065j87487
4466C394779j26420j54609j05871j38769r9310j34070q7022o0031k2441k1209
4456B445027j43723r38j3054m1355m7809j5078p1289k5781Q5828p1020k0502N0112
4444B130418o9488j7818j2267j8311L2179m1426o7181l5496j3104L9018O6736
4433A993260k0096p1662k6599j5821n5125j5362l8815m6113l17p7947j1566q1317
$$ plain form
4421 1532520 1517594 1465130 1420850 1367178 1352139 1284849 1290920 1286171 1266494 1189597 1161332 1213698
4409 1213698 1172894 1208991 1228364 1163369 1156680 1178863 1158269 1170686 1182192 1177584 1074357 1075513
4397 1075513 1120154 1169826 1138196 1106274 1076265 1104876 1075153 1085793 1157229 1113487 1123975
4386 1123975 1155577 1146411 1123487 1171965 1090509 1099143 1139852 1096658 1106116 1117394 1101582 1092915
4374 1092915 1042590 1050491 1077939 1045255 1082288 1084219 1000044 1025153 1034067 1003893 919695 927667
4362 927667 944143 951125 972430 966245 971397 988636 1022003 998457 1025807 977028 1000421 1017063
4350 1017063 1044083 1025040 975278 1020206 1108454 1101218 1077994 1087236 1122823 1124322 1099298 1084066
4338 1084066 1133227 1269063 1209153 1189569 1159627 1110793 1210962 1266119 1208715 1208758 1247448 1213654
$$ packed form
4421A532520j4926n2464m4280n3672j5039o7290O071m749j9677p6897k8265N2366
4409A213698m0804L6097J9373o4995o689K2183k0594J2417J1506m608j03227J156
4397A075513M4641M9672l1630l1922l0009K8611k9723J0640P1436m3742J0488
4386A123975L1602r166k2924M8478q1456Q634M0709m3194R458J1278j5812q667
4374A092915n0325P901K7448l2684L7033J931q4175K5109Q914l0174q4198P972
4362I27667J6476O982K1305o185N152J7239L3367k3546K7350m8779K3393J6642
4350A017063K7020j9043m9762M4928Q8248p236k3224R242L5587J499k5024j5232
4338A084066M9161J35836n9910j9584k9942m8834J00169N5157n7404M3L8690l3794
$$ plain form
4326 1213654 1227280 1203295 1246756 1240251 1213419 1247732 1331355 1324442 1344025 1427513 1407612 1429986
4314 1429986 1468496 1527605 1590618 1556079 1645755 1679366 1684283 1690370 1659446 1711347 1760062 1830520
4302 1830520 1855432 1854944 1938698 1977749 2012120 2100678 2181234 2201868 2250050 2317550 2491842 2625538
4290 2625538 2831247 2950262 3069102 3198837 3365294 3589025 3743074 3903141 4092277 4328890
4280 4328890 4647283 5042276 5494408 5961239 6498809 7125292 7631390 8117457 8510128 8918338
4270 8918338 9236049 9590390 9894506 10248529 10689868 11311083 12089068 13151676 14297827
4261 14297827 15402742 16559590 17654847 18549539 19283824 19763727 20092178 20413334 20550368
4252 20550368 20736417 21056977 21534497 22331398 23385733 24652362 26014429 27322339 28399438
$$ packed form
4326A213654J3626k3985M3461o505k6832L4313Q3623o913J9583Q3488j9901K2374
4314A429986L8510N9109O3013l4539Q9676L3611M917O087l0924N1901M8715P0458
4302A830520K4912m88Q3754L9051L4371Q8558Q0556K0634M8182O7500J74292J33696
4290B625538K05709J19015J18840J29735J66457K23731J54049J60067J89136K36613
4280D328890L18393L94993M52132M66831N37570O26483N06098M86067L92671M08210
4270H918338L17711L54341L04116L54023M41339O21215P77985J062608J146151
4261A4297827J104915J156848J095257Q94692P34285M79903L28451L21156J37034
4252B0550368J86049L20560M77520P96901J054335J266629J362067J307910J077099
$$ plain form
4243 28399438 29324761 29930414 30177360 30173609 29932210 29453377 28900132 28481866 28162557 28050536
4233 28050536 28279924 28688887 29263394 29908877 30471373 30896632 30987278 30702393 30101939 29218501
4223 29218501 28153609 26908125 25663387 24515760 23488565 22717491 22145974 21877971 21705588
4214 21705588 21657166 21493557 21160369 20688350 19981523 18997840 17859971 16724570 15530177
4205 15530177 14383922 13399339 12500865 11798217 11271004 10841688 10506094 10204481 9928641
4196 9928641 9511552 9026218 8459371 7808152 7170897 6632327 6076080 5604825 5203293 4878019
4186 4878019 4584447 4317222 4140629 3922271 3681619 3514103 3341235 3087890 2855583 2700057
4176 2700057 2615793 2466240 2405547 2270192 2097010 2017786 1921548 1812029 1739161 1721180 1694583
$$ packed form
4243B8399438R25323O05653K46946l751k41399m78833n53245m18266l19309j12021
4233B8050536K29388M08963N74507O45483N62496M25259R0646k84885o00454q83438
4223B9218501j064892j245484j244738j147627j027195p71074n71517k68003j72383
4214B1705588m8422j63609l33188m72019p06827r83683j137869j135401j194393
4205A5530177j146255r84583q98474p02648n27213m29316l35594l01613k75840
4196I928641m17089m85334n66847o51219o37255n38570n56247m71255m01532l25274
4186D878019k93572k67225j76593k18358k40652j67516j72868k53345k32307j55526
4176B700057q4264j49553o0693j35355j73182p9224r6238j09519p2868j7981k6597
$$ plain form
4165 1694583 1547512 1469631 1500323 1476076 1428713 1384129 1329697 1308668 1335988 1269141 1170619
4154 1170619 1198206 1221632 1192202 1123750 1152461 1089494 1036437 1024496 1023031 972752 947844 935900
4142 935900 832125 899275 967961 926644 1024887 1000506 883734 908678 893640 880379 900421
4131 900421 877640 851594 891714 902934 910872 860303 856351 876351 822946 798456 842127 818471
4119 818471 797779 787624 725060 771906 772959 777160 744134 717757 663978 632805 566458 529301
4107 529301 601167 639104 593472 651083 715974 581654 610888 598609 563930 559138 545811 560296
4095 560296 524625 520516 615704 587120 565870 551166 557366 617878 628167 633421 685544 740869
4083 740869 706930 642691 630882 615007 657089 671847 734474 767074 788030 864948 922306 907299
$$ packed form
4165A694583j47071p7881L0692k4247m7363m4584n4432k1029K7320o6847r8522
4154A170619K7587K3426k9430o8452K8711o2967n3057j1941j465n0279k4908j1944
4142I35900j03775O7150O8686m1317R8243k4381j16772K4944j5038j3261K0042
4131I00421k2781k6046M0120J1220P938n0569l952K0000n3405k4490M3671k3656
4119H18471k0692j0155o2564M6846J053M201l3026k6377n3779l1173o6347l7157
4107E29301P1866L7937m5632N7611O4891j34320K9234j2279l4679m792j3327J4485
4095E60296l5671m109R5188k8584k1250j4704O200O0512J0289N254N2123N5325
4083G40869l3939o4239j1809j5875M2082J4758O2627L2600K0956P6918N7358j5007
$$ plain form
4071 907299 847892 849767 857923 898570 861447 829480 825374 885429 916578 901444 960426 997683
4059 997683 1005211 991648 995939 935601 950111 974852 1000295 952205 935692 978501 1044666 1040598
4047 1040598 952437 963592 982583 1045770 1019183 929967 966447 1032649 1018464 1006669 965589
4036 965589 927546 919420 933490 965526 883648 850513 884153 884306 866221 853113 789998 771925
4024 771925 732036 716341 804024 810825 763616 708757 729963 724927 721367 717975 757793 728653
4012 728653 710243 659670 618102 623224 648637 677361 659156 681292 638423 608009 642178 675929
4000 675929 658500 625356 601427 581400 606467 625424 647258 706766 732389 698764 712063 778980
3988 778980 799527 785051 794328 810533 743249 752307 826363 856323 913162 945471 961211 1064368
$$ packed form
4071I07299n9407J875Q156M0647l7123l1967m106O0055L1149j5134N8982L7257
4059I97683P528j3563M291o0338J4510K4741K5443m8090j6513M2809O6165m068
4047A040598q8161J1155J8991O3187k6587q9216L6480O6202j4185j1795m1080
4036I65589l8043q126J4070L2036q1878l3135L3640J53j8085j3108o3115j8073
4024G71925l9889j5695Q7683O801m7209n4859K1206n036l560l392L9818k9140
4012G28653j8410n0573m1568N122K5413K8724j8205K2136m2869l0414L4169L3751
4000F75929j7429l3144k3929k0027K5067J8957K1834N9508K5623l3625J3299O6917
3988G78980K0547j4476R277J6205o7284R058P4056K9960N6839L2309J5740J03157
$$ plain form
3976 1064368 1127087 1057208 1017626 977779 989955 972462 968833 990454 1003684 1005738 1008475 948518
3964 948518 991578 1004806 996061 989790 987783 1044772 1016674 1014366 1024471 1031711 1162558 1174670
3952 1174670 1171458 1235921 1360058 1552967 1797066 2187045 2643733 2881071 2881587 2856137 2806470
3941 2806470 2689499 2474808 2268688 2114913 1944026 1781607 1662025 1561044 1556352 1496596
3931 1496596 1499593 1468923 1479825 1494920 1492267 1518099 1536925 1516571 1531849 1565629 1518829 1576660
3919 1576660 1710512 1850327 2132477 2523816 2885590 3180764 3228955 3197195 3188754 3010452
3909 3010452 2810735 2584605 2368143 2226996 2064464 1955289 1875004 1771026 1752071 1680927
3899 1680927 1620475 1611244 1556298 1518548 1530293 1569558 1529430 1455596 1481454 1497741 1448425 1426960
$$ packed form
3976A064368O2719o9879l9582l9847J2176j7493l629K1621J3230K054K737n9957
3964I48518M3060J3228q745o271k007N6989k8098k308J0105P240J30847J2112
3952A174670l212O4463J24137J92909K44099L89979M56688K37338N16k5450m9667
3941B806470j16971k14691k06120j53775j70887j62419j19582j00981m692n9756
3931A496596K997l0670J0902J5095k653K5832J8826k0354J5278L3780m6800N7831
3919A576660J33852J39815K82150L91339L61774K95174M8191l1760q441j78302
3909C010452j99717k26130k16462j41147j62532j09175q0285j03978j8955p1144
3899A680927o0452r231n4946l7750J1745L9265m0128p3834K5858J6287m9316k1465
$$ plain form
3887 1426960 1395033 1370387 1341219 1379182 1405864 1428679 1480146 1508126 1457877 1478158 1511225
3876 1511225 1503703 1520641 1514241 1551586 1542492 1518622 1580901 1622575 1599892 1644634 1619774 1586899
3864 1586899 1662854 1734859 1682906 1762516 1804001 1828224 1877046 1887316 1949689 1969157 1960943 2046354
3852 2046354 2092942 2107171 2162894 2193548 2218650 2309038 2370266 2381440 2438914 2527778 2647578
3841 2647578 2728600 2754319 2825849 2907945 2948925 3005294 3047345 3073913 3111077 3106643 3188676 3256338
3829 3256338 3288259 3326374 3404187 3517754 3544846 3578632 3626026 3726944 3862178 3954346 4041125
3818 4041125 4165653 4333068 4509908 4688814 4867114 5064947 5324130 5537240 5859520 6208439
3808 6208439 6596141 7032719 7523355 8113690 8850389 9691227 10695051 11954321 13349926
$$ packed form
3887A426960l1927k4646k9168L7963K6682K2815N1467K7980n0249K0281L3067
3876A511225p522J6938o400L7345r094k3870O2279M1674k2683M4742k4860l2875
3864A586899P5955P2005n1953P9610M1485K4223M8822J0270O2373J9468q214Q5411
3852B046354M6588J4229N5723L0654K5102R0388O1228J1174N7474Q8864J19800
3841B647578Q1022K5719P1530Q2096M0980N6369M2051K6568L7164m434Q2033O7662
3829C256338L1921L8115P7813J13567K7092L3786M7394J00918J35234R2168Q6779
3818D041125J24528J67415J76840J78906J78300J97833K59183K13110L22280L48919
3808F208439L87702M36578M90636N90335P36699Q40838J003824J259270J395605
$$ plain form
3799 13349926 15114596 17241474 19640366 22465128 25653648 29081020 32693357 36369945
3791 36369945 39844617 43072456 45954046 48392234 50281175 51524595 52196610 52514416
3783 52514416 52589547 52442850 52134203 51924810 51883538 51890635 51998727 52268054 52484093 52444731
3773 52444731 52165109 51433262 50137084 48544832 46339150 43734682 40788124 37624499
3765 37624499 34470300 31232669 28054344 25089238 22408532 20117038 18031996 16296528
3757 16296528 14789744 13469462 12373715 11369347 10566027 9927304 9364489 8834074 8441498
3748 8441498 8053343 7748916 7462379 7211160 6911171 6677219 6508607 6335631 6189364 6032809
3738 6032809 5948092 5880124 5744968 5683245 5616715 5559174 5378261 5219449 5157233 5088721 4989274
$$ packed form
3799A3349926J764670K126878K398892K824762L188520L427372L612337L676588
3791C6369945L474672L227839K881590K438188J888941J243420O72015L17806
3783E2514416P5131j46697l08647k09393m1272P097J08092K69327K16039l9362
3773E2444731k79622p31847j296178j592252k205682k604468k946558l163625
3765C7624499l154199l237631l178325k965106k680706k291494k085042j735468
3757A6296528j506784j320282j095747j004368q03320o38723n62815n30415l92576
3748H441498l88155l04427k86537k51219k99989k33952j68612j72976j46267j56555
3738F032809q4717o7968j35156o1723o6530n7541j80913j58812o2216o8512r9447
$$ plain form
3727 4989274 4893265 4786982 4693339 4624207 4612515 4576811 4491006 4452793 4456896 4430191 4384139
3716 4384139 4382623 4337958 4224889 4206650 4236422 4121418 4119341 4067754 3964607 3927917 3890787
3705 3890787 3910900 3934221 3915625 3896654 3915951 3955972 3973548 3985117 4062405 4115525 4160068
3694 4160068 4125623 4146716 4147527 4155371 4162145 4158321 4189432 4180983 4133787 4159985 4142952 4144405 4275076
3681 4275076 4326969 4430729 4472994 4487961 4573674 4671329 4738905 4733996 4814001 4905449 5030811
3670 5030811 5192135 5280690 5350181 5423987 5646112 5875787 6033003 6153171 6338271 6600636
3660 6600636 6883497 7197493 7547837 7989163 8503344 9099344 9808413 10550006 11444331 12488387
3650 12488387 13611926 14914275 16343776 17844405 19402728 20928168 22374329 23620227
$$ packed form
3727D989274r6009j06283r3643o9132j1692l5704q5805l8213M103k6705m6052
3716D384139j516m4665j13069j8239K9772j15004k077n1587j03147l6690l7130
3705C890787K0113K3321j8596j8971J9297M0021J7576J1569P7288N3120M4543
3694D160068l4445K1093Q11P844O774l824L1111q449m7196K6198j7033J453J30671
3681D275076N1893J03760M2265J4967Q5713R7655O7576m909Q0005R1448J25362
3670E030811J61324Q8555O9491P3806K22125K29675J57216J20168J85100K62365
3660F600636K82861L13996L50344M41326N14181N96000P09069P41593Q94325J044056
3650A2488387J123539J302349J429501J500629J558323J525440J446161J245898
$$ plain form
3642 23620227 24716638 25503566 26007368 26348238 26438985 26380099 26205711 26099787 26056706 26253018
3632 26253018 26878763 27958429 29506674 31648390 34170117 37004459 39988039 42883639
3624 42883639 45572722 47846333 49752857 51125902 51811030 52021269 51859308 51582923 51330131
3615 51330131 51202075 51435585 52102326 53073156 54314234 55471656 56410013 57132875 57401938
3606 57401938 57163502 56513513 55506266 54233995 53001035 51990363 51270883 51045585 51502431
3597 51502431 52660915 54558959 56987715 59837803 62853878 65974040 68874922 71261309
3589 71261309 73000519 74026926 74147313 73423090 71757456 69378749 66269581 62610931
3581 62610931 58736874 54702864 50660355 46757174 43092171 39804581 36867642 34357431
$$ packed form
3642B3620227J096411P86928N03802L40870R0747n8886j74388j05924m3081J96312
3632B6253018O25745J079666J548245K141716K521727K834342K983580K895600
3624D2883639K689083K273611J906524J373045O85128K10239j61961k76385k52792
3615E1330131j28056K33510O66741R70830J241078J157422R38357P22862K69063
3606E7401938k38436o49989j007247j272271j232960j010672p19480k25298M56846
3597E1502431J158484J898044K428756K850088L016075L120162K900882K386387
3589G1261309J739210J026407J20387p24223j665634k378707l109168l658650
3581F2610931l874057m034010m042509l903181l665003l287590k936939k510211
$$ plain form
3573 34357431 32254389 30499681 29239223 28321097 27787554 27655498 27855986 28447573 29398360
3564 29398360 30652159 32283784 34315731 36680250 39328274 42126411 45117946 48305869
3556 48305869 51431641 54454336 57248841 59766283 61826874 63440037 64375120 64681838
3548 64681838 64444006 63477456 62059659 60084180 57620913 54943394 52068732 49020010
3540 49020010 46025641 43185125 40457491 37971171 35777858 33914012 32289799 30877384
3532 30877384 29659309 28763722 27964390 27206155 26569035 25995708 25466057 24968638 24528785
3523 24528785 24261024 24024567 23814601 23713645 23647347 23617965 23721371 23873162 24014951 24153368
3513 24153368 24217035 24436452 24621399 24807903 25139398 25529735 26011670 26638731 27415533 28291904
$$ packed form
3573C4357431k103042j754708j260458r18126n33543j32056K00488N91587R50787
3564B9398360J253799J631625K031947K364519K648024K798137K991535L187923
3556D8305869L125772L022695K794505K517442K060591J613163R35083L06718
3548F4681838k37832r66550j417797j975479k463267k677519k874662l048722
3540D9020010k994369k840516k727634k486320k193313j863846j624213j412415
3532C0877384j218075q95587p99332p58235o37120n73327n29651m97419m39853
3523B4528785k67761k36457k09966j00956o6298k9382J03406J51791J41789J38417
3513B4153368O3667K19417J84947J86504L31495L90337M81935O27061P76802Q76371
$$ plain form
3503 28291904 29338465 30489836 31770345 33097321 34421898 35722580 37031687 38327169
3495 38327169 39627932 40926726 42252970 43700399 45127572 46653603 48384399 50233390
3487 50233390 52343543 54773473 57575231 60902711 64754511 69277741 74574334 80575206
3479 80575206 87302143 94607596 102341010 110346181 118416440 126382557 133940665 141002483
3471 141002483 147622055 153676371 159207270 164367160 169218464 173801803 178135146 182135374
3463 182135374 185728846 188733786 190932201 192180204 192331596 191344367 189195166 185876937
3455 185876937 181575359 176467913 170508167 163972133 157053092 149931827 142673391 135440735
3447 135440735 128220801 121179495 114490247 108165006 102512875 97418679 93045710 89584605
$$ packed form
3503B8291904J046561J151371J280509J326976J324577J300682J309107J295482
3495C8327169J300763J298794J326244J447429J427173J526031J730796J848991
3487E0233390K110153K429930K801758L327480L851800M523230N296593O000872
3479H0575206O726937P305453P733414Q005171Q070259P966117P558108P061818
3471A41002483O619572O054316N530899N159890M851304M583339M333343M000228
3463A82135374L593472L004940K198415J248003J51392r87229k149201l318229
3455A85876937m301578n107446n959746o536034o919041p121265p258436p232656
3447A35440735p219934p041306o689248o325241n652131n094196m372969l461105
$$ plain form
3439 89584605 87035042 85487866 84914888 85220068 86195713 87640917 89342070 91012524 92402017
3430 92402017 93415296 93935690 93916118 93376270 92441691 91100119 89626929 87933299 86380800
3421 86380800 85081789 83986538 83223230 82661160 82464911 82402954 82277704 82009090 81526762
3412 81526762 80715699 79444840 77601438 75294967 72368834 69071436 65491345 61731813
3404 61731813 57932302 54115210 50387014 46887497 43664476 40615781 37864069 35299000
3396 35299000 33028960 30945477 29070835 27352295 25756190 24369976 23066034 21905254
3388 21905254 20795161 19838556 18965799 18100660 17275600 16577282 15911448 15382174 14974942
3379 14974942 14545983 14180603 13876065 13683435 13554074 13500751 13588818 13780439 14033251 14326682
$$ packed form
3439H9584605k549563j547176n72978L05180R75645J445204J701153J670454J389493
3430I2402017J013279N20394j9572n39848r34579j341572j473190j693630j552499
3421H6380800j299011j095251p63308n62070j96249o1957j25250k68614m82328
3412H1526762q11063j270859j843402k306471k926133l297398l580091l759532
3404F1731813l799511l817092l728196l499517l223021l048695k751712k565069
3396C5299000k270040k083483j874642j718540j596105j386214j303942j160780
3388B1905254j110093r56605q72757q65139q25060o98318o65834n29274m07232
3379A4974942m28959l65380l04538j92630j29361n3323Q8067J91621K52812K93431
$$ plain form
3369 14326682 14721568 15279668 15848024 16511870 17240176 17980525 18765403 19465249 20137031
3360 20137031 20739495 21162856 21335366 21311065 21136586 20846649 20358802 19732122 19152016 18561833
3350 18561833 17885219 17134614 16361179 15510607 14735740 14058520 13452862 12892355 12329834
3341 12329834 11867865 11486038 11204857 10971679 10802937 10807013 10822926 10948822 11157063 11293711
3331 11293711 11423718 11719878 12055758 12328180 12705196 13139439 13650992 14275290 14941519
3322 14941519 15639803 16594409 17674719 18924350 20512388 22452543 24829054 27681539
3314 27681539 31131514 35319796 40424366 46345175 53117598 60581215 68844423 77580290
3306 77580290 86617949 95813043 104891961 113457024 121212041 127631908 132425093 135385953
$$ packed form
3369A4326682L94886N58100N68356O63846P28306P40349P84878O99846O71782
3360B0137031O02464M23361J72510k4301j74479k89937m87847o26680n80106n90183
3350A8561833o76614p50605p73435q50572p74867o77220o05658n60507n62521
3341A2329834m61969l81827k81181k33178j68742M076J5913J25896K08241J36648
3331A1293711J30007K96160L35880K72422L77016M34243N11553O24298O66229
3322A4941519O98284R54606J080310J249631J588038J940155K376511K852485
3314B7681539L449975M188282N104570N920809O772423P463617Q263208Q735867
3306G7580290R037659R195094R078918Q565063P755017O419867M793185K960860
$$ plain form
3298 135385953 136286748 135197031 132115309 127299503 120895794 113250070 104777215 95813574
3290 95813574 86711042 77877849 69377094 61444153 54211089 47868529 42162906 37218286
3282 37218286 32943896 29255560 26137946 23513501 21232270 19351264 17691755 16261703
3274 16261703 15106801 14006308 13060136 12345867 11751053 11242451 10772526 10348268 9976904
3265 9976904 9623901 9337770 9102828 8773164 8554798 8467016 8356069 8190389 7985746 7915074
3255 7915074 7760608 7662121 7655561 7654011 7647847 7647394 7554159 7616693 7754487 7837516 7960876 7957869
3243 7957869 7991813 8024193 8018529 7947359 7849666 7799742 7615858 7476938 7274156 7045511 6822666
3232 6822666 6570254 6312087 6085534 5930186 5730699 5539647 5447068 5340830 5238169 5129693
$$ packed form
3298A35385953R00795j089717l081722m815806o403709p645724q472855q963641
3290I5813574r102532q833193q500755p932941p233064o342560n705623m944620
3282C7218286m274390l688336l117614k624445k281231j881006j659509j430052
3274A6261703j154902j100493r46172p14269n94814n08602m69925m24258l71364
3265I976904l53003k86131k34942l29664k18366q7782j10947j65680k04643p0672
3255G915074j54466r8487o560j550o164m53r3235O2534J37794Q3029J23360l007
3243G957869L3944L2380n664p1170r7693m9924j83884j38920k02782k28645k22845
3232F822666k52412k58167k26553j55348j99487j91052r2579j06238j02661j08476
$$ plain form
3222 5129693 5015012 4852093 4816945 4755533 4716913 4665565 4603558 4650381 4747144 4752260 4786384
3211 4786384 4777232 4740661 4707728 4720065 4807378 4841689 4925695 4950168 4978343 4975881 5029425 5099328
3199 5099328 5102316 5086283 5058949 5116679 5186048 5165601 5255498 5321792 5334293 5332016 5373686 5397418
3187 5397418 5457604 5441387 5420661 5485133 5504562 5478961 5518141 5551241 5530413 5506438 5515200 5539240
3175 5539240 5649686 5718139 5687953 5786794 5905334 6013528 6038169 6127954 6196083 6272306 6364403
3164 6364403 6363502 6523152 6674122 6742532 6898035 7097375 7217815 7383396 7477397 7609295
3154 7609295 7812373 8034521 8314538 8542962 8779557 9074028 9355834 9620650 9853694 9978772
3144 9978772 10093913 10284744 10422651 10501689 10586148 10678235 10720858 10862146 11097429 11245825
$$ packed form
3222E129693j14681j62919l5148o1412l8620n1348o2007M6823R6763N116L4124
3211D786384r152l6571l2933J2337Q7313L4311Q4006K4473K8175k462N3544O9903
3199E099328K988j6033k7334N7730O9369k0447Q9897O6294J2501k277M1670K3732
3187E397418O0186j6217k0726O4472J9429k5601L9180L3100k0828k3975Q762K4040
3175E539240J10446O8453l0186R8841J18540J08194K4641Q9785O8129P6223R2097
3164F364403r01J59650J50970O8410J55503J99340J20440J65581R4001J31898
3154G609295K03078K22148K80017K28424K36595K94471K81806K64816K33044J25078
3144I978772J15141J90831J37907P9038Q4459R2087M2623J41288K35283J48396
$$ plain form
3134 11245825 11507256 11670476 11836077 12131366 12363911 12586540 12797101 13078996 13448774
3125 13448774 13925268 14475914 15291972 16288302 17258768 18089920 18718360 19202793 19541486
3116 19541486 19795853 19919573 20014130 20126966 20268738 20535419 20837995 21260583 21934341 22651354
3106 22651354 23375908 24232545 25209749 26287730 27516918 28766331 30124423 31658497 33431873
3097 33431873 35501984 37871665 40660429 44122784 48255211 53209901 59031188 65676029
3089 65676029 73358943 82369793 93308763 107261151 125831396 151056615 184671050
3082 184671050 226587513 272927798 316902054 351395672 373174569 383055062 383931128
3075 383931128 379498727 375064907 375972927 383774250 395012062 402760233 401636488 390768158
$$ packed form
3134A1245825K61431J63220J65601K95289K32545K22629K10561K81895L69778
3125A3448774M76494N50646Q16058R96330R70466Q31152O28440M84433L38693
3116A9541486K54367J23720R4557J12836J41772K66681L02576M22588O73758P17013
3106B2651354P24554Q56637R77204J077981J229188J249413J358092J534074J773376
3097C3431873K070111K369681K788764L462355M132427M954690N821287O644841
3089F5676029P682914R010850J0938970J3952388J8570245K5225219L3614435
3082A84671050M1916463M6340285M3974256L4493618K1778897R880493Q76066
3075C83931128m432401m433820R08020P801323J1237812P748171j123745j0868330
$$ plain form
3067 390768158 371977610 346381951 315136641 280904335 246240530 212887448 181878847
3060 181878847 154138817 130714314 111929198 97286848 85686806 76318618 68473432
3053 68473432 61841724 55971820 50768740 46200901 42268239 38796830 35880759 33391617
3045 33391617 31293906 29509285 27936967 26573069 25289324 24186368 23164795 22236574
3037 22236574 21372703 20584977 19928433 19308673 18739981 18141341 17554421 16982352 16383779
3028 16383779 15840121 15444007 15065675 14673112 14312746 13977760 13613195 13201140 12857172
3019 12857172 12554819 12242198 11973221 11649518 11279985 10908466 10692632 10366725 10138675
3010 10138675 9848354 9479070 9129963 8804892 8577735 8343398 8091542 7800940 7560894
$$ packed form
3067C90768158j8790548k5595659l1245310l4232306l4663805l3353082l1008601
3060A81878847k7740030k3424503j8785116j4642350j1600042r368188p845186
3053F8473432o631708n869904n203080m567839l932662l471409k916071k489142
3045C3391617k097711j784621j572318j363898j283745j102956j021573r28221
3037B2236574q63871p87726o56544o19760n68692n98640n86920n72069n98573
3028A6383779n43658l96114l78332l92563l60366l34986l64565m12055l43968
3019A2857172l02353l12621k68977l23703l69533l71519k15834l25907k28050
3010A0138675k90321l69284l49107l25071k27157k34337k51856k90602k40046
$$ plain form
3001 7560894 7334701 7117838 6833448 6654433 6399913 6248688 6053165 5951917 5811774 5724299
2991 5724299 5630554 5429507 5286937 5157846 5022553 4988387 4875210 4756643 4683792 4564335
2981 4564335 4491240 4449252 4330434 4209940 4160165 4137999 4027718 3951897 3883132 3880920 3816768
2970 3816768 3742878 3720258 3627873 3493508 3339130 3198690 3140601 3023090 2941859 2813523
2960 2813523 2691455 2713148 2688235 2543936 2400185 2351548 2252625 2224816 2175714 2082863 2043378
2949 2043378 1946219 1838227 1847643 1791118 1733471 1668421 1641686 1607424 1552318 1507493 1578763
2938 1578763 1573703 1526759 1463486 1388276 1413137 1340914 1305116 1305836 1284749 1284514 1236588 1291255
2926 1291255 1287598 1245033 1203087 1174673 1160253 1210444 1189468 1213507 1185237 1151104 1085758 994134
$$ packed form
3001G560894k26193k16863k84390j79015k54520j51225j95523j01248j40143q7475
2991E724299r3745k01047j42570j29091j35293l4166j13177j18567p2851j19457
2981D564335p3095m1988j18818j20494m9775k2166j10281p5821o8765k212o4152
2970C816768p3890k2620r2385j34365j54378j40440n8089j17511q1231j28336
2960B813523j22068K1693k4913j44299j43751m8637r8923k7809m9102r2851l9485
2949B043378r7159j07992R416n6525n7647o5050k6735l4262n5106m4825P1270
2938A578763n060m6944o3273p5210K4861p2223l5798P20k1087k35m7926N4667
2926A291255l657m2565m1946k8414j4420N0191k0976K4039k8270l4133o5346r1624
$$ plain form
2914 994134 977425 962445 993981 941448 907903 778805 772080 771645 765649 760940 758867 696625 620705
2901 620705 623233 702479 758344 697359 612296 598390 675110 706936 761830 727412 753490 744375
2889 744375 715393 708419 657128 617146 665599 694791 687074 697081 704769 757601 733272 778261
2877 778261 820816 748802 793756 770181 735004 742026 764316 806313 805865 772570 794992 791540
2865 791540 781892 805278 792884 747998 794978 759750 730670 751121 748544 687512 744136 803953
2853 803953 757394 775887 739533 705768 728469 806973 811702 786585 773949 776344 784968 862696
2841 862696 785316 797267 841210 824148 785671 735342 741318 735205 780733 769682 666525 618185
2829 618185 697187 680600 552769 513755 544074 547161 508267 540462 578806 508248 530656 516904
$$ packed form
2914I94134j6709j4980L1536n2533l3545j29098o725m35n996m709k073o2242p5920
2901F20705K528P9246N5865o0985q5063j3906P6720L1826N4894l4418K6078r115
2889G44375k8982o974n1291l9982M8453K9192p717J0007P688N2832k4329M4989
2877G78261M2555p2014M4954k3575l5177P022K2290M1997m48l3295K2422l452
2865G91540r648K3386j2394m4886M6980l5228k9080K0451k577o1032N6624N9817
2853H03953m6559J8493l6354l3765K2701P8504M729k5117j2636K395Q624P7728
2841H62696p7380J1951M3943j7062l8477n0329N976o113M5528j1051j03157m8340
2829F18185P9002j6587j27831l9014L0319L087l8894L2195L8344p0558K2408j3752
$$ plain form
2817 516904 510138 491479 537418 595886 556739 559612 583303 683541 744311 788016 783619 855839
2805 855839 810214 824466 932967 1066708 1176357 1283684 1472941 1667947 1911513 2031107
2795 2031107 2137183 2236239 2232941 2253566 2304752 2308123 2303117 2328353 2303920 2315777 2275949 2224998
2783 2224998 2012178 1911318 1779421 1549603 1307093 1199751 1088090 967064 879987 727749
2773 727749 692014 680151 680841 654696 578169 496946 467087 398732 324438 347784 322185 252938
2761 252938 267679 255578 258338 274923 246985 221712 250496 257441 234125 179294 250127 329894
2749 329894 360296 316117 260415 215365 205177 205171 222117 289280 328921 387393 337040 294046
2737 294046 350316 395244 386780 387191 317137 270314 310319 319048 321798 294556 311175 253224 232091
$$ packed form
2817E16904o766j8659M5939N8468l9147K873K3691J00238O0770M3705m397P2220
2805H55839m5625J4252J08501J33741J09649J07327J89257J95006K43566J19594
2795B031107J06076R9056l298K0625N1186L371n006K5236k4433J1857l9828n0951
2783B224998k12820j00860j31897k29818k42510j07342j11661j21026q7077j52238
2773G27749l5735j1863O90k6145p6527q1223k9859o8355p4294K3346k5599o9247
2761B52938J4741j2101K760J6585k7938k5273K8784O945k3316n4831P0833P9767
2749C29894L0402m4179n5702m5050j0188oJ6946O7163L9641N8472n0353m2994
2737B94046N6270M4928q464M11p0054m6823M0005Q729K750k7242J6619n7951k1133
$$ plain form
2724 232091 182502 184302 122284 90348 135262 98917 111827 130490 153479 113564 107651 133372
2712 133372 167424 164057 139905 105612 53522 90488 102102 166645 125903 115834 144111 177664
2700 177664 235631 250065 271176 233075 246411 270627 267515 246055 243992 316741 265147 231869
2688 231869 217643 216370 230644 185482 149745 117981 181300 245312 225200 221615 240073 307204
2676 307204 292492 291440 322455 360882 294231 265145 345331 378900 337775 277893 321222 353306
2664 353306 335668 321796 237289 254544 323251 308413 321602 346813 338761 289138 299459 329580
2652 329580 344443 257619 213182 228335 237374 230129 193379 233643 265842 225460 223723 230695
2640 230695 193651 159746 192626 202038 196778 180461 205365 199034 244845 226453 110875 106540
$$ packed form
2724B32091m9589J800o2018l1936M4914l6345J2910J8663K2989l9915n913K5721
2712A33372L4052l367k4152l4293n2090L6966J1614O4543m0742j0069K8277L3553
2700A77664N7967J4434K1111l8101J3336K4216l112k1460k063P2749n1594l3278
2688B31869j4226j273J4274m5162l5737l1764O3319O4012k0112l585J8458O7131
2676C07204j4712j052L1015L8427o6651k9086Q0186L3569m1125n9882M3329L2084
2664C53306j7638j3872q4507J7255O8707j4838J3189K5211q052m9623J0321L0121
2652C29580J4863q6824m4437J5153R039p245l6750M0264L2199m0382j737O972
2640B30695l7044l3905L2880R412n260j6317K4904o331M5811j8392j15578m335
$$ plain form
2628 106540 86468 88793 115221 110307 113917 61695 72904 116924 136562 89190 114109 173575
2616 173575 129760 135190 165682 151661 99183 91467 45111 62875 69487 71273 60907 39907
2604 39907 67695 37861 23252 20771 -10775 44510 59564 -28001 -37279 -29065 -27106 -51164 -29266
2591 -29266 6165 75745 62011 45973 55833 115215 110730 212282 308448 350024 329958 284473
2579 284473 271116 256703 293393 238362 211604 183819 193238 207834 136898 114410 169494 175366
2567 175366 133474 116310 161234 169964 158706 128965 87870 127644 169296 157131 95450 105536
2555 105536 125421 179220 115235 97077 77349 163575 176697 174988 127820 66828 9042 -42855
2543 -42855 13576 40523 73249 71133 105291 66703 -6958 -37002 -7030 -22275 -38823 -47063
$$ packed form
2628A06540k0072K325K6428m914L610n2222J1209M4020J9638m7372K4919N9466
2616A73575m3815N430L0492j4021n2478p716m6356J7764O612J786j0366k1000
2604C9907K7788k9834j4609k481l1546N5285J5054q7565r278Q214J959k4058K1898
2591b9266L5431O9580j3734j6038R860N9382m485J01552R6166M1576k0066m5485
2579B84473j3357j4413L6690n5031k6758k7785R419J4596p0936k2488N5084N872
2567A75366m1892j7164M4924Q730j1258k9741m1095L9774M1652j2165o1681J0086
2555A05536J9885N3799o3985j8158j9728Q6226J3122j709m7168o0992n7786n1897
2543d2855N6431K6947L2726k116L4158l8588p3661l0044K9972j5245j6548q240
$$ plain form
2531 -47063 -41618 2396 35433 13021 16753 30599 36914 16109 72544 124606 132235 84397 55673
2518 55673 16326 55720 75412 108038 141935 90693 49216 -2410 76820 92187 50469 105909
2506 105909 100091 75510 122898 168013 138098 129340 127153 152092 124584 121375 116231 192632 208783
2493 208783 202294 162817 116371 104724 168569 155977 143085 204076 200270 186284 189108 206177
2481 206177 172920 192690 221111 189427 155302 115575 140544 85122 122312 148546 145348 120816
2469 120816 143998 103407 132814 150371 146613 98845 165838 198166 224007 213896 132110 167385
2457 167385 182652 229804 241800 285328 240929 187636 230740 263276 266026 288172 269167 292475
2445 292475 229442 174666 170059 261934 253207 220001 190973 257267 274028 257459 260194 290299
$$ packed form
2531d7063N445M4014L3037k2412L732J3846O315k0805N6435N2062P629m7838k8724
2518E5673l9347L9394J9692L2626L3897n1242m1477n1626P9230J5367m1718N5440
2506A05909n818k4581M7388M5115k9915q758k187K4939k7508l209n144P6401J6151
2493B08783o489l9477m6446j1647O3845j2592j2892O0991l806j3986K824J7069
2481B06177l3257J9770K8421l1684l4125l9727K4969n5422L7190K6234l198k4532
2469A20816K3182m0591K9407J7557l758m7768O6993L2328K5841j0111q1786L5275
2457A67385J5267M7152J1996M3528m4399n3293M3104L2536K750K2146j9005K3308
2445B92475o3033n4776m607R1875q727l3206k9028O6294J6761j6569K735L0105
$$ plain form
2433 290299 349930 299649 243937 240472 191088 258892 278796 335812 321344 298760 300514 263840
2421 263840 318314 305445 313079 289309 232735 245281 284402 285670 304993 328414 346499 350567
2409 350567 323354 339434 313745 307850 317997 308163 273203 299900 316908 361945 356691 363828
2397 363828 370423 349168 338711 326790 302608 293610 319556 312429 300584 357917 429008 448173
2385 448173 448147 459699 501034 489204 518659 508886 441368 494421 521868 505180 508620 520248 501555
2372 501555 527547 539185 519011 555370 504221 559897 637778 619215 681065 728566 754727 794278
2360 794278 802692 741368 806275 888280 957382 1042597 1038708 1031160 1125674 1219108 1258941 1265742
2348 1265742 1347047 1383314 1434576 1511847 1587580 1689880 1793057 1895361 2043289 2192418
$$ packed form
2433B90299N9631n0281n5712l465m9384O7804J9904N7016j4468k2584J754l6674
2421B63840N4474j2869P634k3770n6574J2546L9121J268J9323K3421J8085M068
2409C50567k7213J6080k5689n895J0147r834l4960K6697J7008M5037n254P137
2397C63828O595k1255j0457j1921k4182q998K5946p127j1845N7333P1091J9165
2385D48173k6J1552M1335j1830K9455r773o7518N3053K7447j6688L440J1628j8693
2372E01555K5992J1638k0174L6359n1149N5676P7881j8563O1850M7501K6161L9551
2360G94278Q414o1324O4907Q2005O9102Q5215l889p548R4514R3434L9833O801
2348A265742Q1305L6267N1262P7271P5733J02300J03177J02304J47928J49129
$$ plain form
2338 2192418 2309474 2414083 2592240 2782520 3155172 3616552 4112896 4557105 4929985 5304367
2328 5304367 5860756 6400765 6959109 7714100 8726922 10045062 11912366 14836007 20405335
2319 20405335 30311762 43549827 57501626 66931011 69399951 68234532 66136497 60181391
2311 60181391 52313522 44708692 37348559 30610692 24241083 18864264 15070575 12840972
2303 12840972 11455334 10469742 9687277 8939260 8154890 7477619 6739997 5969382 5345573
2294 5345573 4854359 4397666 3952957 3651627 3355540 3118494 2979126 2791772 2660263 2470397
2284 2470397 2438871 2360437 2283431 2224678 2137270 2013289 1995100 1971826 1905709 1883922 1833135
2273 1833135 1769871 1689474 1617138 1620948 1631181 1569556 1460401 1441931 1416454 1347566 1314817
$$ packed form
2338B192418J17056J04609J78157J90280L72652M61380M96344M44209L72880L74382
2328E304367N56389N40009N58344P54991J012822J318140J867304K923641N569328
2319B0405335R906427J3238065J3951799R429385K468940j165419k098035n955106
2311F0181391p867869p604830p360133o737867o369609n376819l793689k229603
2303A2840972j385638r85592p82465p48017p84370o77271p37622p70615o23809
2294E345573m91214m56693m44709l01330k96087k37046j39368j87354j31509j89866
2284B470397l1526p8434p7006n8753q7408j23981j8189k3274o6117k1787n0787
2273A833135o3264q0397p2336L810J0233o1625j09155j8470k5477o8888l2749
$$ plain form
2262 1314817 1296310 1259901 1280588 1252984 1220382 1107401 1125950 1076402 1044705 980108 938301
2251 938301 841596 818491 744286 748826 803102 781146 745259 715979 703562 692782 716409 678210
2239 678210 644961 628453 624121 609323 562318 542914 606007 589554 589297 571887 553997 450701
2227 450701 431914 425807 431861 440731 493521 463055 510016 492995 470448 482902 492848 455349
2215 455349 432174 451132 446787 413815 361551 436584 359397 320829 399011 377622 356473 285667
2203 285667 221830 224908 207288 207939 228833 251810 246138 228468 251571 256166 233770 249424 322822
2190 322822 234945 162967 233541 184294 127215 139041 167743 209138 247725 143808 114382
2179 114382 176257 171507 221424 195166 144914 176047 186048 118945 103921 61798 26809 76812
$$ packed form
2262A314817j8507l6409K0687k7604l2602j12981J8549m9548l1697o4597m1807
2251I38301r6705k3105p4205M540N4276k1956l5887k9280j2417j0780K3627l8199
2239F78210l3249j6508m332j4798m7005j9404O3093j6453k57j7410j7890j03296
2227D50701j8787o107O054Q870N2790l0466M6961j7021k2547J2454R946l7499
2215D55349k3175J8958m345l2972n2264P5033p7187l8568P8182k1389k1149p0806
2203B85667o3837L078j7620O51K0894K2977n672j7670K3103M595k2396J5654P3398
2190C22822q7877p1978P0574m9247n7079J1826K8702M1395L8587j03917k9426
2179A14382O1875m750M9917k6258n0252L1133J0001o7103j5024m2123l4989N0003
$$ plain form
2167 76812 71709 128118 151008 185354 221760 202188 257397 226684 192669 163611 174850 197799
2155 197799 130588 104404 70277 53508 71085 138337 116259 178492 173791 102558 61103 101989
2143 101989 95647 55149 76274 103976 72628 35411 51157 -6442 16340 79510 61525 36442
2131 36442 52308 103603 105660 119084 51915 30795 22219 78200 110626 126980 182247 152791
2119 152791 124996 134356 149621 78892 81283 141630 148061 136522 129940 132766 98439 48255 126263
2106 126263 108052 99536 122694 161734 163472 113310 98734 91293 57347 68353 91593 50337
2094 50337 67348 116085 128697 125399 129559 124158 91305 129560 144993 103370 83963 113719
2082 113719 114942 105664 88068 49894 101119 154957 174004 127954 91511 72131 75576 78470
$$ packed form
2167G6812n103N6409K2890L4346L6406j9572N5209l0713l4015k9058J1239K2949
2155A97799o7211k6184l4127j6769J7577O7252k2078O2233m701p1233m1455M0886
2143A01989o342m0498K1125K7702l1348l7217J5746n7599K2782O3170j7985k5083
2131C6442J5866N1295K057J3424o7169k1120q576N5981L2426J6354N5267k9456
2119A52791k7795R360J5265p0729K391O0347O431j1539o582K826l4327n0184P8008
2106A26263j8211q516K3158L9040J738n0162j4576p441l3946J1006K3240m1256
2094E0337J7011M8737J2612l298M160n401l2853L8255J5433m1623j9407K9756
2082A13719J223r278j7596l8174N1225N3838J9047m6050l6443j9380L445K894
$$ plain form
2070 78470 97246 83318 92030 31991 7626 -15946 16250 69733 88570 72233 96853 96616
2058 96616 38322 62098 77897 74972 19724 102787 117384 120989 198319 303166 339755 356140
2046 356140 371986 414771 435210 423504 344558 269108 206376 149886 149216 144356 19170 51140
2034 51140 86885 86288 121178 145046 92972 71397 18134 41317 75173 68442 14414 -42006
2022 -42006 9102 69036 121304 136505 112839 97471 45702 -11460 49800 59345 61525 142581
2010 142581 96162 69904 84661 103314 125478 78499 34753 -403 66558 109998 101352 56351
1998 56351 46350 -5423 -4984 -16991 51327 130307 109753 31570 -31522 -8926 27663 69150
1986 69150 46705 -12031 -1850 66879 41651 7999 -19721 -15999 -14767 -47412 -42187 -14016
$$ packed form
2070G8470J8776j3928Q712o0039k4365k3572L2196N3483J8837j6337K4620k37
2058I6616n8294K3776J5799k925n5248Q3063J4597L605P7330J04847L6589J6385
2046C56140J5846M2785K0439j1706p8946p5450o2732n6490o70m860j25186L1970
2034E1140L5745n97L4890K3868n2074k1575n3263K3183L3856o731n4028n6420
2022d2006N1108N9934N2268J5201k3666j5368n1769n7162O1260R545K180Q1056
2010A42581m6419k6258J4757J8653K2164m6979m3746l5156O6961M3440q646m5001
1998E6351j0001n1773M39j2007O8318P8980k0554p8183o3092K2596L6589M1487
1986F9150k2445n8736J0181O8729k5228l3652k7720L722J232l2645N225K8171
$$ plain form
1974 -14016 -6521 -1856 58847 85550 52726 24978 46434 88051 80038 34225 47749 53271 53776
1961 53776 -14257 -21259 18335 9399 33239 127891 89560 62744 55922 -1118 9253 17154 -39620
1948 -39620 26715 67555 96665 74433 64559 80223 126503 44087 4688 45743 59795 24982
1936 24982 77092 121383 63974 54392 94501 76020 4024 -14260 -24012 13440 14311 -28973 32536
1923 32536 32452 9980 -2471 -42730 25883 40657 63266 90388 21888 -40519 -18937 -30202
1911 -30202 -57618 -55250 63188 72476 33410 45507 2724 70914 82181 49000 101717 90289
1899 90289 1186 -53807 -12407 33523 -6977 9014 100155 80254 72072 45443 75364 61910
1887 61910 -15525 4285 -9863 60351 85269 55297 84675 49664 26878 -3417 -16390 -13763
$$ packed form
1974a4016P495M665O0703K6703l2824k7748K1456M1617q013m5813J3524N522N05
1961E3776o8033p002L9594q936K3840R4652l8331k6816o822n7040J0371P901n6774
1948c9620O6335M0840K9110k2232r874J5664M6280q2416l9399M1055J4052l4813
1936B4982N2110M4291n7409r582M0109j8481p1996j8284r752L7452Q71m3284O1509
1923C2536q4k2472j2451m0259O8613J4774K2609K7122o8500o2407K1582j1265
1911c0202k7416K368J18438R288l9066J2097m2783O8190J1267l3181N2717j1428
1899I0289q9103n4993M1400M5930m0500J5991R1141j9901q182k6629K9921j3454
1887F1910p7435J9810j4148P0214K4918k9972K9378l5011k2786l0295j2973K627
$$ plain form
1875 -13763 -7405 -48606 15022 28380 32962 19312 37530 7484 -19239 -41647 -30248 -21493
1863 -21493 -47054 -5370 -5203 -36839 7323 30662 -51987 8858 49109 66138 77559 46724
1851 46724 33480 -2006 24926 13009 45100 45314 37350 33594 104754 34842 5639 34194 62220
1838 62220 54202 27723 16690 23325 56538 59020 70341 64753 34326 1187 54621 -41363 -9038
1825 -9038 43217 -8315 -27503 33216 -3913 -31703 -18863 -9013 -19899 -28531 -4992 -19703
1813 -19703 -18013 27318 -5643 -42550 9044 -31794 -43216 26167 52881 -23599 -391 43786
1801 43786 42368 34029 68802 28124 -28141 -108 -38372 15749 58765 49158 95844 66301
1789 66301 45207 60779 26140 -18429 -51049 -839 -94656 -72693 -52275 -54341 -2412 -53191
$$ packed form
1875a3763O358m1201O3628J3358M582j3650J8218l0046k6723k2408J1399Q755
1863b1493k5561M1684J67l1636M4162K3339q2649O0845M0251J7029J1421l0835
1851D6724j3244l5486K6932j1917L2091K14p964l756P1160o9912k9203K8555K8026
1838F2220q018k6479j1033O635L3213K482J1321n588l0427l3139N3434r5984L2325
1825i038N2255n1532j9188O0719l7129k7790J2840R850j0886q632K3539j4711
1813a9703J690M5331l2961l6907N1594m0838j1422O9383K6714p6480K3208M4177
1801D3786j418q339L4773m0678n6265K8033l8264N4121M3016r607M6686k9543
1789F6301k1094J5572l4639m4569l2620N0210r3817K1963K0418k066N1929n0779
$$ plain form
1777 -53191 -70571 -51587 6370 30360 28782 16264 25335 -19266 -20705 21014 -1631 3062 90178
1764 90178 106680 55230 -15741 -8400 53104 -14950 3717 23994 74204 68972 25342 -5442
1752 -5442 -7603 -28249 -14335 -44940 -33924 -1653 18522 31669 1245 -7311 -19996 -60723
1740 -60723 -9325 -30792 -46686 -11128 28049 16517 -32029 3770 -8405 23237 2972 65182
1728 65182 90054 31405 26812 46466 46443 18783 15379 15831 -1557 -20438 7439 25942 26544 -103
1714 -103 -23617 15299 -26090 9373 46374 -24616 -24335 -3333 -16632 -19044 -10147 4915 5735
1701 5735 -38040 -46453 39069 47192 25721 -2525 31775 130218 80362 15420 -1269 7126 10261
1688 10261 -20516 2998 -31592 -60718 -94124 -48884 -37013 58214 29632 -19620 9479 45922
$$ packed form
1777e3191j7380J8984N7957K3990j578j2518R071m4601j439M1719k2645M693Q7116
1764I0178J6502n1450p0971P341O1504o8054J8667K0277N0210n232m3630l0784
1752e442k161k0646J3914l0605J1016L2271K0175J3147l0424q556j2685m0727
1740f0723N1398k1467j5894L5558L9177j1532m8546L5799j2175L1642k0265O2210
1728F5182K4872n8649m593J9654k3k7660l404M52j7388j8881K7877J8503O02k6647
1714a03k3514L8916m1389L5463L7001p0990K81K1002j3299k412Q897J5062Q20
1701E735m3775q413Q5522Q123k1471k8246L4300R8443m9856o4942j6689Q395L135
1688A0261l0777K3514l4590k9126l3406M5240J1871R5227k8582m9252K9099L6443
$$ plain form
1676 45922 101757 78140 88509 46970 26122 23995 57459 28169 18488 32655 3426 17560
1664 17560 12561 818 40596 48569 -21011 -65221 -31195 9223 35297 45267 -31649 -7982
1652 -7982 -2626 -3637 35540 10124 1276 -21557 -78841 -67770 -39048 -23817 -9076 -12294 42955
1639 42955 9058 11247 84504 58274 43180 65435 -18572 -11239 -41809 -20655 13633 47660
1627 47660 51978 55595 31320 26036 15313 -36057 54278 39291 39437 37751 -27435 9967 -20160
1614 -20160 15374 48563 19183 21060 13273 37675 33764 -10694 -22566 33858 30468 65549 55920
1601 55920 24154 62520 -4435 22246 79915 44826 -4793 17130 -60874 -38723 -28993 -2178
1589 -2178 29196 -22668 -28188 -29931 -54788 -33151 20935 -22561 87640 73980 12948 -9795
$$ packed form
1676D5922N5835k3617J0369m1539k0848k127L3464k9290r681J4167k9229J4134
1664A7560m999j1743L9778P973o9580m4210L4026M0418K6074R970p6916K3667
1652g982N356j011L9177k5416q848k2833n7284J1071K8722J5231J4741l218N5249
1639D2955l3897K189P3257k6230j5094K2255q4007P333l0570K1154L4288L4027
1627D7660M318L617k4275n284j0723n1370R0335j4987J46j686o5186L7402l0127
1614b0160L5534L3189k9380J877p787K4402l911m4458j1872N6424l390L5081r629
1601E5920l1766L8366o6955K6681N7669l5089m9619K1923p8004K2151R730K6815
1589b178L1374n1864n520j743k4857K1637N4086m3496J10201j3660o1032k2743
$$ plain form
1577 -9795 -18460 -67389 -20870 -72251 -51091 -74122 -40368 22212 -7055 -25983 -25330 3289 -8156
1564 -8156 41164 75271 -13069 -42680 6239 -9170 35021 24487 13394 -18401 20402 27248
1552 27248 -5460 -17108 12633 22719 39956 36557 -1335 37268 42369 1593 -15170 -26168
1540 -26168 3299 -500 -13265 -29179 -41628 17387 50877 60030 42472 68521 1576 -30011
1528 -30011 24503 69045 48217 -16874 -28134 -17706 -45557 20848 24940 39950 8637 -49520
1516 -49520 -27329 42990 15813 -9845 20645 29339 50384 43953 113300 94396 110757 64111
1504 64111 -72802 -77263 9711 16173 98995 93156 16724 26854 47486 64373 78481 109225
1492 109225 40886 23981 13180 55451 17068 -41806 -45722 -80661 -101 87800 52679 24970
$$ packed form
1577i795q665m8929M6519n1381K1160k3031L3754O2580k9267j8928O53K8619j1445
1564h156M9320L4107q8340k9611M8919j5409M4191j0534j1093l1795L8803O846
1552B7248l2708j1648K9741J0086J7237l399l7892L8603N101m0776j6763j0998
1540b6168K9467l799j2765j5914j2449N9015L3490R153j7558K6049o6945l1587
1528c0011N4514M4542k0828o5091j1260J0428k7851O6405M092J5010l1313n8157
1516d9520K2191P0319k7177k5658L0490Q694K1045o431O9347j8904J6361m6646
1504F4111j36913m461Q6974O462Q2822n839p6432J0130K0632J6887J4108L0744
1492A09225o8339j6905j0801M2271l8383n8874l916l4939Q0560Q7901l5121k7709
$$ plain form
1480 24970 37731 12323 -1797 -51905 10767 34707 25403 -38739 -37660 60628 105914 85168
1468 85168 53445 -21751 -37208 27278 13027 -72581 -28706 22843 63119 33013 18135 20096
1456 20096 -25423 -6377 -13303 2667 11345 -30099 -65079 -42477 -8537 -58110 -30814 -26703
1444 -26703 35704 54394 -12833 -13456 -60175 -90765 -29698 -18027 -14289 -35733 -68143 -47748
1432 -47748 -22001 37119 37461 -1918 -21458 -55477 -55361 -4651 -4865 -17051 -37893 22229 35386
1419 35386 8593 -33645 -73729 -26779 9239 25062 36647 74867 40662 -15605 -45999 -21664
1407 -21664 15085 -18458 21777 69786 81208 55412 35006 27274 -12963 -10208 19098 59599
1395 59599 45515 13029 48814 1910 13438 -3111 -33731 -26909 4544 59588 61392 -2186
$$ packed form
1480B4970J2761k5408j4120n0108O2672K3940r304o4142J079R8288M5286k0746
1468H5168l1723p5196j5457O4486j4251q5608M3875N1549M0276l0106j4878J961
1456B0096m5519J9046o926J5970Q678m1444l4980K2602L3940m9573K7296M111
1444b6703O2407J8690o7227o23m6719l0590O1067J1671L738k1444l2410K0395
1432d7748K5747N9120L42l9379j9540l4019J16N0710k14j2186k0842O0122J3157
1419C5386k6793m2238m0084M6950L6018J5823J1585L8220l4205n6267l0394K4335
1407b1664L6749l3543M0235M8009J1422k5796k0406p732m0237K755K9306M0501
1395E9599j4084l2486L5785m6904J1528j6549l0620O822L1453N5044J804o3578
$$ plain form
1383 -2186 25277 -6974 -11269 -13253 -24166 -7538 -11756 7814 -92115 -87197 -45703 -21233 45560
1370 45560 5948 20688 39762 -13534 -15523 -9022 -5657 -35945 -19859 -19046 1614 -17259 -9766
1357 -9766 21833 -16672 26616 16653 -9164 3235 -12775 -42111 39775 31667 -26899 -37024
1345 -37024 11868 48488 63220 39054 6765 -16727 -44836 -32950 5917 15323 21819 -33495
1333 -33495 -22282 9310 54570 -15326 -32701 -36166 -37115 4319 -6362 40198 -5852 -62663
1321 -62663 -48230 -8704 674 16489 -12281 27288 96389 103777 8696 -26078 -6488 -59418
1309 -59418 -31828 -22581 -81274 -55873 -85320 -117542 -67623 -38276 -48765 -12712 -14087 -21984
1297 -21984 -30989 46645 111508 33976 1808 19606 31830 3367 -43567 -80001 -48833 9395
$$ packed form
1383b186K7463l2251m295j984j0913J6628m218J9570r9929M918M1494K4470O6793
1370D5560l9612J4740J9074n3296j989O501L365l0288J6086Q13K0660j8873P493
1357i766L1599l8505M3288r963k5817J2399j6010k9336Q1886q108n8566j0125
1345c7024M8892L6620J4732k4166l2289k3492k8109J1886L8867R406O496n5314
1333c3495J1213L1592M5260o9896j7375l465r49M1434j0681M6560m6050n6811
1321f2663J4433L9526R378J5815k8770L9569O9101P388r5081l4774J9590n2930
1309e9418K7590R247n8693K5401k9447l2222M9919K9347j0489L6053j375p897
1297b1984r005P7634O4863p7532l2168J7798J2224k8463m6934l6434L1168N8228
$$ plain form
1285 9395 57311 92481 60714 48239 47224 -3260 353 56850 18227 -59759 -101030 -44078
1273 -44078 -49317 32858 63147 -15989 -7183 37711 29717 -18636 20020 62129 27155 51560
1261 51560 -10334 -30912 29756 -8410 16700 -13984 1520 -1315 -18531 8573 48613 6636
1249 6636 11278 37665 78005 70732 41050 43578 -10033 -22183 -85167 -37660 -7860 -1706 42261
1236 42261 55225 10348 4051 -37477 -43865 -7407 17212 49411 59332 64130 79479 4378 13652
1223 13652 25145 64664 28676 -20532 -49689 13305 -46779 -43537 -43760 -78814 -91023 -95175 -79121
1210 -79121 -100879 -36147 -2853 12794 -60816 -44924 -28548 -42499 -8222 8072 -21414 -1549
1198 -1549 -13723 8220 3188 -55015 -19839 -407 -29399 6845 46183 101932 89204 50264
$$ packed form
1285I395M7916L5170l1767j2475j015n0484L613N6497l8623p7986m1271N6952
1273d4078n239Q2175L0289p9136Q806M4894p994m8353L8656M2109l4974K4405
1261E1560o1894k0578O0668l8166K5110l0684J5504k835j7216K7104M0040m1977
1249F636M642K6387M0340p273k9682K528n3611j2150o2984M7507K9800O154M3967
1236D2261J2964m4877o297m1528o388L6458K4619L2199R921M798J5349p5101R274
1223A3652J1493L9519l5988m9208k9157O2994o0084L242k23l5054j2209m152J6054
1210g9121k1758O4732L3294J5647p3610J5892J6376j3951L4277J6294k9486J9865
1198a549j2174K1943n032n8203L5176J9432k8992L6244L9338N5749j2728l8940
$$ plain form
1186 50264 32616 52688 -12295 -61089 -47616 -66566 -5739 10880 -7238 7464 -33630 -82113
1174 -82113 -38535 -8448 -48708 42782 88527 46136 17528 8288 7184 -55255 -14641 3048
1162 3048 6661 2586 -27533 -29060 -58767 -12895 -2635 64273 -32457 -53570 -20706 -1602 34819
1149 34819 -1367 28812 19369 2994 22620 27007 79423 58468 -34028 -4783 -21386 33505
1137 33505 53859 10460 42766 2709 -29193 -39457 51961 -4450 9955 -27634 5561 35300
1125 35300 -4566 13565 -1099 -4136 75905 39900 29177 -26165 -8095 -5701 -9752 -5047 -62112
1112 -62112 -30066 32025 9066 -43406 6673 30441 73678 30461 -9723 6127 16917 61403
1100 61403 7350 -24921 50011 70602 80001 91072 26535 3378 63833 80861 83109 31628
$$ packed form
1186E0264j7648K0072o4983m8794J3473j8950O0827J6619j8118J4702m1094m8483
1174h2113M3578L0087m0260R1490M5745m2391k8608r240j104o2439M0614J7689
1162C048L613m075l0119j527k9707M5872J0260O6908r6730k1113L2864J9104L6421
1149C4819l6186L0179r443j6375J9626M387N2416k0955r2496K9245j6603N4891
1137C3505K0354m3399L2306m0057l1902j0264R1418n6411J4405l7589L3195K9739
1125C5300l9866J8131j4664l037Q0041l6005j0723n5342J8070K394m051M705n7065
1112f2112L2046O2091k2959n2472N0079K3768M3237m3217m0184J5850J0790M4486
1100F1403n4053l2271P4932K0591R399J1071o4537k3157O0455J7028K248n1481
$$ plain form
1088 31628 22692 60631 -10193 -40771 40171 31498 -40056 -44182 -35356 1488 23609 -59994 -50417
1075 -50417 9725 59207 -24412 23670 686 -834 -40919 37725 15336 30440 46314 40256
1063 40256 74310 51466 19911 -1369 -53536 -48861 -24819 -46 33828 53282 72617 78252
1051 78252 75931 54290 40973 44788 -7180 -27869 -2694 -13324 4925 -1532 -8526 450 -4676
1038 -4676 64232 24667 -14005 21790 1087 -15646 11306 12484 -12459 -47616 -92373 -58392
1026 -58392 -43420 -64776 -55928 -10292 6968 -29034 1179 49225 71055 45627 -18766 -26982
1014 -26982 20261 8054 28298 1473 -41277 -57814 -36246 18382 19551 5864 -15844 -1833
1002 -1833 -73874 -15831 62101 54915 9913 -14433 -1656 36901 13119 -341 -22699 -60303
$$ packed form
1088C1628q936L7939p0824l0578Q0942q673p1554m126Q826L6844K2121q3603R577
1075e0417O0142M9482q3619M8082k2984j520m0085P8644k2389J5104J5874o058
1063D0256L4054k2844l1555k1280n2167M675K4042K4773L3874J9454J9335N635
1051G8252k321k1641j3317L815n1968k0689K5175j0630J8249o457o994Q976n126
1038d676O8908l9565l8672L5795k0703j6733K6952J178k4943l5157m4757L3981
1026e8392J4972k1356Q848M5636J7260l6002L0213M8046K1830k5428o4393q216
1014b6982M7243j2207K0244k6825m2750j6537K1568N4628J169j3687k1708J4011
1002a833p2041N8043P7932p186m5002k4346J2777L8557k3782j3460k2358l7604
$$ plain form
990 -60303 -74005 -53466 -38962 -16911 21348 6984 -24708 18397 66882 1281 19945 19216
978 19216 22921 40891 58406 5971 4062 39487 30085 37446 -17895 -1450 -58406 2501 23742
965 23742 -3622 -34211 21128 2914 -1894 -22721 -12246 -18662 17429 -46908 -69103 16153
953 16153 39659 59894 68939 13961 -21573 -9496 7034 21139 -5909 54118 64688 100987
941 100987 79595 61664 206 -46923 20931 -26373 30389 17055 -25963 -21471 -3351 7686
929 7686 7693 -71890 -35056 -14220 -27409 -3833 41603 36547 40870 42095 -21910 8571 -70867 -51338
915 -51338 -65195 -97479 -24969 637 31417 -32236 -84023 -81823 -1997 8743 -27147 25812
903 25812 70607 79389 33081 -1461 -42261 -26220 -58489 -49817 -36524 35244 -7621 44059
$$ packed form
990f0303j3702K0539J4504K2051L8259j4364l1692M3105M8485o5601J8664p29
978A9216L705J7970J7515n2435j909L5425r402P361n5341J6445n6956O0907K1241
965B3742k7364l0589N5339j8214m808k0827J0475o416L6091o4337k2195Q5256
953A6153K3506K0235R045n4978l5534J2077J6530J4105k7048O0027J0570L6299
941A00987k1392j7931o1458m7129O7854m7304N6762j3334m3018M492J8120J1037
929G686Pp9583L6834K0836j3189K3576M5436n056M323J225o4005L0481p9438J9529
915e1338j3857l2284P2510K5606L0780o3653n1787K200P9826J0740l5890N2959
903B5812M4795Q782m6308l4542m0800J6041l2269Q672J3293P1768m2865N1680
$$ plain form
891 44059 63715 53544 12131 38299 37214 18938 -2559 -34905 -52754 -42603 -31191 -27242
879 -27242 -22044 -3208 35873 25798 -15069 -43671 -3637 -50360 -71161 -37096 -25234 28654
867 28654 31119 -33576 -8900 10626 -4938 -11495 47945 89054 35159 -2365 -16188 71092
855 71092 42968 9853 9010 -41171 -65842 -58421 -56285 -18870 -23007 -16134 35085 -6771 -38448
842 -38448 -66691 -50049 -38098 -53600 -9630 -2959 5673 78565 128530 93794 -2026 -21539
830 -21539 6873 6100 313 -17617 -65189 -35799 44241 19917 8067 1953 18281 58464 26584
817 26584 22093 24090 49062 43947 27274 11855 -52708 16849 51291 -30692 -59966 -36845 -23256
804 -23256 -24614 41453 17189 7487 6038 48673 24153 -73173 -85043 -7468 -37523 -58673 -52635
$$ packed form
891D4059J9656j0171m1413K6168j085j8276k1497l2346j7849J0151J1412L949
879b7242N198J8836L9081j0075m0867k8602M0034m6723k0801L4065J1862N3888
867B8654K465o4695K4676J9526j5564o557N9440M1109n3895l7524j3823Q7280
855G1092k8124l3115q43n0181k4671P421K136L7415m137O873N1219m1856l1677
842c8448k8243J6642J1951j5502M3970O671Q632P2892M9965l4736r5820j9513
830b1539K8412p73n787j7930m7572K9390Q0040k4324j1850o114J6328M0183l1880
817B6584m491J997K4972n115j6673j5419o4563O9557L4442q1983k9274K3121J3589
804b3256j358O6067k4264r702j449M2635k4520r7326j1870P7575l0055k1150O038
$$ plain form
791 -52635 -98461 -140227 -97818 -56122 -2876 68456 5321 37323 27262 -30234 14449 20660
779 20660 -1536 64342 67716 -4115 -11340 -893 -28090 -66892 -78305 -15350 -12418 -15435 -30113
766 -30113 -15965 -33473 -52363 8146 -7723 18374 51726 76088 59796 52906 40051 42595
754 42595 54940 24476 62269 34045 -25258 -19781 -2631 34422 50440 82616 45429 3237
742 3237 -28019 -34064 -86509 -133918 -124887 -64366 -17452 60949 72404 32244 6456 -9869 -20570
729 -20570 -53601 -76361 -47476 -13969 -13449 -10662 -72085 -75653 -102657 -48707 -46059 -51095 -47243
716 -47243 -43129 -28421 -20217 -32377 -33745 -53773 -50055 -59069 -34479 -15922 28030 -33639 -67478
703 -67478 42117 22890 -2213 67 21227 36949 6877 -11939 25581 50479 24741 -88999
$$ packed form
791e2635m5826m1766M2409M1696N3246P1332o3135L2002j0061n7496M4683O211
779B0660k2196O5878L374p1831p225J0447k7197l8802j1413O2955K932l017j4678
766c0113J4148j7508j8890O0509j5869K6097L3352K4362j6292o890j2855K544
754D2595J2345l0464L7793k8224n9303N477J7150L7053J6018L2176l7187m2192
742C237l1256o045n2445m7409R031O0521M6914P8401J1455m0160k5788j6325j0701
729b0570l3031k2760K8885L3507N20K787o1423l568k7004N3950K648n036L852
716d7243M114J4708Q204j2160j368k0028L718r014K4590J8557M3952o1669l3839
703f7478J09595j9227k5103K280K1160J5722l0072j8816L7520K4898k5738j13740
$$ plain form
691 -88999 -25645 6593 -9644 -29581 -53276 -36489 -23799 -27489 -25326 5547 -10787 -7828 -2780
678 -2780 -22009 -10256 39033 58219 44942 50533 -13994 5012 -35496 -85374 -88893 -94878 26150
665 26150 63056 15971 -9368 4523 -49390 -41951 652 -8756 18309 -33182 -13153 14047
653 14047 27500 26275 30313 -27985 -24349 -89 -50856 -35393 -24595 11441 17739 32532 14774
640 14774 -9609 -6528 -13825 -55433 -57630 -8976 -34688 -76680 -32244 -44369 -46599 -38308 -50262
627 -50262 20629 55998 13511 -44622 -1932 55455 22100 -18460 32654 61791 22944 18937
615 18937 -8305 -59765 -25051 24798 38525 60349 -23814 -46548 -54124 -15012 -26304 -44745
603 -44745 -34319 -35111 -315 -25577 -43041 -72699 -112323 -72944 -50954 -33781 -93137 -61621
$$ packed form
691h8999O3354L2238j6237j9937k3695J6787J2690l690K163L0873j6334K959N048
678b780j9229J1753M9289J9186j3277N591o4527J9006m0508m9878l519n985J21028
665B6150L6906m7085k5339J3891n3913P439M2603r408K7065n1491K0029K7200
653A4047J3453j225M038n8298L636K4260n0767J5463J0798L6036O298J4793j7758
640A4774k4383L081p297m1608k197M8654k5712m1992M4436j2125k230Q291j1954
627e0262P0891L5369m2487n8133M2690N7387l3355m0560N1114K9137l8847m007
615A8937k7242n1460L4714M9849J3727K1824q4163k2734p576L9112j1292j8441
603d4745J0426p92L4796k5262j7464k9658l9624L9379K1990J7173n9356L1516
$$ plain form
591 -61621 -67052 -81614 -40060 1156 -30461 -21278 -7347 16229 -20512 -43567 -1379 -41769
579 -41769 -26891 -19890 -13073 -36950 -35395 -7736 15856 35203 73565 102754 31442 -42499 -16515
566 -16515 -21508 23254 -20154 -885 44370 35909 51109 22051 -11890 -12498 12972 -9415 -2532
553 -2532 14876 14176 17328 -7613 -12653 -12772 47809 44818 66517 22753 54197 45287 24066 12831
539 12831 49037 57082 -36731 -29096 -46898 -61546 -52685 -4593 -25012 -45426 -76640 -67532 -67401
526 -67401 -40089 -30222 -24413 -78013 -38729 27117 9261 -8670 43826 25164 -30998 16053
514 16053 37918 -2053 -6210 -50093 -14853 3737 15630 -3445 -56406 -18877 -7238 -31743
502 -31743 376 52218 14905 54761 64103 45010 -13756 -54047 -38371 3662 -25924 -6407
$$ packed form
591f1621n431j4562M1554M1216l1617R183J3931K3576l6741k3055M2188m0390
579d1769J4878P001O817k3877J555K7659K3592J9347L8362K9189p1312p3941K5984
566a6515m993M4762m3408J9269M5255q461J5200k9058l3941o08K5470k2387O883
553b532J7408p00L152k4941n040j19O0581k991K1699m3764L1444q910k1221j1235
539A2831L6206Q045r3813P635j7802j4648Q861M8092k0419k0414l1214R108J31
526f7401K7312R867N809n3600L9284O5846j7856j7931N2496j8662n6162M7051
514A6053K1865l9971m157m3883L5240J8590J1893j9075n2961L7529J1639k4505
502c1743L2119N1842l7313L9856R342j9093n8766m0291J5676M2033k9586J9517
$$ plain form
490 -6407 17184 -12445 -30498 -35052 -101106 -100336 -65103 -15414 18471 21158 -13124 -47855 -57612
477 -57612 -26418 -29069 -28004 13328 25760 -29455 14311 46964 46773 47245 2820 31853 3250
464 3250 3807 56311 21655 -19749 21393 -600 -14379 -47411 -60382 -21011 36035 29151 37408
451 37408 29965 55146 19359 -59369 -45953 -34869 -13696 -22829 -29265 -54663 24610 -62303 -74128
438 -74128 -16015 -67635 -4813 4156 -56962 -23230 -12642 19406 15084 4549 -26440 -37534
426 -37534 5012 50636 7910 -57605 -36941 -4730 -6803 -41238 -18707 -72967 -82839 -63279
414 -63279 -43096 -15903 -23746 40634 25388 3694 -12853 -16974 -32298 -50564 11166 -7151
402 -7151 -3692 27596 47087 32360 38623 54226 52837 50901 106064 58161 77143 26210 60202
$$ packed form
490f407K3591k9629j8053m554o6054P70L5233M9689L3885K687l4282l4731r757
477e7612L1194k651J065M1332J2432n5215M3766L2653j91M72m4425K9033k8603
464C250N57N2504l4656m1404M1142k1993j3779l3032j2971L9371N7046o884Q257
451C7408p443K5181l5787p8728J3416J1084K1173r133o436k5398P9273q6913j1825
438g4128N8113n1620O2822Q969o1118L3732J0588L2048m322j0535l0989j1094
426c7534M2546M5624m2726o5515K0664L2211k073l4435K2531n4260r872J9560
414f3279K0183K7193p843O4380j5246k1694j6547m121j5324j8266O1730j8317
402g151L459L1288J9491j4727O263J5603j389j936N5163m7903J8982n0933L3992
$$ plain form
389 60202 65780 48982 29021 37146 65503 95663 72664 17964 11442 -2601 3512 13182 38032
376 38032 48654 79529 66034 18876 13399 27496 -17798 -9588 466 42077 48867 21929 34311
363 34311 56675 35036 56684 76983 60457 17506 16862 39305 22701 -13669 51126 88905
351 88905 -19821 -40172 -24484 -58107 -9295 64215 78644 35685 -39869 -39484 -43177 -9797
339 -9797 -13891 -80665 -118409 -68158 -43195 24191 89869 87612 42077 60801 81501 22468 9758
326 9758 73693 72351 74116 -8296 42515 109833 41865 -45455 -70091 -39800 28996 46088 -1045
313 -1045 -3213 14996 57586 67892 58157 88304 42135 20830 89800 36893 50781 3989 47151
300 47151 -82338 -84601 -103 -32162 -39666 -37332 -42294 25377 80141 123545 92346 56543 30920
$$ packed form
389F0202N578j6798j9961Q125K8357L0160k2999n4700o522j4043O113R670K4850
376C8032J0622L0875j3495m7158n477J4097m5294Q210J0054M1611O790k6938J2382
363C4311K2364k1639K1648K0299j6526m2951o44K2443j6604l6370O4795L7779
351H8905j08726k0351J5688l3623M8812P3510J4429m2959p5554L85l693L3380
339i797m094o6774l7744N0251K4963O7386O5678k257m5535J8724K0700n9033j2710
326I758O3935j342J765q2412N0811O7318o7968q7320k4636L0291O8796J7092m7133
313a045k168J8209M2590J0306r735L0147m6169k1305O8970n2907J3888m6792M3162
300D7151j29489k263Q4498l2059p504K334m962O7671N4764M3404l1199l5803k5623
$$ plain form
287 30920 1046 15369 36703 38706 -44131 436 30780 22695 12560 29631 40404 37066 36740
274 36740 -4340 6773 16689 15395 -10177 281 25706 10697 4560 5534 -45737 -9263 -3443
261 -3443 22278 18819 66733 88410 86892 54741 35866 84597 113376 107368 103586 82266 48672
248 48672 99534 57021 39481 39915 51933 43787 42462 -32516 2278 52169 -26365 -84391 -94390
235 -94390 -39315 -165 17859 39536 27896 32103 59830 21196 -9689 -22773 10467 2917
223 2917 2981 11467 -7530 46824 73016 70931 77079 89945 82468 25706 16557 2729 -21182 44446
209 44446 31687 31293 68461 31589 -22233 -11163 14946 16659 50174 71717 10769 35585 65519
196 65519 74551 74479 55453 73042 87402 86089 64804 33718 3998 29199 31808 51393 31488
$$ packed form
287C0920k9874J4323K1334K003q2837M4567L0344q085j0135J7071J0773l338l26
274C6740m1080J1113R916j294k5572J0458K5425j5009o137R74n1271L6474N820
261c443K5721l459M7914K1677j518l2151j8875M8731K8779o008l782k1320l3594
248D8672N0862m2513j7540M34J2018q146j325p4978L4794M9891p8534n8026r999
235i4390N5075L9150J8024K1677j1640M207K7727l8634l0885j3084L3240p550
223B917O4Q486j8997N4354K6192k085O148J2866p477n6762r149j3828k3911O5628
209D4446j2759l94L7168l6872n3822J1070K6109J713L3515K1543o0948K4816K9934
196F5519R032p2j9026J7589J4360j313k1285l1086k9720K5201K609J9585j9905
$$ plain form
183 31488 31315 36222 40358 69526 40140 49492 1899 -67809 -46556 -37217 -6289 25104 -33831
170 -33831 -31822 -1474 13144 23958 9150 34388 28825 33483 68760 40909 -1010 -10154 37451
157 37451 33924 79612 67839 74313 90925 89103 17721 -81397 -36686 57971 11576 -27558 -31116
144 -31116 13206 48945 38816 -26307 17089 23664 21313 22607 14349 2999 -4812 -1803 3589
131 3589 32916 32907 32631 48497 16917 -2220 3105 16422 54876 90891 67730 20965 62589 -17819
117 -17819 -61733 -57218 292 505 -41136 -34361 43791 50153 16868 -46094 -47721 7868 -4356
104 -4356 -42860 -7750 37092 18089 84459 165709 75913 14974 25998 49743 47911 53835 49475
91 49475 3944 24904 36513 -19165 -42350 -14815 25865 15487 6796 -20159 31028 5536
$$ packed form
183C1488j73M907M136K9168k9386R352m7593o9708K1253R339L0928L1393n8935
170c3831K009L0348J4618J0814j4808K5238n563M658L5277k7851m1919r144M7605
157C7451l527M5688j1773O474J6612j822p1382r9118M4711R4657m6395l9134l558
144c1116M4322L5739j0129o5123M3396O575k351J294q258j1350p811L009N392
131C589K9327rk76J5866l1580j9137N325J3317L8454L6015k3161m6765M1624q0408
117a7819m3914M515N7510K13m1641O775P8152O362l3285o2962j627N5589j2224
104d356l8504L5110M4842j9003O6370Q1250q9796o0939J1024K3745j832N924m360
91D9475m5531K0960J1609n5678k3185K7535M0680j0378q691k6955N1187k5492
$$ plain form
79 5536 17211 14163 -17180 -44492 -5309 34164 -364 41651 19818 32744 74198 70021 58899
66 58899 39655 36516 29564 89359 132138 82378 9858 36098 101772 81680 47069 32318 20129
53 20129 70255 63619 24939 40551 46521 45965 25518 -21928 28699 35233 1157 2302 24595
40 24595 1817 20952 56218 31125 17517 33270 42887 49228 93620 46266 -3728 -10355 12460
27 12460 -2899 62300 56228 78021 42454 40509 19158 -17925 -6385 -7311 -25 51528 25132
14 25132 15177 9032 31399 -6867 -3366 11783 30336 46625 38370 11988 -12932 5332 -13606
1 -13606 19882
0 19882
$$ packed form
79E536J1675l048l1343k7312L9183L9473l4528M2015k1833J2926M1454m177j1122
66E8899j9244l139o952N9795M2779m9760p2520K6240O5674k0092l4611j4751j2189
53B0129N0126o636l8680J5612N970n56k0447m7446N0627O534l4076J145K2293
40B4595k2778J9135L5266k5093j3608J5753R617O341M4392m7354m9994o627K2815
27A2460j5359O5199o072K1793l5567j945k1351l7083J1540r26P286N1553k6396
14B5132r955o145K2367l8266L501J5149J8553J6289q255k6382k4920J8264j8938
1a3606L3488
0A9882
$$ Imaginary data points
##PAGE= N=2
##DATA TABLE= (X++(I..I)), XYDATA
$$ plain form
16383 -1444486 -1403261 -1386252 -1399448 -1364135 -1334011 -1359045 -1375273 -1320150 -1260408 -1236190 -1222123
16372 -1222123 -1246868 -1232408 -1176827 -1182869 -1148982 -1126205 -1118486 -1104006 -1087653 -1038012 -1000691 -1030780
16360 -1030780 -1047250 -1007301 -960493 -977234 -959240 -925461 -927816 -886591 -863665 -814781 -819931 -830223
16348 -830223 -804685 -782658 -759353 -753970 -749520 -747077 -714189 -669984 -682995 -659627 -615602 -575813
16336 -575813 -561539 -524923 -519299 -527617 -513391 -492250 -462713 -474510 -461705 -429706 -427935 -442946
16324 -442946 -401110 -384461 -372435 -322347 -310423 -299955 -290831 -255705 -210077 -233778 -237376 -200597
16312 -200597 -192751 -162446 -177843 -142686 -167804 -160059 -138383 -104771 -73599 -67507 -64604 -13200
16300 -13200 -8770 -68717 -32501 56065 80495 83473 61394 46106 91977 81762 110924 160781
$$ packed form
16383a444486M1225J7009j3196L5313L0124k5034j6228N5123N9742K4218J4067
16372a222123k4745J4460N5581o042L3887K2777P719J4480J6353M9641L7321l0089
16360a030780j6470L9949M6808j6741J7994L3779k355M1225K2926M8884n150j0292
16348h30223K5538K2027K3305N383M450K443L2888M4205j3011K3368M4025L9789
16336e75813J4274L6616N624q318J4226K1141K9537j1797J2805L1999J771j5011
16324d42946M1836J6649J2026N0088J1924J0468R124L5126M5628k3701l598L6779
16312b00597P846L0305j5397L5157k5118P745K1676L3612L1172O092K903N1404
16300a3200M430n9947L6216Q8566K4430K978k2079j5288M5871j0215K9162M9857
$$ plain form
16288 160781 166185 201200 234282 186441 200253 226957 277875 300892 292640 273599 234585 235728
16276 235728 316164 371207 382382 388354 412553 462457 386508 372260 439101 391087 404612 446578
16264 446578 433098 477949 464154 446437 496265 489583 532060 561183 559622 629136 664338 608228
16252 608228 619285 628568 654505 633415 595498 600346 635075 654074 688979 720311 738163 721938
16240 721938 714124 740925 744964 763450 777858 790836 841902 811854 774452 855298 809156 717897
16228 717897 812866 807058 817252 836922 852451 873201 852613 874616 928617 930901 937202 921477
16216 921477 947171 971175 978710 983956 985845 1028320 1035101 1024994 1013883 1064360 1036390 1002192
16204 1002192 1033618 1067712 1089078 1130604 1109629 1116450 1095671 1106242 1067945 1082664 1102986
$$ packed form
16288A60781N404L5015L3082m7841J3812K6704N0918K3017q252j9041l9014J143
16276B35728Q0436N5043J1175N972K4199M9904p5949j4248O6841m8014J3525M1966
16264D46578j3480M4851j3795j7717M9828o682M2477K9123j561O9514L5202n6110
16252F08228J1057R283K5937k1090l7917M848L4729J8999L4905L1332J7852j6225
16240G21938p814K6801M039J8486J4408J2978N1066l0048l7402Q0846m6142r1259
16228G17897R4969n808J0194J9670J5529K0750k0588K2003N4001K284O301j5725
16216I21477K5694K4004P535N246J889M2475O781j0107j1111N0477k7970l4198
16204A002192L1426L4094K1366M1526k0975O821k0779J0571l8297J4719K0322
$$ plain form
16193 1102986 1135103 1130875 1101702 1088176 1111232 1124799 1075519 1056153 1119068 1155132 1146021 1117174
16181 1117174 1133127 1127393 1140232 1206802 1185817 1162051 1160159 1185176 1231842 1247128 1223004 1247018
16169 1247018 1181712 1178279 1272893 1304237 1230293 1194179 1233294 1259587 1296402 1240057 1288898
16158 1288898 1313323 1310189 1266280 1247399 1183902 1195200 1261099 1259936 1240143 1192491 1223172 1190318
16146 1190318 1194149 1277798 1302703 1294870 1299514 1277235 1240189 1255367 1299360 1267760 1348942 1373433
16134 1373433 1372468 1350470 1320493 1367618 1347736 1333071 1396544 1373679 1369169 1375697 1358964 1290645
16122 1290645 1298686 1344245 1300985 1301583 1333039 1347030 1384095 1358921 1373114 1395331 1461334 1491265
16110 1491265 1453227 1432860 1393195 1397034 1419945 1447745 1433805 1422932 1356319 1381969 1351888
$$ packed form
16193A102986L2117m228k9173j3526K3056J3567m9280j9366O2915L6064r111k8847
16181A117174J5953n734J2839O6570k0985k3766j892K5017M6666J5286k4124K4014
16169A247018o5306l433R4614L1344p3944l6114L9115K6293L6815n6345M8841
16158A288898K4425l134m3909j8881o3497J1298O5899j163j9793m7652L0681l2854
16146A190318L831Q3649K4905p833M644k2279l7046J5178M3993l1600Q1182K4491
16134A373433r65k1998k9977M7125j9882j4665O3473k2865m510O528j6733o8319
16122A290645Q041M5559m3260N98L1456J3991L7065k5174J4193K2217O6003K9931
16110A491265l8038k0367l9665L839K2911K7800j3940j0873o6613K5650l0081
$$ plain form
16099 1351888 1364626 1351122 1414266 1473608 1516508 1481376 1499157 1472238 1402390 1386569 1340043
16088 1340043 1424851 1462881 1466178 1423692 1390442 1374187 1349206 1388932 1417970 1410189 1438248 1453727
16076 1453727 1398308 1379585 1420484 1350671 1384933 1474473 1445493 1390703 1462201 1487754 1434145
16065 1434145 1408460 1488472 1461653 1427146 1462763 1392209 1337011 1321075 1419019 1451218 1428454
16054 1428454 1413327 1388279 1391119 1354301 1415882 1423278 1446183 1430083 1470642 1461975 1510925 1560580
16042 1560580 1476911 1449189 1507043 1500295 1469643 1460889 1470745 1474136 1472053 1429293 1465566 1447825
$$ packed form
16099A351888J2738j3504O3144N9342M2900l5132J7781k6919o9848j5821m6526
16088A340043Q4808L8030L297m2486l3250j6255k4981L9726K9038p781K8059J5479
16076A453727n5419j8723M0899o9813L4262Q9540k8980n4790P1498K5553n3609
16065A434145k5685Q0012k6819l4507L5617p0554n5198j5936R7944L2199k2764
16054A428454j5127k5048K840l6818O1581P396K2905j6100M0559q667M8950M9655
16042A560580q3669k7722N7854o748l0652q754R856L391k083m2760L6273j7741
$$ [...]
##END NTUPLES=NMR SPECTRUM
##END=
