##TITLE=1H_TG-2410-C1
 200.13Hz, DMSO+CCl4.
 8 sc
 13.8.2026
##JCAMPDX= 6.0         $$ Bruker NMR JCAMP-DX V2.0
##DATA TYPE= NMR SPECTRUM
##DATA CLASS= NTUPLES
##ORIGIN= UXNMR, Bruker Analytische Messtechnik GmbH
##OWNER= pz
$$ XWIN-NMR		Version 3.5
$$ Wed Aug 12 12:45:20 2026 Russian Standard Time (UT+4h)  she@DPX200
##.OBSERVE FREQUENCY= 200.1313
##.OBSERVE NUCLEUS= ^1H
##.ACQUISITION MODE= SIMULTANEOUS
##.ACQUISITION SCHEME= undefined
##.AVERAGES= 8
##.DIGITISER RES= 18
##SPECTROMETER/DATA SYSTEM= spect
##.PULSE SEQUENCE= zg30
##.SOLVENT NAME= DMSO
##.SHIFT REFERENCE= (INTERNAL, DMSO, 0, 24.5057)
##AUDIT TRAIL= $$ (NUMBER, WHEN, WHO, WHERE, WHAT)
$$ ##TITLE= Audit trail, XWIN-NMR		Version 3.5
$$ ##JCAMPDX= 5.01
$$ ##ORIGIN= Bruker BioSpin GmbH
$$ ##OWNER= she
$$ F:/spectra/data/she/nmr/H-C/1/pdata/1/auditp.txt
$$ ##AUDIT TRAIL=  $$ (NUMBER, WHEN, WHO, WHERE, WHAT)
(   1,<2026-08-12 12:43:51.73 +0400>,<she>,<DPX200>,
      <created by zg, POWCHK disabled, PULCHK disabled
       configuration hash MD5:
       00 E9 B6 7A A2 85 ED C7 34 08 36 98 17 FE 4E 26
       data hash MD5: 16K
       2E C0 61 8B 35 99 F0 29 5E E4 72 3F 92 2D A9 08>)
(   2,<2026-08-12 12:43:54.03 +0400>,<she>,<DPX200>,
      <Start of raw data processing
       efp BC_mod = 2 LB = 0.25 FT_mod = 6 PKNL = 1 PHC0 = -4220.179 PHC1 = 11.1923 SI = 16K 
       data hash MD5: 16K
       3A E8 F0 A5 1E FA FC 93 70 DF A1 26 B4 B6 D3 3B>)
(   3,<2026-08-12 12:44:21.70 +0400>,<she>,<DPX200>,
      <pk PHC0 = -3.500366 PHC1 = 4.2 
       data hash MD5: 16K
       12 87 94 05 50 0D 03 D0 67 DB 4B 10 D6 0A 84 08>)
(   4,<2026-08-12 12:44:25.70 +0400>,<she>,<DPX200>,
      <abs ABSG = 5 
       data hash MD5: 16K
       2F 56 C1 2D E1 BE 82 69 74 EF 0C 97 07 02 1C 50>)
$$ ##END=
$$ 
$$ hash MD5
$$ 50 F9 16 7A 41 27 DC 6F AF EF 58 50 60 5B 1A C4
##$RELAX= 
##$RELAX= 
##$RELAX= 
##$RELAX= 
##$RELAX= 
##$RELAX= 
$$ Bruker specific parameters
$$ --------------------------
##$DU= <F:/spectra>
##$EXPNO= 1
##$NAME= <H-C>
##$PROCNO= 1
##$TYPE= <nmr>
##$USER= <she>
##$AMP= (0..31)
100 100 100 100 100 100 100 100 100 100 100 100 100 100 100 100 100 100 
100 100 100 100 100 100 100 100 100 100 100 100 100 100 
##$AQSEQ= 0
##$AQ_mod= 1
##$AUNM= <au_zg>
##$AUTOPOS= <>
##$BF1= 200.13
##$BF2= 200.13
##$BF3= 200.13
##$BF4= 200.13
##$BF5= 200.13
##$BF6= 200.13
##$BF7= 200.13
##$BF8= 200.13
##$BYTORDA= 1
##$CFDGTYP= 0
##$CFRGTYP= 5
##$CHEMSTR= <none>
##$CNST= (0..31)
1 1 145 1 1 1 1 1 1 1 1 1 1 1 1 1 1 1 1 1 1 1 1 1 1 1 1 1 1 1 1 1 
##$CPDPRG= <>
##$CPDPRG1= <>
##$CPDPRG2= <>
##$CPDPRG3= <>
##$CPDPRG4= <mlev>
##$CPDPRG5= <mlev>
##$CPDPRG6= <mlev>
##$CPDPRG7= <mlev>
##$CPDPRG8= <mlev>
##$CPDPRGB= <>
##$CPDPRGT= <>
##$D= (0..31)
0 0.7 0 0 0 0 0 0 0 0 0 0.03 0 0 0 0 0 0 0 0 0 0 0 0 0 0 0 0 0 0 0 0 
##$DATE= 1786524231
##$DBL= (0..7)
120 120 120 120 120 120 120 120 
##$DBP= (0..7)
150 150 150 150 150 150 150 150 
##$DBP07= 0
##$DBPNAM0= <>
##$DBPNAM1= <>
##$DBPNAM2= <>
##$DBPNAM3= <>
##$DBPNAM4= <>
$$ [...]
##$SUBNAM3= <"">
##$SUBNAM4= <"">
##$SUBNAM5= <"">
##$SUBNAM6= <"">
##$SUBNAM7= <"">
##$SUBNAM8= <"">
##$SUBNAM9= <"">
##$SW= 18.0517328524113
##$SWIBOX= (0..15)
0 0 2 0 0 0 0 0 0 0 0 0 0 0 0 0 
##$SW_h= 3612.71676300578
##$TD= 16384
##$TD0= 1
##$TE= 0
##$TE2= 300
##$TE3= 300
##$TEG= 300
##$TL= (0..7)
0 120 120 120 120 120 120 120 
##$TP= (0..7)
150 150 150 150 150 150 150 150 
##$TP07= 0
##$TPNAME0= <>
##$TPNAME1= <>
##$TPNAME2= <>
##$TPNAME3= <>
##$TPNAME4= <>
##$TPNAME5= <>
##$TPNAME6= <>
##$TPNAME7= <>
##$TPOAL= (0..7)
0.5 0.5 0.5 0.5 0.5 0.5 0.5 0.5 
##$TPOFFS= (0..7)
0 0 0 0 0 0 0 0 
##$TUNHIN= 0
##$TUNHOUT= 0
##$TUNXOUT= 0
##$USERA1= <user>
##$USERA2= <user>
##$USERA3= <user>
##$USERA4= <user>
##$USERA5= <user>
##$V9= 5
##$VALIST= <valist>
##$VCLIST= <CCCCCCCCCCCCCCC>
##$VD= 0
##$VDLIST= <DDDDDDDDDDDDDDD>
##$VPLIST= <PPPPPPPPPPPPPPP>
##$VTLIST= <TTTTTTTTTTTTTTT>
##$WBST= 1024
##$WBSW= 4
##$XGAIN= (0..3)
0 0 0 0 
##$XL= 0
##$YL= 0
##$YMAX_a= 599900
##$YMIN_a= -635985
##$ZGOPTNS= <>
##$ZL1= 120
##$ZL2= 120
##$ZL3= 120
##$ZL4= 120
##$ABSF1= 15.50229
##$ABSF2= -2.54956
##$ABSG= 5
##$ABSL= 3
##$ALPHA= 0
##$AQORDER= 0
##$ASSFAC= 0
##$ASSFACI= 0
##$ASSFACX= 0
##$ASSWID= 0
##$AUNMP= <proc_1d>
##$AZFE= 0.1
##$AZFW= 0.1
##$BCFW= 0
##$BC_mod= 2
##$BYTORDP= 0
##$COROFFS= 0
##$CY= -3
##$DATMOD= 1
##$DC= 0
##$DFILT= <>
##$DTYPP= 0
##$F1P= 0
##$F2P= 0
##$FCOR= 1
##$FTSIZE= 16384
##$FT_mod= 6
##$GAMMA= 0
##$GB= 0
##$INTBC= 1
##$INTSCL= 3.241238e-09
##$ISEN= 128
##$LB= 0.25
##$LEV0= 0
##$LPBIN= 0
##$MAXI= 10000
##$MC2= 0
##$MEAN= 0
##$ME_mod= 0
##$MI= 1.114404
##$NCOEF= 0
##$NC_proc= -5
##$NLEV= 6
##$NOISF1= 3.799351
##$NOISF2= 2.8
##$NSP= 0
##$NTH_PI= 0
##$NZP= 0
##$OFFSET= 24.50574
##$PC= 1
##$PHC0= -4223.68
##$PHC1= 15.3923
##$PH_mod= 1
##$PKNL= yes
##$PPARMOD= 0
##$PSCAL= 0
##$PSIGN= 0
##$REVERSE= no
##$SF= 200.128202069573
##$SI= 16384
##$SIGF1= 3
##$SIGF2= 2
##$SINO= 0.751879
##$SIOLD= 32768
##$SREGLST= <19F.Aceton>
##$SSB= 0
##$STSI= 16384
##$STSR= 0
##$SW_p= 3612.71676300578
##$SYMM= 0
##$S_DEV= 0
##$TDeff= 16384
##$TDoff= 0
##$TI= <>
##$TILT= no
##$TM1= 0
##$TM2= 0
##$TOPLEV= 0
##$USERP1= <user>
##$USERP2= <user>
##$USERP3= <user>
##$USERP4= <user>
##$USERP5= <user>
##$WDW= 1
##$XDIM= 16384
##$YMAX_p= 421405333
##$YMIN_p= -283847
$$ End of Bruker specific parameters
$$ ---------------------------------
##NTUPLES= NMR SPECTRUM
##VAR_NAME=  FREQUENCY,     SPECTRUM/REAL,   SPECTRUM/IMAG
##SYMBOL=    X,             R,               I
##VAR_TYPE=  INDEPENDENT,   DEPENDENT,       DEPENDENT
##VAR_FORM=  AFFN,          ASDF,            ASDF
##VAR_DIM=   16384,         16384,           16384
##UNITS=     HZ,            ARBITRARY UNITS, ARBITRARY UNITS
##FACTOR=    0.220516191357247, 1,           1
##FIRST=     4904.28952889063, 0,            0
##LAST=      1291.57276588485, 0,            0
##MIN=       1291.57276588485, -283847,      0
##MAX=       4904.28952889063, 421405333,    0
$$ Real data points
##PAGE= N=1
##DATA TABLE= (X++(R..R)), XYDATA
$$ [...]
6091A17631q8831K0126M9103P123L57m1990J2219O207K6330n257k0867M8965k0876
6078A10240J8706n934m6172K7390O0225l6536R223j4616K2331o1061N0959k227
6066A32528k5991n497Q114o250P3690M5657J4631n7549j37326n201K0723M4905
6054A02434K8782l5299N823n6971K225Q2672L5825o167L2591j9702k7515l152
6042A41546Q856m6878K886O904k1707J9797l4655N3425o9701M6612K9769J3241
6030A50095m0351l503J5007k4124L813o153M5125l4442J4214l2646Q750P1258
6018A67043k2824L7756K6394n6078o0021K5175L8963o7973P4029q4317k2178K6451
6006H2420L9855N4642J0363J9435l5832j5675K059o420j5427K8016L892l3530
$$ y = [117631, 28800, 48926, 98029, 105152, 105509, 63519, 75738, 81945, 108275, 103018, 82151, 131116, 110240, 128946, 123012, 76840, 104230, 164455, 127919, 137142, 122526, 144857, 83796, 134755, 132528, 106537, 101040, 109154, 102904, 176594, 222251, 236882, 179333, 42007, 36806, 57529, 102434, 131216, 95917, 101740, 44769, 46994, 129666, 165491, 159324, 191915, 172213, 144698, 141546, 150402, 103524, 106410, 113314, 91607, 111404, 76749, 130174, 60473, 107085, 136854, 150095, 109744, 106241, 121248, 97124, 100937, 94784, 139909, 105467, 119681, 87035, 95785, 167043, 144219, 181975, 208369, 152291, 92270, 117445, 156408, 88435, 162464, 78147, 55969, 82420, 122275, 176917, 187280, 206715, 170883, 155208, 157267, 150847, 135420, 163436, 167328, 133798]
5994A33798m1159M0643J4670k5360j5972J4572J7678M8253N896o9433k8500O1010
5982A56096M1016J6365l4311K278k6947m8830J0081L5930k2067j9542M581O1937
5970A76587l857L9836L0452l4157k5772j1960j157J2165M8529k5222k9367J7909
5958A93986n1342O2435m7853j6811M287l687N6761m2249M5618N8804J5516k6333
5946B49132O765M29k2452m0121L2955j4953j2722J8785l2405j030Q1232J517m2602
5933B24530k200M1396k7279K72r1797l7637L4813L8867j0479K3570j8371N9608
5921B35293ll1394j2006k75k6578Q737L2995o600k3192j283P3569m9095J3078
5908B13246M805k7402q069P3673P512p485K4164l4479n9160M2214N1614R234l5747
$$ y = [133798, 92639, 133282, 147952, 122592, 106620, 121192, 138870, 187123, 193019, 123586, 95086, 156096, 197112, 213477, 179166, 181444, 154497, 105667, 115748, 151678, 129611, 110069, 114650, 176587, 172730, 212566, 243018, 208861, 183089, 171129, 169972, 182137, 230666, 205444, 176077, 193986, 142644, 205079, 157226, 140415, 144702, 141015, 197776, 155527, 201145, 259949, 275465, 249132, 255897, 256326, 233874, 193753, 226708, 211755, 199033, 217818, 185413, 184383, 265615, 267132, 224530, 222330, 263726, 236447, 236719, 144922, 107285, 142098, 180965, 170486, 194056, 175685, 235293, 235290, 203896, 191890, 191615, 165037, 173774, 206769, 200169, 176977, 175694, 249263, 200168, 213246, 218051, 190649, 182580, 256253, 263765, 256280, 280444, 245965, 186805, 229019, 280633, 289867, 254120]
5895B54120o5698J932K3567m0816K1065k6394K9696P093L4233n3335J242m8417
5883A38288p334J16831k2944J1607L1363l5435k0445k0837M6653L4791q0829m264
5871A87445O129j9501j5079M1901p203o8298M045O0726O9837L5804L665l1423
5859B68048m3363j72J6707M1552K1154m9060j9805J7108n936L4729j5031O3226
5847C29157P102n4506n850L2722J1932j8800m0289p896Q9594R900k86N3694M6745
5834D53219j8480n3287m5393k3561L1123M1894m6165L2664J1668o2687o4411N5931
5822C12515K0198m8541M0277L0j2030j6326l4398n5277J03376L4600J0603Q551
5810C63578m2162M2853L2728K1586l8553K7491J5234k1045l8810k077O5540j2538
$$ y = [254120, 188422, 190354, 213921, 173105, 194170, 167776, 197472, 204565, 238798, 185463, 186705, 138288, 130954, 247785, 224841, 236448, 267811, 232376, 211931, 191094, 237747, 272538, 191709, 187445, 193574, 174073, 158994, 200895, 193692, 125394, 129439, 190165, 260002, 295806, 299471, 268048, 224685, 224513, 241220, 282772, 303926, 254866, 235061, 252169, 246233, 280962, 265931, 329157, 336259, 281753, 275903, 308625, 320557, 301757, 261468, 253572, 343166, 353066, 352780, 406474, 453219, 434739, 381452, 336059, 312498, 343621, 385515, 339350, 372014, 383682, 320995, 256584, 312515, 332713, 284172, 324449, 324479, 312449, 296123, 261725, 206448, 309824, 344424, 355027, 363578, 321416, 364269, 396997, 418583, 380030, 407521, 422755, 401710, 362900, 360823, 426363, 413825]
5798D13825k7098l638P1499k234k8109O6980O8591J8204m5902l9535J8693J9366
5786E30642N8605J4400N5437l6061M4342k2597P6147L1818P2042L7898j9216Q9437
5774I32894K6326j6730Q1796R2419O7961J29429J09538Q2681J30609J62892J89758
5763A989573K32085L01151N33035P18823J304995J957306K578543L095299K799500
5754A5510310J437396j1754q28330j106268j555937j567851j726197j733272j500796
5745F917301j415858j172634q55052n91732m04142j91929j62819k74679k72603
5736A575853j35986j12553j03106j2658m4653j6322j15036o3392n6940m7190Q454
5725H76471j8443p0582l4838l079j1700j9167o6095k6987J7165J4435q3397J7750
$$ y = [413825, 386727, 383089, 454588, 452354, 424245, 491225, 559816, 578020, 532118, 492583, 511276, 530642, 589247, 603647, 659084, 623023, 667365, 644768, 720915, 752733, 824775, 862673, 843457, 932894, 959220, 942490, 1024286, 1116705, 1184666, 1314095, 1423633, 1506314, 1636923, 1799815, 1989573, 2221658, 2522809, 3055844, 3774667, 5079662, 7036968, 9615511, 12710810, 15510310, 16947706, 16935952, 16107622, 15001354, 13445417, 11877566, 10151369, 8418097, 6917301, 5501443, 4328809, 3473757, 2882025, 2477883, 2285954, 2123135, 1848456, 1575853, 1439867, 1327314, 1224208, 1211550, 1166897, 1150575, 1035539, 972147, 915207, 868017, 876471, 858028, 787446, 752608, 749529, 737829, 718662, 652567, 625580, 642745, 657180, 573783, 591533]
5713E91533J9498J383L6914p859p3463J7132L1285m9221k5609j0259k6090k0300
5701D84944j5170L1652m7967l4043M8556l3307K1956q31l4003k8140K4357O4161
5689D82165P4246o0229l2348J515p33L3608k2745l4913n0989O6628K0750m41N0187
5676E26701j4302m5179k776K3496N6536k6953n6234q983K8802n9616k3831J669
5664C99330K0176m0208l1323J11979N1046l7327J4784J7357k6701M4518K0704
5653E44335l8885J3712M8035j11707j7078J1942k1761Q124j7750J622J9118J255
5641D40962k9721M5270P276J9266M3016r655k0259K4872J2897J4206p2658N907
5629D81379q3313K5256j6291Q599N8027p6931j4781Q3939M0271l0880J6781O5730
$$ y = [591533, 611031, 612414, 649328, 641469, 568006, 585138, 616423, 567202, 541593, 531334, 505244, 484944, 469774, 501426, 453459, 419416, 467972, 434665, 456621, 455790, 421787, 393647, 418004, 482165, 556411, 496182, 463834, 465349, 464616, 498224, 475479, 440566, 389577, 456205, 476955, 476514, 526701, 512399, 467220, 464444, 487940, 544476, 517523, 461289, 452306, 481108, 421492, 397661, 399330, 419506, 379298, 347975, 459954, 511000, 473673, 488457, 505814, 479113, 523631, 544335, 505450, 519162, 567197, 455490, 438412, 450354, 428593, 436717, 418967, 420589, 439707, 440962, 411241, 456511, 463787, 483053, 526069, 516414, 496155, 521027, 533924, 548130, 475472, 481379, 398066, 423322, 407031, 415630, 473657, 396726, 381945, 465884, 506155, 475275, 492056, 557786]
5617E57786l0086k4477K4262J494P9109K050k905R603n7005M5159M4149M6266
5605F95405J7014L6396N1670P245L2846K1582K9379M6568K2562m8806J6373j8292
5593I09942J821L2295N6968P700L031K0R591m046j9527l8739n6942l3864n659
5580H62591j8397K6266k6353l7333J2121p613j6847R163l2828n4950L7525Q8904
5568H42249M4181J8166o2120J2785O2665K1374K8996P2042N6272Q97j6578O9126
5556A150055K5201j0441P8001O6922N7088K1417J33117J1205K7184J72826Q6425
5545A819000J42939J06805J34368J87279K57651K57128M04400M06933N91753P57892
5535E066148Q44378J010128R95018Q42406N94211M24905J96415J30063R7500O991
$$ y = [557786, 527700, 503223, 527485, 528979, 608088, 610138, 607233, 616836, 559831, 604990, 649139, 695405, 712419, 748815, 800485, 807730, 840576, 862158, 891537, 938105, 960667, 911861, 928234, 909942, 911763, 944058, 1001026, 1008726, 1011757, 1011777, 1021368, 1017322, 997795, 959056, 902114, 868250, 862591, 844194, 870460, 844107, 806774, 818895, 811282, 794435, 803598, 770770, 715820, 753345, 842249, 886430, 904596, 842476, 855261, 917926, 939300, 968296, 1040338, 1096610, 1097507, 1080929, 1150055, 1175256, 1164815, 1242816, 1309738, 1366826, 1388243, 1521360, 1532565, 1559749, 1732575, 1819000, 1961939, 2068744, 2203112, 2390391, 2648042, 2905170, 3309570, 3716503, 4308256, 5066148, 5910526, 6920654, 7915672, 8758078, 9352289, 9777194, 9973609, 10103672, 10201172, 10208163]
5525A0208163R9457K26407K13168J66348N4865j66415l24778n17107p16703p02567
5515H540838q00231q87368p77888p25450o72083n93330n25595l55826l22897k44461
5505B635709k04846k48891j40510j48101j65032k8887q6337j04816n5279o5357
5495A387653J9791r9087l2342M860p3518J3113j9068m0601j27929K561p104m1862
5483I86467k2183N9289l3673l9615l570p0363K6813N4739p315l2857m8964K2570
5471H91338k2509J8802M4349J0008Q276m5614k3218j4991J8058q724m9378J6146
5459H42543J4529k0618n2565N3723L2689l4756R6780k1888l2294K6956j0102l9272
5447H55725j1537J6901O78K1572O488l7352M5563P869K8733j3020m6038N8825
$$ y = [10208163, 10307620, 10534027, 10747195, 10913543, 10968408, 10801993, 10477215, 9960108, 9243405, 8540838, 7740607, 6853239, 6075351, 5349901, 4677818, 4084488, 3558893, 3203067, 2880170, 2635709, 2430863, 2181972, 2041462, 1893361, 1728329, 1699442, 1613105, 1508289, 1453010, 1387653, 1407444, 1308357, 1276015, 1280875, 1207357, 1220470, 1201402, 1160801, 1032872, 1035433, 1028329, 986467, 964284, 1023573, 989900, 950285, 946715, 876352, 903165, 957904, 950589, 917732, 868768, 891338, 868829, 887631, 931980, 941988, 950264, 904650, 881432, 866441, 884499, 875775, 826397, 842543, 857072, 836454, 783889, 837612, 870301, 835545, 932325, 910437, 878143, 905099, 894997, 855725, 844188, 861089, 861767, 883339, 889827, 852475, 898038, 905907, 934640, 921620, 875582, 934407]
5435I34407M4986N2085J6479l0316n890L0037j2407L3883M4622m4836j1311k496
5423A049243r964K1205L3722J7786r622j9246j3075L9707j6148J5833J2665J7712
5411A139818N0934l3828J6516l4690n8084L4368J13924k1154p2511L7764Q2509
5400A255566M6359n1301k8374J2526L1433k0304k778N4595q5898o2084J05754
5389A255494Q000M8250L20p2005L0679N4806M2502N4835M4394Q69l3601J5607
5377A450150K8933K0277Q6716k1035M6557M0427J9311k5153M2292M0612K7650
5366A756737K4758L2683M3302M5895m0354n2191j8245K3120Q5606j10029L5237
5355A826519L0654L4626K1823M6970J3860r656N9790J21053J7388o32P7815K3908
$$ y = [934407, 979393, 1031478, 1047957, 1017641, 1011751, 1041788, 1029381, 1063264, 1107886, 1063050, 1051739, 1049243, 1039279, 1060484, 1094206, 1111992, 1102370, 1083124, 1070049, 1109756, 1093608, 1109441, 1122106, 1139818, 1190752, 1156924, 1173440, 1138750, 1080666, 1115034, 1228958, 1207804, 1135293, 1173057, 1255566, 1301925, 1250624, 1222250, 1234776, 1266209, 1245905, 1243127, 1297722, 1211824, 1149740, 1255494, 1263494, 1311744, 1312064, 1240059, 1270738, 1325544, 1368046, 1422881, 1467275, 1468144, 1434543, 1450150, 1479083, 1499360, 1586076, 1565041, 1611598, 1652025, 1671336, 1646183, 1688475, 1729087, 1756737, 1781495, 1814178, 1857480, 1903375, 1863021, 1810830, 1792585, 1815705, 1901311, 1791282, 1826519, 1857173, 1891799, 1913622, 1960592, 1974452, 1964796, 2024586, 2145639, 2163027, 2162395, 2240210, 2264118]
5343B264118k6254K9440R7622O1286N2631R1992Q3301M5627M9524J14345P6029
5332B939661L8394P8457P1843J47508J23488J41908P0288Q7016J16398J22550
5322C937511J12372J22756K30610J98693K07029J56024J69720L79279K97620L37650
5312F149264L40182L67724L08982L68146L93079N18420N13918N96866P19779R02245
5302A1178605J193052J310873J592901K011277K651328L696259N388399P627000
5294C6649694R881492J1123865R923156O481930K662628M4419j773418k996893
5286G1996873l016248k026593m9300K617525M914800N482140L525082J84574k511261
5277H1117592m497591o111021p128867p577263p685564p230461o472315n743322
$$ y = [2264118, 2237864, 2267304, 2364926, 2426212, 2478843, 2570835, 2654136, 2699763, 2749287, 2863632, 2939661, 2978055, 3056512, 3128355, 3275863, 3399351, 3541259, 3611547, 3698563, 3814961, 3937511, 4049883, 4172639, 4403249, 4601942, 4808971, 4964995, 5134715, 5513994, 5811614, 6149264, 6489446, 6857170, 7166152, 7534298, 7927377, 8445797, 8959715, 9556581, 10276360, 11178605, 12371657, 13682530, 15275431, 17286708, 19938036, 23634295, 29022694, 36649694, 46531186, 57655051, 67578207, 74060137, 76722765, 76767184, 74993766, 71996873, 68980625, 66954032, 66904732, 69522257, 74437057, 79919197, 83444279, 83628853, 81117592, 76620001, 70508980, 63380113, 55802850, 48117286, 40886825, 34414510, 28671188]
5269B8671188m731465l601507k847758k086884j644543j461801j213075j008510
5261A0075645q92668p00431o00844m56946m90195m31960k64711k94492l20595
5252E622803k48609k53459j71266k10148j94071j11456r4380j96704j52007j51322
5242C839381j17458q0476p8350j563j04999j00357m7259m2115q9009k5449l2543
5231C119803q0979o2958m1571p8930j11073m1887n3530j8733L2965j4065m0298
5220B608744q5921q8378N9139R647l0204o2089j24291K3249p2935m5303K7852
5209B219510p7246m9074n6459k5669n2971n0821o093k6385o1630n4534K6319k9573
5197A755374j3773M0706r920q098M0687l4539l1730K421k7425j8037k9855m0997
$$ y = [28671188, 23939723, 20338216, 17490458, 15403574, 13759031, 12297230, 11084155, 10075645, 9182977, 8482546, 7881702, 7424756, 6934561, 6502601, 6237890, 5943398, 5622803, 5374194, 5120735, 4949469, 4739321, 4545250, 4433794, 4339414, 4142710, 3990703, 3839381, 3721923, 3641447, 3563097, 3561534, 3456535, 3356178, 3308919, 3266804, 3177795, 3152346, 3119803, 3038824, 2975866, 2934295, 2855365, 2744292, 2702405, 2648875, 2630142, 2663107, 2649042, 2608744, 2522823, 2434445, 2493584, 2503231, 2473027, 2410938, 2286647, 2309896, 2236961, 2191658, 2219510, 2142264, 2093190, 2036731, 2011062, 1958091, 1907270, 1901177, 1874792, 1813162, 1758628, 1784947, 1755374, 1741601, 1782307, 1772387, 1764289, 1804976, 1770437, 1738707, 1741128, 1713703, 1695666, 1665811, 1624814]
5185A624814L368j7865n1150r952K0356K5057O8022n2001o4443K7107l6084l6206
5173A501023l5982J1266N9094q7003N3597k750N2089m8728o2204K0667O4489K5068
5161A550626j0564O2023k5133m5959K4227K5013m4932p2753l8409J4619L8595
5150A477353n8209R39k6593l3499N3705m9329J3468N5450K847k0432M4109p512
5138A452297K5713M1298j6610L2382m1331M283L6557N2876k8376K818j643K985
5126A563249O8599k6297M4849j2524M2223J7591n8801J6431J6904q2395L6567
5115A626396J4083M4584p911K5059j9743J1329J6799J099k4261J2176r16l5182
5103A663512l8357M2723R118m760K8080K3260K2625l2653O5716p997K7093p776
$$ y = [1624814, 1628182, 1610317, 1559167, 1549215, 1569571, 1594628, 1662650, 1610649, 1546206, 1573313, 1537229, 1501023, 1465041, 1476307, 1535401, 1448398, 1501995, 1499245, 1551334, 1502606, 1440402, 1461069, 1525558, 1550626, 1540062, 1602085, 1576952, 1530993, 1555220, 1580233, 1535301, 1462548, 1424139, 1438758, 1477353, 1419144, 1420083, 1393490, 1359991, 1413696, 1364367, 1377835, 1433285, 1436132, 1415700, 1459809, 1452297, 1478010, 1519308, 1502698, 1535080, 1493749, 1498032, 1534589, 1587465, 1559089, 1561907, 1560264, 1563249, 1631848, 1605551, 1650400, 1637876, 1680099, 1697690, 1638889, 1655320, 1672224, 1589829, 1626396, 1640479, 1685063, 1677152, 1702211, 1682468, 1693797, 1710596, 1711695, 1687434, 1699610, 1698694, 1663512, 1625155, 1667878, 1676996, 1672236, 1700316, 1723576, 1746201, 1713548, 1779264, 1771267, 1798360, 1790584]
5091A790584m3106J8153J2045j7748O125m3502L356K9361J7290J3918p6742m0680
5079A669054K8180o458L0011M888L0581M0743J4679m4650P291M2371j4556L2695
5067A834829N0792M4479j5411m3836N8963N7522J5990J0344L2264L5908n8444
5056B023400N1558P4795n5854l3107j1150J02263O7971Q6028R584k0501K8024
5045B323011K1391j7858r875l9248P4286J02154m1908r7504j9300J06252m2020
5034B359381P7513N5185q4762k7888O2001j3616K6980l32l733O0865O8753M5735
5022B626082k5048m37P7318O2727N7107j1515M2171K9160K8057R966K721J19667
5010C017976O4786N1626n480P1215J24534O8567R0400J72618K19452K28748K03012
$$ y = [1790584, 1747478, 1765631, 1777676, 1759928, 1766053, 1722551, 1725907, 1755268, 1772558, 1786476, 1709734, 1669054, 1697234, 1690776, 1720787, 1725675, 1756256, 1796999, 1811678, 1767028, 1774319, 1816690, 1802134, 1834829, 1885621, 1930100, 1914689, 1870853, 1929816, 1987338, 2003328, 2013672, 2045936, 2081844, 2023400, 2074958, 2149753, 2093899, 2060792, 2049642, 2151905, 2219876, 2305904, 2315488, 2294987, 2323011, 2344402, 2326544, 2316669, 2277421, 2351707, 2453861, 2411953, 2314449, 2295149, 2401401, 2359381, 2436894, 2492079, 2407317, 2379429, 2441430, 2427814, 2454794, 2454462, 2450729, 2511594, 2580347, 2626082, 2601034, 2600597, 2677915, 2740642, 2797749, 2786234, 2828405, 2857565, 2885622, 2895588, 2898309, 3017976, 3082762, 3134388, 3128908, 3200123, 3324657, 3393224, 3483624, 3656242, 3875694, 4104442, 4307454]
4999D307454K21430L44326M15022N53959R39377J328468J905698K591784L081915
4990A5689433K875373K134339J167214R1738q07252j327892j612162j895621j872072
4981A4443098j944054j836160j486354j149598r41287o88905m97102l60531l26726
4972E212381k26231j90588k16741j34507j10733l6321r7249n9846m8212j14110
4962C977843o0991M30p0827q6264k6285k3566p8954n98K6684l8905j0115J7802
4950C626254L1770n25j3598j6458j5237m2000K0584M3227j0398k2457P1622k6817
4938C645967K5087P2606j5652l195L6711M212k075K4848l5472J56839n320R633
4926C914189M5400P8861J0109r0682j5783N0732J0893N3276k2278k4672J6962
$$ y = [4307454, 4528884, 4873210, 5288232, 5842191, 6781568, 8110036, 10015734, 12607518, 15689433, 18564806, 20699145, 21866359, 21958097, 21150845, 19822953, 18210791, 16315170, 14443098, 12499044, 10662884, 9176530, 8026932, 7085645, 6396740, 5899638, 5539107, 5212381, 4986150, 4795562, 4578821, 4444314, 4333581, 4297260, 4200011, 4140165, 4091953, 3977843, 3916852, 3917282, 3846455, 3760191, 3733906, 3710340, 3631386, 3630788, 3657472, 3618567, 3608452, 3626254, 3658024, 3657499, 3643901, 3627443, 3612206, 3570206, 3590790, 3634017, 3623619, 3601162, 3672784, 3645967, 3671054, 3743660, 3728008, 3724813, 3761524, 3765736, 3763661, 3788509, 3753037, 3909876, 3904556, 3914189, 3959589, 4038450, 4048559, 3957877, 3942094, 3992826, 4003719, 4056995, 4034717, 4010045, 4027007]
4915D027007J2000N2422O6684N0403Q4900m5908k8020J5621L426K6575J32014
4904D397124m0723k8584J68196J3991N5286M4343J7359K1864N5234l2351K6225
4893D697964J6757R5173O0687j104M6466M0857P2114J3630O3665K1120K793P9866
4881E209988N8041J15686O3018O7014L0718L2856m622O7476O6912O3096K9582
4870E799765J08982J18539M8978J45922J04459J49099J03547M5552J39603J79074
4860F943520K00889K15897K95362L54216M76094O91073R27906J401102K083462
4851A3589521K550820K816491K476342J966681J330270K80645o96626j227436
4843B3086708j624321j791530j805223j795690j650244j440313j120253q75346
$$ y = [4027007, 4039007, 4091429, 4158113, 4208516, 4293416, 4247508, 4219488, 4235109, 4238535, 4265110, 4397124, 4356401, 4327817, 4496013, 4510004, 4565290, 4609633, 4626992, 4648856, 4704090, 4671739, 4697964, 4714721, 4809894, 4870581, 4869477, 4915943, 4956800, 5028914, 5042544, 5106209, 5127329, 5130122, 5209988, 5268029, 5383715, 5446733, 5513747, 5544465, 5577321, 5572699, 5640175, 5707087, 5770183, 5799765, 5908747, 6027286, 6076264, 6222186, 6326645, 6475744, 6579291, 6624843, 6764446, 6943520, 7144409, 7360306, 7655668, 8009884, 8485978, 9177051, 10104957, 11506059, 13589521, 16140341, 18956832, 21433174, 23399855, 24730125, 25010770, 24314144, 23086708, 21462387, 19670857, 17865634, 16069944, 14419700, 12979387, 11859134, 10983788]
4835A0983788o36079n02812l04994j44947j64977o8530N1668k1910J51289J14809
4825I457305K32743N06569Q37387J337673J826633K212738K055638J042190L4752
4816A9543628m30283q09559j013831j034946j102142j249642j025295r45273p30271
4807A1202386n00098l71621k29627k07630j59605j08910m9735j20078j48371n4056
4797I252655n02j8775m5884l735O2986n2260L6249M3788L2067Q2065O5155j3157
4785I440652Q7638M0306l5338M7340L4300N8678K0088o084P0619k2028L7294O3385
4773I836850M0057R4372M0057M2600R713O868Q3303O6697O4344J4501K8666O9690
4761A0397718Q4661L0384R1715J9115j7599Q7222N7812J19220K6968m618O2746
$$ y = [10983788, 10347709, 9844897, 9539903, 9394956, 9229979, 9161449, 9213117, 9191207, 9342496, 9457305, 9690048, 10196617, 11034004, 12371677, 14198310, 16411048, 18466686, 19508876, 19543628, 19113345, 18303786, 17289955, 16255009, 15152867, 13903225, 12877930, 11932657, 11202386, 10702288, 10330667, 10101040, 9893410, 9733805, 9624895, 9575160, 9455082, 9306711, 9252655, 9252153, 9233378, 9187494, 9183759, 9246745, 9194485, 9230734, 9274522, 9306589, 9388654, 9453809, 9440652, 9528290, 9568596, 9533258, 9580598, 9614898, 9673576, 9693664, 9687580, 9758199, 9736171, 9773465, 9836850, 9876907, 9971279, 10011336, 10053936, 10063649, 10070517, 10153820, 10220517, 10284861, 10299362, 10328028, 10397718, 10482379, 10512763, 10604478, 10623593, 10605994, 10693216, 10751028, 10870248, 10897216, 10892598, 10955344]
4750A0955344M0171N0290P6219K6318j4121M5367O3468J1611O1515O5949L5480
4739A1417611O7004J15814j4952J0987L8831L2907K8392j9119P7991O4243J9362
4728A1839071N7416M9340K5331l4356Q737M7084J18676P9201K4938l4967k1309
4717A2159162Q6435P2761j9054N770N8454K0296L3591K3914M8755L1835L7700
4706A2559619n4J5880L9658L3427J6701J093J5536k562l4457O8070q473J6565
4694A2721003j0627M3559Q2459n6319m2681k7435L4095O3592r074m8430N0270
4683A2800412l0745k2095l1273P1292R214j2486J7725K8607M3340J08970l9703
4672A2943258l5369m9813k9517o8712r1643O1439k69r140J5107j7026o4350j7760
$$ y = [10955344, 10995515, 11045805, 11122024, 11148342, 11134221, 11179588, 11243056, 11254667, 11316182, 11382131, 11417611, 11484615, 11600429, 11585477, 11596464, 11635295, 11668202, 11696594, 11677475, 11755466, 11819709, 11839071, 11896487, 11945827, 11971158, 11936802, 11945539, 11992623, 12111299, 12190500, 12215438, 12180471, 12159162, 12245597, 12318358, 12299304, 12305074, 12363528, 12383824, 12417415, 12441329, 12490084, 12521919, 12559619, 12559565, 12575445, 12615103, 12648530, 12665231, 12666324, 12681860, 12679298, 12644841, 12712911, 12704438, 12721003, 12710376, 12753935, 12836394, 12780075, 12737394, 12709959, 12744054, 12807646, 12798572, 12750142, 12800412, 12769667, 12747572, 12716299, 12787591, 12796805, 12784319, 12802044, 12830651, 12873991, 12982961, 12943258, 12907889, 12858076, 12828559, 12759847, 12668204, 12729643, 12729374, 12720234, 12735341, 12718315, 12653965, 12636205]
4660A2636205k0711j6140m7603l4592M718k3087M044K7076r47q355m0462n8336
4648A2421810l7330j2214l9147Q970l1251m6561k7094P6754k2742l4175q901K1293
4636A2269412L7121N9073P7176N9714M3354J25773K29575L64157N03736O53401
4626A4422492N53601K95856Q9881l1877j40225m24282l61992l18252l35106l34194
4616A3415902j93961j21420l254j6898J41090K59145K14408L14638L60334K44607
4606A4614591J80571K54116K56794L86030M88616N85997M91508L47298K26934
4597A7832455J64837J31635K91060L80965M42223L88388K45890k4470j59042k36526
4587A9457415k81824k10987k13946j59656j92257l34316m35776n68450n56995
$$ y = [12636205, 12615494, 12599354, 12551751, 12517159, 12521877, 12498790, 12502834, 12529910, 12528963, 12520608, 12480146, 12421810, 12384480, 12372266, 12333119, 12342089, 12310838, 12264277, 12237183, 12313937, 12291195, 12257020, 12248119, 12269412, 12306533, 12365606, 12442782, 12502496, 12545850, 12671623, 12901198, 13265355, 13769091, 14422492, 14976093, 15271949, 15361830, 15329953, 15189728, 14765446, 14403454, 14085202, 13750096, 13415902, 13221941, 13100521, 13097267, 13080369, 13221459, 13480604, 13695012, 14009650, 14369984, 14614591, 14795162, 15049278, 15306072, 15692102, 16180718, 16766715, 17258223, 17605521, 17832455, 17997292, 18128927, 18419987, 18800952, 19243175, 19631563, 19877453, 19852983, 19693941, 19457415, 19175591, 18964604, 18750658, 18591002, 18398745, 18064429, 17628653, 17060203, 16503208]
4578A6503208m57827m40935l46525m46660m70479l96027m52867m77047m52649
4569A2562192m13301m16358k86476l31415k92793k43833j62203j20425j88598
4560A0106790j16391m9395n400J396J02491N2849J25943J00860K03013K82899
4550A0805055K88390R4330J32473J64513J38234J38148K02769K94897K57610K59410
4540A2775829K40117K33837K9023j04596m1396j63871k97265k36020k66225j68876
4530A2000557j44894k40061l17127l48650k41049j97933j77153k49515k22552
4521I861623k29707j17415j32934j20483o2970j33990K5029k7977P3719Q4671
4511I219566P4466J05033J47586K34814K91175K97047M51767O00511J043037J410235
$$ y = [16503208, 16045381, 15604446, 15257921, 14811261, 14340782, 13944755, 13491888, 13014841, 12562192, 12148891, 11732533, 11446057, 11114642, 10821849, 10578016, 10415813, 10295388, 10106790, 9990399, 9941004, 9935604, 9937000, 10039491, 10092340, 10218283, 10319143, 10522156, 10805055, 11093445, 11187775, 11320248, 11484761, 11622995, 11761143, 11963912, 12258809, 12516419, 12775829, 13015946, 13249783, 13278806, 13174210, 13132814, 12968943, 12671678, 12435658, 12169433, 12000557, 11855663, 11615602, 11298475, 10949825, 10708776, 10510843, 10333690, 10084175, 9861623, 9631916, 9514501, 9381567, 9261084, 9198114, 9064124, 9089153, 9061176, 9134895, 9219566, 9294032, 9399065, 9546651, 9781465, 10072640, 10369687, 10821454, 11421965, 12465002, 13875237]
4501A3875237J842429K438307K844480K853444K024616Q38652K68035L5433k07654
4492B6812979l4456O22673J563034K769515L833902M177718L129293P79414r49916
4483D2704156j701552k271612k698061k704228k296266j594928q30678j97570
4475B8409261q8262n60786j203852j554485j961670k074476k063867k123169j955870
4466A4822824j750455j519633j178537q50082o50807n28867m48581l44970k54755
4457G296137k70637k86991k29853j01075k12133j88150j95150m5298m5367o6970
4447E654513m2833j39439p7380p9234m5189p8066j01642K5001n9090m8301l1885
4436D976455q7270l1787j2543J9021l0057q035j08373r9993p279m6955p7724k8319
$$ y = [13875237, 15717666, 18155973, 21000453, 23853897, 25878513, 26717165, 26985200, 27020633, 26812979, 26778523, 27401196, 28964230, 31733745, 35567647, 39745365, 42874658, 43654072, 42704156, 41002604, 38730992, 36032931, 33328703, 31032437, 29437509, 28606831, 28409261, 28320999, 27760213, 26556361, 25001876, 23040206, 20965730, 18901863, 16778694, 14822824, 13072369, 11552736, 10374199, 9524117, 8873310, 8344443, 7895862, 7550892, 7296137, 7025500, 6738509, 6508656, 6407581, 6195448, 6007298, 5812148, 5766850, 5721483, 5654513, 5611680, 5472241, 5394861, 5315627, 5270438, 5192372, 5090730, 5115731, 5056641, 5008340, 4976455, 4889185, 4857398, 4844855, 4863876, 4833819, 4825784, 4717411, 4617418, 4610139, 4563184, 4485460, 4457141]
4424D457141k0497l4906j5088l5058o7410r7694p7316k9325k8216q3137k3554
4413C944940m7230l3229N59l5857m0230o2214l8248n6996q091J8927k2267j23050
4401C497014R95L232l403k4322P721n0674m0451o4668n861J9811k6190k6581j5274
4388C271349j0641j1054q522l573K4798p293o9947N2997J4326l2705J0458K6231
4376C256424j6951n205K08K7000M155N186p5582m2033J939o7511p0073O2047M558
4363C084162l3319M8506K6234n8776p2382q2855m1127M8216n9994j9104j0907
4352B828654O418l786N9966k1544J3308k2569n48J1710J1699o2400J5365J445
4340B837718j10190L5214j6530R812k7445o4860L6965l2379M9314N0187j4459
$$ y = [4457141, 4436644, 4401738, 4386650, 4351592, 4284182, 4186488, 4109172, 4079847, 4051631, 3968494, 3944940, 3897710, 3864481, 3865040, 3829183, 3788953, 3726739, 3688491, 3631495, 3623404, 3642331, 3620064, 3497014, 3498009, 3501241, 3497838, 3473516, 3481237, 3430563, 3390112, 3325444, 3319583, 3339394, 3313204, 3286623, 3271349, 3260708, 3249654, 3241132, 3237559, 3262357, 3255064, 3185117, 3238114, 3252440, 3219735, 3230193, 3256424, 3239473, 3234268, 3234476, 3261476, 3265631, 3270817, 3195235, 3153202, 3155141, 3087630, 3017557, 3079604, 3084162, 3050843, 3099349, 3125583, 3066807, 2994425, 2911570, 2870443, 2918659, 2858665, 2839561, 2828654, 2835072, 2831286, 2891252, 2869708, 2883016, 2860447, 2859899, 2871609, 2883308, 2820908, 2836273, 2837718, 2727528, 2762742, 2746212, 2756024, 2728579, 2663719, 2700684, 2668305, 2717619, 2767806, 2753347]
4329B753347l6126q34K0496n3231j3750O9503J9150J9123o083l1513o486l2012
4317B701584K6981P690K2797K8263j1226J3851m7528K7254j7342k9003K2897K7298
4305B773516L1532J8196L199n3648l4909L9946M7018j2078J3746M6030L2834j6832
4293B888550K6300N0416K6587j2994p6454K5804l1228N9908J2306J0476K5066
4282C004737L8601O1333J4896Q4207J23460O3762k5997O3126J46337K7901J48552
4271C750915P0683J46077J41285J33094J37065J17935K78452J94232J43462J10698
4261E223898K02342L04330K74836K58884L92587L86066M37573M74941O13260N85756
4251I154473N43350L76521M08768M42188L53070L52915L59626M50981N11215O48058
$$ y = [2753347, 2717221, 2716387, 2736883, 2683652, 2669902, 2739405, 2758555, 2777678, 2771595, 2740082, 2733596, 2701584, 2728565, 2736255, 2759052, 2787315, 2776089, 2789940, 2742412, 2769666, 2752324, 2723321, 2746218, 2773516, 2805048, 2823244, 2826443, 2772795, 2737886, 2777832, 2824850, 2812772, 2826518, 2872548, 2905382, 2888550, 2914850, 2965266, 2991853, 2978859, 2902405, 2928209, 2896981, 2956889, 2969195, 2979671, 3004737, 3043338, 3104671, 3119567, 3203774, 3327234, 3390996, 3364999, 3428125, 3574462, 3602363, 3750915, 3821598, 3967675, 4108960, 4242054, 4379119, 4497054, 4775506, 4969738, 5113200, 5223898, 5426240, 5730570, 6005406, 6264290, 6656877, 7042943, 7480516, 7955457, 8568717, 9154473, 9697823, 10074344, 10483112, 10925300, 11278370, 11631285, 11990911, 12441892, 12953107, 13601165]
4241A3601165Q64139R36944J024481J054254R49766Q14346O58633N00316K19060
4232B0623104J31433J49531J26698J92319L57609N18128P26615J001820J035182
4223B4862439R63248P68872N58536K62726r7351k35354m18978n13758n10414n32826
4213B5107140l75481j28831K6543J98114K76969J92632O8778j94695l50433m84335
4203B4336401o01990p76562q67782r82688r02051q65583p13484n85550n24813
4194A7515898n00970n02187l83415m54506m64493n14413n51935o04069o36848
4185A2903062o90865p20554o88981n90627n52018n30423m58053n19142m17950
4176G734449l04414l67519k48620j96295l09954l24593k82323l43689k26299k94547
$$ y = [13601165, 14465304, 15402248, 16426729, 17480983, 18430749, 19245095, 19903728, 20404044, 20623104, 20754537, 20904068, 21030766, 21223085, 21580694, 22098822, 22825437, 23827257, 24862439, 25825687, 26594559, 27153095, 27415821, 27318470, 27083116, 26664138, 26150380, 25639966, 25107140, 24731659, 24602828, 24629371, 24827485, 25104454, 25297086, 25365864, 25171169, 24820736, 24336401, 23734411, 22957849, 22090067, 21107379, 20205328, 19339745, 18626261, 18040711, 17515898, 17014928, 16512741, 16129326, 15674820, 15210327, 14695914, 14143979, 13539910, 12903062, 12212197, 11491643, 10802662, 10212035, 9660017, 9129594, 8671541, 8152399, 7734449, 7430035, 7062516, 6813896, 6617601, 6307647, 5983054, 5700731, 5357042, 5130743, 4836196]
4166D836196l31906k32910k15909j54589k85139j79013m0910r5398j65675j16859
4156C017888k9003n8574j47987j02038q3163q2432j13809r7720n4391p0781n8835
4145B119155J0371m9347n3216r0576q9027l954Q396k3844l2899m7246q493l232
4133A736088n1195o910k3072p1774N268l2794M927L3984m5998o7605j3157L3404
4121A501166n3988J5165n8473K6575q037l9726k3520Q812L5999Q134l7493r941
4109A364673J4434l0405p8263J9397j6602k0682k5873L7566m2794k7328l8800
4098A155323j5381J8276k2785m4732K0683N8457n2595l02J5364N1258P251q7770
4086A103047p599m74o55K5094l869m1880j1133J8590R771q7668M1778J4214m0707
$$ y = [4836196, 4504290, 4271380, 4055471, 3900882, 3615743, 3436730, 3395820, 3300422, 3134747, 3017888, 2988885, 2930311, 2782324, 2680286, 2597123, 2514691, 2400882, 2303162, 2248771, 2177990, 2119155, 2129526, 2080179, 2026963, 1936387, 1847360, 1843406, 1851802, 1827958, 1795059, 1747813, 1739320, 1736088, 1684893, 1677983, 1654911, 1583137, 1588405, 1555611, 1560538, 1594522, 1548524, 1480919, 1467762, 1501166, 1447178, 1462343, 1403870, 1430445, 1422408, 1382682, 1359162, 1367974, 1403973, 1412107, 1374614, 1364673, 1379107, 1348702, 1270439, 1289836, 1273234, 1252552, 1226679, 1264245, 1221451, 1194123, 1155323, 1139942, 1158218, 1135433, 1090701, 1111384, 1169841, 1117246, 1116944, 1132308, 1183566, 1190817, 1103047, 1095448, 1094974, 1094319, 1119413, 1115544, 1073664, 1062531, 1081121, 1090892, 1003224, 1045002, 1059216, 1018509]
4073A018509P8127p46k7945n4155L4144k7980L0414O305j611J0137l2864n1832
4061I80503j3150l923J8338L7707m1043N3835l6684K5242J1853l9014K8026P334
4049A029024J462O092n5061j9263L6064l6343P9302m4690n5792N214L0395j2988
4037I63416l2433k1606J2570K6576P3047m0537q5094q540k2715M6635J3951m8821
4025H76449k0704M8163K6843j863k3224M1975p3135J655R97K1251j3435q301K8446
4012I05117k6076J389n556L3775l452P695M1390n486l3233l2896p7540L2146R1688
3999I28961k1922j9544m018l5598M0029J3914L8766m8723L6346j6578J311n1070
3987H61874p138K7208O5507M7966p8072m4862J4755j3125R3643K962r43K633l2595
$$ y = [1018509, 1096636, 1095890, 1067945, 1013790, 1047934, 1019954, 1050368, 1056673, 1055062, 1065199, 1032335, 980503, 967353, 963430, 981768, 1019475, 978432, 1032267, 995583, 1020825, 1032678, 993664, 1021690, 1029024, 1030486, 1036578, 981517, 962254, 998318, 961975, 1041277, 996587, 940795, 946009, 976404, 963416, 930983, 909377, 921947, 948523, 1021570, 981033, 895939, 887399, 864684, 911319, 925270, 876449, 855745, 903908, 930751, 928888, 905664, 947639, 874504, 876159, 877156, 898407, 884972, 876671, 905117, 879041, 880430, 874874, 908649, 905197, 912892, 954282, 948796, 915563, 882667, 805127, 837273, 928961, 907039, 887495, 883477, 847879, 887908, 901822, 940588, 891865, 928211, 911633, 912944, 861874, 854736, 881944, 947451, 995417, 917345, 872483, 887238, 874113, 967756, 970718, 969775, 972408, 939813]
3974I39813R022L7580J4038l0785k0944M2933P3282n027p9463P270J25723n1906
3962A061536M8662J3181l6952J3785o2416K1822P4887L2672O6750O666m4485K9422
3950A225530L0282Q7957P6986J17697J54298K19788L33575L66342K95600J10336
3940C018391j4195o7110p0442q9061j86639k22667p8533j70141j37046o5675m3391
3929A873491r1550M003j10946l7751R1090O7041M6312K4123K3205K4428J0536
3918A923982o258N1471J02176J29525J62196K72562L00744L32599J65391m42n6913
3907C377033j16498j24585j00321j98273k49552j32219j20397j43289j49715r8073
3897A944111r5696j03964k8106N2744l0302k2003k2274L013J0435l6177m0887
$$ y = [939813, 948835, 986415, 1000453, 969668, 948724, 991657, 1064939, 1059912, 980449, 987719, 1113442, 1061536, 1110198, 1123379, 1086427, 1100212, 1037796, 1059618, 1134505, 1167177, 1233927, 1240593, 1196108, 1225530, 1255812, 1343769, 1420755, 1538452, 1692750, 1912538, 2246113, 2612455, 2908055, 3018391, 3004196, 2937086, 2866644, 2777583, 2590944, 2368277, 2289744, 2119603, 1982557, 1916882, 1873491, 1781941, 1785944, 1674998, 1637247, 1728337, 1795378, 1841690, 1865813, 1889018, 1913446, 1923982, 1917724, 1969195, 2071371, 2200896, 2363092, 2635654, 2936398, 3268997, 3434388, 3433946, 3377033, 3260535, 3135950, 3035629, 2837356, 2587804, 2455585, 2335188, 2191899, 2042184, 1944111, 1848415, 1744451, 1716345, 1769089, 1738787, 1716784, 1694510, 1697523, 1707958, 1671781, 1630894]
3886A630894N1776r3659J234k8430J6826j7882r1061J4968j4449n0142m2596K001
3874A379480n0929J654K7648k9967n5649O392m3560J8323j0849k4341K1033o4232
3862A175003J3885O426J449n3685m8252O5702j4336k9700L2227O5841r803k8443
3850A176314j069l3311K1473R3784k2779k8396o8697o047P7154K0111K7059M2738
3838A298334r3334L8206J25398J0900K570n506k4156j6848K2734J9659P050O545
3826A391552o392M3749m4974K3767J9120L7113l234p6829M0847J9970N890J4130
3814A464709K6528k674K3588P1563m0953M584J6811j1219M7107j810N4216N8492
3802A710942J1554P9832R3753K3825P2614J23124J43808J08982J43535K30726
$$ y = [1630894, 1682670, 1589011, 1590245, 1561815, 1578641, 1560759, 1469698, 1484666, 1470217, 1420075, 1377479, 1379480, 1328551, 1330205, 1357853, 1327886, 1272237, 1278629, 1235069, 1253392, 1242543, 1218202, 1239235, 1175003, 1188888, 1195314, 1196763, 1143078, 1094826, 1160528, 1146192, 1116492, 1148719, 1214560, 1204757, 1176314, 1175245, 1141934, 1163407, 1257191, 1234412, 1206016, 1137319, 1131272, 1208426, 1228537, 1255596, 1298334, 1205000, 1243206, 1368604, 1379504, 1382074, 1376568, 1352412, 1335564, 1358298, 1377957, 1385007, 1391552, 1385160, 1428909, 1383935, 1407702, 1426822, 1463935, 1460701, 1383872, 1424719, 1444689, 1450579, 1464709, 1491237, 1488563, 1512151, 1583714, 1542761, 1547345, 1564156, 1552937, 1600044, 1598234, 1652450, 1710942, 1722496, 1802328, 1896081, 1919906, 1992520, 2115644, 2259452, 2368434, 2511969, 2742695]
3792B742695K90223K80821K26912K33096L24577K72886K31666J88192J27390J63154
3782E081612L7575O1664q564k1393K1256O3797q1218L6970O2780m7114Q286L6754
3770E252405N5375l009j16601l8730j28586k00825r4278k22720j67185k12689
3760D123157j68407j74348k40483j69945j35672m7064n7480j6993m5430m9573
3750C017762J563R94L1187K0263j2140l6049J0219k2669j2513l3903m2638j6105
3738B905971o603k6799K6793l1321n7063n2477r643j1858l8793J8086L3095m9197
3726B700191q6578J817M0646j974o6788l5700P115o529J3412K9702M581l4707
3714B565188P0986O5927j2699L0705o0324r98P8185L19J7160R7259j6834K5840
$$ y = [2742695, 3032918, 3313739, 3540651, 3773747, 4098324, 4371210, 4602876, 4791068, 4918458, 5081612, 5119187, 5180851, 5172287, 5150894, 5172150, 5235947, 5154729, 5191699, 5254479, 5207365, 5215651, 5252405, 5307780, 5304771, 5188170, 5149440, 5020854, 4820029, 4725751, 4503031, 4335846, 4123157, 3954750, 3780402, 3539919, 3369974, 3234302, 3187238, 3129758, 3112765, 3067335, 3017762, 3019325, 3020319, 3051506, 3071769, 3059629, 3023580, 3033799, 3011130, 2998617, 2964714, 2922076, 2905971, 2899368, 2872569, 2899362, 2868041, 2810978, 2758501, 2748858, 2737000, 2698207, 2716293, 2749388, 2700191, 2613613, 2615430, 2656076, 2654102, 2587314, 2551614, 2558729, 2552200, 2565612, 2595314, 2599895, 2565188, 2636174, 2702101, 2689402, 2720107, 2659783, 2658785, 2736970, 2737289, 2754449, 2851708, 2834874, 2860714]
3702B860714M5835J8091M6400L7406L7713O7252L2002J04409Q0236K5669P9983
3691C435710n9776N9157J563N6898K7551l2366O424p4069k4396m4036N6842O6428
3679C475930k9017Q4050m776J6798M2087O9230J6925P9377J5093N5728O733L9631
3667C867789L024l203J06170P6542R0836k3491P7788M8634N5977Q0752J01478
3656D482296J70192Q9372J64418J38831O3874J94619J72482J89873J71120K70045
3646F107122K56883K11137K63264K76781L72999L72716L86216L89622M18132M51513
3636I506385M68145M32158N82050O78546P49381Q95446J051550J298050J641593
3627A7303304K042191K416882L010744L591961L965007M404486M621717M490284
$$ y = [2860714, 2906549, 2924640, 2971040, 3008446, 3046159, 3113411, 3145413, 3249822, 3330058, 3355727, 3435710, 3375934, 3435091, 3436654, 3493552, 3521103, 3488737, 3495161, 3421092, 3396696, 3352660, 3409502, 3475930, 3446913, 3530963, 3526187, 3542985, 3585072, 3654302, 3671227, 3750604, 3765697, 3821425, 3828158, 3867789, 3870813, 3867610, 3973780, 4050322, 4141158, 4117667, 4195455, 4244089, 4300066, 4380818, 4482296, 4652488, 4741860, 4906278, 5045109, 5108983, 5303602, 5476084, 5665957, 5837077, 6107122, 6364005, 6575142, 6838406, 7115187, 7488186, 7860902, 8247118, 8636740, 9054872, 9506385, 9974530, 10406688, 10988738, 11667284, 12416665, 13312111, 14363661, 15661711, 17303304, 19345495, 21762377, 24773121, 28365082, 32330089, 36734575, 41356292, 45846576]
3619D5846576M360087L912774L233105K478087J647286Q59446K75738k34343l65631
3610F2013125l59531j67048J78115O10984O94188P61409O46284K59846n4780o00822
3600F3981770j299380k035060k683478l205830l565414l764656l818980l719093
3592C9889879l533742l174293k796654k330908k020402j768826j473298j153502
3584B1638254j134672r23713q36797p98148o85752p30302o08349m75080m23734
3575A5021707m14176k78594k61100j38974n7875J5374K36256M28042N77112P30824
3565A5858596Q39120J029730J135272J248598J303926J243223J238027J137210
3557B5033702J011199P32279O07613M84939L45624L55604J45746J18731K38531
$$ y = [45846576, 50206663, 54119437, 57352542, 59830629, 61477915, 62337361, 62613099, 62378756, 62013125, 61653594, 61486546, 61664661, 62275645, 62969833, 63731242, 64377526, 64637372, 64582592, 63981770, 62682390, 60647330, 57963852, 54758022, 51192608, 47427952, 43608972, 39889879, 36356137, 33181844, 30385190, 28054282, 26033880, 24265054, 22791756, 21638254, 20503582, 19579869, 18743072, 17944924, 17259172, 16528870, 15920521, 15445441, 15021707, 14607531, 14328937, 14067837, 13928863, 13870988, 13886362, 14122618, 14550660, 15127772, 15858596, 16697716, 17727446, 18862718, 20111316, 21415242, 22658465, 23896492, 25033702, 26044901, 26777180, 27384793, 27869732, 28215356, 28570960, 28716706, 28835437, 29073968]
3548B9073968K20672K50380J92708L2357N045j33236k78794m06115o31164q28802
3538B7497019q43045j069721j103101j113423j023515q98682p91983p17116o47951
3529A9288482n66904m10025l08751k83958k30321j88772q2711q2874m7322N7638
3519A7144482L3899J00672J77441K42575K50896K18101K83652K69845J83819J42512
3509A9047894J21504J29178J05425J47382K00761P2365J32158K25216L32495L88556
3499B0902934L59556L87932M82856N72813O22059O27877P45547Q13245Q95283
3490B6410102J136488J336059J538041J664064K010305K292990K545145K957959
3482D1891153L218383L582140L905560M275435M609114N019123N327911N698537
$$ y = [29073968, 29294640, 29545020, 29737728, 29770085, 29775130, 29641894, 29363100, 28956985, 28325821, 27497019, 26653974, 25584253, 24481152, 23367729, 22344214, 21445532, 20653549, 19936433, 19288482, 18721578, 18311553, 18002802, 17718844, 17488523, 17299751, 17217040, 17134166, 17086844, 17144482, 17178381, 17279053, 17456494, 17699069, 17949965, 18168066, 18451718, 18721563, 18905382, 19047894, 19169398, 19298576, 19404001, 19551383, 19752144, 19824509, 19956667, 20181883, 20514378, 20902934, 21262490, 21650422, 22133278, 22706091, 23328150, 23956027, 24701574, 25514819, 26410102, 27546590, 28882649, 30420690, 32084754, 34095059, 36388049, 38933194, 41891153, 45109536, 48691676, 52597236, 56872671, 61481785, 66500908, 71828819, 77527356]
3474G7527356O071059O141041O311401O359153O256755O168695N965598N671532
3466A26472590N416040N112461M887827M552264M415900M200272L785591L464290
3458A62307235K854848K177665J390410O14758k10424j154469j851615k652902
3450A63475506l319936l865445m330591m603152m823541m968434n113943n047802
3442A27402662n007360m776619m415134l967436l306984k627149j780331r41467
3434A00580182K2266R98606J923767K639731L289319L663415L702372L626883
3426A20446541L067566K426143J684033Q34484j26245r00322j435446j925274
3418A24071480k111195k267048k141356j907104j535738j196230r48740n26193
$$ y = [77527356, 83598415, 89739456, 96050857, 102410010, 108666765, 114835460, 120801058, 126472590, 131888630, 137001091, 141888918, 146441182, 150857082, 155057354, 158842945, 162307235, 165162083, 167339748, 168730158, 169344916, 169134492, 167980023, 166128408, 163475506, 160155570, 156290125, 151959534, 147356382, 142532841, 137564407, 132450464, 127402662, 122395302, 117618683, 113203549, 109236113, 105929129, 103301980, 101521649, 100580182, 100602448, 101601054, 103524821, 106164552, 109453871, 113117286, 116819658, 120446541, 123514107, 125940250, 127624283, 128458767, 128332522, 127432200, 125996754, 124071480, 121960285, 119693237, 117551881, 115644777, 114109039, 112912809, 111964069, 111437876]
3410A11437876m87438o46517q39360j217666j806429k402343l073260l694966
3402I7269897m266621m622565m963760n094333n065613m855026m650436m400732
3394E9350811m030091l614217l129124k769778k300822j770852j306328q84441
3386C9545158l75769P02L11809M93639O69444Q52778R02064Q76121O73178N08666
3376D4457790M33398J95061J2872j45549l00322l41253m30997m16808l85652k49040
3366D2829500o9300O5738J34697K69246L45280K83960K48926J48726j280j26006
3356D4129487l81019n75176q18666j116353j185500j419232j561887j634707j746681
3347C3690266j690505j596208j532701j636587j583671j498912j476259j269620
$$ y = [111437876, 110950438, 110303921, 109464561, 108246895, 106440466, 104038123, 100964863, 97269897, 93003276, 88380711, 83416951, 78322618, 73257005, 68401979, 63751543, 59350811, 55320720, 51706503, 48577379, 45807601, 43506779, 41735927, 40429599, 39545158, 39169389, 39170091, 39481900, 39975539, 40644983, 41497761, 42399825, 43275946, 43949124, 44457790, 44891188, 45086249, 45099121, 44953572, 44653250, 44311997, 43881000, 43464192, 43078540, 42829500, 42760200, 42825938, 42960635, 43229881, 43575161, 43859121, 44108047, 44256773, 44255493, 44129487, 43748468, 43173292, 42354626, 41238273, 40052773, 38633541, 37071654, 35436947, 33690266, 31999761, 30403553, 28870852, 27234265, 25650594, 24151682, 22675423, 21405803]
3339B1405803j132176j004491r40332r12376p36872o23857n53952m43596l14927
3330A4743224k52233k36443q2551n0962Q3678J07736J48259K03932K80769L63079
3320A5308488M33979N57416O86184Q40579R15793J153743J430371J730532J973918
3311B5031003K377954K858930L419417M000780M595818N191572N652928N977273
3303E9105675O196511O265398O272450O007672N517157M727165L582133K407794
3295A00081955R59958k57253j522997k571684l469053m139496m539700m663793
3287G9877937m603644m322906l968879l549179l203506k957629k685536k592545
3279E1994113k541717k558242k654935k747398k837697k916162k924420k836360
$$ y = [21405803, 20273627, 19269136, 18328804, 17416428, 16679556, 16055699, 15501747, 15058151, 14743224, 14490991, 14254548, 14171997, 14121035, 14204713, 14312449, 14460708, 14664640, 14945409, 15308488, 15742467, 16299883, 16986067, 17826646, 18742439, 19896182, 21326553, 23057085, 25031003, 27408957, 30267887, 33687304, 37688084, 42283902, 47475474, 53128402, 59105675, 65302186, 71567584, 77840034, 83847706, 89364863, 94092028, 97674161, 100081955, 101041913, 100784660, 99261663, 96689979, 93220926, 89081430, 84541730, 79877937, 75274293, 70951387, 66982508, 63433329, 60229823, 57272194, 54586658, 51994113, 49452396, 46894154, 44239219, 41491821, 38654124, 35737962, 32813542, 29977182]
3271B9977182k788959k517537k286038k039590j875662j707872j374202j255158
3263A4132164j066658q55766p31497p17965o19702n01631l77772l91298l25960
3254H543915l46260l23026k06112k50710j42335j30989j09531j00116j14480l6397
3244F783959k8725Q4956p0088O5820J00683L3468k3727j8069p1925o3725j36229
3233F656398j33957j29303k49075j55591j41570j95788j66980j57290j26336j23638
3223E076870j00414o0489m7038p7211j24301j03377m8946J7542n7815q9152l3818
3212D351851J819J8338k726J02510O5200m0489N0970N1726J8725j0280O5836j1650
3200D661830N7986L7671K2110R6106R0564L2847j8891L8659L2421j0722Q5920
$$ y = [29977182, 27188223, 24670686, 22384648, 20345058, 18469396, 16761524, 15387322, 14132164, 13065506, 12209740, 11478243, 10760278, 10140576, 9638945, 9261173, 8869875, 8543915, 8197655, 7874629, 7668517, 7417807, 7275472, 7144483, 7034952, 6934836, 6820356, 6783959, 6755234, 6840190, 6770102, 6835922, 6936605, 6970073, 6946346, 6928277, 6856352, 6792627, 6656398, 6522441, 6393138, 6144063, 5988472, 5846902, 5651114, 5484134, 5326844, 5200508, 5076870, 4976456, 4915967, 4868929, 4791718, 4667417, 4564040, 4515094, 4532636, 4474821, 4385669, 4351851, 4353670, 4372008, 4369282, 4471792, 4536992, 4496503, 4547473, 4599199, 4617924, 4607644, 4673480, 4661830, 4719816, 4757487, 4779597, 4875703, 4966267, 4999114, 4980223, 5018882, 5051303, 5040581, 5126501]
3189E126501P8143J05108M7746p4813J4600L7632M8349O6731J2155M1924K9817
3178E533893P1859K9699o065L2974m4570N9709J18201Q1590P9255P3762J00147
3167F130454J26289N8811k1996O4677J31030R7154J06269K10025J64543J65453
3157G232709J85422K20068L74962K36647L34566L88178K55423L68804M27175N32031
3147A0555985M96737M08186L97661L36876L13017L13864K58219J13403R4200l558
3137A3284590O1831P3491l5968k3391K0405P248K5492J08086P9998K04614K01802
3126A4008198L06257K92028L64603M11190N76501Q18617J068763J377949J595223
3117B0819329J591406J391200R08559M07599J30141k21435m06564o35283p82782
$$ y = [5126501, 5204644, 5309752, 5357498, 5282685, 5297285, 5334917, 5383266, 5449997, 5462152, 5504076, 5533893, 5605752, 5635451, 5629386, 5662360, 5617790, 5677499, 5795700, 5877290, 5956545, 6030307, 6130454, 6256743, 6315554, 6293558, 6358235, 6489265, 6586419, 6692688, 6902713, 7067256, 7232709, 7418131, 7638199, 8013161, 8249808, 8584374, 8972552, 9227975, 9596779, 10023954, 10555985, 11052722, 11460908, 11858569, 12195445, 12508462, 12822326, 13080545, 13193948, 13288148, 13284590, 13346421, 13419912, 13383944, 13360553, 13380958, 13388206, 13413698, 13521784, 13601782, 13806396, 14008198, 14314455, 14606483, 14971086, 15382276, 15958777, 16777394, 17846157, 19224106, 20819329, 22410735, 23801935, 24710494, 25118093, 25248234, 25026799, 24620235, 23984952, 23202170]
3108B3202170p46007o94734o08646l68731k47338n1033O1282K35818L12487M38710
3098B1533978N88778O76584O92714P54771Q19235Q92667J055975J167837J304848
3089B9487387J585847J730132J890387K016457K225030K506845K948103L416145
3081D7806333M114128M961760N997507P279416Q261239Q814341R159312R736549
3073A06130585J1111656J4117540J9333407K7085605L6833122M6116519N1104737
3066C11833171M8004503L5851924J9860231N855504l876393j0262180j4567930
3059C92698830j8651552k3799857k8851296l1828373l2104565l0302808k7604157
3052A99556222k4776322k2454858k0301029j7963130j5776362j3460826j1222464
$$ y = [23202170, 22456163, 21761429, 21152783, 20784052, 20536714, 20485681, 20546963, 20782781, 21095268, 21533978, 22122756, 22799340, 23492054, 24246825, 25066060, 25958727, 27014702, 28182539, 29487387, 31073234, 32803366, 34693753, 36710210, 38935240, 41442085, 44390188, 47806333, 51920461, 56882221, 62879728, 70159144, 78420383, 87234724, 96394036, 106130585, 117242241, 131359781, 150693188, 177778793, 214611915, 260728434, 311833171, 359837674, 395689598, 415549829, 421405333, 417528940, 407266760, 392698830, 374047278, 350247421, 321396125, 289567752, 257463187, 227160379, 199556222, 174779900, 152325042, 132024013, 114060883, 98284521, 84823695, 73601231]
3045G3601231r077139p305102o038049m958537m186568l637865l137064k737990
3037C2522917k454652k120205j793999j536136j331539j205628j044362r90381
3029B0046015q43140o13315o78840n89359m20886m57809m51249l67325l82341
3020A5241751l87630m28093m24932m37487m62394l27678l36026l70513l76289
3011A1690709k98870k66618l19395k96084l15659k26301j35629j62386j20592
3002I549175j60337j49781j37408j71418k70274k42510k24900l48752l34470k98685
2992G210640k76925k47350k30642k76820k11756k20858j31881j73550k04618j66149
2982E070091j57995j10345j22486j56932q3483r7380r9824q5958n6893q6930n9633
$$ y = [73601231, 64524092, 57218990, 51180941, 46222404, 42035836, 38397971, 35260907, 32522917, 30068265, 27948060, 26154061, 24617925, 23286386, 22080758, 21036396, 20046015, 19202875, 18589560, 17910720, 17321361, 16900475, 16442666, 15991417, 15624092, 15241751, 14854121, 14426028, 14001096, 13563609, 13101215, 12773537, 12437511, 12066998, 11690709, 11391839, 11125221, 10805826, 10509742, 10194083, 9967782, 9832153, 9669767, 9549175, 9388838, 9239057, 9101649, 8930231, 8659957, 8417447, 8192547, 7843795, 7509325, 7210640, 6933715, 6686365, 6455723, 6178903, 5967147, 5746289, 5614408, 5440858, 5236240, 5070091, 4912096, 4801751, 4679265, 4522333, 4438850, 4341470, 4241646, 4155688, 4098795, 4011865, 3952232]
2971C952232o1641p3258O641o4259j0598o4964p9421m522j8911j42877m7134N293
2959C396581r8609j01387m9830j20310j2596l7775m9820j2152q0719l2895o7096
2948B733392j9853m8574j15394m1022p3980j19240p1847L1887o9304m4016k3016
2937B139033j34000m8613r8418n95j2871l7298p0712j9738J3455p3581m2531n8432
2925A555699k7422l5966r3281j1125J27503o68J2234k1495k8560K2179M3965J3604
2913A556667R393l1424O0616M8747q0261l4832N1949J7054N8637K8364M2448j0188
2901A717170r955p8515o5942q621l2649O178o1813J7152j01844p4172L6915j2393
2889A331511m323o9626M1796r781k4097K0492Q4515L5670L3281j3765o8435M7761
$$ y = [3952232, 3890591, 3817333, 3823974, 3759715, 3749117, 3684153, 3604732, 3600210, 3581299, 3438422, 3391288, 3396581, 3297972, 3196585, 3146755, 3026445, 3013849, 2976074, 2926254, 2914102, 2833383, 2800488, 2733392, 2713539, 2664965, 2549571, 2508549, 2434569, 2315329, 2243482, 2275369, 2206065, 2162049, 2139033, 2005033, 1956420, 1858002, 1857407, 1844536, 1807238, 1736526, 1716788, 1730243, 1656662, 1614131, 1555699, 1528277, 1492311, 1399030, 1387905, 1515408, 1514740, 1526974, 1505479, 1476919, 1499098, 1543063, 1556667, 1566060, 1534636, 1595252, 1643999, 1563738, 1528906, 1580855, 1597909, 1656546, 1684910, 1727358, 1717170, 1707215, 1628700, 1562758, 1554137, 1521488, 1527666, 1465853, 1483005, 1381161, 1306989, 1343904, 1331511, 1327188, 1257562, 1299358, 1289577, 1265480, 1285972, 1370487, 1406157, 1439438, 1425673, 1357238, 1404999]
2877A404999l9896K1841m917l5254l8386k5795j5745k0220q7094P212o436P562
2865A167871j091q0524p5719m6433j9404K1219o2486n3752r4998l1735m1529m8837
2853F32582l8241l9530k6464l2935o0458K5519K3979J3361O7187M3823K664K3563
2841F35050M4074J6257l9138q252q319J10253M8948l8669M3843K3551m1107N8778
2829H45269O083o0247J0458M7858j2563m8665p906O954N0631J7224p8860m2510
2817G33726J101N0070n576J1103L224m1787J8732l9113j0156L1000O0243J3971
2805H26538K1836K3532k0712L5574J7579j8226N3746K959L4881k1186J5083j7238
2793I54366Q1814M6239j0754Q8409O3954P4100J96610J75628K01850K01828K20025
$$ y = [1404999, 1365103, 1386944, 1382027, 1346773, 1308387, 1282592, 1266847, 1246627, 1159533, 1166745, 1160309, 1167871, 1166780, 1086256, 1010537, 964104, 944700, 965919, 903433, 849681, 754683, 722948, 681419, 632582, 594341, 554811, 528347, 495412, 434954, 460473, 484452, 497813, 565000, 608823, 611487, 635050, 679124, 695381, 656243, 647991, 639672, 749925, 798873, 760204, 804047, 827598, 786491, 845269, 851352, 791105, 801563, 849421, 836858, 788193, 780287, 787241, 837872, 855096, 776236, 733726, 734827, 784897, 779321, 790424, 793648, 751861, 770593, 731480, 721324, 752324, 812567, 826538, 848374, 871906, 851194, 886768, 904347, 886121, 939867, 942826, 977707, 956521, 971604, 954366, 1036180, 1082419, 1071665, 1160074, 1224028, 1298128, 1494738, 1670366, 1872216, 2074044, 2294069]
2782B294069K41902Q7004o0839j6837m4555o1459r1949j05832j46644j39519r6505
2771A858836j46317r6904j00583r6932o0596j48905j18611o9476n0974o1860o2921
2760H44757o9232n6680j5750L3136m1033n0054L681M896J0673L1500p2497l707
2748F19690M939m5251r0867n084K0435q543n5490l1092l2146K882O7517L6488
2736D83478K4230j6016k9887k4700K0901o469M1219K0347l9629l3091r71o1149
2724C78263J9132M287n4893J7424o0808l9313P9537M5489o543j9512L3564l3993
2712C62634N8881J8463P5309m6759q6844l635N0159R311k0082l0090n5988k8454
2700C02905J12543m1927n2342K4845j2705k2742l5996j2710m9228K2110J5581
$$ y = [2294069, 2535971, 2622975, 2562136, 2545299, 2500744, 2439285, 2347336, 2241504, 2094860, 1955341, 1858836, 1712519, 1615615, 1515032, 1418100, 1357504, 1208599, 1089988, 1020512, 969538, 907678, 844757, 775525, 718845, 703095, 736231, 695198, 645144, 648825, 653721, 664394, 695894, 623397, 619690, 624629, 579378, 488511, 483427, 503862, 495319, 439829, 408737, 376591, 379473, 446990, 483478, 507708, 491692, 461805, 437105, 458006, 451537, 492756, 513103, 473474, 440383, 439412, 378263, 397395, 401682, 346789, 364213, 303405, 264092, 343629, 389118, 382575, 363063, 396627, 362634, 421515, 439978, 515287, 468528, 381684, 378049, 428208, 437519, 417437, 387347, 331359, 302905, 415448, 373521, 321179, 346024, 333319, 310577, 274581, 261871, 212643, 234753, 250334]
2689B50334J4584l698K6799j4664l7397L2309j1470M5020m38o3282M9477R4900
2677C82474j0888m6447K1028l8375L056m5084m0471k2639N2899L7333o9994l9523
2665A83369L6305J1328l8583O1247l522o8770L0392Q195J3792Q0314n5167M8061
2653C06961k9154n4111O8241J2497n0817M469j2161K600L0196n7369j7578j6952
2641A86822j9608L5601L5979m6861O1178M3666o6976m5506M4402k1907L9101m9790
2629A96101J068N5746J2612Q4825m9231m8105n822j0882k7050Q065J1776n9412
2617A69691L309Q4724k2372n2264M2908q266j9416K4284j6464q347m2812o638
2605A48337K8567k3810J3597n2467o799K6762m6734Q5107k5721k4343L9190j0158
$$ y = [250334, 264918, 261220, 288019, 273355, 235958, 268267, 256797, 301817, 301379, 238097, 287574, 382474, 371586, 325139, 346167, 307792, 310848, 265764, 225293, 202654, 255553, 292886, 222892, 183369, 219674, 231002, 192419, 253666, 250144, 181374, 211766, 219961, 233753, 314067, 258900, 306961, 277807, 223696, 291937, 304434, 253617, 258086, 245925, 248525, 278721, 221352, 203774, 186822, 167214, 202815, 238794, 191933, 253111, 296777, 229801, 184295, 228697, 206790, 245891, 196101, 197169, 252915, 265527, 350352, 301121, 253016, 247194, 236312, 209262, 217327, 229103, 169691, 173000, 257724, 235352, 183088, 225996, 217730, 198314, 222598, 206134, 197787, 154975, 148337, 176904, 153094, 166691, 114224, 107425, 134187, 87453, 172560, 146839, 122496, 161686, 151528]
2593A51528j6808j3824K561M6935J3724n9443O9853P765M1K0806j1961L2432M3836
2580B87445P2288R930O2983M286q6228O7518M7391r4147p8272o286k2158k7371
2568B37379p8022J9781J970L8165k594K3598l4362l8440K4221k4309K7026m847
2556A89566R50n7341l7776L6054L0408L1261m7236m0875N0868K5088q0986n240
2544I4741L9239N3896j7508m8069L0279l4115k300M9897N621o2836J228n2605
2532E7468l5311P7361L2265J0846L3101K3938L827n7520o706J2329k842r781J1980
2519A50955n0230L2177K7626k8683M8659L6376J0615j2399j26531R894M8980J9078
2507A66517L6237l9295k7578q3997o177J7880J3638l3360L2336K1849n5152k3278
$$ y = [151528, 134720, 120896, 123457, 170392, 184116, 124673, 194526, 202291, 202332, 223138, 211177, 243609, 287445, 359733, 369663, 432646, 436932, 350704, 418222, 465613, 371466, 293194, 286908, 264750, 237379, 159357, 179138, 181108, 219273, 216679, 240277, 205915, 167475, 191696, 167387, 194413, 189566, 190516, 133175, 95399, 131453, 161861, 193122, 145886, 105011, 155879, 180967, 99981, 94741, 133980, 187876, 170368, 122299, 152578, 118463, 116163, 166060, 171681, 108845, 110073, 57468, 22157, 99518, 131783, 142629, 175730, 199668, 203495, 145975, 139269, 151598, 148756, 138975, 150955, 100725, 132902, 160528, 131845, 180504, 216880, 227495, 215096, 88565, 98459, 147439, 166517, 202754, 163459, 135881, 51884, 45707, 63587, 77225, 43865, 76201, 98050, 42898, 19620]
2495A9620J7124K475M1603L0083k4239J5716O9678n933J2818J8328n5940L3053
2483A74386J7305j2301j225N839J3449n0333j3445l071L6034J3604K8772P502
2471B16516j0561Q70n7162J1633K0230J1822r443L6215l6803J5240K1502j8917
2459B01142m1737J9527Q6863n3160J3088M4042j8620p0292N4305N2288K6524j2624
2447C01346k085K0579m253k434O216j4780J6043L9603n9116J5567J2460o0136
2435B69010n3379J5010L4028L9168l4072R008K9854r870o3277K5339l1149O6826
2423B96496L5620k5052p137O1454O137m7658L510k2620L3606N5170n6667J0312
2411C43171Q692j1592k3779l8884J2802M2741k0158J4722m095Q1583J6608p1853
$$ y = [19620, 36744, 39219, 80822, 110905, 86666, 102382, 172060, 166127, 178945, 197273, 141333, 174386, 191691, 179390, 178165, 184004, 197453, 147120, 133675, 130604, 166638, 180242, 209014, 216516, 205955, 206825, 149663, 161296, 181526, 193348, 183905, 220120, 183317, 198557, 220059, 201142, 159405, 178932, 265795, 212635, 225723, 269765, 251145, 180853, 235158, 287446, 313970, 301346, 299261, 319840, 315587, 313153, 319369, 304589, 320632, 360235, 301119, 316686, 329146, 269010, 215631, 230641, 264669, 303837, 269765, 278773, 308627, 298757, 235480, 260819, 229670, 296496, 332116, 307064, 299927, 361381, 367518, 319860, 323370, 300750, 334356, 389526, 332859, 343171, 351863, 340271, 316492, 277608, 290410, 333151, 312993, 327715, 323620, 405203, 421811, 349958]
2399C49958L7274L7889K055m5000m858P8359L0472K9682m475o0868k940J1583
2387D59131N9861R156N2313m3517L079K6187M2441m5852n3438m7558K6927p9328
2375D09402M0133n14m4522k136J9235P9364k0561K806R2069J17231K1790j2394
2363G01903K3068M3035M1511M7105k4425J0116m0872L1090N1367k4967K9229M4557
2351I32717J21804R329L4249P7434J12889L8640O7647Q3761K7363J8264R8897
2340A622994J29567L1424L7198J09296J97785J67138J15340K01143J98834L19590
2330C130309M14297L91837N63219N56678L74947L66408L81222M57548N83957P57088
2320G977510J017999J486460K207542L512008N833407Q730032J1346340J2389730
$$ y = [349958, 387232, 425121, 427176, 382176, 377318, 455677, 486149, 515831, 511356, 450488, 447548, 459131, 518992, 528148, 580461, 536944, 540023, 566210, 608651, 562799, 509361, 461803, 488730, 409402, 449535, 449021, 404499, 402363, 421598, 500962, 480401, 483207, 575276, 692507, 714297, 701903, 724971, 768006, 809517, 856622, 832197, 842313, 801441, 832531, 883898, 858931, 888160, 932717, 1054521, 1063850, 1098099, 1175533, 1288422, 1327062, 1394709, 1478470, 1505833, 1524097, 1622994, 1752561, 1783985, 1821183, 1930479, 2128264, 2295402, 2410742, 2611885, 2810719, 3130309, 3544606, 3936443, 4499662, 5056340, 5431287, 5797695, 6178917, 6636465, 7220422, 7977510, 8995509, 10481969, 12689511, 16201519, 22034926, 30764958, 42111298, 54501028]
2312E4501028R083765L066382j052418l118095m939902o002428o206773o837903
2304C8493656o618200n773780n169632m158339k839082j837744j197798q99153
2296I999928r48463q05658p27272p74840o97826o19788n54073m07059l60192l37726
2286C767031k91789k09190k09072j85912j55086k23670j08161n4559n020j16448
2276B208124q3150p8864P53m5348L581q0312L3764j5587o8974q1785j16809q8325
2264A587068m1431m6616K3524k013j48079o7944k0315M42Q877p4471l4085r987
2252A174970j2226L050K0341j3788k2930k6348k2978l187o7349k3312K765l4606
2240I74402p3634k9906o0073m3549l3796m8018j2023J0955N430j3766r1254l3889
$$ y = [54501028, 63584793, 66651175, 65598757, 62480662, 57540760, 51538332, 45331559, 38493656, 31875456, 26101676, 20932044, 16773705, 13934623, 12096879, 10899081, 9999928, 9051465, 8245807, 7518535, 6743695, 6045869, 5426081, 4872008, 4464949, 4104757, 3767031, 3475242, 3266052, 3056980, 2871068, 2715982, 2492312, 2384151, 2329592, 2324572, 2208124, 2124974, 2046110, 2046863, 2001515, 2005096, 1924784, 1958548, 1942961, 1873987, 1792202, 1675393, 1587068, 1545637, 1499021, 1522545, 1520532, 1372453, 1304509, 1284194, 1284636, 1293513, 1219042, 1184957, 1174970, 1162744, 1165794, 1186135, 1172347, 1149417, 1123069, 1100091, 1096904, 1029555, 1006243, 1009008, 974402, 900768, 870862, 810789, 767240, 733444, 685426, 673403, 684358, 689788, 676022, 584768, 550879]
2228E50879k2279m0019J07238P6346q1753k4129l1812K1241O7318l9725k7793
2217E55512L2860k0666l3433J1677K7363l3765K9799J0796n4305p0580k7849K4143
2205D51552K0317j2271L730j2567j7104K8542K7612l7032m7091Q306l1290l8019
2193C44685m0957N2835M4416m1977j8018l6240l517m3584O1339P11J4535o9865
2181B64363j5721q247J6264K4639L3002Q971o6431J4412Q305n0186r149K9213
2169B49435n6013M4627L4472l2421j0032K9225k7689p9354O0855L8709j4977R431
2157B46268m9057K0866j1207K9290l1298l5449K5837K8096j2577j6440R590K310
2145B06229n952K8949j6519J8603J2401R538m2949l4841Q358O127J410m3526k1981
$$ y = [550879, 528600, 488581, 595819, 672165, 590412, 566283, 534471, 555712, 623030, 583305, 555512, 588372, 567706, 534273, 545950, 573313, 539548, 569347, 580143, 525838, 455258, 427409, 451552, 471869, 459598, 463328, 450761, 433657, 462199, 489811, 452779, 405688, 413994, 382704, 344685, 303728, 356563, 400979, 359002, 340984, 304744, 301227, 257643, 318982, 319693, 334228, 264363, 248642, 240395, 256659, 281298, 314300, 323271, 256840, 271252, 279557, 229371, 220222, 249435, 193422, 238049, 272521, 240100, 230068, 259293, 231604, 152250, 213105, 251814, 236837, 246268, 197211, 218077, 206870, 236160, 204862, 169413, 195250, 223346, 210769, 194329, 203919, 206229, 200277, 229226, 212707, 231310, 243711, 253249, 210300, 175459, 183817, 189944, 191354, 147828, 125847]
2132A25847L0263k371j3867J10303m2205m0785N0166L5155r482n9309m192L7074
2120B16597P073k9550k9300j0208j3636l8500l9757Q9230L2564m2322j5343L3103
2108A59951n965L9161j4533j04250n70k8733N77Q97M0857n7792K7241M9168j74
2095A05835L4203k5277M2639m988k8654K1588o1184K0161l211J3563L4278J9472
2083A68425k0268L5633N588q5177J9517K3426r563J385j3279l6391K3406J5330
2071A28032p4090R956J4008k832j5372k5492R2811m6101Q531K0306L1705l923
2059A37539K6467O750m4098N9022l5586Q138o712q8332N7518O5554l790O5772
2047B48242k9831P921Q4588M0079M0283L7936K2916j30110J7280M3732N5811q6215
$$ y = [125847, 156110, 153739, 139872, 250175, 207970, 167185, 217351, 252506, 243024, 183715, 179523, 216597, 223670, 194120, 164820, 154612, 140976, 102476, 62719, 151949, 184513, 142191, 126848, 159951, 153986, 193147, 178614, 74364, 73794, 45061, 45638, 46535, 87392, 29600, 56841, 106009, 105835, 140038, 114761, 157400, 152412, 123758, 145346, 84162, 104323, 101112, 114675, 148953, 168425, 148157, 183790, 189378, 104201, 123718, 147144, 137581, 138966, 125687, 89296, 112702, 128032, 53942, 63898, 77906, 75074, 59702, 34210, 127021, 80920, 89451, 109757, 141462, 137539, 164006, 170756, 126658, 185680, 150094, 158232, 151520, 63188, 120706, 186260, 182470, 248242, 218411, 226332, 310920, 350999, 391282, 429218, 452134, 322024, 339304, 383036, 438847, 352632]
2035C52632n3901o0201k6186j9305p7103J640j8596N3603o151o4862m0264N7086
2023I8392K5393Q033r119l6655J9885J4242L2971k4777n5644M1374J8852q057
2011A24890m6161k9482K5940R5045n2823m6664J0280l8099m4362K7991K9968J5886
1999G2409M76K343j5069l4097Q518j3053L8901N9645j6249k8551j824K1641l737
1986I1353J4925n4736J9326J3617q5764L6000N3746L9579k4096p2705O9722m7978
1974E2989j0348M6733n3978p864J7509j4037k1364l4994j5621R439k68l1120M7947
1961a4977k0680L8723O4384o3075P379L8382m7645k5363R5447r01K7531N3683
1949A52888j09431m4542L9769o7495N5621Q924j6513L8242k2426N534P080k5822
$$ y = [352632, 298731, 238530, 212344, 193039, 115936, 117576, 98980, 152583, 146432, 81570, 41306, 98392, 123785, 131818, 122699, 86044, 105929, 120171, 153142, 128365, 72721, 114095, 132947, 124890, 78729, 49247, 75187, 170232, 117409, 70745, 81025, 42926, -1436, 26555, 56523, 72409, 72885, 75228, 60159, 26062, 34580, 21527, 60428, 120073, 103824, 75273, 73449, 95090, 91353, 106278, 51542, 70868, 84485, -1279, 34721, 88467, 128046, 103950, 31245, 100967, 52989, 42641, 89374, 35396, 27532, 45041, 31004, 9640, -25354, -40975, -31536, -31804, -62924, -14977, -35657, 3066, 67450, 4375, 11754, 50136, 2491, -22872, 72575, 71674, 99205, 152888, 43457, -1085, 38684, -28811, 26810, 35734, 19221, 57463, 35037, 40571, 47651, 21829]
1937B1829n868R662j4024K6702L2585N3438k3223m3792k35l020J1842k5748Q40
1924D0988M529N8890l0974n0072j1041J1230J3089m8070q2Q460n326Q0116N330
1911G7067p247l3758J6875O3320k367k1426l6458m6022J8719J0520N707l3134
1899A1796l1885K2165m6589M6362Q3076r632M596m2785q402l8246O9783K8526
1887H8765q1454J7206J5826k1794k9099m4958O2826l1558M5167M2161k9471K7811
1875F1428m1884q4291K1680J02691N2275K1350q3955k3058k4260P969L4376K3473
1863F7794k5815J8037J5900p4867n2935R235O0678k0443j9752P1572J4568j2720
1851E1252o1677K6199Q921p031L3295l1417j9310m438K0637M2279k2878m4235
$$ y = [21829, 15961, 25623, 11599, 38301, 70886, 124324, 101101, 57309, 57074, 54054, 65896, 40148, 40988, 45517, 104407, 73433, 23361, 12320, 23550, 36639, -11431, -11513, -3053, -8379, 71737, 77067, 69820, 36062, 52937, 116257, 113890, 92464, 56006, 9984, 28703, 39223, 44930, 11796, -20089, 2076, -44513, 1849, 84925, 75293, 79889, 37104, 28702, -9544, 60239, 88765, 7311, 24517, 40343, 18549, -10550, -55508, 7318, -24240, 20927, 63088, 33617, 61428, 19544, -64747, -43067, 59624, 111899, 133249, 49294, 26236, 1976, 9945, 44321, 67794, 41979, 60016, 75916, 1049, -51886, -42651, 18027, -2416, -22168, 49404, 63972, 51252, -10425, 15774, 24695, 17664, 50959, 19542, 232, -4206, 16431, 58710, 35832, -8403]
1839h403n5126L7139K9853L1604q213j9610k0263j606j8761K8365L6974n9130
1827b7177l364M77K8138O374L9067k5841m9668J14785M0504m8160K4986l4012
1815F6109m6279J1539k9632J2625J8908n1446K7199M6640N518o1409M0436K0981
1803F1189n8316L0568o8589K0594J5988K7565L758r381l8989M5407n221K4863
1791D9436j8319m5034N1712l2141O8308o4141l0043J3735P095N5756J8792p6928
1779a772N550M890k6528M9876K7574j9004p7110J6604L6331Q288n0313L9847Q180
1766B2413k9856L0551q045M5340q958j3726Q213p784o016O65N6015j2613n2101
1753B4098O7904m5856j26528K4459m560N1512L4989n5169K3988L0184q053j2610
$$ y = [-8403, -63529, -26390, 3463, 35067, 26854, 7244, -13019, -14625, -33386, -5021, 31953, -27177, -30541, -30064, -1926, 4448, 43515, 17674, -31994, 82791, 123295, 75135, 100121, 66109, 19830, 31369, 1737, 14362, 33270, -18176, 9023, 55663, 61181, -228, 40208, 61189, 2873, 33441, -35148, -14554, 1434, 28999, 32757, 23376, -15613, 29794, 24573, 49436, 31117, -13917, 37795, 5654, 73962, 9821, -20222, -6487, 608, 56364, 75156, -1772, 3778, 8668, -17860, 32016, 59590, 40586, -36524, -19920, 16411, 24699, -25614, 14233, 22413, -7443, 23108, 15063, 60403, 51445, 37719, 45932, 38148, 32132, 32797, 88812, 76199, 24098, 92002, 46146, -80382, -55923, -60483, -8971, 26018, -29151, -5163, 25021, 16968, 4358]
1741D358L6463L5507Q057l4433n5602O7596k7338K9808K5009q2356K447p043M6369
1728D8842P5020j0113j0176k3675q7305Q522q392M0689P177j4467j7596K9978
1716C8504K7345n2438J7176k2642o7616N2294P008L4856l9311Q1477K6753q4396
1704A9010J7794l0289n4309Q844R9810L1990p0892m6704m150J18193K6047p7110
1692C8234K1141j26465j1131N0415R299Q6314k4137m1321k4839k5387O399R1296
1680D9818l541o347M935r332L2648l4365K7308K4315k5247l3607M2522K8281r59
1667I6429K751n1499n234J1238l899r909K5264J4107J6251k7597p0228M8709m1466
1654D917n6687J10508o159k0188n879k1378M2870m5326O651K2128N0462K767m6533
$$ y = [4358, 40821, 76328, 84385, 49952, -5650, 61946, 34608, 64416, 89425, 7069, 9516, 2473, 48842, 123862, 113749, 103573, 79898, -7407, 1115, -7277, 33412, 40589, 26122, 8526, 38504, 65849, 13411, 30587, 7945, -59671, -7377, -369, 34487, -4824, 76653, 103406, 19010, 36804, 6515, -47794, -38950, 60860, 92850, 21958, -24746, -28896, 89297, 115344, 38234, 59375, -67090, -78221, -27806, -18507, 67807, 43670, 2349, -22490, -47877, -41478, 49818, 46277, 39930, 44865, 35533, 68181, 33816, 61124, 85439, 60192, 26585, 69107, 97388, 96429, 99180, 47681, 42447, 53685, 49786, 39877, 65141, 79248, 95499, 67902, -2326, 46383, 4917, -51770, 58738, 52579, 32391, 26512, 5134, 48004, 2678, 9329, 31457, 81919, 84686, 38153]
1641C8153J1511m6329J804j9533l396P1004n4747N6284m9112n6201N9077K5454
1629C3969k8735N3162J6526P347K200q7259k9852Q2234M5669L5848p4179j06567
1617d9637R0972m734j2374j1217n781r977M063m8105K6014J8156L6247L7969j6278
1604E5318k1472Q834o066n615l1017j5419R773J7816j3796m1576L1159O116O9888
1591F3943k7743m8247J6139L6880L231M4307o4651l0240M1689m5570J3313Q0052
1579H3103k8576l4492j5365R3138M1434q5801l8568r56J1987k221R868j2115p291
1566A4145j7249P910q836n551K5063n998l3053L7354N378j8757M6899o291j572
1553C9442M1582M4014j5375l0440m3981k4051L8920K3995m2836j5104j596L7333
$$ y = [38153, 49664, 3335, 5139, -14394, -17790, 53214, -1533, 54751, 5639, -50562, 8515, 33969, 5234, 58396, 74922, 82269, 84469, -2790, -32642, 49592, 95261, 131109, 56930, -49637, 41335, 36601, 24227, 13010, 7229, -2748, 1315, -46790, -20776, -2620, 33627, 71596, 55318, 33846, 42680, 36614, 30999, -18, -15437, -5664, 12152, -1644, -43220, -12061, -5945, 63943, 36200, -12047, 4092, 40972, 44203, 88510, 23859, -6381, 35308, -10262, 3051, 83103, 54527, 20035, 4670, 97808, 139242, 53441, 14873, 13917, 25904, 23683, 33551, 21436, 14145, -3104, 4806, -4030, -9581, 15482, 9484, -23569, 13785, 19163, 406, 47305, 41014, 39442, 81024, 125038, 109663, 79223, 35242, 11191, 50111, 74106, 31270, 16166, 14570, 51903]
1541E1903k498r1902P092q134J6255O2153m904q261N0308M6200o2652m7886J1676
1528A9350M1846k1008l289L7870q1659j5649J6600P313k3213P392L4105j2122
1516G536k4654M5057R9725k3815j05869P674K3298L8397P0369o4516k5326J8507
1504F6383p2216J6030r905j965M08n394j183L2390m147K8277j6838j2794M011
1491B3057p448k4355K9542p6410K043O0982N498M393K5516N872o2597P9806m2651
1478B3248n1512P29J6799N2047J1282Q889R441l2408J6399P456p0780L235N010
1465a65O0388R082k6739K7456n0560k7923N1562K2687K8482j6857o8229K1356
1453C0540m595R966p506M0101L216l9641j8348M3305J4532j0527q8337K4406K6016
$$ y = [51903, 49405, -42497, -35405, -43539, -27284, 34869, 29965, 21704, 72012, 118212, 55560, 7674, 19350, 61196, 40188, 36899, 74769, -6890, -22539, -5939, 1374, -21839, -14447, 19658, 7536, -17118, 27939, 127664, 103849, -2020, 5654, 28952, 67349, 137718, 73202, 47876, 66383, -5833, 10197, 292, -1673, -1265, -6659, -7842, 24548, 20401, 48678, 31840, 19046, 23057, 15609, -8746, 20796, -55614, -53571, 7411, 12909, 17302, 42818, 48690, -13907, 65899, 23248, -28264, -27535, -10736, 41311, 52593, 61482, 70923, 38515, 54914, 62370, -8410, -5175, -165, 60223, 69305, 42566, 70022, 19462, -8461, 43101, 65788, 94270, 77413, 9184, 30540, 25945, 35911, 28405, 68506, 71722, 32081, 13733, 57038, 71570, 61043, -27294, -2888, 23128]
1440B3128k0710l4894J3871L5699R984J8211l4897j1658O054m5318p39l2981M725
1427f9525k0562J4695J0044K9533M9691M602k5606l3943O5009K3490m9129N3212
1415E1511O72j06498Q7001J0490l3563Q0023j7155m1312P028l7801j5000k8560
1403d3164J5062K1265O2780j3272n5636K1574O227J3920N250K4955n1353k8564
1391b0956M8698k6366N9622k1998j234K2239J9136j07748l2757J02404J1071m2248
1379I863m6738n0841R2208p9573M8439P1214m4062o1018M9585M4059l6833n537
1367i234N648p337n8791O2225M202N9757l8666K0127J8696N4700l4916l4160j6591
1354B5660p816J9214M4186L5523r1343O671l1876o1304K2101M249O6393J4970
$$ y = [23128, 2418, -32476, -18605, 17094, 27078, 45289, 10392, -1266, 4788, -40530, -41269, -74250, -69525, -90087, -75392, -65348, -35815, 13876, 18478, -7128, -41071, 23938, 47428, -1701, 51511, 52183, -54315, 32686, 43176, 9613, 89636, 72481, 31169, 38197, 396, -14604, -43164, -28102, -6837, 55943, 42671, -12965, 8609, 14836, 28756, 34006, 58961, 7608, -20956, 27742, 1376, 60998, 39000, 37766, 60005, 79141, -28607, -61364, 41040, 52111, 9863, -36875, -87716, 4492, -75081, -26642, 44572, 510, -60508, -10923, 33136, -3697, -9234, -3586, -10923, -69714, -7489, -3287, 56470, 17804, 37931, 56627, 111327, 76411, 42251, 25660, 17844, 37058, 81244, 116767, 25424, 32095, 219, -61085, -38984, -34735, 31658, 46628]
1342D6628o315l7446m2177K2075q690P9029K2552m1616P748J745k6102l6596K7782
1329H617l6416K2007k2055Q813N811K3706j1694j0612N1613o8164O1267o1791
1317b8898l5329M6051K554K0541k1926M5724M0586k9994L6106L7472r2152q24
1305A9911J1604M3425j6631l554j7606o6604M6733p543l8283k8599l644P2888
1293A2097P452K9143k8162p7828Q547L1847M8863l828K052K9223J4181m2140k7241
1280D206J3293j0130j2898m9776p7383M7857J19177K1504o9765J3058l1301l1695
1268f3853J6130O6138R2439r1051k5425j3130m8030P52K3394L2823L9750M6340
1256G6277P120p6597J4977M3931j8513l763J7553R083m7289K2717n1752K0727
$$ y = [46628, 40313, 2867, -39310, -17235, -25925, 53104, 75656, 34040, 41788, 43533, 17431, -19165, 8617, -27799, -5792, -27847, -19034, -13223, 10483, -1211, -11823, 39790, -28374, 32893, -28898, -64227, -18176, -15622, 4919, -17007, 28717, 69303, 39309, 75415, 112887, 20735, 19911, 31515, 74940, 58309, 54755, 37149, -29455, 17278, 9735, -28548, -57147, -60791, 12097, 19549, 48692, 20530, -57298, -48751, -16904, 31959, 28131, 30183, 59406, 73587, 31447, 4206, 17499, 7369, -5529, -55305, -132688, -84831, 34346, 55850, -13915, -857, -32158, -63853, -47723, 18415, 110854, 19803, -5622, -18752, -66782, -66030, -42636, -9813, 29937, 76277, 83397, 6800, 21777, 65708, 47195, 43432, 60985, 70068, 22779, 45496, -6256, 14471]
1244A4471r448K8216m1321q585o107J0844M3919J9063m3157L0784O867p9372M213
1231b9613j6837O68r705p2231k2463J3135l870J2970Q450M3049P5883J292M73
1218A201L5369m6770K0161j1440J4560l4964o4130N5850Q8150J5354j8310n3293
1206A738L1625k0294o4891M2795k42j00644L9104P3944J1933O5055n1283k1968
1194F872L1984J156j5214j1981L9548k068K9123J7772n4480k4863L1191j7807
1182C1233K161j2854m4824M0567J2908r90j4625l7416m5428q840K59N4320j1493
1169c5022M1359L2359m9613K802O474j9410J3248j2122K7310K3063K6830L2065
1157H9343n423j7653n2971l9498P3204r498j4574j324p159l3974o4175L1047J5810
$$ y = [14471, 5023, 33239, -8082, -16667, -22774, -11930, 31989, 51052, 7895, 38679, 45546, -33826, -29613, -46450, -45782, -55487, -127718, -150181, -137046, -140916, -127946, -119496, -76447, -564, 728, 1201, 36570, -10200, 9961, -1479, 13081, -21883, -86013, -30163, 57987, 73341, 55031, 1738, 33363, 13069, -51822, -9027, -9269, -109913, -70809, 3135, 15068, 80123, 28840, 6872, 38856, 40012, 24798, 12817, 52365, 50297, 79420, 97192, 42712, 17849, 49040, 31233, 33394, 20540, -24284, 16283, 29191, 28201, 13576, -23840, -69268, -78108, -77849, -23529, -35022, 6337, 38696, -10917, -8115, -1641, -21051, -7803, -19925, 7385, 30448, 57278, 89343, 83920, 66267, 13296, -26202, 47002, 37504, 22930, 21606, 14447, -19527, -83702, -52655, -36845]
1144c6845L2605j7544R461L1532J7336Q894n7433l0874p204l4045K4358j8768
1132g8527P1152O473J3087Q4068J6795j0909r171J1982j0166o5365o7102j6917
1120e4600P4223j7712L4229m3389n9881P0551N2382J8734m764o3698j7494j1767
1108b3186L0537l6668K3856M4599j6628k2359R581J7109L869M3390k7453o9118
1096b2471p9558O9572J9251J5150M7043N3575p5751l5102r508L6319k1024k7660
1084c0164J0425K0744J3645m6234o390k7446L2464N1619M2278q1726j7449M6366
1072H132k5000r478M6912N675O650k8446J4498r3453k8297J12860K2037o2768
1060c0678l063p586l9179O3839J7568n9055O9129j0421o902K7541q7237O4384
$$ y = [-36845, -4240, -21784, -12323, 19209, 36545, 45439, -11994, -42868, -50072, -84117, -59759, -78527, -7375, -902, 12185, 96253, 113048, 102139, 92968, 104950, 94784, 29419, -37683, -54600, 19623, 1911, 36140, -7249, -67130, 3421, 55803, 74537, 69773, 6075, -11419, -23186, 7351, -29317, -5461, 39138, 22510, 151, 9732, 26841, 30710, 74100, 46647, -22471, -102029, -32457, -13206, 1944, 48987, 102562, 26811, -8291, -17799, 18520, -2504, -30164, -19739, 1005, 14650, -31584, -37974, -65420, -32956, 18663, 60941, -20785, -38234, 8132, -16868, -26346, 20566, 26241, 32891, 4445, 18943, -74510, -102807, 10053, 32090, -30678, -33741, -41327, -80506, -16667, 901, -58154, 10975, 554, -6348, 21193, -66044, -1660]
1048a660K0593J9504J5693r8914L4635j7710J1649o3344l0833J6705P173R8213
1036A1704Q10j1254j2748l3000M462P1648n6215l7077n9011J02239N1420l3884
1024i06k5741N3294Q056n9884j6426M0671n2381K0267Q784l6044L0623P272k7324
1011d9739m110P1916j958j7188N7299o5362p2562L8999M8172o5496O2605J3034
999A5610J9426l422k1106J5775k8522k9177l242J2113N0878L589k1060J3747q068
986A6541K3485l7401k3890j1711L718O7912m8331l1364M4533j4944L0149j5772
974B925O3540o190n8738r3125N4631O2867m4069m7636k0050R0290j1582p2760
962g9897k5417N4075M6955l8490L138Q5603k5475q4526K7382j2803k2694J9969
$$ y = [-1660, 18933, 38437, 54130, -44784, -10149, -27859, -16210, -79554, -110387, -93682, -86509, 11704, 12514, 1260, -11488, -44488, -40026, 31622, -24593, -61670, -120681, -18442, 32978, -906, -26647, 26647, 34703, -25181, -41607, -936, -53317, -33050, -24266, -60310, -29687, -22415, -49739, -53849, 18067, 16109, -1079, 56220, -9142, -81704, -42705, 5467, -60029, 2576, 15610, 35036, 31614, 10508, 26283, -2239, -31416, -34658, -22545, 28333, 31922, 10862, 24609, 16541, 40026, 2625, -21265, -32976, -29258, 38654, -9677, -41041, 3492, -11452, 18697, 2925, 66465, 60275, 1537, -91588, -36957, 25910, -18159, -65795, -85845, 4445, -7137, -79897, -105314, -51239, -4284, -42774, -39636, 45967, 20492, -64034, -36652, -49455, -72149, -52180]
950e2180M7414k7511L4001L6326o1332j4595j0279J9782M6557j3048J07345o766
938A05714o3479J705R987n2446K1805M957n9395K6991J9338j6804J2637m2736
926c1726L3994M8836j2752K638p565j9053k7568J4067O1686l7667Q73J0189j7205
913A8747o4863R148J3289m1694N1470N8742K8829j9670o8563K8718m895L504J8837
900C1599n0151K5952L9723j0622J2337L1738j9937l4753J0343j585L7059k3863
888D7840m0540J0259O1109L498r8020n3422o990O732K6048K5106L3119N94m1793
875b6460N2987M530L5762q5294j8740J8569o1602j6585R0779K217l9237q44j4909
862e8827J1573L7889l3603N730l0857J6321K6072j9623J9190j9907q069r57L3297
$$ y = [-52180, -4766, -32277, 1724, 38050, -23282, -37877, -48156, -28374, 18183, 5135, 112480, 105714, 42235, 43940, 53927, 1481, 23286, 28243, -31152, -4161, 15177, -1627, 11010, -31726, 2268, 51104, 38352, 40990, 33425, 14372, -13196, 871, 62557, 24890, 25763, 35952, 18747, -46116, -36968, -23679, -65373, -13903, 44839, 73668, 53998, -14565, 14153, 9258, 12762, 31599, -18552, 7400, 47123, 36501, 48838, 80576, 60639, 25886, 36229, 34644, 71703, 47840, 7300, 17559, 78668, 82166, -15854, -69276, -76266, -69534, -43486, -18380, 14739, 15333, -26460, 26527, 31057, 66819, -18475, -37215, -18646, -80248, -96833, -6054, -3837, -43074, -43918, -58827, -47254, -9365, -42968, -37238, -68095, -51774, -25702, -45325, -26135, -46042, -54111, -55068, -21771]
849b1771M7001P2333o4218k1158j8545j06826M849j9741L024J4610M0353N001
837f5088M5963P1175J1119l4139N9068n2714J2070p4683p8873N2325J247K7632
825b4898m4496R385N7943M0O501n1789m720P3643M3622j00225J6000K7209k115
812F100M577k3197R2410l3366p36k0302n8532J2564Q255J7340L3678J1742P042
799E7575r875m6758o207m5701M3378j1626K781n2206J3044J12966j319K0022p5556
786E18l6777J5782l338k092j0813k8969M6644k471k4416m011K2513K6533J4819
773A3922K5590o7419j4298O6706Q625K8170o0646j3032j9113p440j3246M3227
761h954j5710n5336n735K9788P004K4681o9950J0154j2742L7346N4999N6907P485
$$ y = [-21771, 25230, 97563, 33345, 12187, -6358, -113184, -108335, -128076, -125052, -110442, -70089, -65088, -19125, 52050, 63169, 29030, 88098, 35384, 47454, -27229, -106102, -53777, -52530, -24898, -69394, -60009, -2066, -2026, 4475, -47314, -52034, 21609, 65231, -34994, -18994, 8215, 6100, 10677, -12520, 79890, 46524, 45788, 25486, -33046, -20482, -12227, 5113, 38791, 50533, 57575, 47700, 942, -5265, -50966, -7588, -19214, -16433, -68639, -55595, 57371, 56052, 76074, 518, -36259, -20477, -23815, -25907, -36720, -65689, -19045, -21516, -45932, -49943, -27430, -897, 13922, 39512, -27907, -42205, 24501, 33126, 61296, 650, -12382, -31495, -38935, -52181, -8954, -24664, -80000, -85735, -55947, -48943, -24262, -94212, -84058, -96800, -59454, -4455, 52452, 59937]
748E9937l0618L8349M326n5110J1071n2483Jl363j1239K3843k7512j0949j1841
735f5588K2167O5622l0722n8590M7206L7631J5831o6097L4640N43p987R71r520
722a3893N631K6519K5723m3329K8069L031J8869l211l3532k4819j8547q667o5892
709a04048Q383r843J8300N2157K8973J7989j7722k637O2847o3597n5870N2494
697a2574k0612q5164J7398K2838K9919k6417M0170m035k6196J7573K652m982k561
684e1991P271k3094l2784R5289m2761n517n918O7227K9743p0733j8930N7449l2129
671b6878J6779j6070m3336Q1070J5704J3091J9337m6514o749M6990n7403m4202
659d8181M1413n8006j3053L8864J422K746K7071k7599m4682L4782k478K8726K1427
$$ y = [59937, 29319, 67668, 71994, 16884, 27955, -24528, -24527, -27890, -39129, -15286, -42798, -53747, -65588, -43421, 22201, -8521, -67111, -19905, 17726, 33557, -32540, 2100, 2643, -5344, -4373, -13893, -8262, 18257, 43980, 651, 28720, 31751, 50620, 47409, 13877, -10942, -29489, -38156, -104048, -95665, -105508, -87208, -35051, -6078, 11911, -5811, -8448, 54399, -9198, -65068, -12574, -33186, -118350, -100952, -78114, -48195, -74612, -34442, -38477, -64673, -47100, -44448, -49430, -51991, -44720, -67814, -100598, -5309, -48070, -53587, -59505, 7722, 37465, -33268, -52198, 5251, -26878, -10099, -26169, -69505, 11565, 27269, 40360, 59697, 13183, 6434, 53424, -3979, -48181, -6768, -64774, -77827, -38963, -37541, -34795, -7724, -35323, -80005, -45223, -47701, -18975, 2452]
646B452M4366M075L5153k3633J3317l2820l8924l7009l3971N8763o4083m2323
634a14637O9742r716k1682J6928M0338K7141J4433q039M5999p1567j3710O5745
622D0975j4361l3095K0452p7340N2525M9054m6711J8248r279m9620O6423r5573
610g8302l663l0150L4389J6700J6794K0882j92J8905q400J7652K0113K2850n3414
597e836m5273P552M0048k6194L5639n8741m9428M9497J1139l1075J0893K9734
585c2045Q109J8130k264l1732J6188j9365M2144L0631l0822k712n2470k6500L5827
572d6881m987P2128k9024J2012p3562m2467K760O9911J8628J8480m2729k016Q5706
559C7959n410j02947p942K6364q538j9158K9213N9906J5647l3233l1290L7954
$$ y = [2452, 46818, 50893, 86046, 62413, 75730, 42910, 3986, -33023, -66994, -8231, -72314, -114637, -44895, -54611, -76293, -59365, -19027, 8114, 22547, 14508, 60507, -11060, -24770, 40975, 26614, -6481, 13971, -63369, -10844, 38210, -8501, 9747, 468, -49152, 17271, -78302, -81965, -112115, -77726, -61026, -44232, -23350, -23542, -4637, -13037, 4615, 24728, 47578, -5836, -51109, -43557, -3509, -29703, 5936, -52805, -102233, -52736, -41597, -72672, -61779, -32045, -23936, -5806, -8070, -39802, -23614, -42979, -835, 29796, -1026, -3738, -56208, -82708, -46881, -51868, 20260, -8764, 3248, -70314, -112781, -110021, -40110, -21482, -3002, -45731, -47747, 37959, 32549, -70398, -78340, -51976, -60514, -79672, -50459, 9447, 25094, -8139, -39429, -1475]
547a475j088q6907J1280O1280P690M5774n352k8592J8984j9626j1415r702j7649
534c6798k084o94N032l4398J07847J9672k4107j0409l5102J6002l0369K7232R05
521B729J371L5022q1124k2580L757j8399J1067P9476M2813j5418k9614r45l4440
508b6285O6875J8543l8582P314k9860N9487m1321k8316p090K2382M1323q6266
496d1796M4101J4730m5389k111o215l3251K5995N7217J9088j3155Q328J0416M2964
483H0922l1619m1766K1050r191L9300l5945k7817l9723L8574J5971q4645M5968
471b8921N2230l4997k684O318j8855L531n9355L2024k3643N1598K2440n4381K4870
458b9825K0104k9905Q74P8179M4169j24768R766J0561j0688L8020J4437l1987
$$ y = [-1475, -2563, -89470, -78190, -16910, -9220, 36554, 31202, 2610, 21594, 1968, -9447, -19149, -36798, -38882, -39576, -34544, -68942, 38905, 58577, 34470, 24061, -11041, 4961, -25408, 1824, 2729, 4100, 39122, -42002, -64582, -60825, -79224, -68157, 11319, 54132, 38714, 9100, 8155, -26285, 40590, 59133, 20551, 27865, -1995, 57492, 16171, -12145, -19235, 3147, 44470, -41796, 2305, 17035, -28354, -30465, -36680, -69931, -43936, 13281, 32369, 19214, 27542, 37958, 80922, 49303, 7537, 28587, 19396, 58696, 22751, -5066, -44789, -6215, 9756, -74889, -28921, 23309, -11688, -14372, -8054, -26909, -23378, -82733, -50709, -74352, -22754, -314, -54695, -29825, -9721, -39626, -38752, 39427, 83596, -41172, -31406, -20845, -31533, 6487, 20924, -11063]
446a1063n3380M6817J6162M844k7340k2614k5964P4302N602q4583j9802M4699
434e2320k4341K4722q89N8567m8777J8228O0679j2596n421K1092J726n1950P140
421d140j3971L7794n9802R791M8445j3735k1844m2657K3751r488J5896N5764Q341
408C4145Q831K0463k1936l433K2695m7709n0626L4320j1669m9631M936Q1508k4549
395b655O68M2367o1545J7513M083j8526K2805m4803n7885K1174N9365M4404K0737
382D7702J9656k0727P034m9619O407K0245o6793K8301L3178J9742L1468l087p667
369F5840m6205p3975j979p137j0772P7980r737p3696K2561K0742n86J376m9124
356h4712J412O8645n1194O1816K2648k4670K2970k3755J1305q756l3034N3436
$$ y = [-11063, -64443, -17626, -1464, 3380, -23960, -46574, -72538, 1764, 7366, -77217, -97019, -52320, -76661, -51939, -52828, 5739, -43038, -24810, 35869, 23273, 17852, 38944, 40670, -11280, -4140, -18111, 19683, -40119, -30328, 18117, 4382, -17462, -60119, -36368, -45856, -29960, 25804, 34145, 42976, 63439, 41503, 38070, 60765, 13056, -37570, -3250, -14919, -64550, -59614, 21894, -2655, -1987, 40380, -21165, -3652, 431, -18095, 4710, -40093, -97978, -76804, -17439, 26965, 47702, 67358, 46631, 53665, 4046, 10453, 30698, -36095, -7794, 25384, 45126, 76594, 73507, 65840, 19635, -54340, -56319, -63456, -74228, 3752, -5985, -79681, -57120, -36378, -36964, -35588, -84712, -83300, -14655, -65849, -4033, 18615, -6055, 16915, -6840, 4465, -4291, -37325, 16111]
344A6111N4505o3495k6984M5347k4018k7869J0526l9173L5910J3278J5198k8537
332a9201L5865R6172n4469q3864O7652J1846m5905k6793j823p41O289n244L9715
319A9499j1876k7219L069M5503r469K4368k5702j0483l8619l5517J8058M716P2488
306B8816L4717m6817k074j7190L4389K5135l6424P612j0256K7305o835l2347k2236
293a6205Q728k080M345k156M5286k9897N1060m1317l276j0326Q9541m8095L0551
280G6159o5291O008J1676k567p711j7131L3209K1181j3382n4895K8116J6795L1663
267F3830o262o4332l7252J1137K6898N0521k1881N92m2054k1151k5465k4103K8195
254f1327L5054J2824J1171p595J0029n5215k3937K2845O7259j8046l5153K3345
$$ y = [16111, 70616, 7121, -19863, 25484, 1466, -26403, -15877, -55050, -19140, -5862, 9336, -19201, 16664, 112836, 58367, -25497, 42155, 54001, 8096, -18697, -20520, -21261, -14972, -20216, 19499, 7623, -19596, -16527, 28976, 19507, 43875, 18173, 7690, -30929, -66446, -48388, -43672, 28816, 63533, 16716, 14642, -2548, 31841, 56976, 20552, 28164, 17908, 45213, 38378, 6031, -16205, -7477, -9557, -5212, -7368, 37918, 8021, 59081, 17764, 14488, 4162, 93703, 45608, 76159, 10868, 16876, 28552, 25985, 18274, 1143, 34352, 55533, 42151, -12744, 15372, 32167, 63830, 57568, -6764, -44016, -32879, -5981, 44540, 22659, 23251, -18803, -39954, -65419, -89522, -61327, -26273, -13449, -2278, -9873, 156, -55059, -78996, -56151, 11108, -6938, -42091, -18746]
242a8746K948K6187j0155L7770J41843o5312q574l9277l2962j0954M4346m2606
230B4508p5679L6347m7493L653N4325j8014p254j713K3282j4082L3015M6079l2170
217B4804q1612O4680J3173o3285J396N2554L6380l0432o2905k6741P2880J4285
205A5177Q331n3841n4233L4305O2710K1096m9763o5117L8744r768P315M7412k1829
192a9461K3379l903J6746J1811n2805m3870Q272q291L8882K3723k7527m7321O3947
179a6418p086J3263O0122k3031J0182m1459N3760J200j5013m1392L2495J0375
167C6998n0914n042N686J3994M828l5906J4313L5732J3922p346p259J1759N526
154C6291o9255N0651o441k4516O720L4940l386O98j1339j6527L4006j3208j0256
$$ y = [-18746, -15798, 10389, 234, 38004, 179847, 114535, 105961, 66684, 33722, 22768, 67114, 24508, -51171, -14824, -62317, -58664, -4339, -22353, -29607, -31320, -8038, -22120, 10895, 56974, 24804, -56808, 7872, 21045, -42240, -40844, 11710, 48090, 17658, -45247, -71988, 892, 15177, 23508, -30333, -84566, -50261, 12449, 33545, -16218, -81335, -42591, -52359, -45044, 2368, -19461, 3918, 15, 16761, 28572, -24233, -68103, -59831, -68122, -29240, -5517, -33044, -80365, -16418, -23504, -10241, 49881, 26850, 37032, -4427, 49333, 50533, 35520, -5872, 26623, 36998, -13916, -18958, -13272, 722, 5550, -30356, -16043, 19689, 33611, 26265, 19006, 30765, 36291, -32964, 17687, 11246, -13270, -6550, 28390, 25004, 25702, 14363, -2164, 31842, 18634, 8378]
141H378l060j3563J6399J8605L3384l1452k8167O2648n3367Q71R148q444O664
128A8044o0076M1225N6165l9330k1709l2243J0899J3919J2438L423m85p099j9193
115b4022L4283o769N0273L9558j5779n2450l8880J3273k0909l1186L3989J33j8849
102c7335K9971J1016k1183j3364j2059j8862L4819N0903m6710j834K6312o5584
90f3910M2730L8640l2625q966K6865j2589l3216J3848J1993K5476K3389j3222
78A8413J2965n1967o917J7235j0120k1520O8997K5132j9615o252j5625p875R756
65A2607l0232K2407l739R360L8651m6999j4537L3097k5551j0169K1709J1703K0237
52C8544p9694n427j6019K9193K4762j7895L3621K085P756m0488L4814L6266j4507
$$ y = [8378, 5318, -8245, 8154, 26759, 60143, 28691, 524, 63172, 9805, 10676, 19824, 11380, 18044, -42032, -807, 55358, 16028, -5681, -37924, -27025, -13106, -668, 2755, 2270, -4829, -24022, 10261, 3492, 53765, 93323, 77544, 25094, -13786, -513, -21422, -52608, -18619, -18486, -37335, -7364, 3652, -17531, -30895, -42954, -61816, -26997, 23906, -22804, -24638, 1674, -63910, -21180, 17460, -15165, -24131, 2734, -9855, -43071, -29223, -17230, 8246, 31635, 18413, 31378, -20589, -27506, -10271, -20391, -41911, 27086, 52218, 32603, 26351, 10726, 2851, 12607, -17625, 4782, 1043, 10403, 49054, 2055, -12482, 20615, -4936, -15105, 6604, 18307, 38544, -41150, -46577, -62596, -33403, -8641, -26536, 7085, 9170, 16926, -23562, 11252, 47518, 33011]
39C3011M1504k0195r5727L7566J1148r448K6756j238k5864L031J0461k6478k4685
26d0158j9793N5446L7401R55k9873k917K2321m4604k8076N0548M470l5087P475
13b1892J5274R026M1485k6522m1478m785K3510O802J2969j9714K793l686r981
0a6199
$$ y = [33011, 74515, 54320, -41407, -3841, 7307, -2141, 24615, 23377, -2487, 544, 11005, -15473, -40158, -59951, -4505, 32896, 33851, 3978, 1061, 23382, -21222, -49298, 1250, 5720, -29367, -21892, -6618, 2408, 43893, 17371, -24107, -28892, -5382, 1420, 14389, -5325, -2532, -6218, -16199]
$$ Imaginary data points
##PAGE= N=2
##DATA TABLE= (X++(I..I)), XYDATA
16383a321434J1393J1839L9826R955P010l230J6284L7856N1151j2718M3279j4632
16371a123421n285K9188K6053K1830L924l154Q5902L7140m6332j8408M2154m602
16359i55011J0094J0262R40K3188Q676m896P1057M3390L8434O165n380M4075K1293
16346f87713L625n124k7843J8766O0816p717J8357N1193L380m0545L3284P0704
16334e08817L0826M058J4966k853O938Q987K5571J4979k4011m0887R2883K2921
16322c54439L0881j069j4752J6790J5245K0211K8547K3893Q519l0025K8427O0008
16310a67764k467M5151o812K6883M5012j6925R601J6377j1246J2621N0663j6211
16298a5117K5912L5617j4743j495K8777K156K7745j701P705L7091j1557K5465
$$ y = [-1321434, -1310041, -1298202, -1258376, -1248421, -1241411, -1244641, -1228357, -1190501, -1139350, -1152068, -1108789, -1123421, -1128706, -1099518, -1073465, -1051635, -1047711, -1050865, -964963, -927823, -974155, -992563, -950409, -955011, -944917, -934655, -933715, -910527, -901851, -906747, -835690, -792300, -753866, -747701, -753081, -709006, -687713, -684088, -689212, -717055, -698289, -637473, -645190, -626833, -575640, -572260, -612805, -579521, -508817, -477991, -473933, -458967, -461820, -454882, -445895, -420324, -405345, -429356, -470243, -377360, -354439, -323558, -324627, -339379, -322589, -307344, -287133, -258586, -234693, -226174, -256199, -227772, -167764, -170231, -125080, -131892, -105009, -59997, -76922, -67321, -50944, -62190, -49569, 1094, -15117, 10795, 46412, 31669, 30174, 58951, 61107, 88852, 87151, 94856, 131947, 120390, 145855]
16286A45855L582J9226k3994j0227O3303L9832Q884J733K9900j6915k0854J5631
16274B55956P5953J9759k0657K7480j4401N744K9691k0131j6402j4960N0601M9076
16262D27709k3504p7684K4369Q1707L7484Q089l2220M3687j2597K4699m3276M8742
16250E07205K1706J0552k2579J128M7903k2492K5156j8235L9503O6787j3599N057
16238F48092m7222L101L0422J8076J60j242L4552K3949l4680k1379M7699K9047
16226G30575M921P538q057J0834O3060k0939J808J6126M3007j5611j0813M7994
16214H70443K6626k365l2738L8067Q616p5196K7397J4993k5023J3059K3358N3130
16202I40367l0657l995M2840m681j2349L7937j7580J1817L1964K3038q769J461
$$ y = [145855, 149437, 168663, 144669, 134442, 197745, 237577, 246461, 248194, 278094, 261179, 240325, 255956, 331909, 351668, 331011, 358491, 344090, 349834, 379525, 359394, 342992, 328032, 378633, 427709, 404205, 326521, 350890, 432597, 470081, 478170, 445950, 489637, 477040, 501739, 458463, 507205, 528911, 539463, 516884, 518012, 565915, 543423, 568579, 550344, 589847, 656634, 643035, 648092, 600870, 603971, 634393, 652469, 652629, 651387, 685939, 709888, 675208, 653829, 701528, 730575, 735496, 743034, 734977, 745811, 808871, 787932, 789740, 805866, 848873, 833262, 822449, 870443, 897069, 894704, 861966, 900033, 908649, 833453, 860850, 875843, 850820, 863879, 887237, 940367, 909710, 905715, 948555, 943874, 931525, 969462, 951882, 963699, 995663, 1018701, 1009932, 1011393]
16190A011393l2082K3005J3038j9351r465J9320J2689k8213O0610L102N920k6576
16178A033390N3476n0863l4396K0395q038J1193J4383l704J1614K8395O1036J425
16166A138306q1948L0040L5957J3085m4181L0208j7640l569P846M9536j4216j0749
16154A132675k2480O6k7293m897M7271j4647l9320J4393J4483P6436p986r2118
16142A076583M2894j866K0746O428j0414l7399P6305R0508j3429p5967J8668j3671
16130A179386k2447o246M3212o1004o07L4923L5650j1468M443O477K5103L4039
16118A261461l5982m0861M8083l1765l5747O6979M2916n689K3395k1691n3586
16107A217513k8477J5340K9945L3004K0774l256m5039j1065m4805j5393M0521
$$ y = [1011393, 979311, 1002316, 1015354, 996003, 986538, 1005858, 1018547, 990334, 1050944, 1054046, 1059966, 1033390, 1086866, 1036003, 1001607, 1022002, 1013964, 1025157, 1039540, 1035836, 1047450, 1075845, 1136881, 1138306, 1056358, 1086398, 1122355, 1135440, 1091259, 1121467, 1103827, 1100258, 1108104, 1157640, 1143424, 1132675, 1110195, 1110261, 1082968, 1078071, 1125342, 1110695, 1071375, 1085768, 1100251, 1176687, 1168701, 1076583, 1119477, 1117611, 1138357, 1144785, 1134371, 1096972, 1173277, 1263785, 1250356, 1174389, 1193057, 1179386, 1156939, 1150693, 1193905, 1132901, 1132294, 1167217, 1202867, 1191399, 1195842, 1202319, 1227422, 1261461, 1225479, 1184618, 1232701, 1200936, 1165189, 1232168, 1275084, 1269395, 1292790, 1271099, 1217513, 1189036, 1204376, 1234321, 1267325, 1288099, 1284843, 1239804, 1228739, 1183934, 1168541, 1209062]
16096A209062k2769M2165j0419j4574l0575k2231l6364N3110K5834J7013P4884
16085A285136j5388K0685J291j2764M0945m0441o5580N5505J1134j3227j5882
16074A251414Q90J3147m3662O8552k4243n689j0113m4546m6682O2757M2345n482
16062A258688K0076P181r18k0002p453m0722J550J2364l5609J02355n507L14l3137
16049A259180Q122j8505o672M456M0134J379m3892K1107j0938j1374M7079n858
16037A284218j8661J1943m7836O6081Q4131l3698L252n0729j35871L6278L1095
$$ y = [1209062, 1186293, 1228458, 1218039, 1203465, 1172890, 1150659, 1114295, 1167405, 1193239, 1210252, 1285136, 1269748, 1290433, 1291724, 1278960, 1319905, 1279464, 1213884, 1269389, 1280523, 1267296, 1251414, 1252304, 1265451, 1221789, 1290341, 1266098, 1260409, 1250296, 1205750, 1159068, 1221825, 1264170, 1258688, 1278764, 1285945, 1285027, 1265025, 1257572, 1216850, 1218400, 1230764, 1195155, 1297510, 1292003, 1292317, 1259180, 1267302, 1248797, 1242125, 1246581, 1286715, 1288094, 1244202, 1265309, 1254371, 1242997, 1290076, 1284218, 1265557, 1277500, 1229664, 1295745, 1379876, 1346178, 1349430, 1298701, 1162830, 1199108, 1230203]
$$ [...]
##END NTUPLES=NMR SPECTRUM
##END=
