##TITLE=1H_TG-2410-C
 200.13Hz, DMSO+CCl4.
 8 sc
 13.8.2026
##JCAMPDX= 6.0         $$ Bruker NMR JCAMP-DX V2.0
##DATA TYPE= NMR SPECTRUM
##DATA CLASS= NTUPLES
##ORIGIN= UXNMR, Bruker Analytische Messtechnik GmbH
##OWNER= pz
$$ XWIN-NMR		Version 3.5
$$ Wed Aug 12 12:39:31 2026 Russian Standard Time (UT+4h)  she@DPX200
##.OBSERVE FREQUENCY= 200.1313
##.OBSERVE NUCLEUS= ^1H
##.ACQUISITION MODE= SIMULTANEOUS
##.ACQUISITION SCHEME= undefined
##.AVERAGES= 8
##.DIGITISER RES= 18
##SPECTROMETER/DATA SYSTEM= spect
##.PULSE SEQUENCE= zg30
##.SOLVENT NAME= DMSO
##.SHIFT REFERENCE= (INTERNAL, DMSO, 0, 15.5023)
##AUDIT TRAIL= $$ (NUMBER, WHEN, WHO, WHERE, WHAT)
$$ ##TITLE= Audit trail, XWIN-NMR		Version 3.5
$$ ##JCAMPDX= 5.01
$$ ##ORIGIN= Bruker BioSpin GmbH
$$ ##OWNER= she
$$ F:/spectra/data/she/nmr/H-C/1/pdata/1/auditp.txt
$$ ##AUDIT TRAIL=  $$ (NUMBER, WHEN, WHO, WHERE, WHAT)
(   1,<2026-08-12 12:38:16.75 +0400>,<she>,<DPX200>,
      <created by zg, POWCHK disabled, PULCHK disabled
       configuration hash MD5:
       00 E9 B6 7A A2 85 ED C7 34 08 36 98 17 FE 4E 26
       data hash MD5: 16K
       F4 7F 3B 2E 0E AA 76 77 42 8C 53 E5 54 62 E5 7B>)
(   2,<2026-08-12 12:38:19.21 +0400>,<she>,<DPX200>,
      <Start of raw data processing
       efp BC_mod = 2 LB = 0.25 FT_mod = 6 PKNL = 1 PHC0 = -4216.801 PHC1 = 8.9923 SI = 16K 
       data hash MD5: 16K
       0D 04 BD 00 39 C6 25 45 BC BB D4 D9 36 0C 89 B6>)
(   3,<2026-08-12 12:38:39.31 +0400>,<she>,<DPX200>,
      <pk PHC0 = -3.377836 PHC1 = 2.2 
       data hash MD5: 16K
       F9 B2 6C F5 BC 15 5B FB BB A1 4E 74 71 06 F2 34>)
(   4,<2026-08-12 12:38:45.70 +0400>,<she>,<DPX200>,
      <abs ABSG = 5 
       data hash MD5: 16K
       F6 F5 BD 4D 38 E2 7A 09 DC F6 90 4A A0 D6 6F E6>)
$$ ##END=
$$ 
$$ hash MD5
$$ 10 03 58 58 A5 31 F1 B7 64 5A EA 31 2C C6 CE 90
##$RELAX= 
##$RELAX= 
##$RELAX= 
##$RELAX= 
##$RELAX= 
##$RELAX= 
$$ Bruker specific parameters
$$ --------------------------
##$DU= <F:/spectra>
##$EXPNO= 1
##$NAME= <H-C>
##$PROCNO= 1
##$TYPE= <nmr>
##$USER= <she>
##$AMP= (0..31)
100 100 100 100 100 100 100 100 100 100 100 100 100 100 100 100 100 100 
100 100 100 100 100 100 100 100 100 100 100 100 100 100 
##$AQSEQ= 0
##$AQ_mod= 1
##$AUNM= <au_zg>
##$AUTOPOS= <>
##$BF1= 200.13
##$BF2= 200.13
##$BF3= 200.13
##$BF4= 200.13
##$BF5= 200.13
##$BF6= 200.13
##$BF7= 200.13
##$BF8= 200.13
##$BYTORDA= 1
##$CFDGTYP= 0
##$CFRGTYP= 5
##$CHEMSTR= <none>
##$CNST= (0..31)
1 1 145 1 1 1 1 1 1 1 1 1 1 1 1 1 1 1 1 1 1 1 1 1 1 1 1 1 1 1 1 1 
##$CPDPRG= <>
##$CPDPRG1= <>
##$CPDPRG2= <>
##$CPDPRG3= <>
##$CPDPRG4= <mlev>
##$CPDPRG5= <mlev>
##$CPDPRG6= <mlev>
##$CPDPRG7= <mlev>
##$CPDPRG8= <mlev>
##$CPDPRGB= <>
##$CPDPRGT= <>
##$D= (0..31)
0 0.7 0 0 0 0 0 0 0 0 0 0.03 0 0 0 0 0 0 0 0 0 0 0 0 0 0 0 0 0 0 0 0 
##$DATE= 1786523896
##$DBL= (0..7)
120 120 120 120 120 120 120 120 
##$DBP= (0..7)
150 150 150 150 150 150 150 150 
##$DBP07= 0
##$DBPNAM0= <>
##$DBPNAM1= <>
##$DBPNAM2= <>
##$DBPNAM3= <>
##$DBPNAM4= <>
##$DBPNAM5= <>
$$ [...]
##$SUBNAM3= <"">
##$SUBNAM4= <"">
##$SUBNAM5= <"">
##$SUBNAM6= <"">
##$SUBNAM7= <"">
##$SUBNAM8= <"">
##$SUBNAM9= <"">
##$SW= 18.0517328524113
##$SWIBOX= (0..15)
0 0 2 0 0 0 0 0 0 0 0 0 0 0 0 0 
##$SW_h= 3612.71676300578
##$TD= 16384
##$TD0= 1
##$TE= 0
##$TE2= 300
##$TE3= 300
##$TEG= 300
##$TL= (0..7)
0 120 120 120 120 120 120 120 
##$TP= (0..7)
150 150 150 150 150 150 150 150 
##$TP07= 0
##$TPNAME0= <>
##$TPNAME1= <>
##$TPNAME2= <>
##$TPNAME3= <>
##$TPNAME4= <>
##$TPNAME5= <>
##$TPNAME6= <>
##$TPNAME7= <>
##$TPOAL= (0..7)
0.5 0.5 0.5 0.5 0.5 0.5 0.5 0.5 
##$TPOFFS= (0..7)
0 0 0 0 0 0 0 0 
##$TUNHIN= 0
##$TUNHOUT= 0
##$TUNXOUT= 0
##$USERA1= <user>
##$USERA2= <user>
##$USERA3= <user>
##$USERA4= <user>
##$USERA5= <user>
##$V9= 5
##$VALIST= <valist>
##$VCLIST= <CCCCCCCCCCCCCCC>
##$VD= 0
##$VDLIST= <DDDDDDDDDDDDDDD>
##$VPLIST= <PPPPPPPPPPPPPPP>
##$VTLIST= <TTTTTTTTTTTTTTT>
##$WBST= 1024
##$WBSW= 4
##$XGAIN= (0..3)
0 0 0 0 
##$XL= 0
##$YL= 0
##$YMAX_a= 727557
##$YMIN_a= -765231
##$ZGOPTNS= <>
##$ZL1= 120
##$ZL2= 120
##$ZL3= 120
##$ZL4= 120
##$ABSF1= 15.5067
##$ABSF2= -2.54515
##$ABSG= 5
##$ABSL= 3
##$ALPHA= 0
##$AQORDER= 0
##$ASSFAC= 0
##$ASSFACI= 0
##$ASSFACX= 0
##$ASSWID= 0
##$AUNMP= <proc_1d>
##$AZFE= 0.1
##$AZFW= 0.1
##$BCFW= 0
##$BC_mod= 2
##$BYTORDP= 0
##$COROFFS= 0
##$CY= -3
##$DATMOD= 1
##$DC= 0
##$DFILT= <>
##$DTYPP= 0
##$F1P= 0
##$F2P= 0
##$FCOR= 1
##$FTSIZE= 16384
##$FT_mod= 6
##$GAMMA= 0
##$GB= 0
##$INTBC= 1
##$INTSCL= 3.241238e-09
##$ISEN= 128
##$LB= 0.25
##$LEV0= 0
##$LPBIN= 0
##$MAXI= 10000
##$MC2= 0
##$MEAN= 0
##$ME_mod= 0
##$MI= 1.114404
##$NCOEF= 0
##$NC_proc= -4
##$NLEV= 6
##$NOISF1= 3.799351
##$NOISF2= 2.8
##$NSP= 0
##$NTH_PI= 0
##$NZP= 0
##$OFFSET= 15.50229
##$PC= 1
##$PHC0= -4220.179
##$PHC1= 11.1923
##$PH_mod= 1
##$PKNL= yes
##$PPARMOD= 0
##$PSCAL= 0
##$PSIGN= 0
##$REVERSE= no
##$SF= 200.130003885028
##$SI= 16384
##$SIGF1= 3
##$SIGF2= 2
##$SINO= 0.751879
##$SIOLD= 32768
##$SREGLST= <19F.Aceton>
##$SSB= 0
##$STSI= 16384
##$STSR= 0
##$SW_p= 3612.71676300578
##$SYMM= 0
##$S_DEV= 0
##$TDeff= 16384
##$TDoff= 0
##$TI= <>
##$TILT= no
##$TM1= 0
##$TM2= 0
##$TOPLEV= 0
##$USERP1= <user>
##$USERP2= <user>
##$USERP3= <user>
##$USERP4= <user>
##$USERP5= <user>
##$WDW= 1
##$XDIM= 16384
##$YMAX_p= 289694443
##$YMIN_p= -85079
$$ End of Bruker specific parameters
$$ ---------------------------------
##NTUPLES= NMR SPECTRUM
##VAR_NAME=  FREQUENCY,     SPECTRUM/REAL,   SPECTRUM/IMAG
##SYMBOL=    X,             R,               I
##VAR_TYPE=  INDEPENDENT,   DEPENDENT,       DEPENDENT
##VAR_FORM=  AFFN,          ASDF,            ASDF
##VAR_DIM=   16384,         16384,           16384
##UNITS=     HZ,            ARBITRARY UNITS, ARBITRARY UNITS
##FACTOR=    0.220516191357247, 1,           1
##FIRST=     3102.47331230393, 0,            0
##LAST=      -510.243450701847, 0,           0
##MIN=       -510.243450701847, -85079,      0
##MAX=       3102.47331230393, 289694443,    0
$$ Real data points
##PAGE= N=1
##DATA TABLE= (X++(R..R)), XYDATA
$$ [...]
6256g708J8664L87j6796J054J3639L407P860P904k640j3627M611n17J600q973
6242H865q618n390k2373K2270k060N471j4355K817L4909J4590l9630m925L0310
6229B1881Q312k6429J1452K5894M184l745l0433K5022q166n4146K6471j1893L3374
6216B1778J897j1985M0233k2906l7971M7678J3750k4903m816J7329p869O523N850
6203D4588O971j5371l5489J7462K1995N24n850N454l4100O63k738j1524K5053
6190A7638r976q470J1296O418L110J5789j0604K4171j5595k6519k2816K7315J0860
6177B2617J186j5582J8017M032k1491o234Q987k201n964J7278k3718J2790O286
6164A6003k3519J3496L3224l0825J2868N311j435P096n903N92J2836J3166N665
$$ plain form
6256 -7708 10956 11343 -5453 -4399 9240 12647 20507 28411 25771 12144 16755 16238 17838 8865
6242 8865 247 -5143 -27516 -5246 -7306 -1835 -16190 -13373 21536 36126 -3504 -8429 21881
6229 21881 30193 3764 15216 41110 45294 41549 11116 36138 27972 -26174 297 -11596 21778
6216 21778 23675 11690 51923 29017 -8954 38724 52474 27571 22755 40084 32215 38738 44588
6203 44588 51559 36188 699 18161 40156 40680 34830 40284 6184 6847 4109 -7415 17638
6190 17638 7662 -808 10488 16906 20016 35805 25201 49372 33777 7258 -15558 11757 22617
6177 22617 23803 8221 26238 30270 8779 2545 11532 9331 3367 20645 -3073 9717 16003
6164 16003 -7516 5980 39204 8379 21247 26558 25123 32219 26316 26908 39744 52910 58575
6151E8575j7446M728k883l138n1243K5616K4297j2207k1904J9167P924Q4j4032
6138A7538N561K5243J9312k1370k1624j7509l108K9684j903l884O165q285m125
6125B1695O969k7967r587M282N350K3351K9150k5083q577J9367J5492j3106k9649
6112A1687K6814n071k4344j5030j5618N3020K6810k7193k4406L3036j040J1211
6100D9876j3113j5148N873P391j798q901l878J2236K2743l4l9752j0052L6878
6087D2321k1982n974k5874L817K0611R375K598N70j4428R051J6506j4662j4075
6074G854J6513K7082l634j1338k1886k6028J8685o092P10p564K0282l887J287
6061A1984K1369j0902Q665k3843Q93K716J4982J3849k5096n649j2121O927K736
$$ plain form
6151 58575 41129 45857 42974 39836 -11407 14209 38506 26299 4395 23562 31486 31570 17538
6138 17538 23099 48342 67654 46284 24660 7151 4043 33727 31824 27940 34105 25820 21695
6125 21695 28664 697 -8890 -4608 742 24093 53243 28160 19583 38950 54442 41336 11687
6112 11687 38501 33430 9086 -5944 -21562 31458 58268 31075 6669 39705 38665 49876
6100 49876 36763 21615 27488 34879 33081 24180 20302 32538 55281 55247 15495 5443 42321
6087 42321 20339 14365 -11509 -7692 12919 22294 24892 25462 11034 20085 36591 21929 7854
6074 7854 24367 51449 47815 36477 14591 -11437 7248 1156 1866 -5698 14584 10697 11984
6061 11984 33353 22451 31116 7273 8166 10882 25864 39713 14617 8968 -3153 3774 6510
6048F510L967L0263k2707P679k4102k1089L1373L4989r470Q985l1408l1052J8364
6035B302L7988p087l4182M5233P984j0465k2186L528M2458k298K7616r588l8155
6022D3148K512r730K1302L642k1321L5753l90o250j121k628m304J8563j8549P993
6008F8620n080m7082O952J3746j2584L263M8818l1827j4469L0912j4065J3343
5996F0547O805Q319o326K454k836k8888K8810j2734Q250J2596n1840k0851J4412
5983A8718j2782L946L1569J5525j7323k1202j5039O6014N560l5059j2656K3469
5971E0740K1033j2491L3814P963j0208k5287p873l689K3524K9333l6662k2061
5959D8136Q626K020N900M551l3241r419P978o88k804j9653N479n689R172K8371
$$ plain form
6048 6510 10477 40740 18033 25712 1610 -19479 11894 46883 37413 46398 14990 -16062 2302
6035 2302 40290 33203 -979 44254 52238 41773 19587 23115 65573 63275 90891 81303 43148
6022 43148 45660 35930 57232 60874 39553 75306 74916 68666 67545 64917 60613 79176 60627 68620
6008 68620 63540 16458 23410 37156 24572 27835 76653 44826 30357 61269 47204 60547
5996 60547 67352 75671 69345 71799 68963 40075 68885 56151 64401 76997 25157 4306 18718
5983 18718 5936 9882 41451 56976 39653 18451 3412 69426 74986 39927 27271 50740
5971 50740 71773 59282 93096 101059 90851 65564 57691 54002 77526 106859 70197 48136
5959 48136 56762 58782 64682 69233 35992 26573 34551 33863 31059 11406 16885 11196 20368 48739
5945D8739L55k4030j2034J8063R311m704J6527J2391k3399J8964j7137n683L6792
5932G4155M969n05j7278L5485j374J837o971k4376n588J4438k2603j3081r848
5919B9260P114L484j2790J07r144L3802J9788J8124l9135Q182q218j8965K2452
5906E4061n780p156K6679J2438j1725m913l485m671J602M8779q338m2645L0763
5893H5609k3873N107L5402p819l8749N272l156k125J2362L562J1919Q719M533
5880I6763O860n361j8245J734j0779L5198j2897l4604M664J2360J0783J3502M300
5867A04278J6435J7683j1713p209n727n764L938J6007k0863K4524M2887j1146
5855A63330K6178j8851J4820j0199J7628L8872m948L5318K0813m1739k2537m865
$$ plain form
5945 48739 49094 25064 13030 31093 40404 35700 52227 64618 41219 60183 43046 37363 74155
5932 74155 79124 78619 61341 96826 95452 97289 90318 65942 60354 74792 52189 39108 29260
5919 29260 36374 39858 27068 27175 18031 51833 71621 89745 50610 58792 50574 31609 54061
5906 54061 48281 41125 67804 80242 68517 63604 60119 55448 57050 105829 97491 54846 85609
5893 85609 61736 66843 102245 94426 55677 60949 57793 55668 68030 71592 83511 92230 96763
5880 96763 103623 98262 80017 81751 70972 106170 93273 58669 63333 75693 86476 99978 104278
5867 104278 120713 138396 126683 119474 113747 107983 111921 127928 107065 131589 174476 163330
5855 163330 189508 170657 185477 175278 192906 231778 226830 262148 282961 241222 218685 213820
5843B13820K3325R903k5732J5123J7073J8030Q590l1765K194J106J2379k1883
5831B42163l1565O106k289j4705j2189L275j3041k0078K6294J4173l0159j6921
5819A51064M2874p014m8842R008R802K5537J3694L813j5288j575K38Q58j5753
5806A68416N2547J6130k72p168L16J3709J0603n220j5804K4236l15j000J7708
5793B73886j8604J0009j29K2160L2737o071J2374l110J9092M1010k2652J7598
5781C78300L9341O836J8449N072J9577J5475M0545J7438L6416Q6883N3826M3749
5769G61907M7414P8577Q8431P9491J73396K05083K52881M40063Q40597J452774
5759D420614J695645J460369J025145K33725k47974m86761r38465r86619r21162
$$ plain form
5843 213820 237145 247048 221316 236439 253512 271542 280132 248367 250561 251667 264046 242163
5831 242163 210598 216704 214415 199710 187521 190796 177755 157677 183971 198144 167985 151064
5819 151064 193938 186924 138082 147090 156892 182429 196123 199936 184648 183073 183311 184169 168416
5806 168416 220963 237093 236821 229653 229969 243678 254281 249061 233257 257493 257178 256178 273886
5793 273886 255282 265291 265162 287322 320059 313988 326362 323252 342344 383354 360702 378300
5781 378300 417641 424477 442926 447998 467575 483050 523595 541033 577449 664332 718158 761907
5769 761907 809321 887898 976329 1055820 1229216 1434299 1687180 2127243 2967840 4420614
5759 4420614 6116259 7576628 8601773 8835498 8587524 8100763 7162298 6175679 5254517
5750E254517q76547q03920p57319o09399m56684l35844k02853j52886j42465q7880
5740H28720r8478p0973l1913n4775o8268L524J15o7680j9049L661k7250k6170
5728C71464j8484M710o017j7401O369j682k7233k436J6064L1320k5205k8859j1485
5715B91125K7799K312j2964n436o996j3418n016J187q528r517k7386J8581l277
5702B48466O427L2846j4487K0207q726k8284Q461K0345L7713l0889j7491r804
5690B64784k4283k4013M716K1813J1763L1745m711j7429J0519m492Q584K5924
5678C04920k4340K1792k1524j2937P055m991j3836J9153J9478j5297J469J1047
5666B91989l588r786J6780J7738J64P818K2987j1972K826j471L3548J2940k2215
$$ plain form
5750 5254517 4377970 3574050 2816731 2207332 1750648 1414804 1211951 1059065 916600 828720
5740 828720 730242 659269 627356 572581 504313 507837 507952 440272 421223 424884 397634 371464
5728 371464 352980 357690 351673 334272 340641 338959 311726 309290 325354 356674 331469 302610 291125
5715 291125 318924 321236 308272 302836 295840 282422 277406 278593 270065 260548 233162 251743 248466
5702 248466 254893 287739 273252 293459 284733 256449 264910 285255 322968 292079 274588 264784
5690 264784 240501 216488 221204 243017 254780 286525 281814 264385 274904 270412 278996 304920
5678 304920 280580 302372 280848 267911 274966 269975 256139 275292 294770 279473 280942 291989
5666 291989 288401 278615 295395 313133 313297 321115 344102 332130 334956 333485 367033 379973 357758
5653C57758l156O235P31R449l0264o784O026M8664K2335J3775j0408m0688j7676
5640C55997M9084N417K825K2450P985m555j1667R535K2001O364K396k919R840
5627D74753O356k423N223j2701l489Q394P016K1816K3493K0904L3719l3o114M2206
5613F19120N4183m6795L3309N0002J738N311M9508M8983L3874L4355M4157O393
5601I34138K860L41N837j1585L6034Q631K5842M6901J3541J7370J3332O782l6995
5588A063029j2706j8942K097M4047M692j8467K1617L0636K3636p317K4531J6246
5576A173099J8904M8205M9841L8617M4289N3438K8437M1929K6914N4490O3287
5565A641450O1945O1070K8649P7143P2696O5338J00366P1239J36163J87868J53521
$$ plain form
5653 357758 354602 360837 361568 371017 340753 333969 339995 388659 410994 424769 414361 373673 355997
5640 355997 405081 410498 413323 435773 443758 439203 427536 437071 459072 465436 467832 464913 474753
5627 474753 481109 478686 483909 471208 467719 476113 483129 504945 528438 549342 583061 583028 576914 619120
5613 619120 673303 626508 659817 709819 711557 716868 766376 815359 849233 883588 927745 934138
5601 934138 936998 937339 943176 931591 967625 976256 1002098 1048999 1062540 1079910 1093242 1100024 1063029
5588 1063029 1050323 1031381 1033478 1077525 1082217 1063750 1085367 1116003 1139639 1132322 1156853 1173099
5576 1173099 1192003 1240208 1290049 1328666 1372955 1426393 1454830 1496759 1523673 1578163 1641450
5565 1641450 1703395 1764465 1793114 1870257 1942953 2008291 2108657 2179896 2316059 2503927 2657448
5554B657448J47879J56295J94916K21527K51978K51533L00570L02619L79753M77505
5544E342023N57675O76624Q58443J073933J406052J746495K239094K697423K915570
5535A9513332K883282K405333J778568J056618M64744J1278j68324l4339K51604
5526B8162096N85093P33673N34750P6514n18264j137987j704151k100228k411722
5517B2219774k537070k472799k373410k128027j840646j579185j323344j050676
5509F914617q52161p28865n64430m56535l98162l38055l00965k54118k00439j92130
5499B628757j85880r9059j13915j27797j12245j27896r2909o3011o5168o1623
5489A579254o1213n1524n0557k8678q4064q1701j5519L0966m1012l2871m0343
$$ plain form
5554 2657448 2805327 2961622 3156538 3378065 3630043 3881576 4182146 4484765 4864518 5342023
5544 5342023 5899698 6576322 7434765 8508698 9914750 11661245 13900339 16597762 19513332
5535 19513332 22396614 24801947 26580515 27637133 28101877 28113155 27944831 27910492 28162096
5526 28162096 28747189 29480862 30015612 30092126 29573862 28435875 26731724 24631496 22219774
5517 22219774 19682704 17209905 14836495 12708468 10867822 9288637 7965293 6914617
5509 6914617 6062456 5333591 4769161 4312626 3914464 3576409 3275444 3021326 2820887 2628757
5499 2628757 2442877 2343818 2229903 2102106 1989861 1861965 1769056 1706045 1640877 1579254
5489 1579254 1518041 1466517 1415960 1387282 1303218 1221517 1205998 1236964 1195952 1163081 1122738
5478A122738k9121J4498k8489k4785k6448k3106m8248J9918n9j062l0265n343
5466I40228l183l461J5032k7004k4294n300L2477J017l6074k1363k2465n2489
5454G93121j993Q609l7702m728j8484m767r932J373k5169n6150j6860L0647K66
5441F58231k7706J048N924L4277Q328P86k1788k6907J3179J605o37j0517K0661
5428F56484j5398k0108L3706p835K4510J2840n4127J7118M0554j1883P204K7415
5416G10480l924N607j3870j2913J090M159j2859J2048M810Q069M0668J873O470
5403G51708o718K7996j7928j4077n651n952M5095r880j2719J9409l1226J1426
5391G51483K9540J0065Q828j1934M217K6859K8459K7195q531n24K9453J9110O812
$$ plain form
5478 1122738 1093617 1108115 1079626 1054841 1028393 1005287 957039 976957 976898 975836 945571 940228
5466 940228 937045 933584 948616 921612 897318 892018 924495 925512 889438 868075 845610 793121
5454 793121 791128 799737 762035 757307 738823 734056 724124 725497 700328 644178 627318 657965 658231
5441 658231 630525 631573 637497 671774 680102 680888 659100 632193 645372 646977 646340 635823 656484
5428 656484 641086 620978 654684 646849 671359 684199 630072 647190 687744 675861 683065 710480
5416 710480 706556 712163 698293 685380 686470 690629 677770 689818 694628 702697 743365 745238 751708
5403 751708 744990 772986 755058 740981 735330 729378 774473 764593 751874 771283 740057 751483
5391 751483 781023 791088 799916 787982 792199 819058 847517 874712 866181 865657 895110 914220 921032
5378I21032Q967j2047L2581K2126L1553R916j6692j2670K4977j3350k0844M6833
5366A022382L2201J8197J7196n780K5113L3638K6004j2647l2050K3106K1866N7040
5354A226266M1757j9764J9016L8189K1442N6481M3119N364J1386N3355P2723M5429
5342A614763M0025N1839K0799N6736N5574N6823M8090M8817Q7096J23901N2273
5331B256736M4066P6257Q4472Q8309J00395Q1312Q8045R0102O0761J14618J51771
5320C236844J41415J73553K40967K42588K60230K77335K51058K55392K89897L36929
5310E706208M01665M45043N17982O28863P09734R26135J069976J300170J674662
5301A3380438K353364L498386N395600P391412Q054519P110598M918230K109131
$$ plain form
5378 921032 929999 917952 950533 972659 1004212 1014128 997436 984766 1009743 996393 975549 1022382
5366 1022382 1054583 1072780 1089976 1084196 1109309 1142947 1168951 1156304 1124254 1147360 1169226 1226266
5354 1226266 1268023 1248259 1267275 1305464 1326906 1383387 1426506 1431870 1443256 1496611 1569334 1614763
5342 1614763 1654788 1706627 1727426 1784162 1839736 1896559 1944649 1993466 2080562 2204463 2256736
5331 2256736 2300802 2377059 2461531 2549840 2650235 2731547 2819592 2909694 2970455 3085073 3236844
5320 3236844 3378259 3551812 3792779 4035367 4295597 4572932 4823990 5079382 5369279 5706208
5310 5706208 6107873 6552916 7070898 7699761 8409495 9335630 10405606 11705776 13380438
5301 13380438 15733802 19232188 24627788 32019200 40073719 47184317 52102547 54211678
5293E4211678k1613j590851k791519k880289k043382k28539K188987L920784L991912
5284E4757168K779362N62956j640479l251080m728990n558052n685587n432547
5276C1802751m997057m521726l923124l237935k476422j854610j418140j116652
5268H257085r25276p58701o80274n25209m09746l80180k98865l00831k25406j81748
5258C570849j80734j45163j28854j78510j57857j20403j38264j34787j20578j04325
5248B161374o0565o6513q5421m8111n5052m6024n6640l0403j0794l6828m6055
5237A618968q0470q1517o79k7291m1559j6449l9054l5038k3504j1170l1604o751
5225A223882J162r353l1223k9272l6229l663o594j2478n6144m4919k2415J5700
$$ plain form
5293 54211678 54190065 52599214 49807695 46927406 44884024 44655485 46844472 50765256 54757168
5284 54757168 57536530 58099486 56459007 53207927 48478937 42920885 37235298 31802751
5276 31802751 26805694 22283968 18360844 15122909 12646487 10791877 9373737 8257085
5268 8257085 7331809 6573108 5892834 5367625 4957879 4577699 4278834 3978003 3752597 3570849
5258 3570849 3390115 3244952 3116098 2937588 2779731 2659328 2521064 2386277 2265699 2161374
5248 2161374 2100809 2034296 1948875 1900764 1845712 1799688 1743048 1712645 1701851 1665023 1618968
5237 1618968 1538498 1456981 1456302 1429011 1387452 1371003 1331949 1296911 1273407 1262237 1230633 1223882
5225 1223882 1225044 1215691 1184468 1155196 1118967 1115304 1108710 1096232 1040088 995169 972754 988454
5213I88454n1045j6721O722l3278j8253n1986j4922l3947L2134N122o3648K625
5201G51257q987n1079j5526l2561l7184J7073k2725P410k1455n9731L7971O571
5189E71034j8045p557j9717k2205k2424R095k3162l0272j1795P177j9520o682
5177D05927K3284j7531j0883j9292j1288M76P305k5887j1532l919J1559l9310
5165C08909J6722J0432l224j9132o06J2878k4347Q426Q336K8910J7562k4290k3867
5152C16709K4056K8048J9194k3301k9161J3344j1812j8507j5479L507K1158K0598
5140C48354j3848N172R961O084q967K2352k6116j5471K860k0037j5840l622L0456
5127C21338L6614L944l1145J704R186K0382l1062j4803O993L5782J2078k2004
$$ plain form
5213 988454 937409 920688 927410 894132 875879 823893 808971 775024 807158 812280 748632 751257
5201 751257 742270 691191 675665 643104 605920 622993 600268 607678 586223 526492 564463 571034
5189 571034 552989 545432 525715 503510 481086 490181 467019 436747 424952 432129 412609 405927
5177 405927 429211 411680 400797 381505 370217 370693 377998 352111 340579 336660 348219 308909
5165 308909 325631 336063 332839 313707 313101 325979 301632 310058 318394 347304 364866 340576 316709
5152 316709 340765 368813 388007 364706 335545 348889 337077 318570 303091 306598 327756 348354
5140 348354 334506 339678 349639 355723 346756 369108 342992 327521 330381 310344 294504 290882 321338
5127 321338 357952 361896 330751 332455 341641 362023 330961 316158 323151 358933 371011 349007
5115C49007K228Q050J007k0280k6636J4812Q648M822K6453K942J6165r756J5484
5102C92946K7215K114m648q4k0387J398P006n3223m237L6877j3252k1308J1705
5089C62122j1105J1742k9216L895L0226j7751j0012K8327j9122k5217J9803n280
5077C38412k032k4831j5281j0917r597K8356L3772j2817J3044K5283L841m957
5065C62276m04M7093j2288j9234j7662K9187J9529k177R51k0527J8276L5428R54
5052D41402k1164k5973p466N01R808J4819j7561k0357M052q363K320K4511j0689
5039C85840j0340K6964l5881K7r245n8098j2194O052r522J6388L7993j6937m1170
5026B79877j7894K6669L7661L4398n191l0091L413J907Q585k9214j257J2883M413
$$ plain form
5115 349007 351235 359285 360292 340012 313376 328188 336836 341658 368111 371053 387218 377462 392946
5102 392946 420161 422275 417627 417543 397156 398554 405560 352337 348100 384977 371725 350417 362122
5089 362122 351017 362759 333543 337438 367664 349913 339901 368228 349106 323889 343692 338412
5077 338412 336380 311549 296268 285351 275754 304110 337882 325065 338109 363392 367233 362276
5065 362276 361872 408965 396677 377443 359781 388968 408497 406320 407271 386744 405020 440448 441402
5052 441402 420238 394265 386799 387300 397108 411927 394366 374009 378061 369698 372018 396529 385840
5039 385840 375500 402464 366583 366610 357365 299267 287073 293125 283603 299991 337984 321047 279877
5026 279877 261983 288652 326313 360711 355520 325429 328842 330749 339334 310120 308863 321746 326159
5013C26159K9565J1074k3223k0377Q315Q462Q639n005K5502j1000J597K4710k2943
5000C61475L1123Q281j6182K3221M344N2001P4277J8922J2806P1915K3130M8631
4988G13944J8494l3018J686J3278J0538J3777j5732n779j115J487l8193l1737
4976F47630j2072l882k1740K7076m476K6978K0853K4741m718l6532j8754o8702
4964E76402k4207k3515j9151l0526J2288j4000j3632j4487R339J7753n48J6997
4952D92713n7028j4013K7561o273j54J6217K03j4339j1747m750K3165O08P225
4939D59388j5245q331j5164L3878p687J0707Q121m958L2449j2615Q897J0853j5124
4926D85169j0786M984J5089j1868j7611K2757L1912Q788j5461L083J0551k0323
$$ plain form
5013 326159 355724 366798 343575 323198 331513 339975 348614 343609 369111 358111 359708 384418 361475
5000 361475 392598 400879 384697 407918 412262 464263 538540 557462 570268 642183 665313 713944
4988 713944 732438 699420 701106 714384 724922 738699 722967 717188 716073 717560 679367 647630
4976 647630 635558 631676 609936 637012 632536 659514 680367 705108 700390 663858 645104 576402
4964 576402 552195 528680 509529 479003 491291 477291 463659 449172 458511 476264 475716 492713
4952 492713 435685 421672 449233 442960 442806 459023 459226 444887 433140 428390 451555 452163 459388
4939 459388 444143 435812 420648 454526 446839 457546 465667 460709 493158 480543 489440 500293 485169
4926 485169 474383 479367 494456 482588 464977 487734 519646 528434 512973 516056 526607 506284
4914E06284J1962m245K9497n437r454j4813J3708n0k2363j6557J6807L5120j58
4901E40301k982J6952K4814m719K15k287Q92M742K1553j754J6366J969J1546l0749
4887E96859l440L201J2559q319m388L1793J695j7573K3584j3009K5835M981M830
4874F58608L95n71L2631N078l329K2734j8923L137J9272J3803k4535p341L0022
4861G30981K8022L6932J509J7732J5653J6158M3802K5277K7754O0361K7620M6758
4849A078559M3284j022J4844l3548j8484M453p303K2476j9506J9527Q610p813
4837A104077R354L6004L0103Q1303M9941M9259O8014O0966J15235J33103J99242
4826A936601L26980O13662J064935J187356J007348P12915J32323j74852m16531
$$ plain form
4914 506284 518246 514001 543498 538061 528607 513794 527502 527452 505089 488532 505339 540459 540301
4901 540301 537319 554271 579085 574366 574581 572294 573186 577928 599481 597727 614093 616062 627608 596859
4887 596859 593419 596620 609179 600860 596472 628265 629960 612387 635971 622962 648797 653778 658608
4874 658608 659003 658432 691063 696141 692812 715546 696623 699760 719032 732835 708300 700959 730981
4861 730981 759003 795935 797444 815176 830829 846987 890789 916066 943820 1004181 1031801 1078559
4849 1078559 1121843 1120821 1135665 1102117 1083633 1088086 1080783 1103259 1083753 1103280 1111890 1104077
4837 1104077 1113431 1149435 1179538 1260841 1310782 1360041 1428055 1489021 1604256 1737359 1936601
4826 1936601 2263581 2877243 3942178 5129534 6136882 6849797 6982120 6807268 6390737
4817F390737o58250o31926o65063o26703n63422n14380m34225k74952j97454j23264
4807A701098j01623n5921q3925p7954r9554l6683l090k4964k6209Q41L8634j9237
4795A211413n0998J0962r72k8076J4382Q494k900J5891l637L65k963j5281q487
4782A148193J4372N3161j3857k2625M2011L3368k3863O466j371k0229N246J06
4770A220978L5041q399J7720L2465n014K9273k549j860r49j703m037K1867K2278
4757A355111J2920J4671q121J986J4508j84K2109M1938N915J4646K0521k2792
4745A473228L2407j6488K0823K8245p760q257L3832K1283n491r17l331K3112J8701
4732A609387J0246r892K3907P881L7345K0766M391K3128K0740K4791qK4298K2651
$$ plain form
4817 6390737 5732487 5100561 4435498 3808795 3245373 2730993 2296768 2021816 1824362 1701098
4807 1701098 1599475 1543554 1459629 1381675 1282121 1245438 1242348 1217384 1191175 1192016 1230650 1211413
4795 1211413 1160415 1171377 1170405 1142329 1156711 1165205 1162305 1178196 1174559 1174924 1171961 1156680 1148193
4782 1148193 1162565 1215726 1201869 1179244 1221255 1254623 1230760 1237226 1235855 1215626 1220872 1220978
4770 1220978 1256019 1247620 1265340 1297805 1292791 1322064 1319515 1317655 1316706 1315003 1310966 1332833 1355111
4757 1355111 1368031 1382702 1374581 1376567 1391075 1390891 1413000 1454938 1460853 1475499 1496020 1473228
4745 1473228 1505635 1489147 1509970 1538215 1530455 1522198 1556030 1577313 1571822 1570905 1567574 1590686 1609387
4732 1609387 1619633 1609741 1633648 1641529 1678874 1699640 1704031 1727159 1747899 1772690 1772682 1796980 1819631
4719A819631N4520O425j024j3007K6251K9609j778K7492J7677K7604M7759j3074
4707B028085J379L5631K4872L2720K799N602K3545K1288N270J8314N6872L8161
4695B294538o902j8450L5871N0706m78Q809M2059M381L5457M2909M9224J2584
4683B550708N017K9392N5151j2356M2225L5042M2234N5202M5225K4923L6363J5258
4671B924384J2480N3370L0684N4180O0939O4094L35N8425L9433N02K9590K4354
4659C352770M3778N3223J7191K7304O1694N3387M538L9644J7161L1863N3227N5979
4647C811759M6083O7752L7162L5642L0440Q7155P6301M3909L6362N3210M2816
4636D368591O4713O8121N4338Q7853R5920J31612J53579K48413M15806L92630
$$ plain form
4719 1819631 1874151 1880576 1879552 1866545 1892796 1922405 1920627 1948119 1965796 1993400 2041159 2028085
4707 2028085 2029464 2065095 2089967 2122687 2125486 2131088 2154633 2175921 2181191 2199505 2256377 2294538
4695 2294538 2287636 2269186 2305057 2355763 2355285 2364094 2406153 2410534 2445991 2488900 2538124 2550708
4683 2550708 2555725 2585117 2640268 2627912 2670137 2705179 2747413 2802615 2847840 2872763 2909126 2924384
4671 2924384 2936864 2990234 3020918 3075098 3136037 3200131 3200466 3258891 3298324 3298826 3328416 3352770
4659 3352770 3396548 3449771 3466962 3494266 3555960 3609347 3613885 3653529 3670690 3702553 3755780 3811759
4647 3811759 3857842 3925594 3962756 3998398 4028838 4115993 4192294 4236203 4272565 4325775 4368591
4636 4368591 4433304 4501425 4555763 4643616 4739536 4871148 5024727 5273140 5688946 6081576
4626F081576L58756K23678J04068L7366l6127j45412j19754p2003j09292p0802
4616F252054n3290j3694N8385R6597J56392J83712K26076K18890K18779K02243
4606G546144J77109K33093K37264L05154L38929L70662L01278K28161J61988J34540
4596A0034322J38655J64316K87684L49369L19926K00150Q2289k1704o6825j03330
4586A1384852o3575K1679p850m3148p4901j49874j93795j65571j71881j57558
4576A0378378j15540r2885j11245j09866r1617j39776j04356j00936o4764l0430
4566I416963j056J8755P1643J42866K16265K69455L33292M88276N44280O82462
4556A2183201P58005Q26971Q22437P27194O17445N41693N02719N29856O25906
$$ plain form
4626 6081576 6440332 6664010 6768078 6805444 6769317 6623905 6504151 6432148 6322856 6252054
4616 6252054 6198764 6185070 6243455 6340052 6496444 6680156 6906232 7125122 7343901 7546144
4606 7546144 7723253 7956346 8193610 8498764 8837693 9208355 9509633 9737794 9899782 10034322
4596 10034322 10172977 10337293 10624977 10974346 11294272 11494422 11576711 11555007 11488182 11384852
4586 11384852 11321277 11342956 11335106 11291958 11217057 11067183 10873388 10707817 10535936 10378378
4576 10378378 10262838 10169953 10058708 9948842 9857225 9717449 9613093 9512157 9447393 9416963
4566 9416963 9415907 9434662 9506305 9649171 9865436 10134891 10468183 10956459 11500739 12183201
4556 12183201 12941206 13768177 14590614 15317808 15935253 16476946 16979665 17509521 18135427
4547A8135427P97284R67535J036159R58756O69018K51347n1271l26844n74165
4538B1863246o80680o04372n71137n44913n75554n91533o08778o51622o86797
4529A6347860p11014o74277o88878p00245o42298n31881m73002l87904k88670
4520A1249691k11179j62816j04647k8364p821L4762J09950J22554J72158K35784
4510A1410072L51504N19344Q00287J346745J922280K067590J937308J451047P31686
4501B2537863K08474j25265l60242l10971N5976R41209K271212K974425K892780
4492C1085461K233683P64304n34440j110401j858182k191231k115246j739964
4484B4533984j016815l97205k03437j85493m07001q47592j070490j331009j551710
$$ plain form
4547 18135427 18932711 19900246 20936405 21895161 22564179 22815526 22764255 22437411 21863246
4538 21863246 21182566 20578194 20007057 19462144 18886590 18295057 17686279 17034657 16347860
4529 16347860 15636846 14962569 14273691 13573446 12931148 12399267 11926265 11538361 11249691
4520 11249691 11038512 10875696 10771049 10742685 10734864 10769626 10879576 11002130 11174288 11410072
4510 11410072 11761576 12280920 13081207 14427952 16350232 18417822 20355130 21806177 22537863
4501 22537863 22746337 22621072 22260830 21949859 22005835 22947044 25218256 28192681 31085461
4492 31085461 33319144 34083448 33549008 32438607 30580425 28389194 26273948 24533984
4484 24533984 23517169 23119964 22916527 22731034 22324033 21476441 20405951 19074942 17523232
4475A7523232j581220j533089j411784j220020j053441r05838p09934n39396l70578
4466H197932l43913k87314k50866k01170j87968j98526j43800j26663j09858j06983
4456F240871j30356r5501q8934q3782o2574q9620j06853o7104j0836p3589n1746
4445E379976o7941m7760m5712o8409o3180J3536k7372n3587n710o4319o7423n8562
4433D823537r1931p8216p9389r1457o3782p4256o9783p9874p3017k5127n1596
4422D045109o3874o9125n7877q0375l9842l0953K937r2989o9479l6167p181m3042
4410C457142m0400m5913n3333j9938o255n0292p7655l9908j0640k9265n2799j9656
4398C011088k4925P439k4261Q22m0753l0592j8939k9439l0986n2214m873j5021
$$ plain form
4475 17523232 15942012 14408923 12997139 11777119 10723678 9817840 9107906 8568510 8197932
4466 8197932 7854019 7566705 7315839 7114669 6926701 6728175 6584375 6457712 6347854 6240871
4456 6240871 6110515 6015014 5926080 5842298 5779724 5690104 5583251 5516147 5505311 5431722 5379976
4445 5379976 5312035 5264275 5218563 5150154 5086974 5100510 5073138 5019551 5013841 4949522 4882099 4823537
4433 4823537 4731606 4653390 4574001 4482544 4418762 4344506 4274723 4194849 4121832 4096705 4045109
4422 4045109 3981235 3912110 3854233 3773858 3734016 3703063 3706000 3613011 3543532 3507365 3500184 3457142
4410 3457142 3416742 3370829 3317496 3297558 3291303 3241011 3163356 3123448 3112808 3083543 3030744 3011088
4398 3011088 2986163 2993602 2969341 2970163 2929410 2898818 2879879 2850440 2819454 2767240 2762367 2747346
4386B747346j4665l1353J313k3485J1131q450l1493j3455K02j8355m4993k8046
4374B545697k6729j9291j5961p0239j3274K3625o4774j1281j3958n1736o545K997
4362B278531k9684j5249j7231L832n0504l7054r198j4802K1635l2749j1336j4360
4350B071831k0001O256p538j9844r86J903j5298m0608J443J1420l1605K3694R972
4337A990639j6582k1762n2j1525j009l9379l303j8536o575o707J6465R144L847
4324A894665m9106k1877J255k5196J5428K682j9278P554J005K77J0790p022K7775
4311A838952L0582J3063J1477j3434J1189o063L110P39Q939K685j84r829N666
4298A896892J4228K2918J2990K0031K3148J1471J4443M7850M8471N0159N1223
$$ plain form
4386 2747346 2732681 2701328 2702641 2679156 2690287 2681837 2650344 2636889 2637091 2618736 2573743 2545697
4374 2545697 2518968 2499677 2483716 2413477 2400203 2423828 2359054 2347773 2333815 2282079 2275534 2278531
4362 2278531 2248847 2233598 2216367 2220199 2169695 2132641 2123443 2108641 2130276 2097527 2086191 2071831
4350 2071831 2051830 2058086 2050548 2030704 2029718 2031621 2016323 1975715 1977158 1988578 1956973 1980667 1990639
4337 1990639 1974057 1952295 1952243 1940718 1939709 1900330 1897027 1878491 1871916 1865209 1881674 1890818 1894665
4324 1894665 1845559 1823682 1824937 1799741 1815169 1817851 1798573 1806127 1807132 1807409 1818199 1811177 1838952
4311 1838952 1869534 1882597 1894074 1880640 1891829 1885766 1888876 1889615 1898554 1901239 1901055 1891226 1896892
4298 1896892 1911120 1934038 1947028 1967059 1990207 2001678 2016121 2063971 2112442 2162601 2213824
4287B213824q54L1463O4217N3531N9548M5165J01948O3277P9610J71771J18569
4276C002069J21716J69291J27406J64823J63622J19208J57508J46382J42763J46388
4266D461176J53539J57253K39306K52996L06328L13565M22149M18845M51347M75921
4256G652425M17269L53137L49282L13027K38729K53914K44757K19923K86131M04619
4246A0733213M89994N37481O28490O94790P12391O99325O15276M79566K50601
4237A5841127R1966k4843r5621j53045q7588J3139J54693L47578M39279N97122
4227A7123807O71309N70200L97392J88073j09961l89591n63008o84419p03644
4218A6500158o77414n91516m02786j92019K667J31847J54478J00719p205k57453
$$ plain form
4287 2213824 2212970 2244433 2308650 2362181 2421729 2466894 2568842 2632119 2711729 2883500 3002069
4276 3002069 3123785 3293076 3420482 3585305 3748927 3868135 4025643 4172025 4314788 4461176
4266 4461176 4614715 4771968 5011274 5264270 5570598 5884163 6306312 6725157 7176504 7652425
4256 7652425 8069694 8422831 8772113 9085140 9323869 9577783 9822540 10042463 10328594 10733213
4246 10733213 11223207 11760688 12389178 13083968 13796359 14495684 15110960 15590526 15841127
4237 15841127 15933093 15908250 15812629 15659584 15571996 15585135 15739828 16087406 16526685 17123807
4227 17123807 17795116 18365316 18762708 18950781 18840820 18451229 17888221 17203802 16500158
4218 16500158 15822744 15231228 14828442 14636423 14639090 14770937 14925415 15026134 15018929 14761476
4208A4761476n27770o39211p27646q43412q57399p90617o79786n58429m37025
4199H700181k55436j60192j67369j73423k74718l24734l72901m38931m78369m76873
4189E577235n07464m32058l34541k80635k46245k55395j80279j65901j35946j48218
4179B890553j42618j28989j62974j30392j38831j29001j29381j19804q7729p9487
4169A641347p9585m8809o6297k8137j8967o7580n1366k5977k5003m1949j9155
4158A168522p139o7769k6210J5309k4690k7817j9203K9818J2760o4455k3099J5932
4146I81959J148m3328o5225m8487m989K3158P506n200j1157j2028O845N378k3439
4133H12141l2710k9623J3012o89l8552j9387J4033R143n63k2683r021k7790j4906
$$ plain form
4208 14761476 14233706 13594495 12866849 12023437 11166038 10375421 9695635 9137206 8700181
4199 8700181 8444745 8284553 8117184 7943761 7669043 7344309 6971408 6532477 6054108 5577235
4189 5577235 5069771 4637713 4303172 4022537 3776292 3520897 3340618 3174717 3038771 2890553
4179 2890553 2747935 2618946 2455972 2325580 2186749 2057748 1928367 1808563 1720834 1641347
4169 1641347 1561762 1512953 1446656 1418519 1399552 1331972 1280606 1254629 1229626 1187677 1168522
4158 1168522 1161383 1093614 1067404 1082713 1058023 1030206 1011003 1040821 1053581 989126 966027 981959
4146 981959 983107 939779 874554 826067 821078 844236 851742 846542 835385 823357 830202 835580 812141
4133 812141 779431 749808 762820 762131 723579 704192 718225 727368 726805 704122 695101 667311 652405
4120F52405J9271o892l1451m641o163l2212m656J5507K900J6210k9447k6873j0194
4107E53764K2075j8018O339j5790J8780j429m3831j600J7653Q164K4635k3007
4095E47735j4083J0876l029n948J0989r486k8823K2364k920K857M501j4593K4610
4082E45050K7864l9441L772L8694m736o310J2637K427J411J0908Q91l368m464
4069E85335N309j2116J9924L6240J4034r954j1279k2619k4153K3815L6691J8832
4057F60059n863j3011l3368J0126o95J9218k427J4615L325j5899l6893J052K1891
4044F22130r606J8874L6652l0434q799J1892k1215J8620J9048K520j2259j7847
4032F29576q197k4186j0200J8609J3738R258l3560j4095J2427O4P727L882k879
$$ plain form
4120 652405 671676 664784 633333 628692 622529 590317 585661 601168 604068 620278 590831 563958 553764
4107 553764 575839 557821 564160 548370 567150 565721 521890 520290 537943 546107 570742 547735
4095 547735 533652 544528 541499 535551 546540 537054 508231 530595 527675 530532 535033 520440 545050
4082 545050 572914 533473 537245 575939 571203 564893 577530 579957 581368 592276 593167 589799 585335
4069 585335 590644 578528 598452 634692 648726 638772 627493 604874 580721 604536 641227 660059
4057 660059 654196 641185 607817 617943 617248 636466 634039 648654 651979 636080 599187 600239 622130
4044 622130 612524 631398 668050 637616 628817 640709 619494 638114 657162 659682 647423 629576
4032 629576 621379 597193 586993 605602 619340 628598 595038 580943 593370 593434 601161 605043 602164
4019F02164k451k6668M340j4209J0667l040j8276l2910O900Q420j9709l1762j0983
4006D72483J6051J7613J1831j3365O785l468L094k2333K894j711J3254K5032l1241
3993D96919n502K8801J0692K0350k3043J0073j7862p369k987n606K3034J5370
3981E42870Q414J2609q507J8743l1861L1754J69k8264L810o534J2828j3640j9375
3968E23016n779p517L0106j0351J4153M0594M315k2787j4687L9774j1718J365
3956E80484l864J3047J4778K6589q977M0652O1139M2680J18712J58796J63686
3945A207722J78813J03006L9020l29n3453p6965q0911o9415q3232r4114p1075
3934I99067j1838n4818m6911j5872J9939J7356R715K7651p671M2542P825m0071
$$ plain form
4019 602164 599713 573045 577385 563176 573843 570803 552527 519617 526517 534937 515228 483466 472483
4006 472483 488534 506147 517978 504613 511398 507930 511024 488691 491585 489874 503128 528160 496919
3993 496919 491417 520218 530910 551260 528217 538290 520428 513059 510072 504466 527500 542870
3981 542870 551284 563893 555386 574129 542268 574022 574191 545927 549737 543203 556031 542391 523016
3968 523016 517237 509720 539826 529475 543628 584222 588537 565750 551063 590837 579119 580484
3956 580484 576620 589667 604445 631034 622057 662709 723848 766528 885240 1044036 1207722
3945 1207722 1386535 1489541 1528561 1528232 1474779 1397814 1316903 1247488 1164256 1070142 999067
3934 999067 987229 932411 885500 869628 889567 906923 916638 944289 936618 979160 986985 946914
3922I46914r022N412K1975M5348L5076Q7595J31878K23411J38818Q8335M5037
3911A760777j8491m5294q2162j00155j11401j19360p7547p4913p1444l3147n6285
3900I70578m6708J3033M31m5931j1782P224j9998k199n139k1929j745J8923q321
3887H46437l3929j5429k7992j2934J0518K2012j1844j3519K5557k4560l1504j4651
3875G18162J2288j014P801N162k5565O356q315l215p280J0872j755R935J4227
3862G37659K0366K6091r477R281m634m13N953K7739J3696o388j3263J3428K4728
3849H44766k3319N488K1179J0628l397M3845J6887P03Q682N0514L4179K2821k614
3836A030362l794K1540J3994K65P999L8768L8641K5781K6060j0036K0762J6494
$$ plain form
3922 946914 937892 943304 965279 1010627 1045703 1133298 1265176 1488587 1627405 1715740 1760777
3911 1760777 1742286 1696992 1614830 1514675 1403274 1283914 1206367 1131454 1060010 1026863 970578
3900 970578 923870 936903 937334 891403 879621 886845 866847 864648 859509 837580 835835 854758 846437
3887 846437 812508 797079 769087 756153 766671 788683 776839 763320 788877 764317 732813 718162
3875 718162 730450 729436 737237 742399 716834 723190 714875 711660 704380 715252 713497 723432 737659
3862 737659 758025 784116 774639 783920 779286 778873 784826 812565 826261 819873 806610 820038 844766
3849 844766 821447 826935 848114 858742 855345 899190 916077 916780 925462 975976 1010155 1032976 1030362
3836 1030362 1026568 1048108 1062102 1062367 1070366 1109134 1147775 1173556 1199616 1189580 1210342 1226836
3824A226836k949K8497J2733L3047L6845M2000N508M5928M8618j1670J0573O2904
3812A538870O0844O3504P4697O9030R5502J00843J23517J52820J62024J71528
3802B613179K03559K34978K90839L13212M04997M68103N35378N96907O79668P41688
3792G082508P55280P96944P26865O54905N88536N00541L70201K35501R2142L3099
3782A1836522p059l6279m0909l3846j3359j8949L137j2038K5686j5875p4279k06055
3770A1406697k90121l34286m59549n89282o43630o56163o60099o51888o53309
3761F468370o01022n39429m73728m44959l65182k92041k15880j90861j85787j62249
3751B997232j00187q7150j12901q6427l3613l9586p0819q3649m0953l1681m163
$$ plain form
3824 1226836 1223887 1252384 1265117 1298164 1335009 1377009 1382517 1428445 1477063 1465393 1475966 1538870
3812 1538870 1599714 1663218 1737915 1806945 1902447 2003290 2126807 2279627 2441651 2613179
3802 2613179 2816738 3051716 3342555 3655767 4060764 4528867 5064245 5661152 6340820 7082508
3792 7082508 7837788 8634732 9361597 10016502 10605038 11105579 11475780 11711281 11803423 11836522
3782 11836522 11829463 11793184 11752275 11718429 11705070 11686121 11689258 11677220 11702906 11687031 11612752 11406697
3770 11406697 11116576 10782290 10322741 9733459 9089829 8433666 7773567 7121679 6468370
3761 6468370 5867348 5327919 4854191 4409232 4044050 3752009 3536129 3345268 3159481 2997232
3751 2997232 2897045 2809895 2696994 2610567 2576954 2537368 2466549 2382900 2341947 2310266 2306103
3740B306103j6730n4646k0774l0624k2643j0541l3937L912l7385k9909m3246j0226
3728A999354m8303j6373j155n439k2542q130L106m268R256J9232J9574M517R278
3715A958107m713J0648L2229L9701j6751k520j1553N0287J4072j5288j2487M2402
3703B084134K6295J3547R80L8219L6412M5330L0049k2573K1347N7839J3826J2846
3691B358251J3054R941l0620j7027M2625j8398j1284J3979J3592O295Q885O922
3679B396215K5234N5955N6251K8218L7352M6490N1757l917L5219O7945Q9010R2452
3667B978181M7391L5733N6853R6205O5269J08018J18681P0047J06127J57724J73770
3656D013999J45988J68460K08062J70738K85487L10374K72331L09625L84347M42344
$$ plain form
3740 2306103 2289373 2234727 2213953 2183329 2160686 2150145 2116208 2120120 2082735 2052826 2009580 1999354
3728 1999354 1951051 1934678 1933523 1928084 1905542 1897412 1900518 1896250 1905506 1924738 1944312 1948829 1958107
3715 1958107 1953394 1964042 1996271 2035972 2019221 2016701 2005148 2055435 2069507 2054219 2041732 2084134
3703 2084134 2110429 2123976 2124956 2163175 2199587 2244917 2274966 2252393 2273740 2331579 2345405 2358251
3691 2358251 2371305 2381246 2350626 2333599 2376224 2357826 2346542 2360521 2374113 2380408 2389293 2396215
3679 2396215 2421449 2477404 2533655 2561873 2599225 2645715 2697472 2693555 2728774 2796719 2885729 2978181
3667 2978181 3025572 3061305 3118158 3214363 3279632 3387650 3506331 3576378 3682505 3840229 4013999
3656 4013999 4159987 4328447 4536509 4707247 4992734 5303108 5575439 5885064 6269411 6711755
3646F711755M45368M62842M43744M29452M80042M36821L96710L94293L44873L56397
3636A0902297L44550M09370N24785N87066P54906J028618J382470J715124K110128
3627A9759314K566847K854225L111294L204589L103515K873083K480431J980275
3619D1933573J350285P64495K65706j41478m18007m63383l61012j25010J68587
3610D2973756L95797N57303O19697N58581K74772r4065n00784r73565j465643
3601D2345849j852902k148973k295619k289094k113821j936298j636683j335179
3593B6737280j055550p89115n99859m55868m06097l78314m55352n12732o59654
3584B1424739p74777q34060r21355r66727j034424j074894r89300r25145r07240
$$ plain form
3646 6711755 7157123 7619965 8063709 8493161 8973203 9410024 9806734 10201027 10545900 10902297
3636 10902297 11246847 11656217 12181002 12768068 13522974 14551592 15934062 17649186 19759314
3627 19759314 22326161 25180386 28291680 31496269 34599784 37472867 39953298 41933573
3619 41933573 43283858 44048353 44314059 44172581 43754574 43291191 42930179 42805169 42973756
3610 42973756 43369553 43926856 44546553 45105134 45379906 45285841 44785057 43811492 42345849
3601 42345849 40492947 38343974 36048355 33759261 31645440 29709142 28072459 26737280
3593 26737280 25681730 24892615 24292756 23836888 23430791 23052477 22597125 22084393 21424739
3584 21424739 20649962 19815902 18894547 17927820 16893396 15818502 14829202 13904057 12996817
3575A2996817p84428o97814o14855m71533m13957k68387j42606j15294m7924M6050
3565I486069J60803K05677K73569L62785M49549N13244N77703O09334O32107O29024
3555A3899864O76317O46512O09169N26041M34617L27034J81594L0365j05518j97091
3545A7028904l03604m29337m74826n51156n72788n41721n58047m88697m31708
3536A2677020l33242l16191k58425j42305j00665p1476l1906k3769n1146n5736
3526A1292159l2040m0919l772q635l3125J6611Q0756O2147R6024J27884P8077
3515A1635167O9197P5399P8087P8268P1761L703K1164P1707J39559J64873J91833
3504A2600718K40221L02033L86513M05457M64443M92506N62839O19302O98993
$$ plain form
3575 12996817 12212389 11514575 10899720 10428187 10014230 9745843 9603237 9487943 9440019 9486069
3565 9486069 9646872 9852549 10126118 10488903 10938452 11451696 12029399 12638733 13270840 13899864
3555 13899864 14576181 15222693 15831862 16357903 16792520 17119554 17301148 17331513 17225995 17028904
3545 17028904 16725300 16295963 15821137 15269981 14697193 14155472 13597425 13108728 12677020
3536 12677020 12343778 12027587 11769162 11626857 11526192 11454716 11422810 11399041 11347895 11292159
3526 11292159 11260119 11219200 11215428 11206793 11173668 11190279 11271035 11333182 11429206 11557090 11635167
3515 11635167 11704364 11779763 11857850 11936118 12007879 12011582 12032746 12104453 12244012 12408885 12600718
3504 12600718 12840939 13142972 13529485 13934942 14399385 14891891 15454730 16074032 16773025
3495A6773025P33639P95367Q84099R66868J058484J198396J370263J530824J731650
3486B7042615J926136K111566K378241K627152K880966L202283L522120L849358
3478D9540437M094992M383461M555261M604729M585186M460818M227666L947034
3470H4399584L560961L112204K774838K487757K235374J993861J853493J619846
3462A04037918J411392J105651P06540K48919k87160q82428j503825k039648k611399
3453A00185960l131503l549904l897488m086936m228940m289119m295780m205646
3445F8500644m015670l753883l457060k972695k401217j781384j021813k28121
3437D8868801N93696J398127K133517K764422L264597L487973L531569L326006
$$ plain form
3495 16773025 17506664 18302031 19186130 20152998 21211482 22409878 23780141 25310965 27042615
3486 27042615 28968751 31080317 33458558 36085710 38966676 42168959 45691079 49540437
3478 49540437 53635429 58018890 62574151 67178880 71764066 76224884 80452550 84399584
3470 84399584 87960545 91072749 93847587 96335344 98570718 100564579 102418072 104037918
3462 104037918 105449310 106554961 107261501 107510420 107223260 106340832 104837007 102797359 100185960
3453 100185960 97054457 93504553 89607065 85520129 81291189 77002070 72706290 68500644
3445 68500644 64484974 60731091 57274031 54301336 51900119 50118735 49096922 48868801
3437 48868801 49462497 50860624 52994141 55758563 59023160 62511133 66042702 69368708
3429F9368708K942166K316312J755305J080975M00004j20402n48761r03737j082810
3420G5207760j142463j027378q52099o70014l95822k41879r4967j02000k06436
3411G0474702m58315q26101j291026j758996k252751k758162l148661l385630
3403E4595060l596209l628826l628739l525373l312463l115095k883897k675471
3395B8228987k466921k217106j980766j786551j516164j387472j263321j070522
3387A4540164r32427q40534p07323o07044n41793m92603l94396l19079k78437
3378I426528k10705j86100j42241o6210l4245L9931R2387J21146J76181K73821
3368I490493L25333L53568M51686N20010N22246N53017N73136N48925M98277M47491
$$ plain form
3429 69368708 72310874 74627186 76382491 77463466 77863470 77743068 77194307 76290570 75207760
3420 75207760 74065297 73037919 72185820 71515806 71119984 70878105 70783138 70681138 70474702
3411 70474702 70016387 69190286 67899260 66140264 63887513 61129351 57980690 54595060
3403 54595060 50998851 47370025 43741286 40215913 36903450 33788355 30904458 28228987
3395 28228987 25762066 23544960 21564194 19777643 18261479 16874007 15610686 14540164
3387 14540164 13607737 12767203 12059880 11452836 10911043 10418440 10024044 9704965 9426528
3378 9426528 9215823 9029723 8887482 8821272 8787027 8826958 8919345 9040491 9216672 9490493
3368 9490493 9815826 10169394 10621080 11141090 11663336 12216353 12789489 13338414 13836691 14284182
3358A4284182L73672J88178J07400P469j28904j86749k79655l61173m14415l95301
3348A3194704m84778n43330n65524o19199n95638n75699n38345m82752m01150
3339H388289l53997k64628k24949j61951j04614o5824M891J2733L4415J05453
3329G369818J44103J27300J91730K25309K79449L11474L38817M34943N24095N87595
3319A0534633P44184Q30345J012525J212700J439034J701824K091996K541363
3311B2108604K989510L522497L978203M380589M737533M949322N168453N153121
3303E6987832M975983M612275M003246L127114K066583Q98885l53323j520763
3295G4797832k616353l566595m347268m844500n238146n331908n273355m971410
$$ plain form
3358 14284182 14657854 14846032 14953432 14960901 14831997 14645248 14365593 14004420 13590005 13194704
3348 13194704 12709926 12166596 11601072 10981873 10386235 9810536 9272191 8789439 8388289
3339 8388289 8034292 7769664 7544715 7382764 7278150 7212326 7217217 7229950 7264365 7369818
3329 7369818 7513921 7641221 7832951 8058260 8337709 8649183 8988000 9422943 9947038 10534633
3319 10534633 11278817 12109162 13121687 14334387 15773421 17475245 19567241 22108604
3311 22108604 25098114 28620611 32598814 36979403 41716936 46666258 51834711 56987832
3303 56987832 61963815 66576090 70579336 73706450 75773033 76671918 76318595 74797832
3295 74797832 72181479 68614884 64267616 59423116 54184970 48853062 43579707 38608297
3287C8608297m634786m210198l765533l306522k838909k450482k102333j751268
3279A3548266j447927j218088j021808q73280p59737n89441n15683m23588l65364
3270F333350l12480l09181k78174k20111j87225j87594j48324j50303j49050r7126
3260D293782q9238j06350j21884p5665n8964o4699n6087l3524l4892j0017k759
3249C639703K146O2936O9283N4183P7819L9876L3084K5991N1027R712j0398m0006
3237D015356q3719q3649p4380q6643j65364j40068j53261j49562j42167j01196
3227B835347q8699r5130o5610j4781n7050j39259p1829l2065j7798l7516L59R84
3215B216953p226j0853R16n889L5828M9570N517j1683L4503M3499J2348J889J433
$$ plain form
3287 38608297 33973511 29763313 25997780 22691258 19852349 17401867 15299534 13548266
3279 13548266 12100339 10882251 9860443 8987163 8227426 7637985 7122302 6698714 6333350
3270 6333350 6020870 5711689 5433515 5213404 5026179 4838585 4690261 4539958 4390908 4293782
3260 4293782 4204544 4098194 3976310 3900645 3841681 3776982 3720895 3687371 3652479 3642462 3639703
3249 3639703 3641849 3704785 3774068 3828251 3906070 3945946 3979030 4005021 4056048 4065760 4055362 4015356
3237 4015356 3931637 3847988 3773608 3686965 3521601 3381533 3228272 3078710 2936543 2835347
3227 2835347 2746648 2651518 2585908 2571127 2514077 2374818 2302989 2270924 2253126 2215610 2215969 2216953
3215 2216953 2209727 2198874 2199790 2193901 2229729 2279299 2284816 2273133 2307636 2351135 2363483 2365372 2366805
3202B366805M1155N0341K0979N6711N7075K9780L6210L0455N0771M7985M0944
3191B829211L5276J7270J1745o102K2991N5173M0597J8295K4459N966L0210M4945
3179C130036L8399K4175N7473L7685J7539K3881o907J3603R550K5889K7129j046
3167C397406K0511j6668O5170M4414K9252O8779O8431M8678J01479R4973M3904
3156C966329O5294P2914Q7598N2268J00412N8326P6258J18960J22479P2537O9173
3145D862548O7122N4112O7626M5771P1683P8675J20971J26774J29331R2092R8696
3134E815401P6481P9884J62251J59694J76296J62407J92940J45031J35207J37119
3124G242711J68725K26090K65681L62501L86595L66690L52774L18407K36383K10394
$$ plain form
3202 2366805 2407960 2458301 2479280 2535991 2593066 2622846 2659056 2689511 2740282 2788267 2829211
3191 2829211 2864487 2881757 2893502 2887400 2910391 2965564 3006161 3024456 3048915 3054881 3085091 3130036
3179 3130036 3168435 3192610 3250083 3287768 3305307 3329188 3322281 3335884 3345434 3371323 3398452 3397406
3167 3397406 3417917 3401249 3466419 3510833 3540085 3608864 3677295 3725973 3827452 3922425 3966329
3156 3966329 4031623 4104537 4192135 4244403 4344815 4403141 4479399 4598359 4720838 4793375 4862548
3145 4862548 4929670 4983782 5051408 5097179 5168862 5247537 5368508 5495282 5624613 5716705 5815401
3134 5815401 5891882 5971766 6134017 6293711 6470007 6632414 6825354 6970385 7105592 7242711
3124 7242711 7411436 7637526 7903207 8265708 8652303 9018993 9371767 9690174 9926557 10136951
3114A0136951J97208J64967J70063J51665J84119J41694K12777K51330K44721
3105A1855495K84676L64606M45249N13604O03271O03461N74138O06524O70240
3096A6521264P56524R16115J061493J280823J500076J737721J979762K284139
3088B8037917K597317K982455L575081M350672N518287P165129R249571J1311803
3080G4788232J2485558J2269743J0795966Q741706P027657O520581Q107317J2686493
3072A53423253K0205913K8015771L1651511K8695378J9884246P818371l883185
3065B85811258j3543587k1171732k5692480k7284591k7030878k5502128k3218735
3058A22367127k0296804j6913408j3570234j0611211q387950o796526n614959
$$ plain form
3114 10136951 10334159 10499126 10669189 10820854 11004973 11146667 11359444 11610774 11855495
3105 11855495 12140171 12504777 12950026 13463630 14066901 14670362 15244500 15851024 16521264
3096 16521264 17277788 18193903 19255396 20536219 22036295 23774016 25753778 28037917
3088 28037917 30635234 33617689 37192770 41543442 47061729 54226858 63476429 74788232
3080 74788232 87273790 99543533 110339499 119081205 126108862 132629443 140736760 153423253
3072 153423253 173629166 201644937 233296448 261991826 281876072 289694443 285811258
3065 285811258 272267671 251095939 225403459 198118868 171087990 145585862 122367127
3058 122367127 102070323 85156915 71586681 60975470 52587520 45790994 40176035
3051D0176035m795640m031294l411009k835483k336757j923952j589271j306278
3043A7946351j105522r20611q40253q13906p38142p09892o68185o38520n55571
3034A0955749m79646m78038m11051l76818l41937k94230k38489k07492k29492
3025G898556j85074k34091k39612j99172k26033k34303k03918j67309j15466q5510
3015F008068j16912p7010r7290j16532j24125j62656j76658j88795j62105j56295
3005D629690j32822j40443j89235j72524j65462j29898j07155j32533j08959j07513
2995C243146n7118q2015r9491q4886r6251o6102q2741j14279r5633n4287p0690
2984B339653q6671j02225n3673m3014r2520l0103l1509m5082m2405k7844j429
$$ plain form
3051 40176035 35380395 31349101 27938092 25102609 22765852 20841900 19252629 17946351
3043 17946351 16840829 15920218 15079965 14266059 13527917 12818025 12149840 11511320 10955749
3034 10955749 10476103 9998065 9587014 9210196 8868259 8574029 8335540 8128048 7898556
3025 7898556 7713482 7479391 7239779 7040607 6814574 6580271 6376353 6209044 6093578 6008068
3015 6008068 5891156 5814146 5716856 5600324 5476199 5313543 5136885 4948090 4785985 4629690
3005 4629690 4496868 4356425 4167190 3994666 3829204 3699306 3592151 3459618 3350659 3243146
2995 3243146 3186028 3104013 3004522 2919636 2823385 2757283 2674542 2560263 2464630 2410343 2339653
2984 2339653 2252982 2150757 2097084 2054070 1961550 1931447 1899938 1854856 1812451 1784607 1783178
2973A783178j4470q174l4224j7598j0252m1865n6254p0607o5483n5239k1355o3781
2961A323876m7478k4436n6278j5951m5955m8351k0709n2369k3381j0767j595n411
2949I71195k012l660k6161k5307n392l5129l0656j369k7326k2375k1076k1031
2937G49701k251J4964q198k1701l140K4720K4356j4147j6353K2520k4492q929
2925G37050L5324J5210l0797L620j2901j066J0242J096n076p90O780m0907k2062
2912F95723k8172R808J6611n7744k7203P69n4478n8767k7122Q880l3465m4748
2900D00092m2798J135q471M478k337j2976L679J5412j0394L1434j3887J6348J8003
2887C99718k731j513K8770k896K603N4659J491j9158j9866j2707L725J3077R673
$$ plain form
2973 1783178 1768708 1760534 1726310 1708712 1698460 1656595 1600341 1529734 1464251 1409012 1387657 1323876
2961 1323876 1276398 1251962 1195684 1179733 1133778 1085427 1064718 1012349 988968 978201 976606 971195
2949 971195 969183 965523 939362 914055 908663 873534 842878 841509 814183 791808 770732 749701
2937 749701 747450 762414 754216 732515 729375 754095 778451 764304 747951 770471 745979 737050
2925 737050 772374 787584 756787 760407 747506 746440 756682 757778 752702 751912 758692 717785 695723
2912 695723 667551 677359 693970 636226 609023 609792 555314 496547 469425 478305 444840 400092
2900 400092 357294 358429 349958 354436 352099 339123 342802 358214 347820 379254 365367 381715 399718
2887 399718 396987 395474 424244 421348 423951 478610 480101 460943 441077 428370 432095 445172 454845
2874D54845k0648j0228K3815j7146j8298m095K8714Q48M88k0593j815j4338L1285
2861D32834q708l7866r683J3426J1788k076k7138R253K547j6088j5069l0470j8809
2848C03941R362l054J9130j0749l3204m594J2075o632k7351j1836k7787K0074
2836B39375L0772k7878k4530N873q374l3160J7831j8094J8688P89q791J2311J737
2823B06549J0061K1053L313J8168J3040l1891j812J5038k6097J4905M7930M3765
2811C34022j8670P778L6875m4938J574m403K5044l2079N4153K5524L1256M7145
2799D63281K3808M1685O4498M0449L8508L3770L6299O7991N5921Q5202J01304
2788A052716R1786J88218J63967R2649K3188m1397o2362j28277j25335j05034
$$ plain form
2874 454845 434197 423969 447784 430638 412340 408245 436959 437807 438295 417702 415887 401549 432834
2861 432834 424126 386260 376577 390003 401791 399715 372577 381830 384377 368289 353220 322750 303941
2848 303941 313303 310249 329379 318630 285426 280832 292907 286275 258924 247088 219301 239375
2836 239375 270147 242269 217739 223612 215238 182078 199909 181815 200503 201292 192501 204812 206549
2823 206549 216610 237663 240976 259144 272184 240293 238481 253519 227422 242327 290257 334022
2811 334022 315352 323130 360005 315067 316641 312238 337282 305203 359356 384880 416136 463281
2799 463281 487089 528774 593272 633721 672229 705999 742298 810289 866210 951412 1052716
2788 1052716 1144502 1332720 1496687 1589336 1612524 1571127 1508765 1380488 1255153 1150119
2778A150119j47327j32759r9117j04437q1752q4734n4162l3385k1814j6054l7996
2767C36582m5243J4323r166j5614k7666q66k2763r341j9250J0799k0103j8454
2755A73238J6487l240l435p550j97j1795p115m277L1244j2028k8996k68l0353
2742A11715k5190M431K2747O380k6738o213j078J6807r513M1381Q930P691j8147
2729A33203Q867J5789k2788N813k392j3486Q93J0705n186k1028p517J1730k7314
2716H7289K0233M0561j8551k7080n3890J778K8566R76n508k9235j7962k9892K3120
2703B0405J6629P230Q394n859O200j9607k5282O147R330J1381P071j7682k3862
2690D95K9256m35k8179j0891J8830L8506J8349o699o95J12k3171J5486j0525N413
$$ plain form
2778 1150119 1002792 870033 770916 666479 584727 499993 445831 412446 390632 374578 336582
2767 336582 291339 305662 296496 280882 253216 252350 229587 220246 200996 211795 191692 173238
2755 173238 189725 186485 183050 175500 175303 163508 156393 152116 183360 171332 142336 142068 111715
2742 111715 86525 90956 113703 120083 93345 87132 86054 102861 93348 134729 143659 151350 133203
2729 133203 142070 157859 135071 140884 138492 125006 125899 136604 131418 110390 102873 114603 87289
2716 87289 107522 148083 129532 102452 48562 50340 78906 79882 74374 45139 27177 -2715 20405
2703 20405 37034 44264 52658 46799 52999 33392 8110 14257 23587 34968 42039 24357 495
2690 495 29751 29316 1137 -9754 9076 47582 65931 59232 58537 58649 35478 50964 40439 45852
2676D5852n45p815J1058K7506J2659r751n261j4534O295K1529J0581o155O203
2663I7622J6101p291J0650l5619J241N702j0418K726m8126L9637L2887m9330j2039
2650D3743L1601J1872J0447l1132j2926Q560J5634k0547N181K3493r948l160L3363
2637A06181k8466j9549j1649Q466m426k599K3049N537j3263j1992M775O579r446
2624E3197J6124j8421R724Q740p744p125k07p604k2007r076j8615j967k3532J2250
2610a6263P105J1577j9477K2960k0258k753p313J3853j3158o461M7942J656k0474
2597a064k849K5023K5239N12J0100K4852l030j0123L3173J8931k1739o291K7712
2584A20446K5217J3567K8824M9518O3l8560l9495k4087k4399l8660L7266Q367
$$ plain form
2676 45852 45307 37492 48550 76056 88715 78964 73703 59169 65464 86993 97574 91419 97622
2663 97622 113723 106432 117082 81463 82704 88406 77988 80714 32588 72225 105112 55782 43743
2650 43743 75344 87216 97663 66531 53605 62165 77799 57252 62433 85926 75978 72818 106181
2637 106181 77715 58166 46517 54983 50557 47958 71007 76544 63281 51289 56064 62643 53197
2624 53197 69321 50900 60624 69364 61620 54495 54288 46684 24677 15601 -3014 -4981 -28513 -16263
2610 -16263 -9158 2419 -17058 5902 -14356 -17109 -24422 -10569 -23727 -30188 17754 19410 -1064
2597 -1064 -3913 21110 46349 46861 56961 81813 78783 68660 101833 120764 99025 92734 120446
2584 120446 145663 159230 188054 237572 237635 199075 159580 135493 111094 72434 109700 118067
2572A18067j1276j4505l7939k7256k3095L5451L2910q92l4609j1183j1321k6827
2560a2475J3936R616r237j1290J4975j3071J867Q703k7645o465N2471l975q037
2547I373K3127m0407l1470K458K3045Q26j546j4695l238l3326N889L6740l993
2534b7217J3326K7486J6607n328j1925j7632M504K4289j2337K096J8765K4255
2522E6889l2930p828Q605J1115p863k2719J6665r891j6570J7326J1484j8289k01
2509E793j1847n485J450L0319J2420n5397p592L2745N939M5110M804j2618k2984
2496B2657k8215R434J5832K4616J6587J3891j8523M567J1696j7205J857k1713
2484C5481m734K5408J0356n864R715l2701R980K668L514M689K7847j4853j9049
$$ plain form
2572 118067 106791 92286 54347 27091 3996 39447 72357 71465 36856 25673 14352 -12475
2560 -12475 1461 11077 1840 -9450 5525 -7546 -5679 3024 -24621 -31086 21385 17410 9373
2547 9373 32500 -7907 -39377 -36919 -13874 -13048 -14594 -29289 -32527 -65853 -59964 -23224 -27217
2534 -27217 -13891 13595 30202 24874 12949 -4683 -179 24110 11773 13869 32634 56889
2522 56889 23959 16131 24736 35851 27988 5269 21934 12043 -4527 12799 24283 5994 5793
2509 5793 -6054 -11539 -10089 20230 32650 -22747 -30339 2406 8345 53455 58259 45641 22657
2496 22657 -5558 3876 19708 44324 60911 74802 56279 60846 72542 55337 57194 35481
2484 35481 30747 56155 66511 60647 70362 37661 47641 50309 53823 58512 86359 71506 52457
2471E2457q38O576p361Q918o028L765r095m283J6141J0277J3893k1567j0597J1271
2457F3529J3995m2114J9442K6783k0906M6120J5257k7170L9109k3863k3978o729
2445G9475j1467K9805J7501K8826J026P315O594j1731k8724j4494q328K0907L72
2432A17077K2554P845l5480K1612L3810K9268j8568p628K2870P004k5056P727
2420A83035k1876k7640R227J7720j8635p593q847M264J3219r385M4648L749P933
2407A89819j4180J2644J7893p670K2554N257J3958J815K2258o098q755J05j6355
2394B33245J1012M0704l0602k8620j4856J3116J3555j2636J1628O760p814K0950
2382B56442J1192J8270k1079J1376J5411J4971L7314K2174m8031n992K736L5236
$$ plain form
2471 52457 51619 58195 50834 59752 53724 57489 48394 44111 60252 70529 84422 62855 52258 63529
2457 63529 77524 35410 54852 81635 60729 106849 122106 94936 134045 110182 86204 79475
2445 79475 68008 97813 115314 144140 145166 152481 159075 147344 118620 104126 95798 116705 117077
2432 117077 139631 147476 111996 133608 167418 196686 178118 170490 193360 200364 175308 183035
2420 183035 161159 133519 142746 160466 141831 134238 125391 129655 142874 133489 178137 181886 189819
2407 189819 175639 188283 206176 198506 221060 226317 240275 242090 264348 258250 249495 249600 233245
2394 233245 244257 284961 254359 225739 210883 223999 237554 224918 236546 243306 235492 256442
2382 256442 267634 285904 264825 276201 291612 306583 343897 366071 318040 312048 314784 350020
2370C50020j7486K151M8352r515J4037K9294N8827M4537J7814K24p880L4643J6322
2357E81340j1232J1158K3751o503K8747M0460K8131M3953K8765K6888k283N1698
2345H44873J3362j480P63L5993N9122O5488O4774Q1679J12338J24942J42423J46623
2333A690900K71067K77791L15277K97622K45859J59408K15168K14909L02955L42284
2323D333240M76568O57359R57159J484407K767661N195420O721454O023171M576379
2314C3192818J752229o60050j423919l320470l936583l762981l530500l271766
2306A5038778k953913k589393j994821j331374q25250n64447m66549m13324l99755
2297C499952l49386l17194k71901k21467k44491k07631j27450j18959r0160j18126
$$ plain form
2370 350020 332534 334685 383037 373522 387559 416853 475680 520217 538031 538255 530375 565018 581340
2357 581340 570108 581266 605017 598514 627261 667721 695852 739805 768570 795458 793175 844873
2345 844873 858235 856755 857518 893511 952633 1018121 1082895 1164574 1276912 1401854 1544277 1690900
2333 1690900 1961967 2239758 2555035 2852657 3098516 3257924 3473092 3688001 3990956 4333240
2323 4333240 4809808 5467167 6424326 7908733 10676394 15871814 22593268 28616439 33192818
2314 33192818 34945047 34284997 32861078 29540608 25604025 21841044 18310544 15038778
2306 15038778 12084865 9495472 7500651 6169277 5344027 4779580 4313031 3899707 3499952
2297 3499952 3150566 2833372 2561471 2340004 2095513 1887882 1760432 1641473 1551313 1433187
2287A433187j13178p4361k6894o3831q8928o5441m1197k6458l9997n5094k2659
2276H15149m184N900k1277j4894l3549k3877l6685r121m4877j6403k0584o846
2264E88752r234j7790J7685j5181M312r939l6852r949l6232n195L549l4277k2278
2251D17371k4313q682q787R257j6689m98j0125p105l220k2969J5119P22o366m9368
2237B84347k5613k180j2889l6220j513l5837M3444K2219o87k1659n591l721j7122
2224A86978n97j5839k0299j0496M9665J8435k165p903j3801L325k9106l0553j1520
2211A16124L2326o9K534k2844j609j4917p913J7578R059j7738n26n350k2776K1902
2197A05781M953K1578j788m988l0473j5291J1467J2628k8084l7971Q021J4591
$$ plain form
2287 1433187 1320009 1245648 1218754 1154923 1065995 1000554 959357 932899 892902 837808 815149
2276 815149 810965 816865 795588 780694 747145 723268 686583 677462 632585 616182 595598 588752
2264 588752 579518 561728 579413 564232 568544 558605 521753 511804 475572 470377 473926 439649 417371
2251 417371 393058 384376 375589 384846 368157 367659 357534 350429 347209 324240 339359 340081 333715 284347
2237 284347 258734 256554 243665 207445 205932 170095 213539 235758 235071 213412 207821 204100 186978
2224 186978 186381 170542 150243 139747 189412 207847 205682 197779 183978 187303 158197 127644 116124
2211 116124 148450 148381 150915 128071 126462 111545 103632 121210 130269 112531 112005 106655 83879 105781
2197 105781 110734 132312 130524 125536 95063 79772 91239 103867 75783 37812 45833 60424
2185F0424O784p533J3606k5978j5757K6379K6839j1868M582k925j8835l44K3498
2172G8872K4482k6662p613j6922j820K9768L7898J4116k3402k7563l940k6390
2160E0824K1166M8555k1015J459j2911k4158K3951K2687l4328m2629J1136l9052
2148E685K292J677K538r738J9039j2850j6924P892J0035N263K207j1449L966k7777
2134a8144J4563J1362N101J9685K394J4958K987P848m943p567Q88K1003k3650
2121D6485R237J7233p1l2009J9647K2730m716k1759N87K94J6650j7362j5126Q088
2107D9908K4270J89j3317R431j2396j3736M9778l3989m5968M760o85K273o453
2094A4065M236r904o46m121k2557n176J0706J1315M1758k1771J2612r803Q94K2887
$$ plain form
2185 60424 67208 59675 73281 47303 31546 57925 84764 72896 77478 74553 55718 55374 78872
2172 78872 103354 76692 69079 52157 50337 80105 118003 132119 108717 81154 77214 50824
2160 50824 71990 120545 99530 100989 88078 63920 87871 110558 76230 33601 44737 5685
2148 5685 7977 9654 12192 2454 21493 8643 -8281 -389 9646 14909 17116 5667 9633 -18144
2134 -18144 -3581 7781 12882 32567 34961 49919 52906 60754 55811 48244 49132 70135 46485
2121 46485 55722 72955 72884 40875 60522 83252 78536 56777 57364 57658 74308 56946 41820 49908
2107 49908 74178 74367 61050 70481 58085 44349 94127 60138 14170 18930 18245 20518 14065
2094 14065 18301 8397 7751 3630 -18927 -24103 -13397 -2082 39676 17905 30517 20714 21608 44495
2080D4495q269l9990q804L4112j0294q426N74j6526K2115J3747j6051L831L3092
2067D3606j8366k5907k0142M9161P309k1038Q578K7141P121L764k8252j6710K7967
2054D4232O797J4700P285J028P156q552M9723L3686L7094J0746k3909J662L139
2041A84787r148j2894l0379j1778j3064n3870j4592o041m729r851j2759J4016
2029A9698q417N34J0343k2849k3113J928J7260L131J8515k4052k9105l660L7681
2016b106J2001k2907j4387M5778K0179j1691j1338o805j8804L1279n861q431k4549
2003a7642l5221K7325J2432k5604P334L3505p964K2754O856j7894j9696R625j789
1990e979m1910P203R013N136K197K6670k1038jQ349k90R231J0841O308j6660J1169
$$ plain form
2080 44495 36226 -3764 -12568 21544 11250 2824 3398 -13128 8987 22734 6683 10514 43606
2067 43606 25240 -667 -20809 28352 35661 14623 23201 50342 57463 61227 32975 16265 44232
2054 44232 51029 65729 73014 74042 81198 72646 122369 156055 193149 203895 179986 181648 184787
2041 184787 175639 162745 132366 120588 107524 53654 39062 33021 28292 18441 5682 19698
2029 19698 11281 11815 22158 -691 -23804 -21876 -4616 -1485 17030 -7022 -36127 -39787 -2106
2016 -2106 9895 -13012 -27399 18379 38558 26867 15529 8724 -10080 21199 15338 6907 -17642
2003 -17642 -52863 -25538 -13106 -38710 -31376 2129 -5835 16919 23775 5881 -13815 -4190 -5979
1990 -5979 -47889 -40686 -31673 -26537 -24340 2330 -18708 -18709 -10360 -10650 -1419 9422 15730 -930 10239
1975A0239J2984l5543n066L9050J8772k5446O185J5915j4736j4902k7385J1655
1963h278K2804O895O032r986j6836l711r694J1380L4050l9837r097R919K2101
1950A5742J2366m0559j5525L6447k0481n251O431j8568J6593M2609k3129k403
1938D272l4j2176n379l362K5455l5364P171K4295j5141j2900q008J9448Q145N093
1924A515j8432p701K59k4924K2146l659K8254J4434m560J920l121k9926j5368
1911c9163J3672K240q421K0057K2932K1031m0521K1772J3751j2616O418L103m1685
1898a7430m5144K3198J047L062J3241J2946O697k7196m008L1132K4997l640k7734
1885h832J1690J3679k4913J2307J7166j2672n822L0120J4410j6677k4473j914
$$ plain form
1975 10239 23223 -12320 -17386 21664 40436 14990 21175 37090 22354 7452 -19933 -8278
1963 -8278 14526 21421 27453 17467 631 -3080 -12774 -1394 32656 -7181 -16278 -6359 15742
1950 15742 28108 -12451 -27976 8471 -12010 -17261 -10830 -29398 -12805 29804 6675 4272
1938 4272 4238 -7938 -13317 -16679 8776 -26588 -19417 4878 -10263 -23163 -31171 -11723 -3578 1515
1924 1515 -16917 -24618 -24359 -49283 -27137 -30796 -2542 11892 7332 9252 6131 -23795 -39163
1911 -39163 -25491 -23251 -31672 -11615 11317 32348 -8173 13599 27350 14734 21152 24255 -17430
1898 -17430 -62574 -39376 -38329 -35267 -22026 -9080 -2383 -29579 -33587 -2455 22542 18902 -8832
1885 -8832 2858 16537 -8376 3931 21097 8425 2603 32723 47133 30456 5983 4069
1873D069K2750q735j9414j380J6955N632l84p688l2375O372N611J1523P330K2764
1859C3030m2163J5037j0066m639j1184J5616P409j1489K8497k0860m0429l878
1847d5119L9779l596j2651L2682q056Q571L5296k5132J54k4227K8L206J1980j067
1833A1848l336k6285L1565K4833k4906l169l435j2951o908L6774O927j3915K2565
1820C9607P319m6451J8331L596k8963K8049J3331j4498k1529j2450M137K2499
1808A2978l934L447l0560J900K6972j0167n98J4388M846j9299J572n856j4552
1795a8863j780K356n930J8300o614r248K7615K6665k6626l3321K030j602r328
1782c6346K3328J4963j0509J3158j1812K8605o767o636J5218L2349l6419P770
$$ plain form
1873 4069 26819 18084 -1330 -2710 14245 19877 19493 11805 -20570 -14198 -8587 2936 10266 33030
1859 33030 -9133 5904 -4162 -8801 -19985 -4369 3040 -8449 20048 -812 -41241 -45119
1847 -45119 -5340 -8936 -21587 11095 3039 11610 46906 21774 21928 -2299 -2271 935 12915 11848
1833 11848 8512 -17773 13792 38625 13719 10550 7115 -5836 -12744 24030 30957 17042 39607
1820 39607 46926 475 18806 22402 -6561 21488 34819 20321 -1208 -13658 -9521 12978
1808 12978 9044 12491 -18069 -16169 10803 636 38 14426 19272 -27 1545 -4311 -18863
1795 -18863 -20643 -18287 -24217 -5917 -12531 -21779 5836 32501 5875 -27446 -25416 -27018 -36346
1782 -36346 -13018 1945 -8564 4594 -7218 21387 14620 7984 23202 55551 19132 26902
1770B6902J6394r773l280k38J1989Q268j5135j2925j3094J2809J6982m2101k2012
1757b5214K5856L446P38j8775M301K8809l031l0309n773N878N422K8379J7449
1744C7176l3500L6668P278q565j3799j8455j3147k4619L0436K411q871K6870k6548
1731f665j1793j6012J4969J4106j1377J2216k8861K9122K0668k2716j5072R294
1719a2121l834r16R12K9364p034j0262L901N178o418R107r024j4054K3448R252
1705A7499k3957j9668j9311K9819K9863j2630R190j1854m1125J4831k5850K1684
1693c1509n851J9329K7577k871K183r797j9563j339O276O48O502M385j071j2583
1679a7684J501L4318j2045J3168k4041M717j4272j8257K0820k473K3031L943J2967
$$ plain form
1770 26902 43296 33523 30243 30005 41994 50262 35127 22202 9108 21917 38899 -3202 -25214
1757 -25214 642 4088 4826 -13949 -9648 19161 16130 -14179 -19952 -14074 -8652 19727 37176
1744 37176 3676 40344 47622 39057 25258 6803 -6344 -30963 -527 1884 -6987 19883 -6665
1731 -6665 -18458 -34470 -19501 -5395 -16772 -4556 -33417 -4295 16373 -6343 -21415 -12121
1719 -12121 -15955 -16871 -15959 13405 6371 -3891 10 5188 -1230 7877 -1147 -15201 8247 17499
1705 17499 -6458 -26126 -45437 -15618 14245 1615 10805 -1049 -42174 -27343 -53193 -31509
1693 -31509 -37360 -18031 9546 6675 8858 -939 -20502 -21841 -15565 -14917 -8415 -4030 -5101 -17684
1679 -17684 -16183 18135 6090 19258 -4783 -66 -14338 -32595 -11775 -14248 8783 12726 25693
1666B5693n46l814p982k0868L1088k417l4883J5335N104j4075L168Q763q465J9839
1652A5940m689r879j4592K4339R395J6735j2039j0088m98l8801P38Q201M033J8464
1638G259j0446j3350J1019N196l2573M9421l3035l6172K6353K5974p064j3214
1626b0632j2581J4741L477M956J1590k8064j6736M593L199j2519J3964K75K9446
1613d291k1917J7524o261J6813j7790n247J2127k7124M470K291N882L2662k6117
1600a6978l7477M4193J1642n912J6939j8315k0174j7197q762J3629K1752m648
1588b1308j0951J2489K5528o732R121j0353L875L926k0820j342k4458Q812j3786
1575d5999L5423j288K5695J1163k8778r863j0521o43K0411J4937m4349j870L6503
$$ plain form
1666 25693 25147 21333 13351 -7517 23571 21154 -13729 1606 6710 -7365 -4197 4566 -3899 15940
1652 15940 11251 1372 -13220 11119 20514 37249 25210 15122 14624 -24177 -23439 -15238 -11205 7259
1638 7259 -3187 -16537 -5518 -322 -32895 16526 -16509 -52681 -26328 -354 -7418 -20632
1626 -20632 -33213 -18472 -14995 -10039 1551 -26513 -43249 -38656 -35457 -47976 -34012 -33737 -4291
1613 -4291 -26208 -8684 -14945 1868 -15922 -21169 -9042 -36166 -31696 -29405 -23523 9139 -16978
1600 -16978 -54455 -10262 1380 -4532 12407 -5908 -26082 -43279 -52041 -38412 -16660 -21308
1588 -21308 -32259 -19770 5758 -974 8147 -2206 1669 5595 -15225 -16567 -41025 -32213 -45999
1575 -45999 -10576 -11864 13831 24994 -3784 -13647 -24168 -24811 -4400 10537 -33812 -35682 821
1562H21j10k448J688o93J9116K2296j656k6426k8054M733o251l4233M1502K5089
1548A5374k6335J7596j8046J2167J7403k3686M458K0409N934k6076k4092J6061
1536h833M1654L067j1104J3107m0745m7671K4086M8067j9503o851k0340j0098
1524c5164J7480L301m98P241k2113Q854M293L108K3047Q365M781j8885k6025n705
1510b7920J5163L0618P164j6453l1687p923L3651p279K9277k5402m0764k2553
1498f4108N600K6917L3383M718j3035j1081k7017M7220j7491O533J5215n0645
1486d3791L0938M6073k3862N414J0740l5432J3467J2200J0351j4392m104l851
1474C751o353m127l18j2832K815M729n582J4594L056L320Q867j1743k2007K3608
$$ plain form
1562 821 711 -1737 -49 -742 18374 40670 39014 12588 -15466 -10733 -16984 -51217 -9715 15374
1548 15374 -10961 6635 -11411 756 18159 -5527 -1069 19340 25274 -802 -24894 -8833
1536 -8833 32821 35888 24784 37891 -2854 -50525 -26439 21628 2125 -4726 -25066 -35164
1524 -35164 -17684 -14383 -14881 -7640 -29753 -20899 -16606 -13498 9549 17914 22695 3810 -22215 -27920
1510 -27920 -12757 17861 25025 8572 -23115 -31038 2613 -4666 24611 -791 -41555 -64108
1498 -64108 -58508 -31591 1792 6510 -6525 -17606 -44623 2597 -14894 -8361 6854 -43791
1486 -43791 -12853 33220 9358 14772 25512 -9920 3547 15747 26098 11706 7602 3751
1474 3751 -2602 -6729 -7047 -19879 -17064 -12335 -17917 -3323 -267 3053 11920 177 -21830 1778
1460A778k104l3618n995J8632J6915M0240j7805L378m0519m2158M9253l213J9104
1447C888J3484n800J3212j7664j4674Q541j5624J8131m730q424J115K1089M03
1434A2947l176J0603j9499l8453J788N0064j3950k1199J2731K1842o161k4429
1422a6892m709j8188L1214J6556k5408j6794m695P454N380J3586J1487K8333r23
1409B6401l3298r29p75o480j0112L4952K011j4811J2015L224j1824q976P329k1704
1395b2977J8967J7616M682p022J7031j7041l0318j1853j3226M0204L858m223j175
1382e477m397k9827L4957j631L6946J4283m3209j8094K788M63P057r832j3978
1369b9951K1595j3004Q060J9081n439k1885J4031m673m580k0073j6867N0887k5174
$$ plain form
1460 1778 -326 -33944 -39939 -21307 -4392 35848 18043 21421 -19098 -61256 -12003 -15216 3888
1447 3888 17372 11572 24784 7120 -7554 987 -14637 3494 -1236 -9660 -8545 12544 12947
1434 12947 9771 20374 875 -37578 -35790 14274 324 -20875 -8144 13698 7537 -16892
1422 -16892 -21601 -39789 -8575 7981 -17427 -34221 -38916 -31462 -26082 -12496 -1009 27324 26401
1409 26401 -6897 -7826 -8601 -15081 -25193 9759 11770 -3041 8974 12198 374 -8602 -1273 -22977
1395 -22977 -4010 13606 18288 11266 28297 11256 -19062 -30915 -44141 -3937 -79 -4302 -5477
1382 -5477 -9874 -39701 -4744 -6375 30571 44854 1645 -16449 -13661 -13198 -6141 -15973 -29951
1369 -29951 -8356 -21360 -13300 5781 342 -21543 -7512 -12185 -16765 -36838 -53705 -2818 -27992
1356b7992j456L2895M725m118k7379o44j598J7995j3361K0808j3008J8296L806
1343H969j9383K869J5561l368K1234J6603k0721j2326l0204J1555O749j3752l1420
1330d7634l7445M3021J5039K5740j6319k0737L1041O657j0653j7768l806K4481
1318h383J2280N859k3446l6236J2503O997J0698J5245K0460n161J4860k5571k0681
1305b0576R744K1849l3984k93L2854j9428n300J5300J3592j0400m826n025J529
1292d964K8220O607j9292p146l6528K6313j5102M594K897R313P826j0483K1801
1279A4056R853M672l9291j4420L060J5697J8238k5021J7520j4001q114J8197j6172
1266a5726O108L0307q851L829o487r057J9225j1006m624M367l8707M079N854J175
$$ plain form
1356 -27992 -29448 3447 8172 4054 -23325 -23969 -25567 -7572 -20933 -125 -13133 5163 8969
1343 8969 -10414 -7545 8016 4648 25882 42485 21764 9438 -20766 -9211 -2462 -16214 -47634
1330 -47634 -85079 -42058 -27019 -1279 -17598 -38335 -7294 -637 -11290 -29058 -32864 -8383
1318 -8383 3897 9756 -13690 -49926 -37423 -30426 -19728 -4483 15977 10816 25676 105 -20576
1305 -20576 -10832 11017 -22967 -23260 9594 -9834 -15134 166 13758 3358 -1468 -6493 -4964
1292 -4964 23256 29863 10571 3425 -33103 -6790 -21892 -17298 -14401 -5088 2738 -7745 14056
1279 14056 23909 28581 -10710 -25130 -22070 -6373 11865 -13156 4364 -9637 -17751 446 -15726
1266 -15726 -9618 20689 11838 15667 9180 123 19348 8342 3718 8085 -30622 -26543 -20689 -19514
1252a9514n453j0168J6324K6977N806o184R868K737O582l0288L936J1711k4543
1239a2209j4798J8734l88J6769j4050r135j6621K4498J2802j5765J4690j7141
1227a2614q969J5430j0850R034p220k2074Q215K6619l7994Q603L4761N683p188
1214A436j3536M186J9038j4558L965k2495k4626K9664J1638p081K78Q927J4782
1201A1618r937j1143J770J4297k3657J0939K1337j4995r311Q806j7141l1073K8813
1188a9677R657K2015J4809j9488K648Q498k2172K271O15J9111k616p245k3374
1175a4948o174J9511n21M474L5950k343j7922m251m162J8879N481p830l1583K125
1161c314k0307q481j0358J0203M4872K0665m402l1645m3247K0684N6806k8406
$$ plain form
1252 -19514 -24967 -35135 -18811 8166 13972 7788 17656 20393 26975 -3313 623 12334 -12209
1239 -12209 -27007 -8273 -8661 8108 -5942 -15077 -31698 -7200 5602 -10163 4527 -12614
1227 -12614 -21583 -6153 -17003 -7969 -15189 -37263 -29048 -2429 -40423 -31820 2941 8624 1436
1214 1436 -12100 -7914 11124 -3434 531 -21964 -46590 -16926 -5288 -12369 -12091 -3164 11618
1201 11618 1681 -9462 -7692 6605 -17052 -6113 15224 229 -9082 -276 -17417 -48490 -19677
1188 -19677 -10020 11995 26804 7316 9964 18462 -3710 -1439 -824 18287 15671 8426 -14948
1175 -14948 -21122 -1611 -2132 2342 38292 35949 18027 13776 9614 28493 33974 26144 -5439 -3314
1161 -3314 -23621 -32102 -42460 -32257 12615 33280 28878 -2767 -46014 -25330 31476 3070
1149C070N442J221l329q15r485L616j1437K288J4975j33p765L828J8830J1070
1135C1376O223l3811L732q230j0179j7429M529O205j4136K811R104L2537k1064
1122h332j3027m503R431Q590k9622j7760M4407k5240j1653M7806M94j6382j1387
1109b7178j858J3637Q889J4649K724j1595J0297K7361k931l4578J9408N79K2256
1096D1660j7235j150j1040j9814L9860l6432l0184m12M929J0536q237J7090Q350
1083b079J0299J542k0542j7814K3439J0639j0170M778r375k4775J1288L5885j1207
1070A908o382J401p480j4693m385J3252J4501K1769m282L00j741r378o817l530
1056e557K132J3559p808K975J0501k2927j0974J0551J6610o285p389K0863N560
$$ plain form
1149 3070 8512 9733 6404 5589 -3896 -280 -11717 -9429 5546 5413 -2352 1476 20306 31376
1135 31376 37599 3788 7520 -710 -10889 -28318 -23789 -17584 -31720 -28909 -19805 12732 -8332
1122 -8332 -21359 -25862 -16431 -7841 -37463 -55223 -10816 -36056 -47709 97 591 -15791 -27178
1109 -27178 -29036 -15399 -6510 8139 10863 -732 9565 36926 33995 -583 18825 19404 41660
1096 41660 24425 23275 12235 -7579 32281 -4151 -34335 -34747 -29818 -19282 -27519 -10429 -2079
1083 -2079 8220 9762 -10780 -28594 -5155 5484 -4686 92 -9283 -34058 -22770 13115 1908
1070 1908 -4474 -3073 -10553 -25246 -29631 -16379 -1878 19891 15609 15909 14168 4790 -2027 -5557
1056 -5557 -3425 10134 2326 5301 15802 -7125 -18099 -7548 9062 2777 -4612 16251 21811
1043B1811j5750j4055P006J1188m238K5972l2149k0293M1233L2554j3926m4304
1031d951J3333L96O586l528j0443J9272k4078k8999K7907J016k2285j581L198
1018b4157R483J1653o54k8831K0622K16K363j0152K1172P050j5493M2112m7097
1005a1713R770J3736j6962J4695j5001j3539l2492K0498L3730N325J6605J107
993B5759j6588J0782k9116K4516k491O848p766j4850l123l748K3688K8446k5517
980A6840m358k3339q636K4255J0716J8794l8467l4737o801L1462j4996J9597J2906
967C236J6262J3528k3773N331N867j5032p344k9193J2753K6148o280k0038K4594
954F059k1959r740K2935q692L331p807J1220K622K7021j020k4692q837J4611j3531
$$ plain form
1043 21811 6061 -7994 -988 10200 5962 31934 -215 -20508 20725 53279 39353 -4951
1031 -4951 8382 8778 15364 11836 1393 20665 -3413 -32412 -4505 -3489 -25774 -27355 -24157
1018 -24157 -14674 -3021 -3675 -32506 -11884 -11668 -9305 -19457 1715 8765 -6728 35384 -11713
1005 -11713 -1943 11793 -5169 9526 -5475 -19014 -51506 -31008 2722 8047 24652 25759
993 25759 9171 19953 -9163 15353 12862 19710 11944 -2906 -6029 -9777 13911 42357 16840
980 16840 12482 -10857 -19493 4762 15478 34272 -4195 -38932 -45733 -14271 -29267 -9670 3236
967 3236 19498 33026 9253 14584 20451 5419 -1925 -31118 -18365 7783 1503 -18535 6059
954 6059 -15900 -25640 -2705 -11397 -8066 -15873 -4653 -2031 24990 23970 -722 -9559 5052 -8479
940h479m5892M2497J2877l0641J595N1519K2608j4191n9536K8140P431j8559J8172
927G541J2564K89k8425j4313j2458J3963k016q078J996K7570k918j052p273R101
913c509j530n68k8787j0408N7848K5299j5817j1376o394J50o120J2541k2628j4165
899b5464J7548J8904l0795k590j9005L7253j577j4871J9579L1253l766l4713O003
886b241k1654J1505Q549L3770n354k2075k6013J0452K82L561m019o685k6712k3214
872f9848M7025J9372l0657m530j945j218J6142K3083J3714j3853k5949j455J8847
859a1272j9858n309J0506N1369O412j0035J4191m9118J0729p225k2724o129j4862
846e3325K9301J6995R0k444j6449j6940L8083R827k4932J9317R633j4457k3515
$$ plain form
940 -8479 -54371 -11874 1003 -29638 -28043 23476 46084 31893 -27643 497 7928 -10631 7541
927 7541 20105 20394 -8031 -22344 -34802 -20839 -22855 -30933 -28937 -1367 -4285 -5337 -12610 -3509
913 -3509 -5039 -5607 -34394 -44802 13046 38345 22528 11152 4758 4908 -1212 11329 -11299 -25464
899 -25464 -7916 10988 -19807 -22397 -41402 -4149 -5726 -20597 -1018 30235 26469 -8244 -2241
886 -2241 -23895 -12390 -3841 29929 24575 2500 -23513 -13061 -12779 -9218 -13237 -19922 -46634 -69848
872 -69848 -22823 -3451 -34108 -38638 -40583 -41801 -25659 -2576 11138 -2715 -28664 -30119 -11272
859 -11272 -31130 -36439 -25933 25436 31848 21813 36004 -13114 -2385 -9610 -32334 -38463 -53325
846 -53325 -24024 -7029 -6939 -9383 -25832 -42772 -4689 5138 -19794 -477 9156 -5301 -28816
833b8816J3513J9120q09l1305J5568N3571k5206l6250K3729L6779P47j0139j7413
820A3089N000j6653M781K2157k0594J6787k2319J0370p211L493j2474J0195L071
807I692k8733L0110K5377k9957O563q57P136j3696o851Q12O845L0402k9939r096
793b192n355j591j1067J5096K3403R664J6067j5992l113k2237r585J9826k1123
780h199J9561K9082m530j3411q122m004L6693K200k8328k2773J0509K8664l0316
767G026p789k4699j1819K7650L14j2981K7056k537l530n1845J2541O6493j4948
754A0932j7324J9854k7965q875L0322m104J7617J4925M396j0349p037k0728R524
741A1188j0969o195J285N721k7035K1401K3880p217k2465K1828k5105o692J0471
$$ plain form
833 -28816 -15303 3817 3008 -28297 -12729 40842 15636 -20614 3115 39894 40641 30502 13089
820 13089 18089 1436 6217 28374 7780 24567 2248 12618 5407 8900 -3574 6621 9692
807 9692 -19041 11069 36446 6489 13052 12195 19331 5635 -1216 -404 6441 36843 6904 -2192
793 -2192 -7547 -9138 -20205 -5109 18294 27958 44025 28033 24920 2683 -6902 12924 -8199
780 -8199 11362 40444 35914 22503 14381 10377 47070 49270 20942 -1831 8678 37342 7026
767 7026 -763 -25462 -37281 -9631 -9317 -22298 4758 2221 -1309 -53154 -40613 25880 10932
754 10932 -6392 13462 -14503 -23378 6944 2840 20457 35382 39778 29429 22392 1664 11188
741 11188 219 -5976 -4691 1030 -26005 -4604 19276 12059 -10406 11422 -13683 -20375 -9904
728i904K3387J0240Q593j4740j8076N145j6099K08L7713j2257j1183j5850P089
715e734J9990j6276J0004K2219j1602l8594K70L3393Q937M178k4785l6523L5380
702H57m995L162L903l1508K9018L4277k1525m312M559K29j7786j6587K827K5651
688G770N917J3477K473j5919q583r740j4471m136L2063j0662j2406K3378k0382
675a1221j8967K2790J7886r737R804Q984j6020j5792j1194K4024P649o383k9168
662b7345n536r652K6242L8882K205j3626j5638K9496k4848k4935N3202Q564l5986
649A025K1885N438M583j2677j3759J5725j0134N518n1956j8839N6373J2360r309
636F233J2816J4197r457l365m963j748j5116k2250j0864Q151K132M901K2304j8153
$$ plain form
728 -9904 13483 23723 32316 17576 -500 4645 -11454 -11246 26467 14210 3027 -12823 -5734
715 -5734 14256 -2020 7984 30203 18601 -19993 -19723 13670 22607 26785 2000 -34523 857
702 857 -4138 -976 2927 -28581 437 34714 13189 8877 13436 13665 -4121 -20708 -17881 7770
688 7770 13687 27164 29637 13718 5135 -4605 -19076 -23212 8851 -1811 -14217 9161 -11221
675 -11221 -30188 -7398 10488 751 10555 19539 3519 -12273 -23467 557 8206 1823 -27345
662 -27345 -32881 -42533 -16291 22591 24796 11170 -4468 25028 180 -24755 28447 37011 1025
649 1025 22910 28348 32931 20254 6495 22220 12086 17604 -34352 -53191 3182 15542 6233
636 6233 19049 33246 23789 20424 15461 13713 -1403 -23653 -34517 -26366 -24234 -19333 2971 -15182
622a5182j6077K4362K431l395j9986J1249J4811J4165J6077o58m0305K2702n310
609D884K4648K576l0431j5322M2433K211j9986k92j2616l104L9889k306q328m498
595A9758N6411k7424j3765P598k7110J2106j1989o328j6972J1563R824M90L548
582A7710k6288J7185K7425j6386k3514k277K7891K6741j0484o761K041n0468J4079
569c106J2632J8640j0471l1536q617L0467K9042j5694L835n289j0413J920K000
556A3410j4763j8119L233L077L0792l9537K4331o908l4065J1220J8457J2003j1546
543h415j418R661k719J5163l275m803n599K5798J3225j2897p779k6352k1398k1670
529e2478K0197J2733m623K3944p204L5797M136j3649j1902q759l792m03p210J8179
$$ plain form
622 -15182 -31259 -6897 -4466 -7861 -27847 -16598 -1787 12378 28455 27797 -12508 10194 4884
609 4884 29532 32108 1677 -13645 28788 30999 11013 10721 -1895 -4999 34890 32584 24256 19758
595 19758 76169 48745 34980 42578 15468 27574 15585 9257 -7715 3848 13672 14162 17710
582 17710 -8578 8607 36032 19646 -3868 -6145 21746 48487 38003 31242 33283 -17185 -3106
569 -3106 9526 28166 17695 -13841 -22458 8009 37051 21357 25192 19903 9490 11410 13410
556 13410 -1353 -19472 -16239 -13162 17630 -21907 2424 -4484 -38549 -27329 -8872 3131 -8415
543 -8415 -9833 -172 -2891 12272 8997 4194 -1405 24393 37618 24721 16942 -9410 -30808 -52478
529 -52478 -32281 -19548 -24171 -227 -7431 28366 32502 18853 6951 -1808 -5600 -6003 -13213 4966
515D966j1471k0389p30J885Q006M9226l4975j9612m592J3720j2094J5145L770
502g145j7015N099Q429K1720m241P429J4687j1978P807p878l5947M254J2733J7811
488A5765L906p031j3589q58O412o77j4792M82L840K0556Q541O716q628M41N991
473B7075p441k7152j871j093R688j9793P912j480L0556N802j1835k0514N169k2339
459b7316o869K9319L819J115l409J8477j0995J179Q240P247J0852j9396j0126
446B137r206J3682J3560n251m0099K1282J4649J5147J3288l9051K3364r613j5714
433a825j6553p503J6360M2301K2063l0974l0567k901j2472J8239J0121k8841L9319
420A6767l8635K7702K1844P105k3093j1776j6763Q907N0245m5370r297k2720k5479
$$ plain form
515 4966 -6505 -26894 -27624 -25739 -17733 31493 -3482 -23094 -27686 -13966 -26060 -10915 -7145
502 -7145 -24160 -19061 -10632 11088 6847 14276 28963 16985 24792 16914 -19033 -14779 -2046 15765
488 15765 19671 12640 -949 -1807 4605 3928 -10864 -10382 -6542 14014 22555 29271 20643 21084 27075
473 27075 19634 -7518 -9389 -10482 -794 -20587 -12675 -14155 16401 22203 10368 -10146 -4977 -27316
459 -27316 -34185 -4866 -1047 68 -3341 15136 4141 5320 13560 20807 31659 12263 2137
446 2137 -7069 6613 20173 14922 -25177 -3895 10754 25901 39189 138 23502 13889 -1825
433 -1825 -18378 -25881 -9521 32780 54843 23869 -6698 -9599 -22071 -3832 6289 -22552 16767
420 16767 -21868 5834 27678 34783 11690 -86 -16849 -7942 42303 -3067 -12364 -35084 -60563
407f0563N2894L7781j4420l9757J297K0978k1006o199Q676N920J9779R083k2255
394g792n460r506K7733j7065K7210j4857k5922N407m3203L3075J4326q959k0102
381d5115J9999M0863K6254j8128r188l73k7924r240M264n404l6132M7870N4770
368D2516l6264j6275l004J7244k1265j517J2945K9993P007l4065J0797k4608k9445
355d5941L1230j7309l819k646J0782j2254j2193K9371k6852j065m734M3667N939
342e824K6584j8024k1005O218k237j4264K0393M534L671Q992k3945l556k4046
329d2509r427M3162r242j7975P825J9676N735k0786j9758J5744K0074J9994J082
316A3595J7961q730j9299L761p650J8110o847k811k2486l0770J3518P635o307
$$ plain form
407 -60563 -7669 30112 15692 -24065 -22768 -1790 -22796 -28995 -20319 -14399 5380 14463 -7792
394 -7792 -13252 -22758 4975 -12090 15120 263 -25659 -20252 -63455 -30380 -16054 -25013 -45115
381 -45115 -25116 15747 42001 23873 14685 14312 -13612 -22852 -18588 -23992 -60124 -12254 42516
368 42516 6252 -10023 -13027 4217 -17048 -18565 -5620 24373 31380 -2685 8112 -16496 -45941
355 -45941 -14711 -32020 -35839 -38485 -27703 -39957 -52150 -22779 -49631 -50696 -55430 -11763 -5824
342 -5824 20760 2736 -18269 -12051 -14288 -28552 -8159 -3625 46 9038 -14907 -18463 -42509
329 -42509 -51936 -8774 -18016 -35991 -28166 -8490 -2755 -23541 -43299 -27555 -7481 12513 13595
316 13595 31556 22826 3527 7288 -362 17748 10901 8090 -14396 -45166 -31648 -24013 -30320
303c0320K830k96k3982Q262L7407j6123O069L0123l0155J0050K3731j1659O839
290A2776r932j946J3828j1392j499J6802o064r997j1288J9924j9016j5743K674
277b0873R256J4906q158k3513q256L0834N495k344J8654j9333k4267J2412j3550
264b8737P512j1724o439l690J6297J6021q423j3396o89K1853j5063J092n112l1764
250f2262L4383J4979J873K4062j7770k0847P176k5149j9799M0796K4712M882l4284
237b7248N50M8208J280p509J4282R795n0353k7089M4186J557l2636n869J004J058
223b8784K7419O673j8492K751J1435J0219j9212k4422M051n800J1340J2439J0756
210C73o081J649k1704j7026p612J7367J550J0851J236K1333p858J0794r578k6617
$$ plain form
303 -30320 -27490 -27786 -51768 -43506 -6099 -22222 -16153 13970 -16185 -6135 17596 5937 12776
290 12776 2844 898 14726 3334 1835 18637 12573 2576 -8712 11212 -7804 -23547 -20873
277 -20873 -11617 3289 -4869 -28382 -36638 -5804 -309 -2653 16001 -3332 -27599 -15187 -28737
264 -28737 -21225 -32949 -39388 -43078 -26781 -10760 -19183 -32579 -33268 -11415 -26478 -25386 -30498 -62262
250 -62262 -27879 -12900 -11027 13035 -4735 -25582 -18406 -43555 -63354 -22558 2154 7036 -27248
237 -27248 -26698 21510 22790 15281 29563 39358 -10995 -38084 6102 7659 -24977 -30846 -29842 -28784
223 -28784 -1365 5308 -13184 -10433 1002 11221 -7991 -32413 -28362 -34162 -22822 -10383 373
210 373 -5708 -4059 -25763 -42789 -50401 -33034 -31484 -20633 -19397 1936 -5922 4872 -4706 -31323
196c1323k270J9356J9537l1784M423Q17j3278p217M447J9559j8855l978K4255
183a6311M723K414j6525o278J3723q300J5328L389k3251L3585n55k5046L103J0679
169i322O711P95P113j5936j5531J521m781J2293J2798R170J1461k1156k73K1402
155A6265l261k7477k1637K3082J2164J2866J3034m450l7238j0958J9887j2064
143a9787K602P33J0577l4326k1489J6491j1980L4652J6018j346J9253P478j3230
130E646m3422J3224M2584k3141l248N428K390j7686r838J5561j0277L204N802
117a3773O647N688k6926J9668M301k534r551r988j1733K3063K6510j5282l1178
104c5088n247J0055J3575j7417K9123K6327j7560L172j3165J0125r330J690j7061
$$ plain form
196 -31323 -33593 -14237 5300 -26484 -22061 -21244 -34522 -41739 -37292 -17733 -36588 -40566 -16311
183 -16311 -11588 -9174 -25699 -31977 -18254 -26554 -11226 -7837 -31088 2497 1942 -23104 -20001 -9322
169 -9322 -2611 -1816 5297 -10639 -26170 -24649 -29430 -17137 -4339 4831 16292 -4864 -5137 16265
155 16265 13004 -14473 -36110 -13028 -864 12002 25036 20586 -16652 -27610 -7723 -19787
143 -19787 -17185 -16452 -5875 -40201 -61690 -45199 -57179 -22527 -6509 -7855 11398 18876 5646
130 5646 -37776 -24552 18032 -5109 -8357 -2929 -539 -18225 -28063 -12502 -22779 -19575 -13773
117 -13773 -7126 -1438 -28364 -8696 -4395 -6929 -16480 -26468 -38201 -15138 11372 -3910 -35088
104 -35088 -40335 -30280 -16705 -34122 -4999 21328 3768 6940 -6225 3900 -5430 -3740 -20801
91b0801J726j5497j537O775p993N125K2677J7193j5376j3647j6641j0088M4492
78c592r412o472K8054p88r402k1654J0007P834L276Q023j891j8460j3894L645
64b4726q68K574K1393l238l46j0228J7424j2352n858j4709m397P442n343J685
50c1547M36K3799r269j3268J2698k593j7174J3216J3237J1590n108j5820k232
37b2035k2650K404P324N832J1302J5492L28L406j3880J4100r652j9856J1719J275
23a4891J2834j5127m917R348q912J3357k130r828j975J4689L975j3096J2648j5213
9a9238K231L455N168o006m922K053j2337J8863J0659
$$ plain form
91 -20801 -19075 -34572 -36109 -29334 -37327 -32202 -9525 7668 -7708 -21355 -37996 -48084 -3592
78 -3592 -13004 -19476 8578 7790 -1612 -23266 -13259 -5425 -2149 5874 3983 -14477 -28371 -24726
64 -24726 -25594 -23020 -1627 -4865 -5211 -15439 1985 -10367 -16225 -30934 -35331 -27889 -33232 -31547
50 -31547 -31111 -7312 -16581 -29849 -17151 -19744 -36918 -23702 -10465 1125 -3983 -19803 -22035
37 -22035 -44685 -42281 -34957 -29125 -17823 -2331 -2003 1403 -12477 1623 -8029 -27885 -16166 -14891
23 -14891 -2057 -17184 -22101 -12753 -21665 -8308 -10438 -20266 -22241 -7552 -3577 -16673 -4025 -19238
9 -19238 -17007 -13552 -8384 -14390 -19312 -17259 -29596 -10733 -74
0g4
$$ Imaginary data points
##PAGE= N=2
##DATA TABLE= (X++(I..I)), XYDATA
16383h29771K0520L635J8189j080J1412K9839J9195l840n971K4443K8044L2911
16371f52474n987k3206J0333J3351J1945L480J7019M673K0731J3765k867J3226
16359e76011R457J993J0658K0832K348R453J1170n76K0037M280J2389K9683m009
16346d48296j1784J8960l978K6521K5716J2194o218J2478Q46O445q652J1805K4292
16333c39671K227K2024J4254K0698L130j9458N5899j887J7549K256j3793J5458
16321b21314J9793K4472k5025J3916j1908R644J483K5912K3420p80o6O384J2817
16308a21252J6189Q176l28K4896L598J0641j876k239J1811R639O447Q56J5063
16295a8379L923J8262J9389P742R18P130J3894R332k185N451K2083O832k3904
$$ plain form
16383 -829771 -809251 -805616 -787427 -788507 -777095 -747256 -728061 -731901 -737872 -713429 -685385 -652474
16371 -652474 -658461 -681667 -671334 -657983 -646038 -642558 -625539 -620866 -600135 -586370 -589237 -576011
16359 -576011 -566554 -564561 -553903 -533071 -530723 -521270 -510100 -510676 -490639 -486359 -473970 -444287 -448296
16346 -448296 -460080 -441120 -445098 -418577 -392861 -380667 -386885 -374407 -373561 -367116 -375768 -363963 -339671
16333 -339671 -337444 -315420 -301166 -280468 -277338 -296796 -240897 -242784 -225235 -222979 -236772 -221314
16321 -221314 -201521 -177049 -202074 -188158 -200066 -190422 -188939 -163027 -139607 -140387 -140453 -134069 -121252
16308 -121252 -105063 -96887 -97215 -72319 -68721 -58080 -59956 -62195 -50384 -40745 -34298 -33442 -18379
16295 -18379 -14456 3806 23195 30937 31855 38985 52879 62211 60026 65477 87560 94392 70488
16282G0488K1223J8727O075R355j3723J2838J3206N853K6739j403N461j5672J4166
16269A73333J8099k931q220p688P978K7478j8846o313O4890J0201J2730k562Q773
16256B76922n945J4203J740r717L7568l429M124P672j559j046L150K0737j0337
16243C34083K3392j236l585q756K1665J9825j2441K3408J6282j397l258J0360
16231D18342j9036J5510J7457j7558P170O400j3297k052K555L2599J6823J250
16219D66163k2799m042K9981N596l5196J2823K2827J3502N408j8544R10L1516
16207E08145J3844k5576K0030K0933o04j7220M0960k654Pn132m37k0657K7957
16194E59596J0817k3396L6767o123j1993l84L250q970J83J5981q860k0107R328
$$ plain form
16282 70488 91711 110438 116513 125868 112145 124983 138189 144042 170781 169378 174839 159167 173333
16269 173333 191432 188501 180281 172593 180571 208049 189203 182890 247780 257981 270711 268149 276922
16256 276922 270977 285180 286920 277203 314771 311342 315466 323138 321579 320533 323683 344420 334083
16243 334083 357475 356239 352654 343898 365563 385388 372947 396355 412637 411240 407982 418342
16231 418342 399306 414816 432273 414715 421885 428285 414988 412936 415491 448090 464913 466163
16219 466163 443364 439322 469303 474899 439703 452526 475353 488855 494263 475719 476629 508145
16207 508145 521989 496413 516443 537376 536772 519552 560512 557858 557865 552733 552296 531639 559596
16194 559596 570413 547017 583784 577661 565668 565284 568534 559564 559747 575728 566868 546761 556089
16181E56089J1023L744K9152m8j3797L0872j5757k4815R979L309J0522J3161j1708
16168F01726k0389J8706R408O6384j1963j6679k2925J4660J0594M653k866Q947
16156F60256L1443j8124k7823j3332K3137j4569r299O483J6266J3650L0182l5698
16144F62572J537Q081Q975m0195L0681J7960j1257j176k835Q411L158j1232l867
16131F70813K3700J9556r327N86j2629k0286J4058J5849K298j7750J3683K2530
16119G23081j6648K2545j0447O657M4755k3334j3237k087k0738l958p679J4254
16107G13164J7315L2241k0392r612J5550r862j1325R347O2k765L104k4507M5406
16094G57726j4821k8643j1552J2876K4086l8457K6425O634k0409J405k308P745
$$ plain form
16181 556089 567112 570856 600008 599960 586163 617035 601278 576463 586442 589751 600273 613434 601726
16168 601726 581337 600043 609451 675835 663872 647193 624268 638928 649522 654175 651309 660256
16156 660256 691699 673575 645752 632420 655557 640988 631689 638172 654438 668088 698270 662572
16144 662572 664109 672190 681165 640970 671651 689611 678354 677178 674343 682754 685912 674680 670813
16131 670813 694513 714069 704742 705328 692699 672413 686471 702320 704618 686868 700551 723081
16119 723081 706433 728978 718531 725188 769943 746609 733372 731285 710547 706589 698910 713164
16107 713164 730479 762720 742328 732716 748266 738404 727079 736426 736488 733723 736827 712320 757726
16094 757726 742905 714262 702710 715586 739672 701215 727640 734274 713865 715270 712962 720707
16082G20707K9767j4881L273q550K1306N012q305J955k0603l27m7843J6061J7464
16069G15036J3165L061R469K6833k8495j4990L7596k0762l5300K2290M3835j9643
16057G52095j7797J5459j1706L005r070l1194J2524K0142J240J7011l222K569
16045G51056K9771j2351m296j9138m222j7681P565K4322k5713j2778K2347M1888
16033G80770j9252j6522J519j5388k2088J627P439j610L4977L643o239k7535M0370
16020G61711N472j2301k627J5250l7191J9586K9176N72k344m624M672j2991K244
16007G66605J6747j8836k7934J2285l749J4976M431K524j5291p379J0333K174
15995G56886k0824R534K474j4466M0048K2120m4025k2559q384J4838K4659k8559
$$ plain form
16082 720707 750474 735593 738866 730316 751622 756634 748329 750284 729681 729354 681511 697572 715036
16069 715036 728201 731262 740731 767564 739069 724079 761675 740913 705613 727903 771738 752095
16057 752095 734298 749757 738051 741056 731986 700792 713316 733458 734698 751709 748487 751056
16045 751056 780827 768476 764180 745042 740820 723139 730704 755026 729313 716535 738882 780770
16033 780770 761518 744996 746515 731127 709039 710666 718105 716495 751472 755115 748876 721341 761711
16020 761711 767183 754882 752255 767505 730314 749900 779076 779648 777304 772680 777352 764361 766605
16007 766605 783352 764516 736582 748867 745118 760094 764525 767049 751758 744379 754712 756886
15995 756886 736062 745596 748070 733604 773652 795772 751747 729188 720804 735642 760301 731742
15983G31742L775o831r951j7848n568L5044M1293m02l3107K157Q315J8542J2157
15970G79318k7959k8843K767p269J5486K6388j2490J0882k1614k3689M4076J6672
15958G73725Q263k901r413j3787k0236L609J6457m772j9440j7983l002K661K3566
15945G36747K9440K2392l5236J1038K3786j8338r906M060j8815j2387L606J5965
15933G52352m32J4278l1608j5152K8746K545K2307J8310m5050k0143L0495J4262
15921G70910J2853k1177o01J4103J5286J536j0798j1555q206P672j8541J753L125
15908G56360J4099L0246k1542O98j4116p425J2628p529p862q887K4985j0081m929
15895G56645k9334K4092J7141j7567L1419j0364p321K9220k585k5267j7477o89
$$ plain form
15983 731742 735517 728686 718735 700887 695319 730363 771656 771254 738147 740304 748619 767161 779318
15970 779318 751359 722516 725283 718014 733500 759888 747398 758280 736666 712977 757053 773725
15958 773725 781988 779087 769674 755887 735651 739260 755717 750945 731505 713522 710520 713181 736747
15945 736747 766187 788579 753343 764381 788167 769829 759923 763983 745168 732781 736387 752352
15933 752352 751920 766198 734590 719438 748184 750729 773036 791346 746296 726153 756648 770910
15921 770910 783763 762586 761985 776088 791374 792910 782112 770557 762351 770023 751482 753235 756360
15908 756360 770459 800705 779163 779861 765745 758320 770948 763419 755557 746670 771655 761574 756645
15895 756645 727311 751403 768544 750977 782396 772032 764711 793931 791346 766079 748602 747913
15883G47913m4197K1002J6028j3161K0667K6801j6830j3410j756r394N321r462
15871G29522J4104o408l302J0382k551r43J5825J5812k4623n645L2551N623k1304
15858G59043K4941J36n3439p418K6870Q327p113l3956k6897K2506J4822J8181
$$ plain form
15883 747913 703716 724718 740746 727585 748252 775053 758223 744813 743057 733663 738984 729522
15871 729522 743626 737218 733916 744298 741747 740804 756629 772441 747818 742173 774724 780347 759043
15858 759043 783984 784120 730681 723263 750133 758460 751347 717391 690494 713000 727822 746003
$$ [...]
##END NTUPLES=NMR SPECTRUM
##END=
