##TITLE=1H_TG-2410-A2
 200.13Hz, DMSO+CCl4.
 8 sc
 6.7.2026
##JCAMPDX= 6.0         $$ Bruker NMR JCAMP-DX V2.0
##DATA TYPE= NMR SPECTRUM
##DATA CLASS= NTUPLES
##ORIGIN= UXNMR, Bruker Analytische Messtechnik GmbH
##OWNER= pz
$$ XWIN-NMR		Version 3.5
$$ Mon Jul  6 13:20:08 2026 Russian Standard Time (UT+4h)  she@DPX200
##.OBSERVE FREQUENCY= 200.1313
##.OBSERVE NUCLEUS= ^1H
##.ACQUISITION MODE= SIMULTANEOUS
##.ACQUISITION SCHEME= undefined
##.AVERAGES= 8
##.DIGITISER RES= 18
##SPECTROMETER/DATA SYSTEM= spect
##.PULSE SEQUENCE= zg30
##.SOLVENT NAME= DMSO
##.SHIFT REFERENCE= (INTERNAL, DMSO, 0, 15.5056)
##AUDIT TRAIL= $$ (NUMBER, WHEN, WHO, WHERE, WHAT)
$$ ##TITLE= Audit trail, XWIN-NMR		Version 3.5
$$ ##JCAMPDX= 5.01
$$ ##ORIGIN= Bruker BioSpin GmbH
$$ ##OWNER= she
$$ F:/spectra/data/she/nmr/H-C/1/pdata/1/auditp.txt
$$ ##AUDIT TRAIL=  $$ (NUMBER, WHEN, WHO, WHERE, WHAT)
(   1,<2026-07-06 13:18:49.23 +0400>,<she>,<DPX200>,
      <created by zg, POWCHK disabled, PULCHK disabled
       configuration hash MD5:
       00 E9 B6 7A A2 85 ED C7 34 08 36 98 17 FE 4E 26
       data hash MD5: 16K
       0C 58 3E 27 62 D8 91 16 DC 73 74 4B E2 B0 31 5B>)
(   2,<2026-07-06 13:18:51.68 +0400>,<she>,<DPX200>,
      <Start of raw data processing
       efp BC_mod = 2 LB = 0.25 FT_mod = 6 PKNL = 1 PHC0 = -4220.027 PHC1 = 11.3923 SI = 16K 
       data hash MD5: 16K
       10 45 AF D3 54 AD 39 DD 29 77 09 17 21 36 0D 77>)
(   3,<2026-07-06 13:19:13.79 +0400>,<she>,<DPX200>,
      <pk PHC0 = 0.3047758 PHC1 = -0.4 
       data hash MD5: 16K
       BB 8E A2 00 03 3C 3B 46 45 4D 45 E5 D2 73 52 C2>)
(   4,<2026-07-06 13:19:18.28 +0400>,<she>,<DPX200>,
      <abs ABSG = 5 
       data hash MD5: 16K
       46 2F 15 EB 24 1C 10 62 20 22 C6 A9 2F BE 5D DC>)
$$ ##END=
$$ 
$$ hash MD5
$$ D6 B7 49 5C 3A 97 AF 75 01 49 88 2F F7 7A 48 31
##$RELAX= 
##$RELAX= 
##$RELAX= 
##$RELAX= 
##$RELAX= 
##$RELAX= 
$$ Bruker specific parameters
$$ --------------------------
##$DU= <F:/spectra>
##$EXPNO= 1
##$NAME= <H-C>
##$PROCNO= 1
##$TYPE= <nmr>
##$USER= <she>
##$AMP= (0..31)
100 100 100 100 100 100 100 100 100 100 100 100 100 100 100 100 100 100 
100 100 100 100 100 100 100 100 100 100 100 100 100 100 
##$AQSEQ= 0
##$AQ_mod= 1
##$AUNM= <au_zg>
##$AUTOPOS= <>
##$BF1= 200.13
##$BF2= 200.13
##$BF3= 200.13
##$BF4= 200.13
##$BF5= 200.13
##$BF6= 200.13
##$BF7= 200.13
##$BF8= 200.13
##$BYTORDA= 1
##$CFDGTYP= 0
##$CFRGTYP= 5
##$CHEMSTR= <none>
##$CNST= (0..31)
1 1 145 1 1 1 1 1 1 1 1 1 1 1 1 1 1 1 1 1 1 1 1 1 1 1 1 1 1 1 1 1 
##$CPDPRG= <>
##$CPDPRG1= <>
##$CPDPRG2= <>
##$CPDPRG3= <>
##$CPDPRG4= <mlev>
##$CPDPRG5= <mlev>
##$CPDPRG6= <mlev>
##$CPDPRG7= <mlev>
##$CPDPRG8= <mlev>
##$CPDPRGB= <>
##$CPDPRGT= <>
##$D= (0..31)
0 0.7 0 0 0 0 0 0 0 0 0 0.03 0 0 0 0 0 0 0 0 0 0 0 0 0 0 0 0 0 0 0 0 
##$DATE= 1783329528
##$DBL= (0..7)
120 120 120 120 120 120 120 120 
##$DBP= (0..7)
150 150 150 150 150 150 150 150 
##$DBP07= 0
##$DBPNAM0= <>
##$DBPNAM1= <>
##$DBPNAM2= <>
##$DBPNAM3= <>
##$DBPNAM4= <>
$$ [...]
##$SUBNAM3= <"">
##$SUBNAM4= <"">
##$SUBNAM5= <"">
##$SUBNAM6= <"">
##$SUBNAM7= <"">
##$SUBNAM8= <"">
##$SUBNAM9= <"">
##$SW= 18.0517328524113
##$SWIBOX= (0..15)
0 0 2 0 0 0 0 0 0 0 0 0 0 0 0 0 
##$SW_h= 3612.71676300578
##$TD= 16384
##$TD0= 1
##$TE= 0
##$TE2= 300
##$TE3= 300
##$TEG= 300
##$TL= (0..7)
0 120 120 120 120 120 120 120 
##$TP= (0..7)
150 150 150 150 150 150 150 150 
##$TP07= 0
##$TPNAME0= <>
##$TPNAME1= <>
##$TPNAME2= <>
##$TPNAME3= <>
##$TPNAME4= <>
##$TPNAME5= <>
##$TPNAME6= <>
##$TPNAME7= <>
##$TPOAL= (0..7)
0.5 0.5 0.5 0.5 0.5 0.5 0.5 0.5 
##$TPOFFS= (0..7)
0 0 0 0 0 0 0 0 
##$TUNHIN= 0
##$TUNHOUT= 0
##$TUNXOUT= 0
##$USERA1= <user>
##$USERA2= <user>
##$USERA3= <user>
##$USERA4= <user>
##$USERA5= <user>
##$V9= 5
##$VALIST= <valist>
##$VCLIST= <CCCCCCCCCCCCCCC>
##$VD= 0
##$VDLIST= <DDDDDDDDDDDDDDD>
##$VPLIST= <PPPPPPPPPPPPPPP>
##$VTLIST= <TTTTTTTTTTTTTTT>
##$WBST= 1024
##$WBSW= 4
##$XGAIN= (0..3)
0 0 0 0 
##$XL= 0
##$YL= 0
##$YMAX_a= 830968
##$YMIN_a= -884603
##$ZGOPTNS= <>
##$ZL1= 120
##$ZL2= 120
##$ZL3= 120
##$ZL4= 120
##$ABSF1= 15.48797
##$ABSF2= -2.563879
##$ABSG= 5
##$ABSL= 3
##$ALPHA= 0
##$AQORDER= 0
##$ASSFAC= 0
##$ASSFACI= 0
##$ASSFACX= 0
##$ASSWID= 0
##$AUNMP= <proc_1d>
##$AZFE= 0.1
##$AZFW= 0.1
##$BCFW= 0
##$BC_mod= 2
##$BYTORDP= 0
##$COROFFS= 0
##$CY= -3
##$DATMOD= 1
##$DC= 0
##$DFILT= <>
##$DTYPP= 0
##$F1P= 0
##$F2P= 0
##$FCOR= 1
##$FTSIZE= 16384
##$FT_mod= 6
##$GAMMA= 0
##$GB= 0
##$INTBC= 1
##$INTSCL= 3.241238e-09
##$ISEN= 128
##$LB= 0.25
##$LEV0= 0
##$LPBIN= 0
##$MAXI= 10000
##$MC2= 0
##$MEAN= 0
##$ME_mod= 0
##$MI= 1.114404
##$NCOEF= 0
##$NC_proc= -4
##$NLEV= 6
##$NOISF1= 3.799351
##$NOISF2= 2.8
##$NSP= 0
##$NTH_PI= 0
##$NZP= 0
##$OFFSET= 15.5056
##$PC= 1
##$PHC0= -4219.722
##$PHC1= 10.9923
##$PH_mod= 1
##$PKNL= yes
##$PPARMOD= 0
##$PSCAL= 0
##$PSIGN= 0
##$REVERSE= no
##$SF= 200.130003224474
##$SI= 16384
##$SIGF1= 3
##$SIGF2= 2
##$SINO= 0.751879
##$SIOLD= 32768
##$SREGLST= <19F.Aceton>
##$SSB= 0
##$STSI= 16384
##$STSR= 0
##$SW_p= 3612.71676300578
##$SYMM= 0
##$S_DEV= 0
##$TDeff= 16384
##$TDoff= 0
##$TI= <>
##$TILT= no
##$TM1= 0
##$TM2= 0
##$TOPLEV= 0
##$USERP1= <user>
##$USERP2= <user>
##$USERP3= <user>
##$USERP4= <user>
##$USERP5= <user>
##$WDW= 1
##$XDIM= 16384
##$YMAX_p= 384991175
##$YMIN_p= -78727
$$ End of Bruker specific parameters
$$ ---------------------------------
##NTUPLES= NMR SPECTRUM
##VAR_NAME=  FREQUENCY,     SPECTRUM/REAL,   SPECTRUM/IMAG
##SYMBOL=    X,             R,               I
##VAR_TYPE=  INDEPENDENT,   DEPENDENT,       DEPENDENT
##VAR_FORM=  AFFN,          ASDF,            ASDF
##VAR_DIM=   16384,         16384,           16384
##UNITS=     HZ,            ARBITRARY UNITS, ARBITRARY UNITS
##FACTOR=    0.220516191357247, 1,           1
##FIRST=     3103.13577311142, 0,            0
##LAST=      -509.580989894363, 0,           0
##MIN=       -509.580989894363, -78727,      0
##MAX=       3103.13577311142, 384991175,    0
$$ Real data points
##PAGE= N=1
##DATA TABLE= (X++(R..R)), XYDATA
$$ [...]
6293E3269p110j1707r7j01r31l7363p125L5221N830k0889j5710J1207Q646k6836
6279a3696M398R020O834j2745l4243Q662J1936M9486M149k3041n257k0758J099
6266a4156K9202j247l5518J1136M4353q819p459K7577q943k6512j7832J5097R941
6253A6820j8094P861J2826n914J0062l6298N809L4712k191K4396l8510J1918J4257
6240C7654p637j9051o195r269J7812k0147j8669m415j355P381J0457K0055j8480
6227a1859K6159L852l2443K466r601P685K4142K3182J637J2156O262m1215k7221
6214a4798K1776r701j2964Q423K0927j5585j9486K7201K1156j804r041K3898j2453
6201B7549p744j5987J4381n040o473J1310L338K3265j3234k490q112J8261o65
$$ plain form
6293 53269 46159 34452 34355 34254 33323 -4040 -11165 24056 29886 8997 -6713 4494 13140 -13696
6279 -13696 -9298 -278 6556 -6189 -40432 -31770 -19834 29652 33801 10760 5503 -15255 -14156
6266 -14156 15046 13799 -21719 -10583 33770 24951 17492 45069 36126 9614 -8218 6879 16820
6253 16820 -1274 6587 19413 13499 23561 -12737 -6928 27784 25593 49989 11479 23397 37654
6240 37654 30017 10966 4771 -4498 13314 -6833 -25502 -29917 -31272 -23891 -13434 6621 -11859
6227 -11859 14300 18152 -14291 -11825 -21426 -13741 10401 33583 35220 47376 53638 12423 -14798
6214 -14798 6978 -2723 -15687 -7264 13663 -1922 -21408 5793 26949 25145 16104 40002 27549
6201 27549 19805 3818 18199 13159 6686 17996 21334 44599 31365 28875 20763 39024 38359
6188C8359l8193Q390j7537k7693J5937L8942r218k845p564j6291O590K9037L2744
6175E0658q667l310J1929l5649m3K6037L6988m6580q786L1401J0774K1065l5276
6162E0541j1021k157R326j4685k3001P498M200O024j2107K565K068k5502l267
6149i518j4364J0247K4892K3830l6715J1026N978R646M636J6460K652l1553j0952
6136F265j2923o616J2996J8385N367M053n3497m882J4054q076N3743R955l5919
6123B905L2736L4598n5570M82L189M257R077k2715j8688J8191K0768k415l5676
6110h861n889K4517p788r118j1438J2832J7456K531n231Q433l2669J6655J1764
6097A3194J8525J8263j0027j3064P618j268j4133m986r28K0566J5614j8317n224
$$ plain form
6188 38359 166 8556 -8981 -36674 -20737 18205 8987 6142 -1422 -17713 -11123 17914 50658
6175 50658 41991 38681 50610 14961 14918 40955 77943 31363 22577 53978 64752 85817 50541
6162 50541 39520 37363 46689 32004 9003 16501 20701 26725 14618 17183 19251 -6251 -9518
6149 -9518 -23882 -13635 11257 35087 -1628 9398 15376 25022 29658 46118 48770 17217 6265
6136 6265 -6658 -13274 -278 18107 23474 27527 -25970 -30852 -16798 -24874 28869 38824 2905
6123 2905 35641 70239 14669 15151 18340 22597 31674 8959 -9729 8462 29230 26815 -8861
6110 -8861 -14750 9767 1979 -7139 -18577 -5745 11711 14242 9011 17444 -15225 1430 13194
6097 13194 31719 49982 39955 26891 34509 33241 19108 14122 13194 33760 49374 31057 25833
6084B5833j4288K1949l6433m727K4073q248J819K3252j2402p467r67K451r519
6071E326Q969L0750j094j7900q712l0922k198J7281J133l597J8947P174L542K0416
6057D9115j5430k4450l2873M4543K4011o721j1651j1761k083J8359K4639p805
6045D7893l2797R394n849k0221p782K6085J4227q627J3262q920r324p813k617
6032F911K9011j8916O235M3188k2274m7678j8620J2721N601K8975J6807m0819
6020A142J219K2802L3432j4650l4040L973L6538j121j6862n419K5820L654k1942
6007C4546k0635k0526J9455L6699k5154J3671m560k2946K2279O4474j6081j5302
5995F5920p224k9960L3580P352j0105j1858J9420k9426r859L820p808J2603L6044
$$ plain form
6084 25833 11545 33494 -2939 -7666 16407 8159 9978 33230 20828 13361 12394 14845 5326
6071 5326 14295 45045 43951 26051 17339 -13583 -15781 1500 2633 -964 17983 25157 28699 49115
6057 49115 33685 9235 -23638 20905 44916 38195 26544 14783 12700 31059 55698 47893
6045 47893 15096 24490 18641 -1580 -9362 16723 30950 22323 35585 26665 17341 9528 6911
6032 6911 35922 17006 23241 66429 44155 -3523 -22143 -9422 -3821 25154 41961 1142
6020 1142 2361 25163 58595 43945 9905 13878 50416 49295 32433 27014 52834 56488 34546
6007 34546 13911 -6615 12840 49539 24385 38056 33496 10550 32829 97303 81222 65920
5995 65920 58696 28736 62316 69668 59563 47705 67125 37699 27840 31660 23852 36455 72499
5982G2499o063k0190l1111J176j2039l600L6882J4908o546J0240j4475o540J9670
5969E4811k671K6827m4086l7702J8922N5239Q313k8119J9718n163j6925N455p15
5956E3904k640J7608l9993K03J8748L855o334r982R246k818j1437J1411K695l2314
5942A2152j5736K3970p162j2890J5985J9626R067J3066K826K1186J9853j3653
5930H8290r660k8745L251N54l5341L5612P954Q320k0810j2281K0954K4393J0624
5917I3115k4174O349l2527J1107J4038n600l464j4760o09j279j057R553j5441
5904C5251P077n524Q597J6586O379p903j3920j8863p216o985j4287J2052L4752
5891D5996N43j756n275R907J2085m0064J7749K1575j673O665j8703K4015k2982
$$ plain form
5982 72499 66436 46246 15135 16311 4272 672 37554 52462 45916 56156 41681 35141 54811
5969 54811 52140 78967 34881 -2821 16101 71340 79653 51534 71252 66089 49164 54619 53904
5956 53904 51264 68872 28879 29082 47830 51685 45351 35369 44615 41797 30360 41771 44466 12152
5942 12152 -3584 20386 13224 334 16319 35945 45012 58078 60904 82090 101943 88290
5930 88290 78630 49885 53136 53690 18349 53961 61915 70235 49425 37144 58098 82491 93115
5917 93115 68941 75290 42763 53870 67908 62308 58844 44084 43475 42196 41139 50692 35251
5904 35251 42328 36804 45401 61987 68366 60463 46543 27680 20464 13479 -808 11244 45996
5891 45996 46539 44783 39508 49415 61500 21436 39185 60760 59087 65752 47049 71064 48082
5878D8082K2453K8112n107l819l8867j2726j566J8567J7330k8151J0626Q291R173
5865G2398J7950p415j1557Q491J3620N118j6370j9900Q782J8216O073k639M6704
5852A39471l3357n564k4138N264J3616j3739q111k4159J6026P699l2085L2561
5840G3484J2787J9795j0771J9780R531k936l3544q986J7045R848l463m923N81
5827I8228M759o384j4662Q606p474L8501K9615k9707j1704J4560o0061M5916L4683
5814A44876n865L242L6903j4614j6506k7388K5732L6591J8540j9923m3631k4745
5802A13212M8867M3667m4109k4382J4524J3899K4836j8520p200P440j0855J6852
5790A78231M061N210j6015J838M6252J1522m1986L1193L6773L827m0156O715N641
$$ plain form
5878 48082 70535 98647 93540 89721 50854 38128 36562 55129 72459 44308 54934 63225 72398
5865 72398 90348 82933 71376 79867 93487 98605 82235 62335 71117 89333 95406 92767 139471
5852 139471 106114 100550 76412 81676 95292 81553 73442 49283 65309 73008 40923 73484
5840 73484 86271 106066 95295 115075 124606 121670 88126 79140 96185 106033 102570 97647 98228
5827 98228 102987 96603 81941 90547 83073 121574 151189 121482 109778 124338 64277 110193 144876
5814 144876 139011 142253 179156 164542 148036 120648 146380 182971 201511 181588 137957 113212
5802 113212 162079 205746 161637 137255 151779 165678 190514 171994 164794 172234 161379 178231
5790 178231 182292 187502 171487 173325 219577 231099 189113 220306 257079 260906 220750 227465 233106
5777B33106M9211N5346j2425M4535N0764O0892M9692P4093L0574M3308O5793L8318
5765G83207J12538R2305J64701K52486L51177N79648R54203J388217J719177J355487
5755G753146P24086J37817k40200n10697r50980r85102r74829q84899p64493o99593
5745B604256n82166m44676k67933j39151j42569j04340j13646j53619n0593l8647
5735E66916j2258m783j4460j3912j7932K6576k6833m0128j0332j3617j6618j4722
5723D07897k3544j3802J3504n9452j5114j1860m0949m211J3106N465J5136l493
5711B82683N674j2586k0851j5565L1582k4959j4736M367k7410k696j5840J2450
5699B02113K958N176O160m5137J5413m912j0632K8250k0079M7426k6877m635K0256
$$ plain form
5777 233106 282317 337663 325238 369773 420537 481429 531121 605214 635788 679096 744889 783207
5765 783207 895745 988050 1152751 1405237 1756414 2336062 3290265 4678482 6397659 7753146
5755 7753146 8477232 8615049 8374849 7864152 6913172 5928070 4953241 4068342 3303849 2604256
5745 2604256 2022090 1577414 1309481 1170330 1027761 923421 809775 656156 605563 566916
5735 566916 554658 549875 535415 521503 503571 530147 503314 463186 452854 439237 422619 407897
5723 407897 384353 370551 384055 324603 309489 297629 256680 252469 265575 271040 286176 282683
5711 282683 288357 275771 254920 239355 270937 245978 231242 235609 208199 205503 189663 202113
5699 202113 205071 210247 216407 171270 186683 181771 171139 199389 179310 226736 199859 195224 215480
5686B15480j1562J3329j5584j9938j406j5151k892J5915J9421J044k2961k0333
5674A55362J3314J129R150K2846m882j3758k7357M145K3022k1301J4905R860R29
5661A87364J0546L655P323j9983o843pj5975K5152p063O086J1044j4512p921j3154
5647A65712M283K1128k8242j4431k9041L838K2302J832r824J4556r293L3926J4555
5634A91301j7874J7917M0662L837k9457R369k1832p527O346L1611k2641n1079
5622A50633J7043K4479K697J7817P105R530l371j0460j0436O334M2409k201K1081
5609B72660L1253O2726O6064K1528K8288L8649K2900L4595k684l7718j865m0801
5597D95595K2122M307l419l0M7851n781k2608P007k3184j8520m5925o8172k8442
$$ plain form
5686 215480 203918 217247 201663 181725 180319 165168 162276 178191 197612 198656 175695 155362
5674 155362 168676 169805 178955 201801 196919 183161 155804 159949 182971 161670 176575 186435 187364
5661 187364 197910 201565 208888 188905 182062 182055 166080 191232 184169 190255 201299 186787 178866 165712
5647 165712 169995 191123 162881 148450 119409 123247 145549 147381 137557 152113 142820 176746 191301
5634 191301 173427 191344 232006 235843 206386 215755 193923 186396 192742 224353 201712 150633
5622 150633 167676 192155 194852 212669 219774 229304 225933 215473 205037 211371 253780 251579 272660
5609 272660 303913 366639 432703 454231 482519 521168 544068 578663 575979 538261 536396 495595
5597 495595 517717 522024 518605 518575 566426 560645 538037 545044 521860 503340 457415 389243 360801
5584C60801k3662j2311j5075n258j4757J2960J2691j1735j7734l5517o534k7748
5572B16121P952J7027L3340L0956k8962L0808n849M800m611j5150K5518o368J7332
5559C22914M5818p902q447K4867K4796n91L7503J5719L5599K2630O4012K5221
5547F02139M594M8592L8425M6044L3346O6886Q8916J09674J72241J97963K41479
5536A650299L42959L12764L31688K51489J70224J24053P6899J2184m8390K8885
5526C253054L6231N9612Q6150M7934m279k6249j04563k15986k44236k75462k52351
5515B359855k64096k67734k43733k05229j49616j46649j02554q6052p4823m1188
5505G78181q6317k6426n4570m476o528j3241j8830k6417j0454l329k5844n579
$$ plain form
5584 360801 337139 324828 309753 304495 289738 302698 315389 303654 285920 250403 243869 216121
5572 216121 224073 241100 274440 305396 276434 307242 301393 306193 301582 286432 311950 305582 322914
5559 322914 368732 360830 352383 377250 402046 401455 438958 454677 490276 512906 576918 602139
5547 602139 606733 655325 693750 739794 773140 840026 928942 1038616 1210857 1408820 1650299
5536 1650299 1993258 2306022 2637710 2889199 3059423 3183476 3260375 3272559 3224169 3253054
5526 3253054 3289285 3348897 3435047 3482981 3478702 3452453 3347890 3131904 2887668 2612206 2359855
5515 2359855 2095759 1828025 1584292 1379063 1229447 1082798 980244 894192 819369 778181
5505 778181 691864 665438 610868 606392 599864 586623 567793 541376 530922 527593 501749 496170
5493D96170j7602j4860k4206l5184J0268Q559n052J1183k1562j2888J2675j2957
5481C94544q457q858r507Q604R443o658k4382m8701J3013N3050p925k7602j7525
5468C19039j650m717r604K4173M1048J5409K331o044j2640L0054k5696K3910K1479
5455D17092R231j384q081q108l572L5824k2999j5840J4162K2085l851L520O816
5442D44895k940o124o20k1454L1451M8211j2542R241L2749K0480p99L633q422
5429E37759m65J4268R228L9040K4560n068j9554M770M180K8653K1964K501P728
5416F69564j4656L0469M0598J537K2501L6325j7569J0859J5145N314O143L5650
5404H41880n834M006L5611J3543j6486p891J9686k2080l6779M9197O764L2513
$$ plain form
5493 496170 478568 463708 439502 404318 414586 423145 418093 429276 407714 394826 407501 394544
5481 394544 386087 377229 367722 376326 385769 379111 354729 306028 319041 372091 364166 336564 319039
5468 319039 317389 312672 303068 327241 368289 383698 386029 379985 367345 397399 371703 395613 417092
5455 417092 426323 424939 416858 408750 405178 441002 418003 402163 416325 438410 434559 438079 444895
5442 444895 441955 435831 435211 413757 445208 493419 480877 490118 522867 543347 542548 546181 537759
5429 537759 537294 551562 560790 599830 624390 619322 599768 604538 608718 637371 659335 661836 669564
5416 669564 654908 685377 725975 727512 750013 786338 768769 779628 794773 800087 806230 841880
5404 841880 836046 840052 875663 889206 872720 864829 884515 862435 825656 874853 881617 914130
5392I14130m271r133J1872j5265K8082J1453n462r136j5652N023J2690J0205K6486
5379I61022J8463J9464j7582L4132M7597L6415J5317k7857J493L4828J6103K9640
5367A169035j658K2640L0547q87L2779M659K7215O0065K2044K2016L4039J8647
5355A441141L7233N6762K5058L8383N2024M6612R9397L2069J5995M9401O2226
5344A956301P7207L549M5208O5676O5433Q2140N3154J3179M6503N2186K6098N9035
5332B545669R0193L3782L1652M4044O8030J10458O3780N2556J05597R0391O0854
5321C297006P8875J08933J65798K39143K94752L27326L82052L47474L74463M28508
5311F044330M80175M74434N49640O68804P69332R00358J144254J391534J742527
$$ plain form
5392 914130 909859 900726 912598 897333 925415 936868 931406 922270 906618 911641 924331 934536 961022
5379 961022 979485 998949 981367 1015499 1063096 1099511 1114828 1086971 1088464 1123292 1139395 1169035
5367 1169035 1167377 1190017 1220564 1219677 1252456 1257115 1284330 1344395 1366439 1388455 1422494 1441141
5355 1441141 1478374 1535136 1560194 1598577 1650601 1697213 1796610 1828679 1844674 1894075 1956301
5344 1956301 2033508 2037057 2082265 2147941 2213374 2295514 2348668 2361847 2408350 2460536 2486634 2545669
5332 2545669 2635862 2669644 2701296 2745340 2813370 2923828 2987608 3040164 3145761 3236152 3297006
5321 3297006 3375881 3484814 3650612 3889755 4184507 4511833 4893885 5241359 5615822 6044330
5311 6044330 6524505 6998939 7548579 8217383 8986715 9887073 11031327 12422861 14165388
5302A4165388K207907K950001M200972O086966Q675076J1159205J1700322R251573
5294G0397410N339114J842350n99254k913316m366377m002283k283259O93179
5286F4107564M014923O345361N769203K966735l48452k865104n204726p520085
5278F7265419q466576q425511p807643o954957o065171n101554m014530k941123
5270A7488354k177069j754842j432624j230677j101863r15415o98131n66601n10292
5261G100840l97556k84802k97390k70445k76164k74199k53461k53155k61646k45106
5251D286916j98353j74948j72201j73076j63647j53167j62546j23070j40757j27776
5241B697375j30902j07187r9870m7794r8924q4721q1894p7341q4242m8120m9480
$$ plain form
5302 14165388 16373295 19323296 23524268 29611234 38286310 49445515 61145837 70397410
5294 70397410 75736524 77578874 76979620 74066304 69699927 65697644 63414385 64107564
5286 64107564 68122487 74467848 80237051 83203786 82855334 79990230 74785504 67265419
5278 67265419 58798843 50373332 42565689 35610732 29545561 24444007 20429477 17488354
5270 17488354 15311285 13556443 12123819 10893142 9791279 8875864 8177733 7611132 7100840
5261 7100840 6703284 6418482 6121092 5850647 5574483 5300284 5046823 4793668 4532022 4286916
5251 4286916 4088563 3913615 3741414 3568338 3404691 3251524 3088978 2965908 2825151 2697375
5241 2697375 2566473 2459286 2359416 2311622 2212698 2127977 2046083 1968742 1884500 1836380 1786900
5230A786900l1134n8672m1512j6915m4014n8050o4196j8509l1184K449l3936l0488
5218A360739l1157l2492k4648j1712j9367k4482j4266j7863n3969n3564m0446
5207A036773n252j190m2727k4276j2554O801k4614m1062j7947K2975M584q248
5195H93263j9099n4811m4530L0291K0783k7872k3404n6558l3764L1395k3130m3138
5183F49426l0847n863j1668J0342j0243l2910j0184m6900j6176j0302N043j2741
5171D76977j7085j352k5088q909n320n502j8827N157L3185k0165m4074j1682L2221
5158C89536k3121k216m104K3337k46L0271R82l0782j4100J4026j6213j6759L1141
5145C81752K4702q252r33J3735n81n1972J6247J8865k9256j9382J008J2948k4586
$$ plain form
5230 1786900 1755766 1697094 1655582 1638667 1594653 1536603 1472407 1453898 1422714 1425163 1391227 1360739
5218 1360739 1329582 1297090 1272442 1260730 1241363 1216881 1202615 1184752 1130783 1077219 1036773
5207 1036773 1031521 1030331 987604 963328 950774 957575 932961 891899 873952 896927 901511 893263
5195 893263 874164 819353 774823 805114 825897 798025 774621 718063 684299 715694 692564 649426
5183 649426 618579 612716 601048 611390 601147 568237 558053 511153 494977 484675 489718 476977
5171 476977 459892 458540 433452 424543 419223 413721 394894 400051 433236 413071 368997 357315 389536
5158 389536 366415 364199 360095 383432 383186 413457 414439 383657 369557 383583 367370 350611 381752
5145 381752 406454 398202 397269 411004 410423 358451 374698 393563 364307 344925 345933 358881 334295
5132C34295k9530J3842l157J4659R03j1903J1953K4705q955L605R971o3q831j6746
5118C34748O266J1571n031Q503j6613j5802j9736J3790M0459L643r390L5343j6600
5105C71151k1029J310j5571k3608m667K2268k1104l0771l9853L9786r889j2974
5093B55049j1119J9834K4264j3531p470M1599l573j3458j7652k1353J0158N317
5081B68065q479J7441l7377K5520K1190l4843K3480L00k9419J460K7429K288J6902
5068B93957k1669j0849P173K634j1903L634K9983L502K027J6629J3050O008K0204
5055C54380P616M629J9065M458K0716P666J4071K3024k5194L3754N735r700k2743
5042D37477j0744k4198L426q092m909j464K294o293k103k3566k0387Q074P595
$$ plain form
5132 334295 304765 318607 315450 330109 331012 319109 331062 355767 346812 350417 360388 360325 351494 334748
5118 334748 341014 352585 347554 356057 339444 323642 303906 317696 358155 361798 352408 387751 371151
5105 371151 350122 351432 335861 312253 307586 329854 308750 277979 238126 277912 268023 255049
5093 255049 243930 263764 288028 274497 267027 308626 305053 291595 273943 252590 262748 268065
5081 268065 259586 277027 239650 265170 286360 251517 274997 275297 245878 247338 274767 277055 293957
5068 293957 272288 261439 268612 271246 259343 262977 292960 296462 298489 315118 328168 334176 354380
5055 354380 361996 366625 385690 390148 410864 418530 432601 455625 430431 464185 469920 460220 437477
5042 437477 426733 402535 405961 397869 392960 391496 393790 387497 385394 361828 341441 349515 357110
5029C57110J651l3874L28k6250P786R610k8810p172J5689J2879k0644j5864l505
5016B68934L0964L1588k2021j3491O526j80j891J4632p346k1881O242K6482L9135
5003C57693J1265k491k297J4944J7190o281K8795K389m5944M3533M7053L0133
4991D95982R2646Q5929K0097K122J9417J1061l407K0407L7466O440M909J3103
4979H06172m5664j7725j6410Q84m3766l1055P288J3911L7137L7306L118j5157
4967G36039k4265l5308k5350n0886k9785n1290l0311L634j3921m8407j5034m2786
4955C72330J3174J2963r243J6347K1715J569r001j7411L1245m9323j9453K6882
4943C91794J0525q03j7411k6347l0233K5932J9044J4262J9715j172J0954k8992
$$ plain form
5029 357110 358761 324887 325215 298965 306751 316361 287551 280379 296068 308947 288303 272439 268934
5016 268934 299898 331486 309465 295974 302500 302320 300429 315061 307715 285834 292076 318558 357693
5003 357693 368958 366467 364170 379114 396304 390023 418818 421207 375263 418796 465849 495982
4991 495982 588628 674557 694654 696776 716193 727254 723847 744254 781720 788160 793069 806172
4979 806172 760508 742783 726373 727257 683491 652436 659724 673635 710772 748078 751196 736039
4967 736039 711774 676466 651116 600230 570445 519155 488844 492478 478557 430150 415116 372330
4955 372330 385504 398467 389224 405571 427286 428855 419854 402443 433688 384365 364912 391794
4943 391794 402319 401516 384105 357758 327525 353457 372501 386763 406478 405306 416260 387268
4931C87268J8991j0507k137K3575L5067k0719l1532O570L0081q39l2088K592l7675
4918C68647J5487M0469j4345L157J1350j9804J298M545L713K5860J6750j5554
4906D41573l06j5094K2003j1250o904J2462n292J2030j7562j378K4477J5277J1240
4893D81276j1379J3589L5010k3218j1312k2775J0614R135L8308K2710j6126k2259
4881E03573q438L2127M172J4474q974j5297j0655J6127M657M200J432J9741m962
4868E52177J9211N278m058j2726J3289q265j3299K0324J4700J6873k0352J1247
4856E94399O6001o961J8964J7296N3427N0786N4001M9119K6738j5187j0260P079
4844I05402k6162l2917j8347p355j8464L2079J677L337K4243N8869K4420L3481
$$ plain form
4931 387268 406259 395752 393615 417190 452257 431538 400006 406576 436657 435818 403730 406322 368647
4918 368647 384134 424603 410258 413415 424765 404961 406259 410804 414517 440377 457127 441573
4906 441573 441267 426173 448176 436926 430022 442484 437192 449222 431660 430282 454759 470036 481276
4893 481276 469897 483486 518496 495278 483966 461191 471805 480940 519248 541958 525832 503573
4881 503573 495135 527262 531434 545908 536934 521637 510982 527109 531766 535966 537398 557139 552177
4868 552177 571388 576666 572608 559882 573171 564906 551607 571931 586631 603504 583152 594399
4856 594399 660400 653439 672403 689699 743126 793912 847913 897032 923770 908583 898323 905402
4844 905402 879240 846323 827976 820621 802157 834236 835913 839250 863493 922362 946782 980263
4832I80263O2192M8227O3795O3677R4684J22538J69794K48497L94958O57766R43576
4821C849967J237170J004036N45416Q1594j80409l76183o38901o78137o62211
4812D182342o27043n31363n03269m15625k86349k22554j09629o0561q3436p9212
4802A263301p5036o7360m5731m1165j3729l8647m475J5034k587k0657J872R705
4790I80525K1300M041n000j1046m8339Q524K7085k4921m1286J5256P317l0729
4778I02727J3099j7494L56n267K248K8415L439J0012j3739K3892M700k2835K562
4765I32115j7736K5765j5537Q808j1109J7351K1412j2518Q312J5363K2704J0471
4753A005401n113M7833k6811p012J5052Q028j8551K3193L3246l6150K6193J5423
$$ plain form
4832 980263 1042455 1090682 1154477 1218154 1312838 1435376 1605170 1853667 2248625 2906391 3849967
4821 3849967 5087137 6091173 6636589 6718183 6537774 6161591 5522690 4844553 4182342
4812 4182342 3555299 3023936 2520667 2105042 1818693 1596139 1486510 1425949 1342513 1263301
4802 1263301 1188265 1120905 1075174 1034009 1020280 981633 977158 992192 989605 968948 970820 980525
4790 980525 1001825 1005866 1000866 989820 941481 950005 977090 952169 910883 926139 933456 902727
4778 902727 915826 898332 898688 893421 895669 924084 927523 937535 923796 947688 952388 929553 932115
4765 932115 914379 940144 924607 933415 922306 939657 961069 948551 956863 972226 994930 1005401
4753 1005401 1000288 1048121 1021310 1014298 1029350 1037378 1018827 1042020 1075266 1039116 1065309 1080732
4741A080732J2253K185k0674J9664L1629j693J1486J2621L2429l2141k9181K4866
4729A144176K4077k1198N850N1176J2266J2484K647j8913R460K9166j2412K616
4717A241395K8933L998O941r169M7967k7399O656R296P612j2133L0865J5913J9690
4704A370565l8498K692P8844J0756j1529P685L7912K974J4967L4636l841r474
4692A497689Q40Q135O453K5066K8241K0735j2699K3502K3744k74O543J5918M1537
4679A685430J7236L7485Q081J2493j152J636J223L4490L0061N773j866N6482j6747
4666A870625J530L9387K5661L3066L0701R676K2697M2125p446M2945q97L4466
4654B144536N3253L1704J8175m473q340M4062K3096K2503R125N3871L5941L1734
$$ plain form
4741 1080732 1092985 1095170 1074496 1094160 1125789 1124096 1135582 1148203 1180632 1148491 1119310 1144176
4729 1144176 1168253 1147055 1152905 1204081 1216347 1228831 1231478 1212565 1222025 1251191 1238779 1241395
4717 1241395 1270328 1274326 1281267 1272098 1320065 1292666 1299322 1308618 1316230 1304097 1334962 1350875 1370565
4704 1370565 1332067 1334759 1413603 1424359 1412830 1420515 1458427 1461401 1476368 1511004 1507163 1497689
4692 1497689 1498529 1506664 1513117 1538183 1566424 1587159 1574460 1597962 1621706 1621432 1627975 1643893 1685430
4679 1685430 1702666 1740151 1748232 1760725 1759573 1761209 1762432 1796922 1826983 1832756 1830890 1887372 1870625
4666 1870625 1872155 1911542 1937203 1970269 2000970 2010646 2033343 2075468 2068022 2110967 2110070 2144536
4654 2144536 2197789 2229493 2247668 2243195 2234855 2278917 2302013 2324516 2333641 2387512 2423453 2455187
4642B455187N9450L2709L6586J9531L8993J0499N5625M7184P5565O4125O5824
4631B961278J22670J42182K25619L09086M26715L55446J98041Q1023L9632o7872
4621D793820j92764j58066j37401j25095o9059m7267n2597N0643O3296J47870
4611D273380J89682K43149K71757K30295J87830J56646J98955J96205K58869L34555
4601F541323L34864L21121K79497J93022J26760J64214J55191K55517K81231K68081
4591H920821J76199O4722J0732o9647j14488p0848l3255l7551m8384j19696j26633
4580H551972j60877k04574k15094j88253j34488j30276r5170j65371j40428j24790
4570F992651j62160j33522r9228r6296j16019r3714l2609R705M123L5302M9126
$$ plain form
4642 2455187 2514637 2547346 2583932 2603463 2642456 2652955 2708580 2755764 2831329 2895454 2961278
4631 2961278 3083948 3226130 3451749 3760835 4187550 4542996 4741037 4822060 4861692 4793820
4621 4793820 4601056 4442990 4305589 4180494 4111435 4064168 4011571 4062214 4125510 4273380
4611 4273380 4463062 4706211 4977968 5208263 5396093 5552739 5751694 5947899 6206768 6541323
4601 6541323 6876187 7197308 7476805 7669827 7796587 7960801 8115992 8371509 8652740 8920821
4591 8920821 9097020 9161742 9172474 9102827 8988339 8917491 8884236 8846685 8798301 8678605 8551972
4580 8551972 8391095 8186521 7971427 7783174 7648686 7518410 7423240 7257869 7117441 6992651
4570 6992651 6830491 6696969 6597741 6501445 6385426 6291712 6259103 6268808 6272931 6308233 6357359
4559F357359K9815O0370P3681O1077M3336R4250J16780J27121J06595J28482J32906
4548G331772J50207J81441J36547J37803J35316J63862J04157J53025J83312J67598
4538H845040J83133J86497J43890J37493J00886R1679N0351Q343K4639J7722J7734
4527I807407j9971L1610L8593L1487k7659Q764P3542N1768L5753N2313J06733
4516A0190340Q1118J12987J30761J33656J64541J57728J95368K40713L25816L46441
4506A2079469M24769N84520P10514J006260J338867J828638K268792K665438K686675
4497B5593942K156015J472264P41726L77663L55089K81647O06740J403669K227335
4488C5216090L028042L718001K946947J710196K09035j015561j219093j879034
$$ plain form
4559 6357359 6387174 6447544 6521225 6582302 6625638 6719888 6836668 6963789 7070384 7198866 7331772
4548 7331772 7481979 7663420 7799967 7937770 8073086 8236948 8341105 8494130 8677442 8845040
4538 8845040 9028173 9214670 9358560 9496053 9596939 9688618 9738969 9747312 9771951 9789673 9807407
4527 9807407 9787436 9819046 9857639 9889126 9861467 9870231 9943773 9995541 10031294 10083607 10190340
4516 10190340 10271458 10384445 10515206 10648862 10813403 10971131 11166499 11407212 11733028 12079469
4506 12079469 12504238 13088758 13799272 14805532 16144399 17973037 20241829 22907267 25593942
4497 25593942 27749957 29222221 29963947 30341610 30696699 30978346 31585086 32988755 35216090
4488 35216090 38244132 41962133 44909080 46619276 46828311 45812750 44593657 42714623
4480D2714623k373040k301366j884317j285295p36081n49701o48569q41816j269745
4471C0824693j426270j500130j840951k026106j987351j843485j639189j370443
4463A7190768j085033q09952n38389l85477l44453k97019k28653k31510j85149
4454A3085133j59402j71028j07002j01658j38877r7194p3984q9089q3397n0974
4444A2012528o6674r0535m7808q6990q7074r2026q6092j17828n4949o8028n9114
4433A1155410n1905m6115p2154j09219q8776l9547n5490o1350r5117j04737p5840
4422A0355160m7235m6265j03894n8949m8909j01266j02271o9171j04181p5659
4412I597360r2436p9879o6231p5543p0973p9427p2736p2243q6534j01922r1630
$$ plain form
4480 42714623 40341583 38040217 36155900 34870605 34134524 33584823 32936254 32094438 30824693
4471 30824693 29398423 27898293 26057342 24031236 22043885 20200400 18561211 17190768
4463 17190768 16105735 15295783 14757394 14371917 14027464 13730445 13501792 13270282 13085133
4454 13085133 12925731 12754703 12647701 12546043 12407166 12309972 12235988 12146899 12063502 12012528
4444 12012528 11945854 11855319 11807511 11720521 11633447 11541421 11455329 11337501 11282552 11214524 11155410
4433 11155410 11103505 11057390 10985236 10876017 10787241 10747694 10692204 10630854 10535737 10431000 10355160
4422 10355160 10307925 10261660 10157766 10098817 10049908 9948642 9846371 9777200 9673019 9597360
4412 9597360 9504924 9425045 9358814 9283271 9212298 9132871 9060135 8987892 8901358 8799436 8707806
4401H707806o8386r5862r3754o3954q7895p7500p8059n0504r9778j22703p3766
4390G795645p6348o5414j19442p6537m1793p0188p1271o8561j03192q2622l4996
4379F985281r2034r3998l8731n6143r2752o1515m6899q4138n7359q0642p5482
4368F205588q4589p4381o7612q5317p6661q4098o3950q4242o9651o0275o9301
4357E385511p2249l2446o0370q1888n6962m3503m7872j5513l3981p381j0798l6089
4345D886459P16n4813j18005n2250o2384n3042j20329q4208o2622n4964m9552
4334D175006l5608j9598k4110n6146p7772o6442m5779J0546m2935l8501l9570
4323C739091m5950k4147k4556j8229n6660m6505m7045k2946M443m3949k2824j4592
$$ plain form
4401 8707806 8639420 8543558 8449804 8385850 8297955 8220455 8142396 8091892 7992114 7869411 7795645
4390 7795645 7719297 7653883 7534441 7457904 7416111 7345923 7274652 7206091 7102899 7020277 6985281
4379 6985281 6893247 6799249 6760518 6704375 6611623 6550108 6503209 6419071 6361712 6281070 6205588
4368 6205588 6120999 6046618 5979006 5893689 5817028 5732930 5668980 5584738 5515087 5454812 5385511
4357 5385511 5313262 5280816 5220446 5138558 5081596 5038093 4990221 4974708 4940727 4933346 4922548 4886459
4345 4886459 4887175 4832362 4714357 4662107 4599723 4546681 4426352 4342144 4279522 4224558 4175006
4334 4175006 4139398 4119800 4095690 4039544 3961772 3895330 3849551 3860097 3817162 3778661 3739091
4323 3739091 3693141 3668994 3644438 3626209 3569549 3523044 3475999 3453053 3457496 3413547 3390723 3376131
4311C376131j0753j8922k480L1813p4649l8433L4249k4825j3465j7591k0826K446
4299C222695l2725k6588l1715m1663K477j0286j09j0506K427K2607p610j2229
4287C076775n44j7528K6243M943K5167L4724K5426k4350L1432K6656K8934N8493
4275C296371N9968K4621O7517Q1827J13785R3404J01402J34517J19082J25962
4265D218456J17203J48799J67360J15459J36197K08181L01267L63308M14664M41254
4255F632148N15068N38593M83750M67973L72205L31417K97847K45171K35370K52473
4245A0372015L82861N33631P13772Q87468J016730J063504J036549Q81182O33412
4236A7521124L84870J88691J2476j16815j51190o5817R2180L23269O56579Q71185
$$ plain form
4311 3376131 3365378 3346456 3343976 3375789 3301140 3262707 3296956 3272131 3258666 3241075 3220249 3222695
4299 3222695 3189970 3163382 3131667 3090004 3092481 3082195 3082086 3071580 3074007 3096614 3089004 3076775
4287 3076775 3076231 3058703 3084946 3089889 3115056 3149780 3175206 3150856 3182288 3208944 3237878 3296371
4275 3296371 3356339 3380960 3448477 3530304 3644089 3737493 3838895 3973412 4092494 4218456
4265 4218456 4335659 4484458 4651818 4767277 4903474 5111655 5412922 5776230 6190894 6632148
4255 6632148 7147216 7685809 8169559 8637532 9009737 9341154 9639001 9884172 10119542 10372015
4245 10372015 10754876 11288507 12002279 12889747 13906477 14969981 16006530 16887712 17521124
4236 17521124 17905994 18094685 18107161 17990346 17839156 17773339 17865519 18188788 18845367 19716552
4226A9716552J072643J083091R40681N82523J79512k18408n52014q11785r17968
4217B1074827q90811p54138n45301k16984Q8279K82414M18818L53843J79066j31105
4207A9858908m15705p49744r97769j098428j163853j094070r52924p58636n93579
4198A2034200l62998j94047j58973k10102k71421l76645n34582n83476o66048
4189H675908o89789o68231o07107m88517m65560l57690k86233k61398k19896j86206
4179D445281k03779k08332k06322k42447k36405j75748j57487k00706j70387j32402
4169B511266j21000r8610j05858r4301m6066k7048o3385r6100o2209k3179p1148
4158A702362l7423k2615o0798l4472l1541l7430k2496j4835l7878k6981P11o2122
$$ plain form
4226 19716552 20789195 21872286 22812967 23395490 23575002 23356594 22804580 21992795 21074827
4217 21074827 20184016 19429878 18884577 18667593 18755872 19038286 19457104 19810947 19990013 19858908
4207 19858908 19443203 18693459 17695690 16597262 15433409 14339339 13386415 12627779 12034200
4198 12034200 11671202 11477155 11318182 11108080 10836659 10460014 9925432 9341956 8675908
4189 8675908 7986119 7317888 6710781 6222264 5756704 5399014 5112781 4851383 4631487 4445281
4179 4445281 4241502 4033170 3826848 3584401 3347996 3172248 3014761 2814055 2643668 2511266
4169 2511266 2390266 2291656 2185798 2091497 2045431 2018383 1954998 1858898 1796689 1773510 1702362
4158 1702362 1664939 1642324 1581526 1547054 1515513 1478083 1455587 1440752 1402874 1375893 1376604 1314482
4146A314482O260k024j3536n0159m3787K6733J9029m6760n0681j3197k1368j860
4134A123132j3557l4864o071J9142k9075k7445K0273m7236k510K1948j7264l856
4122A002617j4205k6020k1220r658K722l2934k2948N316m5588j193K519j71k0146
4109H19091p978j35n151K1333l12n5534l1384K7189j9850o729L6537J040J744
4096G79861k8052j2422m9070J9724P223j0546p380l282l980L2000l2437J3223
4084G04862N7299j7728m6555j941K1945J7653k0964j0603j4667K592K3506K2812
4072G38211q400k3795j5253j8576O24J6555K4862m541o10l844p37J1092m3237
4059F72351J4670n866j6796N2711J1442K4381m8320r554J9235O782L8293l546
$$ plain form
4146 1314482 1320742 1318718 1305182 1255023 1211236 1237969 1256998 1210238 1159557 1146360 1124992 1123132
4134 1123132 1109575 1074711 1068640 1087782 1058707 1031262 1051535 1004299 1001789 1023737 1006473 1002617
4122 1002617 988412 962392 941172 931514 934236 901302 878354 883670 838082 836889 839408 839237 819091
4109 819091 811113 810978 805827 827160 826848 771314 739930 767119 747269 740540 777077 778117 779861
4096 779861 751809 739387 690317 710041 717264 706718 699338 696056 692076 724076 691639 704862
4084 704862 762161 744433 697878 695937 717882 735535 714571 703968 689301 691893 715399 738211
4072 738211 729811 706016 690763 672187 672811 689366 714228 709687 709077 705233 704496 715588 672351
4059 672351 687021 681155 664359 717070 728512 752893 704573 695019 714254 721036 759329 755783
4047G55783l5628j1335N567L8501J6864k1904k3609J9128j8115j4354M0220N1191
4035H02309j3601K598K1033P537J850l3603m917q539L506l21m0451K4839m465
4022G57775l4130k8309q733o961Q385k0536K3732r211k6488j668k3842j2993K0211
4009F37232K161j9916m3230k4137J0531J7479J8924J0579j9192L62K6666j9669
3997E97790j5862J2168L2654k2949m2781j6733M0512L4735R404k7908k0929l7209
3985E42892J4656J6204n3596p389K0319k449R097n139J3318l4537j3029J2743
3973E13090O623j0004k1214J3552p74n350N994J4600M9710l415k4679m186p590
3960E26357R591K4384L6016j7991k947J4252n67p52J8632P7406L0149K639K6205
$$ plain form
4047 755783 720155 708820 714387 752888 769752 747848 724239 743367 725252 710898 751118 802309
4035 802309 788708 791306 812339 819876 821726 788123 783206 774667 778173 777852 737401 762240 757775
4022 757775 723645 695336 686603 679642 688027 667491 691223 682012 655524 653856 630014 617021 637232
4009 637232 639393 619477 576247 552110 562641 580120 599044 609623 590431 590793 617459 597790
3997 597790 581928 594096 626750 603801 561020 544287 584799 619534 628938 601030 580101 542892
3985 542892 557548 573752 520156 512767 533086 530637 539734 534595 547913 513376 500347 513090
3973 513090 519713 509709 488495 502047 501273 495923 501917 516517 566227 562812 538133 533947 526357
3960 526357 535948 560332 596348 578357 575410 589662 589095 588343 606975 684381 714530 717169 743374
3947G43374N1018J09637J48014J81198J36576P6779M2803N512j11634o9054r0699
3936A223524r5357n2059o4167p1235m1893n5264j5001L934J2056L2009Q025m208
3924H80364J6093L5379O98M6409L0031l822O805L7660N1537R1820J23659K23836
3912A540469J78210R1354j4491k2578l805j20842o3167r5328j18057j01905r2031
3901A177829p0898n6661m3598k0840m0267k0454O128l9424o508J4004j0433j0244
3889H78634J6509l667j8531l5903j8030m1965n4572k99N963j7009m974l3927m0942
3876F31287k3215j0051r892N713n971J4676o671P35k4790J7923J7719j6466M861
3863E95858j0914m323J5420l133j4453N320q370P933K1118J4023l075k135m289
$$ plain form
3947 743374 794392 904029 1052043 1233241 1369817 1446596 1489399 1494911 1383277 1314223 1223524
3936 1223524 1128167 1076108 1011941 940706 898813 843549 828548 832482 844538 876547 884572 880364
3924 880364 896457 931836 932534 978943 1008974 1005152 1011957 1049617 1101154 1192974 1316633 1540469
3912 1540469 1718679 1810033 1795542 1772964 1769159 1648317 1585150 1489822 1371765 1269860 1177829
3901 1177829 1106931 1050270 1006672 985832 945565 925111 931239 891815 885307 899311 888878 878634
3889 878634 895143 891476 872945 837042 819012 777047 722475 722176 728139 711130 706156 672229 631287
3876 631287 608072 598021 588129 593842 587871 602547 595876 596611 571821 589744 607463 590997 595858
3863 595858 584944 580621 596041 592908 578455 583775 575405 583338 604456 618479 615404 613269 608980
3850F08980M311l4577O926N4394O121L7432J7860n250P046q2k1950J6711N0665
3837G48587k5542P863J705L492p482j3789L106L4938j8140n0034q399O503L5470
3824G18278O006k374j3553K2449J8765j1233K2205j740j8900o06K3375p849j1533
3811G43290K0697k670k8317L1728N3965K2826J6436j1181j0998M4822L8515K8892
3799I48005K0250N6362M9693O5970Q3124N1701K7166J19265J29563P8097Q4026
3788A713222O3968P1585O5334L4066L9465O596J3913L7555k0479l1539K4607J6498
3776B034791o819l887L7614J3296r210K3096k7299j2891j6273l5724p1825l5997
3764A888872l1350o1001o9130l2175j4075m4321l88k1423P694M2082k2515J3045
$$ plain form
3850 608980 613291 578714 585640 640034 646155 683587 701447 696197 703243 703161 681211 697922 748587
3837 748587 723045 730908 732613 736105 728623 714834 717940 752878 734738 684704 676305 682808 718278
3824 718278 724284 721910 708357 730806 749571 738338 760543 758803 739903 739297 762672 754823 743290
3811 743290 763987 761317 733000 764728 818693 841519 857955 846774 835776 880598 919113 948005
3799 948005 968255 1024617 1074310 1140280 1223404 1275105 1302271 1421536 1551099 1629196 1713222
3788 1713222 1777190 1848775 1914109 1948175 1987640 1994236 2008149 2045704 2025225 1993686 2018293 2034791
3776 2034791 2027972 2024085 2061699 2074995 2065785 2088881 2061582 2048691 2032418 1996694 1924869 1888872
3764 1888872 1857522 1796521 1727391 1695216 1681141 1636820 1636432 1615009 1622703 1664785 1642270 1655315
3752A655315K8251L7212M2077K5244J8303K481J0436L3522l1965K3321r99k7615
3740A815583O904K7072K1272k7086J1032j637m1891m307r406j6606l8771j6752
3728A725407K6049J1455k1993Q67j8038l1080L978R405m087K5010p430j4522M8891
3715A753912O1289K0026K7691N0742K0712K5726R996J2564K7978N8011N908l0781
3703B043774j5045N3935J5970O6924N4449K9854J2409R871Q7659Q5946L8948j3108
3691B471586J5466R470L2773J2034j5606n008L1811K1292k081J4377K0918L1834
3679B638866M3867M3532M6903J8786M9108L0952r083M9355N9148L8720J1354L3075
3667C054583N4497N9289R2862L1288N8433Q4821K7979N7838O2036Q8715P0850
$$ plain form
3752 1655315 1683566 1720778 1762855 1788099 1806402 1808883 1819319 1852841 1820876 1844197 1843198 1815583
3740 1815583 1822487 1849559 1870831 1843745 1854777 1853140 1811249 1806942 1797536 1780930 1742159 1725407
3728 1725407 1751456 1762911 1740918 1741785 1723747 1692667 1696645 1706050 1701963 1726973 1719543 1705021 1753912
3715 1753912 1815201 1835227 1862918 1913660 1934372 1960098 1970094 1982658 2010636 2068647 2074555 2043774
3703 2043774 2028729 2082664 2098634 2165558 2220007 2249861 2262270 2272141 2359800 2445746 2484694 2471586
3691 2471586 2487052 2496522 2529295 2541329 2525723 2520715 2552526 2573818 2571737 2586114 2607032 2638866
3679 2638866 2682733 2726265 2773168 2791954 2841062 2872014 2862931 2912286 2971434 3010154 3021508 3054583
3667 3054583 3109080 3168369 3261231 3292519 3350952 3435773 3463752 3521590 3583626 3672341 3743191
3656C743191P6485Q6955Q3927O3879J04364J07780J11755J38047J19639J53434
3646D789456J81953K23131L11334K80699L23045L84401M21013N00497N30540N99572
3636H545641O92303P81985R21917J100488J310755J641347K025925K533283L098631
3627B2652275L612189M117996M514865M748783M707608M428066L974796L256825
3619E6013403K424213J578343P32517J6412m46648o72386p25361l97005K1458
3610E8544946M24040P55477Q88419P89679M78564K8693o94347j429807k212382
3601E7573282k916791l482843l944399m129308m129803l987255l709924l357065
3593B7915894k989181k569476k212183j861723j521085j270985j061668r25325
$$ plain form
3656 3743191 3819676 3906631 3990558 4054437 4158801 4266581 4378336 4516383 4636022 4789456
3646 4789456 4971409 5194540 5505874 5786573 6109618 6494019 6915032 7415529 7946069 8545641
3636 8545641 9237944 10019929 10941846 12042334 13353089 14994436 17020361 19553644 22652275
3627 22652275 26264464 30382460 34897325 39646108 44353716 48781782 52756578 56013403
3619 56013403 58437616 60015959 60748476 60764888 60318240 59645854 58920493 58523488 58544946
3610 58544946 58968986 59724463 60612882 61402561 61881125 61909818 61215471 59785664 57573282
3601 57573282 54656491 51173648 47229249 43099941 38970138 34982883 31272959 27915894
3593 27915894 24926713 22357237 20145054 18283331 16762246 15491261 14429593 13504268
3585A3504268p89104p23744n87641n33910m94631m41562l68921l73422l56962
3576H834371k85935l03574k44310k06224k31318k17179j74585j17827j29796j13344
3566F810279p6567p1997m1444m0705J1753k2280k6895N5666K9856K9905P6196
3555F733767O4458J06640R0047J04985J07144Q0148P4696M7045O4497L5818L716
3544G512961J9536N4124P8845L7128O8654J36157J71111J92782K06422K03872
3534H681592K71547K84774L08857K80122K54730K28772J69803J54613J66492J31364
3524A0932666K3391J05287R1671P9121J41682J43771J37950J53992J35300J53916
3514A2098747Q7977R4443N1966k6018J224l2750n9848k3134J762K2553N7193R6356
$$ plain form
3585 13504268 12715164 11991420 11403779 10869869 10375238 9933676 9564755 9191333 8834371
3576 8834371 8548436 8244862 8000552 7794328 7563010 7345831 7171246 7053419 6923623 6810279
3566 6810279 6733712 6661715 6620271 6579566 6591319 6569039 6542144 6597810 6627666 6657571 6733767
3555 6733767 6798225 6904865 6994912 7099897 7207041 7287189 7361885 7408930 7473427 7509245 7512961
3544 7512961 7532497 7586621 7665466 7702594 7771248 7907405 8078516 8271298 8477720 8681592
3534 8681592 8953139 9237913 9546770 9826892 10081622 10310394 10480197 10634810 10801302 10932666
3524 10932666 10956057 11061344 11153015 11232136 11373818 11517589 11655539 11809531 11944831 12098747
3514 12098747 12186724 12281167 12333133 12307115 12308339 12275589 12215741 12192607 12194369 12216922 12274115 12370471
3502A2370471J30256J88913K68367L51455M29338M66238N96279O97173Q15854
3493A6314344J010644J110937J320829J551363J772119J967022K268476K561763
3485B9877497K737247K963914L198668L456467L768049M068332M377756M676864
3477E9124794N017485N297817N452962N580120N586668N522136N269918M893517
3469A01745417M457035L969134L521784L147089K816176K492891K205975J924917
3461A26280418J562134J131801N99691K7464o73612j363525k074656k747642l384580
3452A19357493l941445m362308m693839m909695n033461n036870m983966m851370
3444H1544539m598544m220305l705546l027691k227279j238783j48925R64850
$$ plain form
3502 12370471 12500727 12689640 12958007 13309462 13738800 14205038 14801317 15498490 16314344
3493 16314344 17324988 18435925 19756754 21308117 23080236 25047258 27315734 29877497
3485 29877497 32614744 35578658 38777326 42233793 46001842 50070174 54447930 59124794
3477 59124794 64142279 69440096 74893058 80473178 86059846 91581982 96851900 101745417
3469 101745417 106202452 110171586 113693370 116840459 119656635 122149526 124355501 126280418
3461 126280418 127842552 128974353 129574044 129601508 128927896 127564371 125489715 122742073 119357493
3452 119357493 115416048 111053740 106359901 101450206 96416745 91379875 86395909 81544539
3444 81544539 76945995 72725690 69020144 65992453 63765174 62526391 62377466 63342316
3436F3342316K122294L131449M136730M848921N318719N535855N328877M807002
3428I8572163M056306L167601K160601J217754L21258m40503j049591j407856
3420A06597733j549616j528869j327322j079250p55904m40960j69578k5512j69441
3411I9551281l84098q47871j408863k109995k851472l544365m200388m697301
3403G9506928n054336n232248n238698n105311m927192m641553m321206l965245
3395D1021139l658745l240830k941623k693174k361764k080976j846673j637602
3387B0559752j403091j219517j096573r24387p82168p00184n97230n13902m41612
3378A2881088l38545l21556k36796j73083j36985n2958K9388R6912J53026K75211
$$ plain form
3436 63342316 65464610 68596059 72732789 77581710 82900429 88436284 93765161 98572163
3428 98572163 102628469 105796070 107956671 109174425 109495683 109055180 108005589 106597733
3420 106597733 105048117 103519248 102191926 101112676 100356772 99915812 99746234 99720722 99551281
3411 99551281 99167183 98319312 96910449 94800454 91948982 88404617 84204229 79506928
3403 79506928 74452592 69220344 63981646 58876335 53949143 49307590 44986384 41021139
3395 41021139 37362394 34121564 31179941 28486767 26125003 24044027 22197354 20559752
3387 20559752 19156661 17937144 16840571 15916184 15134016 14433832 13836602 13322700 12881088
3378 12881088 12542543 12220987 11984191 11811108 11674123 11621165 11650553 11747465 11900491 12175702
3368A2175702L33867M38198N38384N90017O52852P35630P30591P18124O89122
3359A7602487O06574N30365L36503K20632P7948q3380k30548l49445m19784m62861
3349A7828491n14297o35990o63192p02912p77746p81633q25659q03063p08286
3340A1415713o72721n71563m93804m49559l40430k30203k05123j58708j02477
3331H191125l9365k0209J9684O2240J40304J80139K35444K82712L52296M17822
3321I822192M78672O16782P50535Q56512J001859J171181J424183J723620K061021
3312A9906557K471470L002845L638630M232557M806419N327331N770151O055735
3304E5211695O161456O123800N927136N453218M606132L546736K252946P70952
$$ plain form
3368 12175702 12509569 12947767 13486151 14076168 14729020 15464650 16195241 16913365 17602487
3359 17602487 18209061 18739426 19075929 19296561 19374509 19291129 19060581 18711136 18291352 17828491
3349 17828491 17314194 16678204 16015012 15312100 14534354 13752721 12927062 12123999 11415713
3340 11415713 10742992 10171429 9677625 9228066 8887636 8657433 8452310 8293602 8191125
3331 8191125 8151760 8131551 8151235 8213475 8353779 8533918 8769362 9052074 9404370 9822192
3321 9822192 10300864 10917646 11668181 12524693 13526552 14697733 16121916 17845536 19906557
3312 19906557 22378027 25380872 29019502 33252059 38058478 43385809 49155960 55211695
3304 55211695 61373151 67496951 73424087 78877305 83483437 87030173 89283119 90054071
3296I0054071p51064k166033l505035m551018n426111o002920o288482o370576
3288E4992832o159432n812287n289161m744288m168013l595314l032732k597173
3280A9594432k190254j818389j528662j310495j066324q88524p20146n91513n26210
3271H953915m89730m19466l67328l37335l38018l00854k84733k60306k38301k27566
3261E690278j93160j62940j58927j73335j52173j65817j08677j33704r7452j09657
3251D234436q3075m2434k3836j3318P396K7782J5512K0929o711j957R438P710
3239D151872l3674k6499k6162l2667n6656m3240n9672r6519j17622j20336j14521
3228C424304j40962j26782j35583j51418j29458j28414r1752q3968k9607j0577
$$ plain form
3296 90054071 89303007 87136974 83631939 79080921 73654810 67651890 61363408 54992832
3288 54992832 48833400 43021113 37731952 32987664 28819651 25224337 22191605 19594432
3280 19594432 17404178 15585789 14057127 12746632 11680308 10791784 10071638 9480125 8953915
3271 8953915 8464185 8044719 7677391 7340056 7002038 6701184 6416451 6156145 5917844 5690278
3261 5690278 5497118 5334178 5175251 5001916 4849743 4683926 4575249 4441545 4344093 4234436
3251 4234436 4151361 4108927 4085091 4071773 4079169 4106951 4122463 4143392 4136681 4134724 4144162 4151872
3239 4151872 4118198 4091699 4065537 4032870 3976214 3932974 3873302 3776783 3659161 3538825 3424304
3228 3424304 3283342 3156560 3020977 2869559 2740101 2611687 2519935 2435967 2406360 2395783
3218B395783n1748n2085j3470J2447L433N0852L7376O7196K9834J871J9481L2168
3206B533138J082L4774L1762P952k032M7027M3050K2213R1036M2536L4660K7699
3194B914897L9092Q6984O5686M7211K5010J3041N0343P708M8376N2704M5751K7521
3182C424324L4199M2043K9747L6819O1137O1607O5262P1441J6851M378L1440O414
3170C885662J0374J4298p869j4714L3476R262R773K7158J0111L4915R0076L2488
3158D135010Q1561Q4415R1722J39325J41675J43299J70019K04234K30658K45127
3148E667045K55430K54844K40816K02869J25012J01137P2789O0403R159N98K8148
3137G018250k242J0580N2621O3754P9606Q6307J29882J67991K40987K46740K71014
$$ plain form
3218 2395783 2344035 2291950 2278480 2290927 2294360 2345212 2382588 2449784 2479618 2481489 2500970 2533138
3206 2533138 2534220 2568994 2600756 2608708 2606676 2653703 2696753 2718966 2810002 2852538 2887198 2914897
3194 2914897 2953989 3040973 3106659 3153870 3178880 3191921 3242264 3249972 3298348 3351052 3396803 3424324
3182 3424324 3458523 3500566 3530313 3567132 3628269 3689876 3755138 3826579 3843430 3847808 3879248 3885662
3170 3885662 3896036 3910334 3902465 3887751 3921227 3930489 3940262 3967420 3977531 4012446 4102522 4135010
3158 4135010 4216571 4300986 4392708 4532033 4673708 4817007 4987026 5191260 5421918 5667045
3148 5667045 5922475 6177319 6418135 6621004 6746016 6847153 6919942 6980345 6989504 6990102 7018250
3137 7018250 7016008 7026588 7079209 7142963 7222569 7308876 7438758 7606749 7847736 8094476 8365490
3126H365490K58733L22068L45581L67961M01780N27951O04398O61222N92250M44375
3116A2891809K11561O5012n9737k07829k58576k98548k95801k59297j93602j11438
3106A1483554j7921J3349R0514J22848J45187K24351K25169K75361L17220L05207
3096A3184839L32659L51997M54361N01348O67465Q66404J124495J389599J676568
3087B0549735J931437K219976K511943K861071L296140L733961M348521M999877
3079D6452661N780933O441358P155968Q141341R674641J2230723J6545000K3441976
3071A35864601L3100345M4007603N1919844N1220744M0121726K3038153N718159
3064C84991175r311157k2423874l2121483l7059177l8109411l6402410l3295112
$$ plain form
3126 8365490 8624223 8946291 9291872 9659833 10061613 10589564 11193962 11855184 12447434 12891809
3116 12891809 13103370 13168382 13108645 12900816 12642240 12343692 12047891 11788594 11594992 11483554
3106 11483554 11465633 11478982 11569496 11692344 11837531 12061882 12287051 12562412 12879632 13184839
3096 13184839 13517498 13869495 14323856 14825204 15492669 16359073 17483568 18873167 20549735
3087 20549735 22481172 24701148 27213091 30074162 33370302 37104263 41452784 46452661
3079 46452661 52233594 58674952 65830920 73972261 83646902 95877625 112422625 135864601
3071 135864601 168964946 212972549 264892393 316113137 356234863 379273016 384991175
3064 384991175 375680018 353256144 321134661 284075484 245966073 209563663 176268551
3057A76268551k9367327k4769953j9801405j5293450j1947618r695305q103382
3050E7290111o952562n953576n053133m199978l325784k552323j975666j562203
3042B5714886j312014j152677j086621j089307j026056j011145r67838r15870
3034A7153358q55725p85141p60992p09219o55753n91075n58095m98538m61260
3025A1277560m35658m08909l96732m11731l68278k98983l30853l40335l03974
3016G982107l38916l26050k68223k68574k43577k80045k57112j85821j63579j84213
3006E465997j13873j03216n4361r7795n3822o3272j05687q4339o6963j10791r2944
2995D518934j47056j77786j49704j41200j78228j69021j61717j25948j20133p8507
$$ plain form
3057 176268551 146901224 122131271 102329866 87036416 75088798 65393493 57290111
3050 57290111 50337549 44383973 39330840 35130862 31805078 29252755 27277089 25714886
3042 25714886 24402872 23250195 22163574 21074267 20048211 19037066 18069228 17153358
3034 17153358 16297633 15512492 14751500 14042281 13386528 12795453 12237358 11738820 11277560
3025 11277560 10841902 10432993 10036261 9624530 9256252 8957269 8626416 8286081 7982107
3016 7982107 7643191 7317141 7048918 6780344 6536767 6256722 5999610 5813789 5650210 5465997
3006 5465997 5352124 5248908 5194547 5096752 5042930 4979658 4873971 4789632 4722669 4611878 4518934
2995 4518934 4371878 4194092 4044388 3903188 3724960 3555939 3394222 3268274 3148141 3069634
2985C069634r4934j13129j0479k7596m7564j9804p668l9533J2558k7173k0094
2974B674218k7785p1112p5098o0697n0822p3482o6235l9627q4138o4761o3914
2963A996547q4879p5851m3387r0362q0914o6432q9630m2876k8845k8779n7737
2952A306855l0060j9322j4524n184m8046k1755l8262K580p5545J283R393o0890
2940A006523m9247k6332j7138k0109L4310k5247j6877j2581J7543l3587k0416
2929H36842J1548k0776j2594J6809n715m331m435J332J4327l0621J6655K387j6296
2916H05132L7470o286k7229Q971K4253J3003r556l421j5626l7782k9696m5729
2904G13504o4516l6019m2409l1288m8960j570k1217k5388N6832L6899J5601K1886
$$ plain form
2985 3069634 2974700 2861571 2851092 2823496 2775932 2756128 2748460 2708927 2721485 2694312 2674218
2974 2674218 2646433 2575321 2500223 2439526 2388704 2315222 2248987 2209360 2125222 2060461 1996547
2963 1996547 1911668 1835817 1792430 1702068 1621154 1554722 1465092 1422216 1393371 1364592 1306855
2952 1306855 1276795 1257473 1242949 1237765 1189719 1167964 1129702 1132282 1056737 1058020 1067413 1006523
2940 1006523 957276 930944 913806 893697 928007 902760 885883 873302 890845 857258 836842
2929 836842 848390 827614 815020 831829 826114 821783 817348 818680 833007 802386 819041 821428 805132
2916 805132 842602 836316 809087 818058 842311 855314 845758 842337 826711 788929 759233 713504
2904 713504 648988 612969 570560 539272 490312 488742 467525 442137 498969 535868 551469 573355
2892E73355J9603J849j3418J7227j1094o422L418j0841r345J9008l0328l165K8051
2879E77898N679p242l0664l1653k5531k2806m9347K8167N583k7097J3394l1863
2867D04518k8689j5141J759m93k1199l6776m0373K1080l645n867j8402j2567M3006
2854B87211J1118l2002P204J195j1682k660k9216k8894j9633J0562j9563J4672
2842A88312j9919j794N7180j2064m104N247K3281j3502n70l4961R303K528j2049
2829A86888q129L341J9222l296j6837K4893P514p375J953N023l2079l7826j992
2816A41300N558j1860m9736J9566L8717M695K0240M722j8705M2846l4L1855J7210
2803B46374M4609Q307J935L2296k762N4529J629M1014O1107M2830K4814L5364
$$ plain form
2892 573355 592958 594807 581389 598616 587522 581100 584518 573677 564332 583340 553012 549847 577898
2879 577898 583577 576335 545671 514018 488487 465681 416334 444501 450084 422987 436381 404518
2867 404518 375829 360688 362447 361954 340755 303979 263606 284686 281041 275174 256772 244205 287211
2854 287211 298329 266327 273531 274726 263044 260384 231168 202274 182641 193203 173640 188312
2842 188312 168393 166599 223779 211715 207611 212858 236139 222637 222067 187106 196409 198937 186888
2829 186888 178759 182100 201322 198026 181189 206082 213596 206221 208174 213197 181118 143292 141300
2816 141300 146858 134998 85262 104828 143545 148240 168480 173202 154497 197343 197309 229164 246374
2803 246374 290983 299290 301225 333521 330759 385288 386917 427931 489038 531868 556682 592046
2791E92046O9846J20122J56344J76785K19653K65459K25869J69638R8809N9186
2781B153757m9956j00552j15538j68647j95872j66714j47447j42543j26990j04287
2771H35211m5036n1482m5638m5474m5574n4663o7339m1893r762k3514N797k6686
2759C83947k6293j5836j582J81K0275r997j4351l7320p023j3054P218j6522l3377
2746B36266J8821m044n8136q327P808j4856p453j3461j5852k8296L3747L4791
2734A81008n9742K1128J7932j3987L0726k5985k8528J6169J390j8710m679l1814
2722H4908j3331M1492k1972j7153k218r7J7163j211J1067k1710j3990J0908J9943
2709I3799j1842m309n239k3181O160J0264K1652k11k4424M766M244P937o3345
$$ plain form
2791 592046 661892 782014 938358 1115143 1334796 1600255 1826124 1995762 2094571 2153757
2781 2153757 2103801 2003249 1887711 1719064 1523192 1356478 1209031 1066488 939498 835211
2771 835211 790175 738693 693055 647581 602007 547344 480005 438112 428350 404836 410633 383947
2759 383947 357654 341818 340236 340417 360692 350695 336344 299024 292001 278947 286165 269643 236266
2746 236266 255087 251043 192907 184580 192388 177532 170079 156618 140766 112470 146217 181008
2734 181008 121266 142394 160326 146339 177065 151080 122552 138721 140111 121401 116722 84908
2722 84908 71577 113069 91097 73944 71726 71629 88792 87581 98648 76938 62948 73856 93799
2709 93799 81957 77648 72409 49228 55388 65652 87304 87093 62669 67435 71679 79616 16271
2696A6271j4244j8309J2927P716n746J4689K5394J884O677k6179J6130K7666P9
2683F4955j0855o914K0486K2957L939l6113k2129O834J4167j7099J1162J3203
2671F4593J0867n51p937j3747J8850J4403L0011L636j9143L734m4364k8640N975
2658C7687R237L119k3897N043J1137P97J2090j1206J4467J1635J9823L894K4787
2645A18613j0610J8645Q388m593j5864l2885L094M336k0376j5877L9210k9614
2633F2467k7245j7980K0668l5364l029l1995J5158n665j2831M3714O002p573k865
2620C462L881K631k6647K3698N4991Q496R772q357L2815r229k5471M1824Q786
2607A20652m628k3650o070J5988r326K921k3071n57j6377L311r548J080R495l6010
$$ plain form
2696 16271 2027 -16282 -3355 4361 -1385 13304 38698 40582 47259 21080 37210 64876 64955
2683 64955 54100 47186 67672 90629 94568 58455 36326 43160 57327 40228 51390 64593
2671 64593 75460 74909 66972 53225 72075 86478 116489 120125 100982 104716 60352 31712 37687
2658 37687 46924 50043 26146 31189 42326 43123 55213 44007 58474 70109 89932 93826 118613
2645 118613 108003 126648 135036 130443 114579 81694 84788 89124 68748 52871 92081 62467
2633 62467 35222 17242 37910 2546 -483 -32478 -17320 -22985 -35816 7898 13900 6327 3462
2620 3462 7343 9974 -16673 7025 62016 70512 80284 71927 104742 95513 70042 111866 120652
2607 120652 116024 92374 86304 102292 92966 95887 72816 72259 55882 59193 49645 50725 60220 24210
2593B4210P061R747qP845j3688K4223n731J992K804K9743N4779J97J7974J4504
2579A75652K5510J0719j0461J798n6291j7996J4556J525j344k3745R422J3065
2567A42410m6550j0678j717P629O018m899O130j0973j9003k3320l339O875M77
2554D9060J2291K7428j3045j0581J8221j2282j5306J802K1483K0053k6941n920
2542F6263n0038j0039L2732k6377K7959K4635k0515M74j5026K2267K954l036r943
2529D2310k0922R120J2716J0044J357j5248j9015K977J0905j1438J4693K5703
2517F3202K628J3098M2245k5946J9460J543k7968j1383m843J5810L0824p695o974
2504A04001Q92l7894Q125k193l6568o199J0976j8676J6690O812l3999n058J5830
$$ plain form
2593 24210 31271 41018 41010 48855 35167 59390 53659 55651 58455 88198 142977 143174 161148 175652
2579 175652 201162 211881 201420 203218 146927 128931 143487 145012 143668 119923 129345 142410
2567 142410 95860 85182 83465 91094 97112 92213 98343 87370 68367 45047 41708 48583 49060
2554 49060 61351 88779 75734 65153 83374 71092 55786 57588 79071 99124 72183 66263
2542 66263 16225 6186 38918 12541 40500 65135 44620 45094 30068 52335 55289 52253 42310
2529 42310 21388 30508 43224 53268 54625 39377 20362 23339 34244 22806 37499 63202
2517 63202 65830 78928 121173 95227 114687 116230 88262 76879 72036 87846 118670 110975 104001
2504 104001 104893 66999 75124 72931 36363 30164 41140 22464 39154 45966 11967 6909 22739
2491B2739j5024o382o495m711k024K6773J948L7485J863M653K6404j4590j6194
2478E6445J7975k922K2909J1071l6951K5769k4742p001j5096J978R88K158J8138
2465G0719K6649J4211O795K3809k7167j7774J0758j1840j26K5239K849n003Q402
2452A27521R051j9943O425J501j229l7651r588j0999r253J6291J6734J8560J2073
2439A19493j3726k3722J2406R844m058J7453K3735m154m2222J0370N232L3196
2427A43847J0150n036R630j2769J9397K0792K8493P373p477k6844K1655j6746
2415A92465j2554J1418n001J1660j0872n3908k2716O622J2507K8523p398L0622
2403A81368j4589j7464r439K5086j8846j4736L192M5559K7555l469Q596K7830
$$ plain form
2491 22739 7715 1333 -5162 -9873 -11897 14876 16824 54309 56172 60825 87229 72639 56445
2478 56445 74420 71498 94407 105478 68527 94296 69554 62553 47457 49435 50423 52581 70719
2465 70719 97368 111579 118374 142183 115016 97242 108000 96160 96034 121273 124122 119119 127521
2452 127521 136572 116629 123054 124555 123326 85675 76087 65088 55835 72126 88860 107420 119493
2439 119493 105767 82045 94451 104295 100237 117690 141425 137271 95049 105419 110651 143847
2427 143847 153997 148961 158591 145822 165219 186011 214504 221877 214400 187556 209211 192465
2415 192465 179911 191329 186328 197988 187116 133208 110492 117114 129621 158144 150746 181368
2403 181368 166779 149315 139876 164962 146116 131380 134572 180131 207686 204217 212813 240643
2391B40643M1190l494Q081k608l9402l4892r535K1974j4027j0685K7448K3582
2379B48275l1752M578L2315O240J2188J0501m099J0698N4870P4570L0610m4782
2367D04212J1662O753J2628n986j8233j011L60N644J6785j0517L4325J170n176
2354D52616J5736O676J3089L9353L4523J2999J7008M6585j663J3446r020K5188
2342F66536M1148O247q739M831K2643O8684J07610J23205J56654J80396K18090
2331A587305L55585M08269M00730K85051K41495K08938K35436K05010L06274M16385
2321D650478O95252R49737J442186K255192L943002N916204P790768O649715L636885
2312C7929419P59624q22831k025593m176208m420737m370852l973559l531999
$$ plain form
2391 240643 281833 278339 286420 283812 244410 209518 199983 221957 207930 197245 224693 248275
2379 248275 216523 221101 253416 259656 271844 282345 278246 288944 343814 418384 448994 404212
2367 404212 415874 422627 435255 429269 411036 410025 410385 416029 432814 422297 456622 457792 452616
2354 452616 468352 475028 488117 527470 561993 574992 592000 638585 636922 650368 641348 666536
2342 666536 707684 713931 705192 710023 732666 801350 908960 1032165 1188819 1369215 1587305
2331 1587305 1942890 2351159 2751889 3036940 3278435 3487373 3722809 3927819 4234093 4650478
2321 4650478 5345730 6295467 7737653 9992845 13935847 19852051 27642819 34292534 37929419
2312 37929419 38689043 37866212 35840619 31664411 27243674 22872822 18899263 15367264
2304A5367264l065257k597047j892960j178584o57914n22740m81277n04870m66641
2295C999974l94752l31261l18209k74588k15398j33588j05999q3781j00422j08667
2285A933309j04626q1885r5530q3829m1996n0512j12943q4098l2393n6676l3059
2274A155762o6162m3776l0927p7187j4081j9720q281o4684j1855j9547m0098j2688
2262G46756l8855k0161j6260o0360o0774K4454l6855k1835p648j4614N921k164
2250D97605m1636Q375M7314k786l3733m631r503k4674N025j9982m6512l9787Q753
2237C43828J327l3868K6424R122n1916o950J699j5170L3726Q023J3852m576j6119
2224C09402M2610n2190l2437J4166L3843j7465l2066j9074j700m166J3774Q31
$$ plain form
2304 15367264 12302007 9704960 7812000 6633416 5975502 5452762 4971485 4466615 3999974
2295 3999974 3605222 3273961 2955752 2681164 2465766 2332178 2226179 2142398 2041976 1933309
2285 1933309 1828683 1746798 1651268 1567439 1525443 1474931 1361988 1277890 1245497 1188821 1155762
2274 1155762 1089600 1045824 1014897 937710 923629 903909 895628 830944 819089 799542 759444 746756
2262 746756 707901 687740 671480 611120 550346 574800 537945 516110 508462 493848 499769 497605
2250 497605 455969 464344 511658 508872 475139 470508 461005 436331 441356 421374 374862 335075 343828
2237 343828 345155 311287 337711 346833 294917 287967 289666 274496 308222 316245 330097 325521 309402
2224 309402 352012 299822 267385 281551 315394 297929 265863 246789 245089 240923 254697 255528
2212B55528k1770K5545l2039O941k968q334l5784p101k8409N114j3991M673k5173
2199A22232L0269J4489j8434j3465J174J594K5165J193m1068r134J9391m16j9022
2186A13968K6000q754r93j2270J1175K8544o7180m3295P47K0661K1296L020k681
2173I0238J8195k1022j0471J2290J833P748K1555j7323n844L2618L32k7424o46
2160A02079N446J6365j2270j9191j0321J848j3j945L1089k248r468j5482l254
2147H2635l5965j1180M209K5114l6603k4579J2355j6619R287K6187J5044n276
2135D4609q185p756L0136N599j0847k3210j0751M2934p941j8387j9505K662K6391
2122D5749J5471Q172k6873k528o17k1227q611J4731m740J9903J7579j3513m1053
$$ plain form
2212 255528 233758 259303 227264 234205 231237 222903 187119 180018 151609 156723 142732 147405 122232
2199 122232 152501 166990 148556 135091 136265 137859 163024 164217 123149 114015 133406 132990 113968
2186 113968 139968 131214 130221 117951 129126 157670 90490 47195 47942 68603 89899 92919 90238
2173 90238 108433 87411 76940 89230 91063 98811 120366 103043 97199 129817 130149 102725 102079
2160 102079 107525 123890 111620 92429 82108 83956 83943 81998 113087 110839 101371 85889 82635
2147 82635 46670 35490 39699 64813 28210 3631 15986 -633 8654 34841 49885 44609
2135 44609 36424 28668 58804 64403 53556 30346 19595 62529 54588 36201 16696 19358 45749
2122 45749 61220 69392 42519 39991 39374 18147 9536 24267 19527 39430 57009 43496 2443
2109B443N397j6150K617M4245j1472N64j5716j0479L962L681M491J9027L27q743
2095B4194k644M915N357j8904J6314J3470r617k9318m5849j394K3087J4824j1006
2082a6571L0646o799q99l69l9335j363K8492k97L443J294J8996n017J2437k187
2068B2471K496q378J3033r176k0980j9025k146J2690j3794J5050K5889j2351k787
2055B992p42Q940K4812P789k9040P641K9874j3418L3988L7304O4301K5992k974
2042A97459K7254j0771j2401m7229k0995j3044j9687j8615m7664l4020J2282R546
2030B2115K5722r168P564r046k4435J0780k2738K4370L202m1327N078J7565k6284
2017a6602J3191O356J273K617j6729K7837k3638J0227J0332o939Q349k1323M61
$$ plain form
2109 2443 7840 -8310 -5693 38552 27080 27644 11928 1449 5411 9092 13583 32610 32937 24194
2095 24194 21550 26465 31822 12918 29232 42702 33085 3767 -42082 -43476 -20389 -5565 -16571
2082 -16571 14075 7276 6377 6008 -33327 -34690 -6198 -6495 -3052 -1758 17238 12221 24658 22471
2068 22471 24967 16589 29622 20446 -534 -19559 -21705 -9015 -22809 -7759 18130 5779 2992
2055 2992 2250 11190 36002 43791 14751 22392 52266 38848 72836 110140 174441 200433 197459
2042 197459 224713 213942 201541 154312 133317 120273 100586 81971 34307 287 12569 22115
2030 22115 47837 38669 46233 37187 12752 23532 794 25164 28366 -12961 -7883 9682 -16602
2017 -16602 -3411 2945 4218 6835 -9894 17943 -5695 4532 14864 7925 16274 -5049 -4588
2004d588J1183k7200J7105M6501j3696l140n4411Q231J4651J4346K0935j4066
1992A5851m0442J710o426L0851K4137m2033k5209M1113j2452p284J7998m776m1577
1979d8539O619n725J0124J8680j7530k2943j3712K9957K0021M674k857k357j7747
1966d1335j8772K2358N0554L0952l1690k7091J7004j186m4069J0063J9273p79
1954a4718J2268Q822r313p649J8535M966k7650j0459j1241J6508K1475j1233l0779
1941d0468J4412J0388k443N052l2919j1251N71K0364l056N2763j3657M35N254
1928E445M728m106j68k461p32j7082P197J4151k2471Q208J4841J4242j7529J8948
1914B3211j0200j3765P629K4698j6345j2290l490k614N613j7090J2714o417J3516
$$ plain form
2004 -4588 6595 -20605 -3500 43001 29305 26165 -28246 -20015 -5364 8982 29917 15851
1992 15851 -24591 -22881 -29307 1544 25681 -16352 -41561 -448 -12900 -20184 -2186 -6962 -48539
1979 -48539 -41920 -47645 -37521 -18841 -36371 -59314 -73026 -43069 -23048 -18374 -21231 -23588 -41335
1966 -41335 -60107 -37749 12805 43757 12067 -15024 1980 794 -43275 -33212 -13939 -14718
1954 -14718 -2450 6372 -2941 -10590 7945 12911 -14739 -25198 -36439 -19931 1544 -9689 -40468
1941 -40468 -26056 -15668 -18111 -13059 -45978 -57229 -56658 -36294 -39350 13413 -244 191 5445
1928 5445 10173 6067 5899 3438 2706 -14376 -7179 6972 -15499 -7291 7550 21792 4263 23211
1914 23211 13011 -754 6875 31573 15228 2938 -552 -3166 2447 -14643 -1929 -8346 5170
1901E170P573J4710k1444N722J0241N443k0086k7319J0780J9147n769j0200L315
1888b717R369O737O375J6452l3918k2846r911p583P277N289K2391J5781l3535
1875b0839j4942L6576j8771r110J8210q048J6882j2876N506K5928M900j2251j7492
1862f327p37n156j0269K2827o10j3123J3720J0469J698n597k1499O497j8762N877
1848b0992K3511l2149J9502J3739l332n624k7673J5839K8335l7139p152J1154
1836b1981K4890J603o723L26k2894m451K1917K6926j7999j5293l7298p875L6239
1823b2613J3526J9206n556Q084j3677l0339L0862J2237j9571J1976l4088o249
1811c6202j4501P978K3921o386j8241r753M9391J9706j8875l3077k919l337R214
$$ plain form
1901 5170 12743 27453 6009 11731 21972 27415 7329 -19990 -9210 9937 4168 -6032 -2717
1888 -2717 6652 13389 19764 36216 2298 -20548 -30459 -38042 -30765 -25476 -3085 12696 -20839
1875 -20839 -35781 795 -17976 -27086 -8876 -16924 -42 -12918 -7412 18516 23416 11165 -6327
1862 -6327 -7064 -12220 -22489 338 -272 -13395 325 10794 12492 6895 -14604 -8107 -26869 -20992
1848 -20992 2519 -29630 -10128 3611 279 -5345 -33018 -17179 11156 -25983 -33135 -21981
1836 -21981 2909 4512 -2211 -1885 -24779 -29230 -7313 19613 1614 -13679 -50977 -58852 -22613
1823 -22613 -9087 10119 4563 12647 -1030 -31369 -507 11730 -7841 4135 -29953 -36202
1811 -36202 -50703 -42725 -18804 -25190 -43431 -53184 -3793 15913 -2962 -36039 -38958 -42295 -33081
1798c3081J7602O541k012j9782k3688L4883j2193J2650J1951k1614r133k319j2941
1785e3136J4761K1819q689M367j3411K0479o190J1952J2115j0535O988k1283J7052
1772c711P979j014J8487j2823n0740j2582M8447l622J9608J1823j1231p31J2670
1759B2560l1864j3771J5880j0636k366n791J4783J565j1164o75L5611R759m6723
1746b2832J2951J8060k0632Q934k8168k1821L1194K4237J3690j9492j7221J795
1734a9305J3157L346r592l1978j849K4773K0193o711K33J5065j9286M6375j9593
1721A4828l1680p848J696n324R365J842K8778J5860j7878j3911j1637J76K1456
1708E723j7738j8806K0534J6583r772l0084J4914L8152o4159j5093L4603N423
$$ plain form
1798 -33081 -15479 -8938 -10950 -30732 -54420 -19537 -31730 -19080 -7129 -28743 -37876 -40195 -53136
1785 -53136 -38375 -16556 -25245 -20878 -34289 -13810 -20000 -8048 4067 -6468 520 -20763 -3711
1772 -3711 4268 3254 21741 8918 -41822 -54404 -5957 -9579 10029 21852 10621 9890 22560
1759 22560 -9304 -23075 -7195 -17831 -20197 -25988 -11205 -9640 -20804 -21479 14132 23891 -22832
1746 -22832 -9881 8179 -12453 -3519 -31687 -53508 -22314 1923 15613 -3879 -21100 -19305
1734 -19305 -6148 -2802 -12394 -44372 -46221 -21448 -1255 -7966 -7733 7332 -11954 34421 14828
1721 14828 -16852 -24700 -23004 -28328 -18963 -17121 11657 27517 9639 -4272 -15909 -15733 5723
1708 5723 -12015 -30821 -10287 6296 -3476 -33560 -18646 19506 -44653 -59746 -25143 -19720
1696a9720K4588N047m7412l153m444J7283R397j6562K0660Q710j7544m0761K98
1683f3613K9669L6090k3194N684l2538J2108K4849j2436j7335o942N330J8771
1671b3557K779k743m96R500J150J5800o702P384k8307J6887l98J6834R0m323q170
1656d272m605k4778K3710K5353k1940P545k3453k3956M4925J0764n681j389k6359
1643b4136K628j5849M6727r253J106P943N049l585N364l1831m492J3298m672p435
1629a9138n931j3890r004J4077J8376l70j1034J1667J5856m2247J0507p882J2277
1616b6736K0648M6377K7141n4839k5906K893K8593J3315n5617k425J1414k9774
1604d4916K4097J4291m166L1104K852l5831K008Q690J1015j0105k3052p970K9361
$$ plain form
1696 -19720 4868 9915 -37497 -40650 -45094 -27811 -18414 -34976 -14316 -5606 -23150 -63911 -63613
1683 -63613 -33944 2146 -21048 -15364 -47902 -35794 -10945 -23381 -40716 -47658 -42328 -23557
1671 -23557 -20778 -23521 -24017 -14517 -13367 2433 -4269 3115 -25192 -8305 -8703 8131 8221 3898 -4272
1656 -4272 -8877 -33655 -9945 15408 -6532 1013 -22440 -46396 -1471 9293 3612 2223 -24136
1643 -24136 -21508 -37357 9370 117 1223 9166 14215 10630 15994 -15837 -20329 -7031 -11703 -19138
1629 -19138 -25069 -38959 -47963 -33886 -15510 -15880 -26914 -15247 609 -41638 -31131 -39013 -26736
1616 -26736 -6088 40289 67430 12591 -13315 -10422 18171 31486 -24131 -26556 -15142 -44916
1604 -44916 -20819 -6528 -10694 20410 23262 -12569 -10561 -1871 9144 -961 -24013 -31983 -2622
1591b622m573k8380K8012J1875J4370l9537l716K7543J0636j8697j3782J9800
1579I29k5895K7223o877J2486j698j8123q550R567o857N621Q385k501k824j7436
1565b6550J4807J1465J4327P196m3358L331k851m480L285n862L4929p852J5698
1552A4085J1446j0082J332k5239j0348N66k7824k540K1759J0454Q969N108P59
1539a555j8756K2629M954n410R044J1400j7113J1207K2087l8029m4184M344O579
1526c2803M464K0048l657R495L8374q935m824k5752q867N813p155K785J0161j2707
1512a3560k5310o545J8921M2607k6654l5364J0767K6846k9700n611R209J231K595
1499c0568P592j0773j3013O370J853K7154O811k944j2984l860J1304j7985J1680
$$ plain form
1591 -2622 -7195 -35575 -7563 4312 18682 -20855 -24571 2972 13608 -5089 -18871 929
1579 929 -24966 2257 -4620 7866 6168 -11955 -20505 -10938 -17795 -12174 -3789 -6290 -9114 -26550
1565 -26550 -11743 -278 14049 21245 -22113 -18782 -21633 -26113 -22828 -28690 6239 -1613 14085
1552 14085 25531 15449 16781 -8458 -18806 -18240 -46064 -48604 -26845 -16391 -7422 -2314 -1555
1539 -1555 -20311 2318 7272 1862 10906 22306 5193 16400 38487 458 -43726 -39382 -32803
1526 -32803 -28339 -8291 -11948 -2453 35921 26986 22162 -3590 -12457 -6644 -13799 -11014 -853 -13560
1512 -13560 -38870 -45415 -26494 16113 -10541 -45905 -35138 -8292 -37992 -43603 -34394 -33163 -30568
1499 -30568 -22976 -33749 -46762 -40392 -38539 -11385 -4574 -7518 -20502 -24362 -13058 -31043 -19363
1486a9363L906L6139j1808p92R960n086l5912j2559K1500j506j2244j163n413
1473c4341Q47L2282K0183j1118l1375M5452J8377n1216j4235J1069O297N070r926
1460a2634r07q344j5930J7709Q098L3662j3657l3942P451K8330J0078k9043m205
1447a3334K842j0445J9602Q065l2324K2533K135K0076k2059j8049K1968O526p709
1434a73k2038K212J730l86K4541L1456k6533J842k592o629j5891J102M3573j6186
1420A6028m7785J982L602Q367L716J9782K763l424J8361r606k0776L5820p798
1407B1032k1531j1235q667J4918J7714j1220J6531j2315p03K2210m3502J4844
1395a924j9457m177L283J4779R557k6374O132K6563l408k2179k0114Q402m470
$$ plain form
1486 -19363 -15457 20682 8874 8082 18042 12956 -22956 -35515 -14015 -15521 -27765 -28928 -34341
1473 -34341 -33494 -1212 18971 7853 -23522 21930 40307 -10909 -25144 -14075 -7778 -2708 -12634
1460 -12634 -13541 -21885 -37815 -20106 -12008 21654 7997 -25945 -18494 9836 19914 -9129 -13334
1447 -13334 -10492 -20937 -1335 6730 -25594 -3061 -926 19150 -2909 -20958 1010 7536 -173
1434 -173 -22211 -19999 -18269 -18655 5886 37342 10809 12651 10059 3430 -12461 -11359 32214 16028
1420 16028 -31757 -29775 -26173 -17806 -14090 5692 8455 5031 23392 13786 -6990 28830 21032
1407 21032 -499 -11734 -20401 -5483 12231 1011 17542 5227 4524 26734 -16768 -1924
1395 -1924 -21381 -25558 -22275 -7496 2061 -24313 -18181 8382 4974 -17205 -37319 -28917 -33387
1382c3387K4566J8363k439l8j1796R953L831k0071J3108K4527q553j2645q663
1369c244j7284K3783J1596j7103j5945M2905j1206k9159j0823J0652N370P531
1357b927l3261j1511M2409J5065o604N050K4587l941k5182p174k104J4533J1981
1344B0921j0539J0024l2558N528J2345k2651k2558K4434J7613j7578M213j6832
1332b7638J5468J3254l6066m99J5617k0754L2676L529k7k1009J60J6139l3158
1319d2308M737J9724J9778k1221j9469K4242J3980J839K7011m230k2992q370L1350
1306B4071k9686o06J515o064k6288J3894J3803K0306l2515m872l550j5569K9076
1293a6485J5123q312l437M5965Q129m653k6308P229k398J0026j8626k7844K175
$$ plain form
1382 -33387 -8821 9542 7103 7065 -4731 5222 9053 -11018 2090 26617 18064 5419 -3244
1369 -3244 -20528 3255 14851 -2252 -18197 24708 13502 -15657 -26480 -15828 -10458 -2927
1357 -2927 -36188 -47699 -5290 9775 3171 8221 32808 28867 3685 -3489 -5593 8940 20921
1344 20921 10382 20406 -12152 -6624 5721 -16930 -39488 -15054 2559 -15019 -10806 -27638
1332 -27638 -12170 1084 -34982 -35481 -19864 -40618 -7942 -4413 -4440 -25449 -25289 -9150 -42308
1319 -42308 -37571 -17847 1931 -19290 -38759 -14517 -537 1302 28313 24083 1091 -7279 24071
1306 24071 -5615 -6221 -4706 -10770 -37058 -23164 -9361 10945 -21570 -26442 -29992 -45561 -16485
1293 -16485 -1362 -9674 -13111 32854 40983 36330 10022 17251 14853 24879 6253 -21591 -19416
1280a9416j8190j0595K7524J5461j3517J217K4637K712K2155J3876k7409k8153
1268i698l65J9359J8527m7295l1979J1257J4278j6747p312J6110J4758K0189j2281
1255a1199J1598j7771N738J0221j6926J0286J8138m4084Q500M081O201j906j0584
1242b7707J9767j1844K3302k1363j2041K0273L740j3848p136L3990l180K4308
1230B8261l7728M656j8402j3041J3798L6957M621k365J5576k217q308m6239r521
1217c3952j2419J9227Q407l155L0979J5084k7980P861o296J1329K4077M453k2601
1204A5014j6349K0217k589j1980r1O215K3082j155j0387m1127K1834J9279j3005
1191H958p358J3370j4062L8339m40l3090o980j8508L6028k1055n046K0675K0266
$$ plain form
1280 -19416 -37606 -48201 -20677 -5216 -18733 -17516 7121 9833 31988 45864 18455 -9698
1268 -9698 -10063 9296 27823 -19472 -51451 -40194 -25916 -42663 -49975 -33865 -19107 1082 -11199
1255 -11199 399 -17372 -11634 -1413 -18339 -8053 10085 -33999 -25499 -21418 -15217 -17123 -27707
1242 -27707 -7940 -19784 3518 -17845 -29886 -9613 -5873 -19721 -26857 7133 3953 28261
1230 28261 -9467 -4811 -23213 -36254 -22456 14501 19122 16757 32333 30116 21808 -24431 -33952
1217 -33952 -46371 -27144 -18737 -21892 9087 24171 -3809 4052 -2244 9085 33162 37615 15014
1204 15014 -1335 18882 16293 4313 4222 10437 33519 32364 21977 -19150 2684 21963 8958
1191 8958 1600 14970 908 39247 38807 5717 -1263 -19771 16257 -4798 -9844 10831 31097
1178C1097j6590K0669R931l4690J0708M191p223j117k6495k7187L7368M3091q542
1165C5211j9718j0165N386J1587m1319P195J7809N891j2056J6940N608L435j5497
1152A0307j2869q634J8523J1721k4847j2310o192P241m054l956R824J6165l1865
1139c0946k5487J7091J6784J906L212K6796J1578m3181n879P795R524k3888J0326
1126b4369k639l627K1568Q533J4001j8037m805M645k7354L371K5030J1636j1263
1113c310l105J989k2872K97O070J5879J0274j5494k3878R600Q422j4375R25K2256
1099g322O259K0819o375n753m360J0804q077N375J3266l6435J9128N606k7115
1086a4180J5403l9965N341J1579P6O749k0306j515j7930J668J8318L4426Q799
$$ plain form
1178 31097 14507 35176 45107 10417 21125 25316 18093 16976 -9519 -36706 662 43753 35211
1165 35211 15493 5328 10714 22301 -19018 -11823 5986 11877 -179 16761 22369 25804 10307
1152 10307 -2562 -11196 7327 19048 -5799 -18109 -24301 -17060 -21114 -25070 -15246 919 -30946
1139 -30946 -56433 -39342 -22558 -20652 -17440 9356 20934 -22247 -28126 -20331 -10807 -34695 -24369
1126 -24369 -27008 -30635 -9067 -534 13467 -4570 -9375 -4730 -32084 -28713 -3683 7953 -3310
1113 -3310 -6415 -4426 -27298 -27001 -20931 -5052 5222 -10272 -34150 -24550 -16128 -30503 -29578 -7322
1099 -7322 -1063 19756 13381 7628 3268 14072 5995 11370 24636 -11799 7329 12935 -14180
1086 -14180 1223 -38742 -33401 -21822 -21746 -14997 -35303 -36818 -54748 -53080 -34762 -336 8463
1073H463K5768j5986p596r609m7897J3622L6952k0017q145R238M4619j0235J5665
1060C4842q688n4222K1339J3708j6266p645k523J4989J8655k0069n4561J734N3820
1047d887L1236k2635N624k121k6824m710m72L1446m231l3361L6549L1606k9265
1034G955j0593M1k1310O064K0965J0858k1655j3260J2738K600j4864J6306J7529
1021A3374j0345m702l951l92L168P269l1130J7975L097o551L3837Q136m4519J6598
1007A864J1669j8392k6944K352L4735j0813R490o313k8552k6214L3167j250J4889
994a0312j5508Q540M2958j493l8531q109K9439p679k92j4270o675J9279Q884l6180
980b9949L4591o2n821j1450j3585L2002L8909k0509m6501j5664K5864j0811j0029
$$ plain form
1073 8463 34231 18245 10649 1040 -46857 -33235 3717 -16300 -24445 -15207 29412 19177 34842
1060 34842 26154 -28068 -6729 6979 -9287 -16932 -19455 -4466 14189 -5880 -60441 -58707 -4887
1047 -4887 26349 3714 9338 7217 -19607 -24317 -24789 6657 2426 -30935 5614 37220 7955
1034 7955 -2638 -2597 -23907 -17843 3122 13980 -7675 -20935 -8197 -5597 -20461 -4155 13374
1021 13374 3029 -1673 -5624 -6016 -2848 4421 -26709 -8734 -5637 -12188 21649 29785 -14734 1864
1007 1864 13533 -4859 -31803 -29451 5284 -5529 3961 -2352 -30904 -57118 -23951 -25201 -10312
994 -10312 -25820 -17280 25678 24185 -14346 -22455 6984 -695 -987 -15257 -21932 -2653 6231 -29949
980 -29949 4642 4580 -1241 -12691 -26276 5726 44635 24126 -22375 -38039 -12175 -22986 -33015
967c3015l684M893J4792j8928K4059j6392l0223K4599k450j4515K2430J3649n469
954b0254j1330P381L8123j3954q355N263K6620k850q974J4244M721q242j9479
941B914K1593j6312j05J9833j6482j8537j0356p280Q494J4006J2526j675l730
928D889n157J500j210M200O404j3762o055K0169K1184k8397P60P940m373R594
914A7686K411J4866j4460m240R615j6945R562j3070j3634L9583L3164o736l3559
901B4243k3887Q680j0792j5978N915M29q457k7435l247J4076J211L5023J3925
888A3706o240o05J2593r076l1213P113L4871l4978N930K2654k07J1905m1881o012
874b1440P860K0602J2795P414J7538n277m7433J1794J1233K542j824l452J108
$$ plain form
967 -33015 -36699 -31806 -17014 -35942 -11883 -28275 -58498 -33899 -36349 -50864 -28434 -14785 -20254
954 -20254 -31584 -24203 13920 -34 -8389 -3126 23494 20644 11670 25914 30635 22393 2914
941 2914 24507 8195 8090 27923 11441 -7096 -17452 -24732 -16238 -2232 10294 8619 4889
928 4889 -268 1232 22 4222 10626 -3136 -9191 10978 32162 3765 4525 12465 8092 17686
914 17686 20097 34963 20503 16263 25878 8933 18495 5425 -8209 31374 64538 57802 24243
901 24243 356 9036 -1756 -17734 -11819 -11390 -19847 -47282 -50529 -36453 -35242 -219 13706
888 13706 7466 6861 19454 10378 -20835 -13722 21149 -13829 -7899 14755 14548 26453 -15428 -21440
874 -21440 -13580 7022 19817 27231 44769 39492 -7941 3853 15086 17628 15804 12352 13460
861A3460M7326o7465j3486K509J1358K4534m9033o187J9700L2623j6586O165L4516
848C9434k8506k5974P813J1622j3539r067K111J6240N383j0056K1919P843k090
835B3133n024j9019r184j782j6636R569k0475J4332J9197J9274q739R575N251
822A9472k4328k7032J250k5354M1496K9214j2318o4J5577K4286K22m6294k1028
809b4901L0353J2380Q3n1302R051K4207J8253k7604j7458J2458L6822J2335j8933
796A5744m3182L4639O847j742J1545l5040o210o49K3333J9484k068j7425k303
783B973j6880r986J2085L3313l0354N101K1784k506n20k2865J9467K4767k2939
770A3440M217o402l902N051j3469k9216N996K0332q243K0672j4395j0446p394
$$ plain form
861 13460 60786 -6679 -20165 -17656 -6298 18236 -30797 -36984 -17284 15339 -1247 4918 39434
848 39434 10928 -15046 -7233 4389 -9150 -18217 -16106 134 5517 -4539 17380 25223 23133
835 23133 18109 -910 -10094 -11876 -28512 -18943 -39418 -25086 -5889 13385 4646 14221 19472
822 19472 -4856 -31888 -30638 -55992 -14496 14718 2400 2336 17913 42199 42421 -3873 -24901
809 -24901 5452 17832 17915 -33387 -24336 -129 18124 -9480 -26938 -14480 22342 34677 15744
796 15744 -27438 7201 14048 12306 23851 -11189 -17399 -18048 5285 24769 22701 5276 2973
783 2973 -13907 -23893 -11808 21505 -8849 -3748 18036 15530 15010 -7855 11612 36379 13440
770 13440 17657 11255 7353 12404 -1065 -30281 -24285 -3953 -12196 8476 -5919 -16365 -23759
757b3759J0592L6768j4079N88j5943J9134j3025M0544L905j5642K2618j4044J7847
744E5504m9172p684R914k5221k3483R216J9730J7533J7558q902K007r259L471
731A1212L1367k9181o929j8910K648l32Q4l0750O526l561N648K4455K534K0890
717A5701j1665J0950O704r314j5429m682n235J8365L7257k1201k0374N182j5149
704h890N998k6752O499J6344J3110j6131o834O115M950Q229J453j3185R767L2141
690C2814L35l0519m2383k0505M2494M3459L35p207k8680Q456L8288j7123k0072
677c08k0927J3231L7321p65k3022j1525K1340j0929k688L907L2361m1675J0706
664G027J8060k3907J6291j1003j993J4498j2619J0416K9054j5356l5294J6390
$$ plain form
757 -23759 -13167 23601 9522 10110 -5833 13301 276 40820 44725 29083 51701 37657 55504
744 55504 6332 -1352 8562 -16659 -40142 -30926 -11196 6337 23895 14993 17000 7741 11212
731 11212 42579 13398 6469 -12441 -9793 -10125 -10041 -40791 -34265 -37826 -32178 -7723 -5189 15701
717 15701 4036 14986 21690 12376 -3053 -7735 -12970 5395 42652 21451 1077 6259 -8890
704 -8890 -2892 -29644 -23145 -6801 6309 -9822 -16656 -10541 -5591 2638 4091 -9094 673 32814
690 32814 33149 2630 -39753 -60258 -17764 25695 26030 18823 -9857 -1401 36887 19764 -308
677 -308 -21235 -8004 29317 28552 5530 -5995 15345 4416 1728 5635 37996 -3679 7027
664 7027 25087 1180 17471 6468 4475 18973 6354 16770 45824 30468 -4826 11564
652A1564J054N575l2075J0987K922K233L1777k1743O85r919k132j3518J5217j124
638A503j8593j2751M5484j1507l508L152o646K1957l778N243k2965r725j6662
625b8796J5871J0073l338J7079L0560k7551J1197J1350k7466P466j8947l2470
613c4972J4794L2923M0488k1555k3002L2607j8920j508j6141L8028J4349O020
601F3111n4606j6093J4698K1861j3662l4778N2217J0077m3138j2997K0867m52
589G105j369k5871J6852J5652L595k743k9909K704J6299J6215j1279k623L574
576H202L1208o959k4971J9299n4291R209L0476l4186L9341Q729M006l584j9696
563F783K6493j0894j5100J7948Q959K2954K4303k6055l0361l6866q680O723K9632
$$ plain form
652 11564 12618 18193 -13882 -2895 27 2260 34037 12294 12979 3060 928 -12590 2627 1503
638 1503 -17090 -29841 15643 4136 628 3780 -2866 19091 15313 20556 -2409 -12134 -28796
625 -28796 -12925 -2852 -6190 10889 41449 13898 25095 36445 8979 16445 -2502 -34972
613 -34972 -20178 12745 53233 31678 8676 41283 22363 20855 4714 42742 57091 63111
601 63111 8505 -7588 7110 28971 15309 -19469 32748 42825 -313 -13310 7557 7105
589 7105 5736 -20135 -3283 12369 15964 13221 -16688 -13984 2315 18530 7251 4628 8202
576 8202 39410 32451 7480 26779 -27512 -18303 12173 -22013 17328 26057 30063 26479 6783
563 6783 33276 22382 7282 25230 34189 57143 81446 55391 25030 -11836 -20516 -13793 15839
550A5839K1553j5402m460k6655j8559j2951K8373Q572J3874J2899n335O698J6736
537D1182k590j0585j5391K1493p411J8863J8850k4630j3312l2650J331K632J2771
524A0553k5885m408R511M979K484k7770J3663J6938j7784K4519P516o824K522
511A0014J6294q869k4281O954L03Q45J4273m240K4662l1914k431j117K3617j4100
497A0010l2392K0046J1928k5875p271K9617J8019j9319J20K5835k2627M981m211
484H861J0977L0379l1001o206j8873K0320k5310k2041L1666K47j7235Q254K4141
471A4179r344p401j8157r97L1967J3324k852r686j1209q92J3036j840R127n252
457A4003m904J2206J1084K71k8848L6497N244k0760j4290L3776J0708j5390j6120
$$ plain form
550 15839 37392 21990 17530 -9125 -27684 -40635 -12262 -3690 10184 23083 17748 24446 41182
537 41182 38592 28007 12616 34109 26698 45561 64411 39781 26469 -6181 -4850 -2218 10553
524 10553 -15332 -19740 -10229 -5250 -2766 -30536 -16873 65 -17719 6800 14316 7492 10014
511 10014 26308 17439 -6842 112 415 1260 15533 11293 35955 4041 1610 493 24110 10010
497 10010 -22382 -2336 9592 -16283 -23554 6063 24082 4763 4883 30718 8091 13072 8861
484 8861 19838 50217 19216 13010 -5863 14457 -10853 -32894 -1228 -981 -18216 -9962 14179
471 14179 4835 -2566 -20723 -21720 10247 23571 20719 11033 -176 -1068 11968 10128 19255 14003
457 14003 9099 21305 32389 32660 3812 40309 45553 24793 10503 44279 54987 39597 23477
444B3477k0754j8338N431J0768J0101N173L957J5312Q240k609l715l4136L3319
431C6226o357L944M639j8538O939L2939j5932l1306k1002K1226O238J2809J1132
418D2957o827j0178p113J2338j4217J3557j1413j6241M845K4053j0576k1591J2245
405A1839j1172L488L803j2153J4905j4002M977R179J1562j7675K9875m445j0627
392A9554j8428J1751L861k7490K7843j9903J9677J6570j0182q374K819l5659j1336
379b9297K857J3884J7082J7183k6065M3367k2249l3760M0206o858J924J391M891
366B4556k01J8746j2649N634m5609r659m333K9354K1956L605j2021r340J3586
353B3625k5483q133j5673K4127j7165j0365K4560O331N12M0067J2387r778j9656
$$ plain form
444 23477 2723 -15615 -10184 584 10685 15858 19815 35127 43367 40758 37043 2907 36226
431 36226 29869 33813 38452 19914 26853 59792 43860 12554 -8448 12778 19016 31825 42957
418 42957 36130 25952 18839 31177 16960 30517 19104 2863 7708 31761 21185 -406 11839
405 11839 667 4155 7958 -4195 10710 -3292 1685 10864 22426 4751 34626 30181 19554
392 19554 1126 12877 16738 -10752 17091 -2812 16865 33435 23253 14879 17698 -17961 -29297
379 -29297 -26440 -12556 4526 21709 -4356 39011 16762 -16998 23208 16350 18274 19665 24556
366 24556 24355 43101 30452 36086 -9523 -19182 -23515 5839 27795 31400 19379 10039 23625
353 23625 -1858 -9991 -25664 -1537 -18702 -29067 -4507 1824 2336 42403 54790 45012 25356
340B5356j7870J2446j4980j1772K5115k256j0952j827p038J6906k5034K5269K3265
327C6628R448k6173n494k904J4090k1188L410p444J8051M415j9480j5123J0070
314a694j6232L2567K7152j1640P279j9835j1374j5627k144r313K9530K4010m962
301B7717j7698J3623j8932q62l661K0935J0034j7264J974P221O471J9102m822
288D3838J4597j2124l4373j3104J0787j9769k548K5150J9427n345l7064L4495
276B3967J4973k5615j0933M613q887j3477O012J680k45k80j6894K3085J9118n958
262A1159J4988J5438j3705J4750l3363K812J7639j4552j4697q382K5605m978J4057
249B6771K52j69k2746N142K111j4230J1982n247p422J2258M842R736n200J3464
$$ plain form
340 25356 7486 19932 4952 -6820 18295 16039 5087 3260 -3778 13128 -11906 13363 36628
327 36628 46076 19903 14409 11505 25595 4407 7817 373 18424 22839 3359 -11764 -1694
314 -1694 -17926 14641 41793 30153 37432 17597 6223 -9404 -11548 -20861 8669 32679 27717
301 27717 10019 23642 4710 3848 187 21122 31156 13892 15866 23087 29558 48660 43838
288 43838 58435 46311 11938 -1166 9621 -10148 -12696 12454 31881 26536 -10528 23967
276 23967 38940 13325 2392 7005 -1882 -15359 -9347 -7667 -7912 -8192 -25086 -2001 17117 11159
262 11159 26147 41585 27880 42630 9267 12079 29718 15166 469 -7913 17692 12714 26771
249 26771 27023 26854 4108 9250 11361 -2869 9113 3866 -3556 8702 13544 23280 18080 31544
235C1544j9192j0067M83J2018O690L035j2594k213J4949l193j1192j6430O546
222C84k5956L3027j1481m425J1050K1350J2027j8574J837K0156N344P418k543
209D9614k4488n79K17J0049k2010L732L2417K2681m7432o947n751k5391o577N457
195a5008K6468J0139K491k5758k492q32J4597J8813j1131M192j8014J5803L167
182B2435k0240J9307J6287l5395k0896N8165N432o464k5913k9297L8080P091j6995
169A1597p590J1578M4J4932K991l2642j5806K0044J2849L135k0931K8320o216
156B2305j0495J4011j2095lK7691j8457l2260m280M935J5297n634J3417j8415
143c983J2621J4841Q611O60j7054j473j0273J4664J1025K269K585q952k410j5758
$$ plain form
235 31544 12352 2285 2768 14786 21476 24511 11917 9704 24653 21460 10268 -6162 384
222 384 -25572 7455 -4026 -8451 2599 23949 35976 17402 19239 39395 44739 52157 49614
209 49614 25126 24547 24764 34813 12803 16535 48952 71633 24201 17254 11503 -13888 -20465 -15008
195 -15008 11460 21599 24090 -1668 -4160 -4992 9605 28418 17287 21479 3465 19268 22435
182 22435 2195 21502 37789 2394 -18502 39663 45095 38631 12718 -16579 21501 28592 11597
169 11597 4007 15585 15629 30561 33552 910 -14896 5148 17997 21132 201 28521 22305
156 22305 11810 25821 13726 13723 41414 22957 -9303 -13583 -8648 6649 1015 14432 -3983
143 -3983 8638 23479 32090 32750 15696 14223 3950 18614 29639 31908 34493 25541 23131 7373
129G373j265p529J9655j8373J0734N037R50K0197M100l6009r116J184r040J0133
115a969j339J638O786k234J5937K3951j9602k041J6383j0337N511l000j4831K746
101A7599K593l487J6655L285n760j0394J500O780m887J7149k3618j3543K6308
88C0180j7865j4827J0141k451L504K5593K4704k2934J2752j665l7736K234p18
75A0912J1521K1696l4135j2233L783Q632K8474k0597O928m061p793m631p85R681
61A7392J8305j5794p581p829k4410K1804O504l663M804P408J7826r937n244j119
47A8466k776P68J244R555p321m012r411J0765r955J8496Q390P378J4040k7875
33B7752r675J4181q908j9089O92L552m429Q066J2404R272l1290k613R593J763
$$ plain form
129 7373 6108 -1421 18234 -139 10595 15632 16582 36779 40879 4870 -4246 -3062 -12102 -1969
115 -1969 -3308 -1670 5116 2882 18819 42770 23168 21127 37510 27173 32684 29684 14853 17599
101 17599 20192 16705 33360 36645 30885 20491 21991 28771 23884 41033 17415 3872 30180
88 30180 12315 -2512 7629 5178 8682 34275 58979 36045 48797 47132 9396 11630 10912
75 10912 22433 44129 9994 -2239 1544 10176 38650 18053 24981 20920 13127 8496 7711 17392
61 17392 35697 19903 12322 4493 -19917 1887 8391 4728 9532 16940 34766 24829 19585 18466
47 18466 15690 16458 17702 27257 19936 15924 6513 17278 7323 25819 34209 41587 55627 27752
33 27752 18077 32258 23350 4261 4953 8505 4076 12142 24546 33818 2528 -85 9508 11271
19A1271J6206k3720P720L325J0758J9138k9122R846j8483R590r96J9785n35q273
5B6510K010k1123J1186K932p91
0B0724
$$ plain form
19 11271 27477 3757 11477 14802 25560 44698 15576 25422 6939 16529 15533 35318 34783 26510
5 26510 28520 7397 18583 21515 20724
0 20724
$$ Imaginary data points
##PAGE= N=2
##DATA TABLE= (X++(I..I)), XYDATA
16383i16021J0752j2734K4868K01O922K2469j3545K4308J6884k159J9148L4618
16371g84289J7773J7590O05L0678j1237m757P070j1776K9717J7389J8307J1106
16359f61824K236J2065K523J3053L8865J7695j0586j2043L5204Q307j201K4119
16347e31587J4730J3432M698K6487j206m530K1421n46N681L0073K7999J3660L512
16334c76176q596N364J6217J3223L577j6634K0082J2373M375K0611L05L6557L722
16321b65000N124R42P051K114K9552K2921k199K5158j8700J5952K4980M65M719
16308a46921J8989n03J1626K7630m238J0462J3019L3001J6733k2353n275L1558
16296a6272L6098k6865L907J0710J3550p749L2159o00j3334M3107L3548j5402
$$ plain form
16383 -916021 -905269 -918003 -893135 -892934 -886012 -863543 -877088 -852780 -835896 -838055 -818907 -784289
16371 -784289 -766516 -748926 -748321 -717643 -728880 -733637 -726567 -738343 -708626 -691237 -672930 -661824
16359 -661824 -659588 -647523 -645000 -631947 -593082 -575387 -585973 -598016 -562812 -554505 -555706 -531587
16347 -531587 -516857 -503425 -498727 -472240 -473446 -477976 -456555 -457101 -451420 -421347 -393348 -379688 -376176
16334 -376176 -384772 -379408 -363191 -349968 -346391 -363025 -342943 -330570 -326195 -305584 -305279 -268722 -265000
16321 -265000 -259876 -258934 -251883 -249769 -220217 -197296 -199495 -174337 -193037 -177085 -152105 -151640 -146921
16308 -146921 -127932 -128435 -116809 -89179 -93417 -82955 -69936 -36935 -20202 -42555 -47830 -16272
16296 -16272 19826 -7039 -3132 7578 21128 13379 45538 44938 31604 74711 108259 92857
16284I2857K8308q336m084K6224J7221K0286j6461J3566k2182J6385J1789k3845
16272A51728K7632K9796p061J0839K2615L886r69j2666J3146K1232P86J6616n690
16259B71890n245m348K3421J1696J9677p482j0371L7347n677j4489K5962J8612
16247C60993O863L609J1182J1063J988o937K6402J089J9028r359k3429P338K8328
16234D38158J6943k0277K1086R749k8315P820K4975O686K4745r015P829R380k0087
16221D89677Q442r399L070Q417L117q198L4465M1150l5805P097J8620J4617k881
16208E72389j4424M243K0277k419q782L6874N498R056j2631m020j0009j8979Q328
16195E85401K6288J8113N01P105k2886J8604N390J773Q196q627j9421K2797J7930
$$ plain form
16284 92857 121165 112829 108745 134969 152190 172476 156015 169581 147399 163784 175573 151728
16272 151728 179360 209156 202095 212934 235549 239435 238466 225800 238946 260178 260964 277580 271890
16259 271890 266645 262297 285718 297414 317091 309609 299238 336585 330908 316419 342381 360993
16247 360993 367856 371465 382647 393710 395698 388761 415163 416252 435280 425921 402492 409830 438158
16234 438158 455101 434824 455910 465659 437344 445164 470139 476825 501570 492555 500384 509764 489677
16221 489677 498119 488720 491790 500207 503324 495126 529591 570741 534936 542033 560653 575270 572389
16208 572389 557965 562208 582485 580066 571284 608158 613656 622712 610081 606061 596052 577073 585401
16195 585401 611689 629802 630303 637408 614522 633126 638516 640289 648485 639858 620437 643234 661164
16182F61164j057n014j2466M34M6319j9970j3201K3845K065j637k5481J3792J0430
16169F79223L7647J2164j3219j8519J8741K7855P124r461O285Q608j4917j3584
16157G27947j4041Q571L6255N886r033Q377M675J7606K833n1924L769K3727k171
16144G62477j8512r698J3705J0712K7154l0370j5325N866M167l5628J4118L9893
16132G68559l831j3053j1827J0543o418J909L0503j5637k9413L0729o52K6226
16120G87638M4958p165M951l1951j9478j2085J619j0914N469K9628K9801j0041
16108H12430J0820K0601r054k6809l3375K4245J2253J9744l745k0637m1960K2318
16096G86831M8621j8198m2006K2874K7457j9523k7724l965K8240K9993r245K3946
$$ plain form
16182 661164 660107 655093 642627 643061 689380 669410 656209 680054 682119 680482 655001 668793 679223
16169 679223 716870 729034 715815 697296 716037 743892 751016 741555 747840 756448 741531 727947
16157 727947 713906 722477 758732 764618 755585 763962 768637 786243 789076 737152 740921 764648 762477
16144 762477 743965 734267 747972 758684 785838 755468 740143 746009 750176 714548 728666 768559
16132 768559 764728 751675 739848 750391 743973 745882 776385 760748 731335 762064 761412 787638
16120 787638 832596 825431 830382 798431 778953 766868 768487 757573 763042 792670 822471 812430
16108 812430 823250 843851 834797 807988 774613 798858 811111 830855 827110 806473 764513 786831
16096 786831 835452 817254 775248 798122 825579 806056 778332 774367 802607 832600 823355 847301
16084H47301l019j1403k1151Q146o691j5633o215l179L0320K3426o120l8050J315
16071G99047L597K8339r789Q742J3356k78j7526k497J5197M739j0401k0560L4779
16058H46745J6641K2452j2819l6579j9537J670k323L765M6099k6652j8469L6411
16046H57404K7181l3410j9569k2352J5864j09m078m074j4106O675q430j76K2813
16033H23633R666k1384L8313l988P517J419l0633L016N258P494j8762Q36o416
16020H15969L322q161J0136J4917n201K1253J0975k4512j1846K2540o768j2610
16008H30014j0368J1091K3043M6206J6502m6116k0317q802J4063Q885n965M591
15996H62827M35l2416J8473K0380M071j4526l5175j168L0989j1379n614J5404
$$ plain form
16084 847301 844282 832879 811728 819874 813183 797550 791335 788156 818476 841902 835782 797732 799047
16071 799047 802644 830983 821194 829936 843292 843014 825488 822991 838188 842927 832526 811966 846745
16058 846745 863386 885838 873019 836440 816903 818573 816250 820015 866114 839462 820993 857404
16046 857404 884585 851175 831606 809254 825118 825009 820931 816857 802751 809426 800996 800820 823633
16033 823633 833299 811915 850228 846240 853757 855176 824543 827559 832817 840311 821549 822385 815969
16020 815969 819291 811130 821266 836183 830982 852235 863210 838698 826852 849392 842624 830014
16008 830014 819646 830737 853780 899986 916488 870372 850055 841253 855316 864201 858236 862827
15996 862827 863262 830846 849319 869699 873770 859244 824069 822901 853890 842511 836897 852301
15984H52301N35L1409j9915j8409K7466J0577k5251J2835q132m0269o492L8612
15972H55267K6276m299j3423j1164l2604M1552P071j0366J656j1831J4647J3903
15960H76685j9826q300J0767j2408J2289m299j0346j3513l667J3839J525j9533
15948H23213m803q140j392P311M3352n880j2946Q959J4389J6992o45j5486j5672
15935H49252K0658l52k0602J03L5506o259o60j8490j0755j0693J8470r796j6994
15922H29388K784K689q098j307J1331Q327M125k5668J9645J5540K8453j781p006
15909H78422m192o937o638l232k2759P89J009j8325L1918l950j1601J3949k719
15896H45734J0804o676j0352J3751k2728l427P592N401J3011k3972n801J2187
$$ plain form
15984 852301 852836 884245 864330 845921 873387 883964 858713 871548 863416 823147 816655 855267
15972 855267 881543 877244 863821 852657 820053 861605 868676 858310 859966 848135 862782 876685
15960 876685 856859 848559 859326 846918 859207 854908 844562 831049 827382 841221 842746 823213
15948 823213 818410 810270 808878 816189 859541 853661 840715 849674 864063 881055 880410 864924 849252
15935 849252 869910 869558 848956 849059 884565 878306 877646 859156 848401 837708 856178 846382 829388
15922 829388 832172 834861 826763 825456 836787 845114 849239 823571 843216 858756 887209 885428 878422
15909 878422 874230 867293 860655 857423 834664 835453 836462 818137 850055 846105 834504 848453 845734
15896 845734 856538 849862 839510 853261 830533 827106 834698 840099 853110 829138 823337 835524
15884H35524n370K4619l0327j4255j2156l624K1294K9583K2356R151m608j7991
15872H54196L431K5218O260p918l1512L894j266l8042L3312J5451K234J2697o758
$$ plain form
15884 835524 830154 854773 824446 810191 798035 794411 815705 845288 867644 876795 872187 854196
15872 854196 857627 882845 889105 881187 849675 853569 852303 814261 847573 863024 865258 877955 871197
$$ [...]
##END NTUPLES=NMR SPECTRUM
##END=
