##TITLE=1H_TG-2410-6
 200.13Hz, DMSO+CCl4.
 8 sc
 2.7.2026
##JCAMPDX= 6.0         $$ Bruker NMR JCAMP-DX V2.0
##DATA TYPE= NMR SPECTRUM
##DATA CLASS= NTUPLES
##ORIGIN= UXNMR, Bruker Analytische Messtechnik GmbH
##OWNER= pz
$$ XWIN-NMR		Version 3.5
$$ Thu Jul  2 14:38:23 2026 Russian Standard Time (UT+4h)  she@DPX200
##.OBSERVE FREQUENCY= 200.1313
##.OBSERVE NUCLEUS= ^1H
##.ACQUISITION MODE= SIMULTANEOUS
##.ACQUISITION SCHEME= undefined
##.AVERAGES= 8
##.DIGITISER RES= 18
##SPECTROMETER/DATA SYSTEM= spect
##.PULSE SEQUENCE= zg30
##.SOLVENT NAME= DMSO
##.SHIFT REFERENCE= (INTERNAL, DMSO, 0, 15.5034)
##AUDIT TRAIL= $$ (NUMBER, WHEN, WHO, WHERE, WHAT)
$$ ##TITLE= Audit trail, XWIN-NMR		Version 3.5
$$ ##JCAMPDX= 5.01
$$ ##ORIGIN= Bruker BioSpin GmbH
$$ ##OWNER= she
$$ F:/spectra/data/she/nmr/H-C/1/pdata/1/auditp.txt
$$ ##AUDIT TRAIL=  $$ (NUMBER, WHEN, WHO, WHERE, WHAT)
(   1,<2026-07-02 14:36:48.71 +0400>,<she>,<DPX200>,
      <created by zg, POWCHK disabled, PULCHK disabled
       configuration hash MD5:
       00 E9 B6 7A A2 85 ED C7 34 08 36 98 17 FE 4E 26
       data hash MD5: 16K
       84 9B 9E F9 FD F7 28 33 BB 5C 9A 8C 21 23 3F FD>)
(   2,<2026-07-02 14:36:56.10 +0400>,<she>,<DPX200>,
      <Start of raw data processing
       efp BC_mod = 2 LB = 0.25 FT_mod = 6 PKNL = 1 PHC0 = -4208.34 PHC1 = -4.207699 SI = 16K 
       data hash MD5: 16K
       A1 24 0B 61 32 F9 9D 49 CB E9 9D B2 55 3A ED 53>)
(   3,<2026-07-02 14:37:20.45 +0400>,<she>,<DPX200>,
      <pk PHC0 = -1.167169 PHC1 = 0 
       data hash MD5: 16K
       13 BE 58 0A 95 15 5E D7 41 40 EF F9 73 79 6A 1B>)
(   4,<2026-07-02 14:37:24.75 +0400>,<she>,<DPX200>,
      <abs ABSG = 5 
       data hash MD5: 16K
       32 AD E6 58 7F 94 21 CD 93 F1 0C 79 00 51 F5 87>)
$$ ##END=
$$ 
$$ hash MD5
$$ C4 76 04 40 5F BD E2 DE 40 37 63 37 05 C3 24 2A
##$RELAX= 
##$RELAX= 
##$RELAX= 
##$RELAX= 
##$RELAX= 
##$RELAX= 
$$ Bruker specific parameters
$$ --------------------------
##$DU= <F:/spectra>
##$EXPNO= 1
##$NAME= <H-C>
##$PROCNO= 1
##$TYPE= <nmr>
##$USER= <she>
##$AMP= (0..31)
100 100 100 100 100 100 100 100 100 100 100 100 100 100 100 100 100 100 
100 100 100 100 100 100 100 100 100 100 100 100 100 100 
##$AQSEQ= 0
##$AQ_mod= 1
##$AUNM= <au_zg>
##$AUTOPOS= <>
##$BF1= 200.13
##$BF2= 200.13
##$BF3= 200.13
##$BF4= 200.13
##$BF5= 200.13
##$BF6= 200.13
##$BF7= 200.13
##$BF8= 200.13
##$BYTORDA= 1
##$CFDGTYP= 0
##$CFRGTYP= 5
##$CHEMSTR= <none>
##$CNST= (0..31)
1 1 145 1 1 1 1 1 1 1 1 1 1 1 1 1 1 1 1 1 1 1 1 1 1 1 1 1 1 1 1 1 
##$CPDPRG= <>
##$CPDPRG1= <>
##$CPDPRG2= <>
##$CPDPRG3= <>
##$CPDPRG4= <mlev>
##$CPDPRG5= <mlev>
##$CPDPRG6= <mlev>
##$CPDPRG7= <mlev>
##$CPDPRG8= <mlev>
##$CPDPRGB= <>
##$CPDPRGT= <>
##$D= (0..31)
0 0.7 0 0 0 0 0 0 0 0 0 0.03 0 0 0 0 0 0 0 0 0 0 0 0 0 0 0 0 0 0 0 0 
##$DATE= 1782988608
##$DBL= (0..7)
120 120 120 120 120 120 120 120 
##$DBP= (0..7)
150 150 150 150 150 150 150 150 
##$DBP07= 0
##$DBPNAM0= <>
##$DBPNAM1= <>
##$DBPNAM2= <>
##$DBPNAM3= <>
##$DBPNAM4= <>
##$DBPNAM5= <>
$$ [...]
##$SUBNAM3= <"">
##$SUBNAM4= <"">
##$SUBNAM5= <"">
##$SUBNAM6= <"">
##$SUBNAM7= <"">
##$SUBNAM8= <"">
##$SUBNAM9= <"">
##$SW= 18.0517328524113
##$SWIBOX= (0..15)
0 0 2 0 0 0 0 0 0 0 0 0 0 0 0 0 
##$SW_h= 3612.71676300578
##$TD= 16384
##$TD0= 1
##$TE= 0
##$TE2= 300
##$TE3= 300
##$TEG= 300
##$TL= (0..7)
0 120 120 120 120 120 120 120 
##$TP= (0..7)
150 150 150 150 150 150 150 150 
##$TP07= 0
##$TPNAME0= <>
##$TPNAME1= <>
##$TPNAME2= <>
##$TPNAME3= <>
##$TPNAME4= <>
##$TPNAME5= <>
##$TPNAME6= <>
##$TPNAME7= <>
##$TPOAL= (0..7)
0.5 0.5 0.5 0.5 0.5 0.5 0.5 0.5 
##$TPOFFS= (0..7)
0 0 0 0 0 0 0 0 
##$TUNHIN= 0
##$TUNHOUT= 0
##$TUNXOUT= 0
##$USERA1= <user>
##$USERA2= <user>
##$USERA3= <user>
##$USERA4= <user>
##$USERA5= <user>
##$V9= 5
##$VALIST= <valist>
##$VCLIST= <CCCCCCCCCCCCCCC>
##$VD= 0
##$VDLIST= <DDDDDDDDDDDDDDD>
##$VPLIST= <PPPPPPPPPPPPPPP>
##$VTLIST= <TTTTTTTTTTTTTTT>
##$WBST= 1024
##$WBSW= 4
##$XGAIN= (0..3)
0 0 0 0 
##$XL= 0
##$YL= 0
##$YMAX_a= 874491
##$YMIN_a= -903650
##$ZGOPTNS= <>
##$ZL1= 120
##$ZL2= 120
##$ZL3= 120
##$ZL4= 120
##$ABSF1= 15.50119
##$ABSF2= -2.550659
##$ABSG= 5
##$ABSL= 3
##$ALPHA= 0
##$AQORDER= 0
##$ASSFAC= 0
##$ASSFACI= 0
##$ASSFACX= 0
##$ASSWID= 0
##$AUNMP= <proc_1d>
##$AZFE= 0.1
##$AZFW= 0.1
##$BCFW= 0
##$BC_mod= 2
##$BYTORDP= 0
##$COROFFS= 0
##$CY= -3
##$DATMOD= 1
##$DC= 0
##$DFILT= <>
##$DTYPP= 0
##$F1P= 0
##$F2P= 0
##$FCOR= 1
##$FTSIZE= 16384
##$FT_mod= 6
##$GAMMA= 0
##$GB= 0
##$INTBC= 1
##$INTSCL= 3.241238e-09
##$ISEN= 128
##$LB= 0.25
##$LEV0= 0
##$LPBIN= 0
##$MAXI= 10000
##$MC2= 0
##$MEAN= 0
##$ME_mod= 0
##$MI= 1.114404
##$NCOEF= 0
##$NC_proc= -4
##$NLEV= 6
##$NOISF1= 3.799351
##$NOISF2= 2.8
##$NSP= 0
##$NTH_PI= 0
##$NZP= 0
##$OFFSET= 15.50339
##$PC= 1
##$PHC0= -4209.507
##$PHC1= -4.207699
##$PH_mod= 1
##$PKNL= yes
##$PPARMOD= 0
##$PSCAL= 0
##$PSIGN= 0
##$REVERSE= no
##$SF= 200.130003665157
##$SI= 16384
##$SIGF1= 3
##$SIGF2= 2
##$SINO= 0.751879
##$SIOLD= 32768
##$SREGLST= <19F.Aceton>
##$SSB= 0
##$STSI= 16384
##$STSR= 0
##$SW_p= 3612.71676300578
##$SYMM= 0
##$S_DEV= 0
##$TDeff= 16384
##$TDoff= 0
##$TI= <>
##$TILT= no
##$TM1= 0
##$TM2= 0
##$TOPLEV= 0
##$USERP1= <user>
##$USERP2= <user>
##$USERP3= <user>
##$USERP4= <user>
##$USERP5= <user>
##$WDW= 1
##$XDIM= 16384
##$YMAX_p= 293322057
##$YMIN_p= -130658
$$ End of Bruker specific parameters
$$ ---------------------------------
##NTUPLES= NMR SPECTRUM
##VAR_NAME=  FREQUENCY,     SPECTRUM/REAL,   SPECTRUM/IMAG
##SYMBOL=    X,             R,               I
##VAR_TYPE=  INDEPENDENT,   DEPENDENT,       DEPENDENT
##VAR_FORM=  AFFN,          ASDF,            ASDF
##VAR_DIM=   16384,         16384,           16384
##UNITS=     HZ,            ARBITRARY UNITS, ARBITRARY UNITS
##FACTOR=    0.220516191357247, 1,           1
##FIRST=     3102.69356000191, 0,            0
##LAST=      -510.023203003871, 0,           0
##MIN=       -510.023203003871, -130658,     0
##MAX=       3102.69356000191, 293322057,    0
$$ Real data points
##PAGE= N=1
##DATA TABLE= (X++(R..R)), XYDATA
$$ [...]
6188A3737l238l652O723N134K2879k8508L8488M247k4416k763k8377K3256L9368
6175F2878l2347l769l042J2944k0622p826K7610j8766j4434p656J3707L4955l234
6162D0398k0059q607J1250j9542j1149j1770L3592N270Q108o52j7472k681J1046
6149A7732P123n985J2427j6093L4636J560k4006j8090J0144J9500l211k1643K5421
6136C9515K494O768K02o870r693q008J8662j3700m5870R661p882l347o663L3062
6122H331k865q448j2043j1841J2555L1312J8391l88l1723L400j525J6906l883
6109A8179O101J482J3943J7287k5160p770q388N842J749M471j160j9101J496J760
6095A0731J0928j0289J6439n628j5509N377k4170J5703K5009k9447L4768L5895
$$ plain form
6188 13737 10499 6847 13570 18704 41583 13075 51563 55810 31394 28631 254 23510 62878
6175 62878 30531 26762 23720 36664 16042 8216 35826 17060 2626 -5030 8677 43632 40398
6162 40398 20339 11732 22982 3440 -7709 -19479 14113 19383 27491 26839 9367 6686 17732
6149 17732 24855 18870 31297 15204 49840 51400 27394 9304 19448 38948 35737 14094 39515
6136 39515 42009 48777 48979 42109 32416 24408 43070 29370 -16500 -6839 -14721 -18068 -24731 8331
6122 8331 5466 -2982 -15025 -26866 -14311 17001 35392 35004 3281 6681 5156 22062 18179
6109 18179 24280 25762 39705 56992 31832 24062 15674 21516 23265 27736 26576 7475 8971 10731
6095 10731 21659 11370 27809 22181 6672 12049 -12121 3582 28591 -856 33912 69807
6083F9807j7713m52j8191k0155j1499J6261J5799N502k0357J537J0042n654K5561
6070E0488j5813j8994L566j7449l7787K384N1478P801O150j4703n364K913j3238
6057A432k2190R010R471q762n79J8756j6250J1030n846P336J8284q053q195l775
6043A669m0466O203J2250K2818k1591J8779L8831j9156j6606l86K2789L032j3862
6030A4304K442j26J4922p338Q951j8342n009j4145j2249J7086L753J783k1550
6017a5518J1368N938r442L7572J8755j8804K34J0119m276l7551p576J2870j6884
6004a3195M777Q216M1026k9031k379k4863Q134K2298M57L2179l2848l6938j7765
5991c9932K6158m174Q904K2556N825n08O584n320j3235n425K4436j0014J5880
$$ plain form
6083 69807 52094 51642 33451 13296 1797 18058 33857 39359 19002 20539 30581 24927 50488
6070 50488 34675 15681 19247 1798 -35989 -33605 17873 25674 31824 17121 11757 14670 1432
6057 1432 -20758 -11748 -2277 -11039 -11618 7138 -9112 1918 -3928 3408 21692 13639 5444 1669
6043 1669 -38797 -32594 -20344 2474 -19117 -338 38493 19337 2731 2345 25134 28166 14304
6030 14304 16746 16620 31542 24204 33155 14813 9804 -4341 -16590 496 4249 6032 -15518
6017 -15518 -4150 1788 -7654 29918 48673 29869 30103 40222 35946 -1605 -9181 3689 -13195
6004 -13195 -8418 -202 40824 11793 9414 -15449 -7315 14983 15440 47619 14771 -22167 -39932
5991 -39932 -13774 -17948 -9044 13512 19337 18829 25413 20093 6858 1433 25869 15855 31735
5978C1735K906l3980M5241L0059j6281k5781k9687M5693R163j0750k0865J9359
5966D6812k6220n057J7063J383L180J3606k5909l0576P355L2140n420J1055l5
5953C9377j0541m590j0746J3943j0291J7024K1839l4454j6363R65N271J3607N346
5940C0387k8803l545Q321J0477k499Q691k752l2510K3697J7120J8766j1091m5737
5927i478l2703K5405J7500K9084P930l1762K2188j4491J639K448Q793k949K179
5914B5783j7282J5770M460o489L8685m4660m1339K5914L1384j0470n950K7762
5902D3568K798J1236J5200k2633m9540j0797N2224N716J0102m276J654K1778k9337
5889D7693l268K8716r159p358K380K0850L9015R631m2211k0217j1124Q578j6476
$$ plain form
5978 31735 34641 661 45902 75961 59680 33899 4212 49905 59068 48318 27453 46812
5966 46812 20592 15535 32598 33981 37161 50767 24858 -5718 1637 33777 28357 39412 39377
5953 39377 28836 24246 13500 27443 17152 34176 56015 21561 5198 6163 11434 25041 30387
5940 30387 1584 -1961 6360 16837 14338 23029 20277 -12233 11464 28584 47350 36259 -9478
5927 -9478 -42181 -16776 724 29808 37738 5976 28164 13673 15312 17760 26553 23604 25783
5914 25783 8501 24271 28731 22242 60927 16267 -25072 842 32226 21756 15806 43568
5902 43568 46366 57602 72802 50169 629 -10168 42056 47772 57874 53598 55252 77030 47693
5889 47693 44425 73141 63982 56624 59004 79854 118869 128500 86289 66072 54948 63526 47050
5876D7050J3487J204k262J4580K186j027J7489k061J84Q17j0358j7225K1959M5856
5862A31879K1873l8881k2307J9228R281K989j9246L4570K1678l6793K0996K7240
5850A72507N7246j7664K1925J8159J7212L1167j4550l788J3857j0680J8116J1746
5838C15253R064K4354k9354J0865q263j7560J245j0470l0666k116N597j9756l9576
5825B08617l0574o945o442j3444j9050n926P794J7026p800J3540J1733m7945N145
5812A25729j5945J4697K7402j246O200p654K972J5136k2272J664J7864M3739M8321
5799B56607K0006l806j4853l0119p881J7162j1043J0737K1022l0142O265r162
5787B24793M634p75r570L4117j3664j8729K9383O8470K3067N634M8146L5386L9796
$$ plain form
5876 47050 60537 61741 59479 74059 76245 75218 92707 90646 90830 91647 81289 64064 86023 131879
5862 131879 153752 114871 92564 111792 121073 124062 104816 139386 161064 124271 145267 172507
5850 172507 229753 212089 234014 252173 269385 300552 286002 282214 296071 285391 303507 315253
5838 315253 324317 348671 319317 330182 321919 304359 305604 295134 264468 262352 267949 248193 208617
5825 208617 178043 171098 164656 151212 132162 126236 134030 151056 143256 156796 168529 120584 125729
5812 125729 109784 124481 151883 150637 156837 149183 152155 167291 145019 146683 164547 208286 256607
5799 256607 276613 272807 257954 227835 219954 237116 226073 236810 257832 227690 233955 224793
5787 224793 229427 228652 219082 253199 239535 220806 250189 318659 341726 347360 395506 430892 470688
5774D70688K9971L9415M1628O4201N2171J2855L2123M4541M6144J00221J12992
5763A046950J52683J60792K64920M33155Q04968J224984J653301J603426J179006
5754H524185K64948l98366o6037m07781j047181j163215r91242q38212p19647
5745C157452n96400m87193k79954j90177j80390j26873j31301j34107j02520r3868
5735H34669p2073j2409l1946j9687K0682k2239o7522k0744k2967m8783l4124n827
5723D97030k4802J1090K6131K1382J9332K7787o468K224k8319j1108j184j4506
5711E18589o4935l8953o347J2988n4686j2241j2471l1054M0301q477j1837j839
5699C29038K5582j0006j0650N262L8153j1137q007l05J9991J6850L1494L3004
$$ plain form
5774 470688 500659 540074 581702 645903 698074 710929 743052 787593 833737 933958 1046950
5763 1046950 1199633 1360425 1625345 2058500 2863468 4088452 5741753 7345179 8524185
5754 8524185 8789133 8390767 8324730 7916949 6869768 5706553 4715311 3877099 3157452
5745 3157452 2561052 2073859 1793905 1603728 1423338 1296465 1165164 1031057 928537 834669
5735 834669 762596 750187 718241 698554 719236 696997 629475 608731 585764 536981 502857 497030
5723 497030 472228 483318 509449 530831 550163 577950 571482 573706 545387 534279 533095 518589
5711 518589 453654 414701 408354 421342 366656 354415 341944 310890 351191 342714 330877 329038
5699 329038 354620 344614 333964 339226 377379 366242 358235 357930 377921 394771 426265 459269
5687D59269m8912m0181L8848k8085l8463R505J0513l2989k0419k0055J3378K3041
5675C25450j5959J9719r536j0157J71k3542j4988L9797J2660p386J3087K2649
5663C51965L6219J9101k3713M554J8115K775J5595k6294k1011K6812R245o122
5651D07241j513J3185j9848k916J5642N315K5675Q563J065K1039m578j4544M5455
5638D99781J1021j7306j3017J2635J8273l37j1724j8074j2013L758K8372r421
5626D91948j0796J6866L5974M821L293O725m216M063K3914p56m772R578K7013
5613F03655L824K3372L1085K6506K8755J2529L9835O4569N0454J7496j0138l4394
5601H57548L0260J7196j7144j6039Q301M1281N753M2539O9539J7564J8625k8555
$$ plain form
5687 459269 410357 370176 409024 380939 342476 351981 362494 329505 309086 289031 302409 325450
5675 325450 309491 329210 319674 309517 309688 286146 271158 310955 323615 316229 329316 351965
5663 351965 388184 407285 383572 388126 406241 409016 424611 398317 377306 404118 413363 407241
5651 407241 405728 418913 399065 396149 411791 417106 442781 451344 452409 473448 468870 454326 499781
5638 499781 510802 493496 480479 493114 511387 511050 499326 481252 469239 472997 501369 491948
5626 491948 481152 498018 533992 538813 542106 548831 544615 548678 572592 571836 567064 576642 603655
5613 603655 607479 630851 661936 688442 717197 729726 769561 834130 884584 902080 891942 857548
5601 857548 887808 905004 887860 871821 880122 921403 927156 969695 1039234 1056798 1075423 1046868
5589A046868k9155j6110L5710k4565m0277J6863L84J7805K7833Q264K3897O1025
5577A128542K2380M7657J470K351K0298O9089N3402N7998J00397M4055Q4798O3886
5565A696323N2585Q1630O7401R2728J01607J33442Q3901J04666J38958J81007
5555B734248K07667J52070J80797K23881K29021K98289L59122M01495M24220N18561
5545E729371N71350O43739Q34951R71136J226612J532101K003453K586965L291492
5536A9391170M042497M785214N101123M784611L868475K652602J545421N67078
5528D6738191r3451k72467m9893N61104J111603J295200R33595P0225j043173
5519D9250934k050736k915625l730828m207074m324363m164800l800005l378033
$$ plain form
5589 1046868 1017713 1001603 1037313 1012748 972471 989334 989718 1007523 1035356 1043620 1067517 1128542
5577 1128542 1150922 1198579 1200049 1202400 1222698 1291787 1345189 1403187 1503584 1547639 1632437 1696323
5565 1696323 1748908 1830538 1897939 1990667 2092274 2225716 2309617 2414283 2553241 2734248
5555 2734248 2941915 3093985 3274782 3498663 3727684 4025973 4385095 4786590 5210810 5729371
5545 5729371 6300721 6944460 7779411 8750547 9977159 11509260 13512713 16099678 19391170
5536 19391170 23433667 28218881 33320004 38104615 41973090 44625692 46171113 46738191
5528 46738191 46644740 46372273 46322380 46883484 47995087 49290287 50223882 50294107 49250934
5519 49250934 47200198 44284573 40553745 36346671 32022308 27857508 24057503 20679470
5511B0679470k883100k366845j896549j574140j236264r84457q58314p64415o37321
5502G478065n34062m50274m18704l98321l11652l04071k73384k58406k29819k22540
5492D076832j64152j78346j54159j03049j61221j41530q0765j00667j02515j00165
5482B790263r3645q3097m0268p2015o9155n6111p3293o4435o5896q6159m8883
5471B037306l5402n1629m1418l4465k6184j7335j8724l4900o0744p8988l3613
5460A603904l4321k9520l4665l0675j7102k9197k6064l0793j9974k6436m0734
5449A284423j8936j4063n4674m2404j6216l1122j9623J693j5910j7108k7702J2849
5437A041207q705j437m2109J3043j1985l967l3033k9028J0815K9953k1501j9058
$$ plain form
5511 20679470 17796370 15429525 13532976 11958836 10722572 9738115 8879801 8115386 7478065
5502 7478065 6944003 6493729 6075025 5676704 5365052 5060981 4787597 4529191 4299372 4076832
5492 4076832 3912680 3734334 3580175 3477126 3315905 3174375 3093610 2992943 2890428 2790263
5482 2790263 2696618 2613521 2573253 2501238 2432083 2375972 2302679 2238244 2172348 2086189 2037306
5471 2037306 2001904 1950275 1908857 1874392 1848208 1830873 1812149 1777249 1716505 1637517 1603904
5460 1603904 1569583 1540063 1505398 1474723 1457621 1428424 1402360 1371567 1351593 1325157 1284423
5449 1284423 1265487 1251424 1196750 1154346 1138130 1107008 1087385 1089078 1073168 1056060 1028358 1041207
5437 1041207 1032502 1031065 988956 1001999 990014 986047 953014 923986 934801 964754 943253 924195
5425I24195j2785j6079K1108p293l1756k261o302q965J0334j4121O090j1519K788
5412H53434l984K2212p886N741K6330j0309O946K8684m4170j7328n320J7328J8600
5399H90278K5967l425K5273M744j1254P946K946J815L1518o131m3442r094J8809
5386I35950p501J4216R296k099J1161l5000k3915R254K6437K501J0641k6681m3408
5373H80852o167J675K3356L2708J4144m9776R085k8711K7054M7043l7104M723
5361I18882l524J437J9645J9903P674Q967K8294J7042l4299k9280L4264M095R481
5348A002581m357M9127P15K3512O9968M8064M3467J0446K4218J145K9628M0952
5336A339466J9623J0512K6086J2398P5356O8502M2886M0087N3740M9471O6448
$$ plain form
5425 924195 911410 895331 916439 909146 877390 875129 868827 859862 870196 856075 862165 850646 853434
5412 853434 849450 871662 863776 869517 895847 885538 892484 921168 876998 859670 854350 871678 890278
5399 890278 916245 912820 938093 942837 931583 939529 942475 944290 975808 969677 926235 917141 935950
5386 935950 928449 942665 951961 949862 961023 926023 902108 911362 937799 940300 950941 924260 880852
5373 880852 874685 876360 899716 932424 946568 896792 905877 877166 904220 951263 914159 918882
5361 918882 915358 916795 936440 956343 964017 972984 1001278 1018320 984021 954741 989005 993100 1002581
5348 1002581 998224 1047351 1048066 1071578 1141546 1189610 1233077 1243523 1267741 1268886 1298514 1339466
5336 1339466 1359089 1369601 1395687 1408085 1483441 1551943 1594829 1634916 1688656 1738127 1804575
5325A804575O7343J09976P4692P9369J18323Q9356J54649J42814J23156J67767
5315B932020J58759J35923J81529K45591K37469L11103L59833M55393N36021N90779
5305F144420O71922Q33988R56060J181721J563539K195684L312592M981971O854110
5296B8696007Q077786P591945N020169J793268R2855p79675k403509l244838k564030
5287D2279978p15083J669241L830175M713074L503587O61920j588696k391698
5279E1962498l850367n472827o016398n699329n036630m353290l583647k850980
5271A5099030k190207j586179j278938j007444q16068p10265n62945m17883l75500
5262F153601l90235l03211k99563k70167k53496k31542j94047k20801k05006j36940
$$ plain form
5325 1804575 1871918 1981894 2056586 2135955 2254278 2343634 2498283 2641097 2764253 2932020
5315 2932020 3090779 3226702 3408231 3653822 3891291 4202394 4562227 5017620 5553641 6144420
5305 6144420 6816342 7650330 8606390 9788111 11351650 13547334 16859926 21841897 28696007
5296 28696007 36773793 44365738 49385907 51179175 51272030 50492355 48088846 44844008 42279978
5287 42279978 41564895 43234136 47064311 51777385 55280972 55942892 54354196 51962498
5279 51962498 48112131 42639304 36622906 30923577 25886947 21533657 17950010 15099030
5271 15099030 12908823 11322644 10043706 9036262 8220194 7509929 6946984 6529101 6153601
5262 6153601 5763366 5460155 5160592 4890425 4636929 4405387 4211340 3990539 3785533 3648593
5252C648593j22683j44179j10716r7741j41448j26193n7701q1630l9034n6740
5242B670528q0793k6571n2734m0663p0691r4333n7704o6334p5591k2123j7461
5231B065530l5725l7447k8849m5298j9847l2686o9522l5921l3157m7754J059m6240
5219A634143j8881m0114K2329k5805J0186M666m0263j7021m0472k8552p889m5717
5207A406610J4916K6066p9840l7819M584k4851m1346m7141o3143P374k7754o8148
5195A069508k7658l9379k3818K1890l8002k7103J9363M575k6676l8058l8728J2748
5183H68662P113l9092j9810j401l2574j3775N805j8917J1969j4195J79O440J5256
5170G75660k9559k6191o87k6531J36k6102j368L0117m2989j4108J3242k9429K2358
$$ plain form
5252 3648593 3525910 3381731 3271015 3173274 3031826 2905633 2847932 2766302 2727268 2670528
5242 2670528 2589735 2563164 2510430 2469767 2399076 2304743 2247039 2180705 2105114 2082991 2065530
5231 2065530 2029805 1992358 1963509 1918211 1898364 1865678 1796156 1760235 1727078 1679324 1680383 1634143
5219 1634143 1615262 1575148 1597477 1571672 1581858 1586524 1546261 1529240 1488768 1460216 1452327 1406610
5207 1406610 1421526 1447592 1367752 1329933 1334517 1309666 1268320 1221179 1158036 1165410 1137656 1069508
5195 1069508 1041850 1002471 978653 1000543 962541 935438 954801 959376 932700 894642 855914 868662
5183 868662 875775 836683 816873 815472 782898 769123 774928 756011 767980 753785 753964 760404 775660
5170 775660 746101 719910 719223 692692 692828 666726 665358 695475 652486 638378 651620 622191 644549
5157F44549K2853p278P342J9325r150k380p551J9403j1836Q337o477K3402m4388
5144F56151J8341M9823L727j4629k3737p538k6262n95J3024l6904j8293J5548
5132F28656k4879l6160j4190K7920m687K533J9014n378K012k417q25J9617N2483
5119F63699J2559j2990K6337N857l5633M924p251L092J9149J0959R526p249J031
5106F94010K6847N788j0616L5409L1405k2834N339L5713M8m357l6031J6013K4112
5093H00846j2829J1971J821n9746l0041j6880J4906O00L0080j1936k6484k6544
5081F75764r492N985l0719j6229J4395K9720R877k2747N859j9468K8912K4168
5069F96025k7295M758l280j4138M3596Q049N980J6991L4437L0752j8675k939R043
$$ plain form
5157 644549 667402 660124 667466 686791 677641 675261 667710 687113 675277 683614 677137 700539 656151
5144 656151 674492 724315 728042 713413 689676 682138 655876 655281 668305 631401 613108 628656
5132 628656 603777 567617 553427 581347 576660 579193 598207 592829 594841 592424 591599 611216 663699
5119 663699 676258 663268 689605 695462 659829 664753 657502 660594 679743 690702 700228 692979 694010
5106 694010 720857 726645 716029 751438 782843 760009 765348 801061 801109 796752 760721 776734 800846
5093 800846 788017 799988 801809 742063 712022 695142 710048 710648 740728 728792 702308 675764
5081 675764 666272 672257 641538 625309 639704 669424 679301 656554 662413 642945 671857 696025
5069 696025 668730 673488 670208 656070 699666 707715 713695 730686 765123 795875 777200 774261 783304
5056G83304K9134q819j2785J7157j2623r987L1419Q103j887l4176m595M1250O759
5043H32254R859j7311p782p57P418p067o733N094o027J7976l9042J7800l734j4906
5029G87042k8773K8691J0995J1146j5520j779L546R700q190k2173M8935Q85o403
5016H18102l6530o828m948J7880j13K926N802K485r470L988O7260J1211k4827
5003H46938J9369J6986Q15J6947L8362n577l1928M8290J1406J1176L7659O1912
4991A072355N4802N3081N6083M9987J9040k4401L8804m986n096N1851J4008k9637
4979A345891j4354k3535l9544k507J6270j8510j7027M498N2572K2162l2289L626
4967A297253K5011m407k4339l3168m7296k828k1388k9758J2131O988k0079M0817
$$ plain form
5056 783304 812438 803619 790834 807991 795368 785381 816800 824903 823016 788840 784245 825495 832254
5043 832254 842113 824802 817020 816263 823681 816614 809881 814975 808948 826924 787882 805682 801948 787042
5029 787042 758269 786960 797955 809101 793581 791802 795348 805048 796858 774685 823620 824505 818102
5016 818102 781572 774744 769796 787676 787563 790489 796291 798776 789306 793294 860554 871765 846938
5003 846938 866307 883293 884108 901055 939417 933840 901912 950202 961608 972784 1010443 1072355
4991 1072355 1127157 1180238 1236321 1286308 1305348 1280947 1319751 1314765 1309669 1361520 1375528 1345891
4979 1345891 1331537 1308002 1268458 1265951 1282221 1263711 1246684 1251182 1303754 1325916 1293627 1297253
4967 1297253 1322264 1317857 1293518 1260350 1213054 1210226 1188838 1159080 1171211 1178199 1158120 1198937
4955A198937L5715l7323j84L5216k4786K6430J3224j0487K4140J1678j0146M571
4943A266985o273j3711o191K2637K1209J122J6503j20L6711K3532K2051M6605
4931A431060n473M424J1579j0289J043J3127J5291q385J444L641L0698J9850K9351
4918A537361k796o847J4378M5169K8511O237P194K7359q442J2823K5042L5763
4906A721752j133J52L8837M640l2761L46L7220M1707M5328q467J6710N4740J9756
4893A938827J0103J1818K3323K050M8483L1543k4876K5052Q505l000L5757L3224
4881B140809M6595M4472J9421K1874n125J1787K7279K4707j5205O2754L3778K6613
4869B439759K9860K3655R063J0283O0341N2657L9980N9960J1722k1304L7253O6448
$$ plain form
4955 1198937 1234652 1197329 1197145 1232361 1207575 1234005 1247229 1236742 1260882 1272560 1262414 1266985
4943 1266985 1260712 1247001 1240810 1263447 1284656 1285778 1302281 1302161 1338872 1362404 1384455 1431060
4931 1431060 1425587 1430011 1441590 1431301 1432344 1445471 1460762 1452377 1453821 1457462 1488160 1508010 1537361
4918 1537361 1534565 1527718 1542096 1587265 1615776 1622013 1629207 1656566 1648124 1660947 1685989 1721752
4906 1721752 1720619 1720771 1759608 1764248 1731487 1731833 1769053 1810760 1856088 1847621 1864331 1919071 1938827
4893 1938827 1948930 1960748 1984071 1986121 2034604 2066147 2041271 2066323 2074828 2071828 2107585 2140809
4881 2140809 2187404 2231876 2251297 2273171 2268046 2279833 2307112 2331819 2316614 2379368 2413146 2439759
4869 2439759 2469619 2493274 2502337 2512620 2572961 2625618 2665598 2725558 2737280 2715976 2753229 2819677
4857B819677N1725K5316O3492O7797L0431N7815N6881N3179J14214R9445O4525
4846C504497K6956J7730M0153K947J7950N3397R386j0835L7639M4497M4938N2658
4834C841913J12003P0479P5734P1531P7423J57920J03862J37439J78765K12063
4824E039132K70022M11138P54420J068081J261746J128391O44770o3441j39058
4815A0375201p7772n04946p42474p41977o10091n37425m46946l00359j72695r8480
4805F142036m9838n1828j5702K4174P243K1309L9579J4141K4815L4099N0661Q1554
4793F322243N7239N3790P4957Q2859P2218M8264O1566O4200Q5548P1962Q8422
4782G083268J30438P3739O2963O0568P8622J11862J03938O8406P2987R6852J06797
$$ plain form
4857 2819677 2871402 2896718 2960210 3028007 3058438 3116253 3173134 3226313 3340527 3439972 3504497
4846 3504497 3531453 3549183 3589336 3592283 3610233 3663630 3673016 3662181 3699820 3744317 3789255 3841913
4834 3841913 3953916 4024395 4100129 4171660 4249083 4407003 4510865 4648304 4827069 5039132
4824 5039132 5309154 5720292 6474712 7542793 8804539 9932930 10577700 10514259 10375201
4815 10375201 10297429 9792483 9050009 8308032 7697941 7160516 6713570 6413211 6240516 6142036
4805 6142036 6092198 6040370 6024668 6048842 6056085 6077394 6116973 6131114 6155929 6190028 6240689 6322243
4793 6322243 6379482 6433272 6508229 6591088 6663306 6711570 6773136 6837336 6922884 6994846 7083268
4782 7083268 7213706 7287445 7350408 7410976 7489598 7601460 7705398 7773804 7846791 7943643 8050440
4771H050440J19970Q0497J08765R1814R7910J00417J25027P0198R3672J25336
4761I064046J17033O1517R1036P7347J14287J29476Q3806Q4670Q9608J30772R3719
4750A0137317J02822J13066O2469Q6542J05607R6178O5181O8386Q4686Q0254R2926
4739A1095434J05237Q8921P7794R2429Q2654R8810J3518P2408J08975P3667L4211
4728A1944058L1899Q7686M2895M9139O5876P5838P5003M5808L6600K8812K1230
4717A2504844M7004K2728J9824m137r41K0228K1624J3300l5445j1251r195R678
4705A2598261j707q461L961k8503l5988l8059l2741k2639l3816l7456p2539m1225
4693A2249088m1287m9204p4723l6716o2798m3524r1484o5860p5054p1986q9460
$$ plain form
4771 8050440 8170410 8250907 8359672 8451486 8549396 8649813 8774840 8845038 8938710 9064046
4761 9064046 9181079 9242596 9333632 9410979 9525266 9654742 9738548 9823218 9912826 10043598 10137317
4750 10137317 10240139 10353205 10415674 10502216 10607823 10704001 10769182 10837568 10922254 11002508 11095434
4739 11095434 11200671 11289592 11367386 11459815 11542469 11641279 11654797 11727205 11836180 11909847 11944058
4728 11944058 11975957 12063643 12106538 12155677 12221553 12297391 12372394 12418202 12454802 12483614 12504844
4717 12504844 12551848 12574576 12594400 12590263 12589322 12609550 12631174 12644474 12609029 12597778 12588583 12598261
4705 12598261 12596554 12588093 12592054 12563551 12527563 12489504 12456763 12434124 12400308 12362852 12290313 12249088
4693 12249088 12207801 12158597 12083874 12047158 11984360 11940836 11849352 11783492 11708438 11636452 11546992
4682A1546992p9436q3842p3399o8214r8468q1022q1184q4391j16203q9221q8833
4671A0602779j06330j07478j23249o1088o1632q2832q3251r4412j17794j19628
4661I645085o3907n6402j15286j04072q5566j18983j26834p5280n5059j01936
4651H741760p7875n1510q5003j32509q0716q4849j05629j00586r0347j13312n8296
4640G761128m8210q4524j09639p1440l0409o5310p6777k7695j0089j2921K7988
4629G252102J06931J86856K88588L05591J36002n0141q6304j16956k27554l01757
4619G493358k77440k35856k10010j73716j08172o2115M1904M391Q6648J56140
4609F715132J08416J15492J13343R0321R1117J34915J66595K14567K59622K49645
$$ plain form
4682 11546992 11467556 11383714 11310315 11242101 11143633 11062611 10981427 10897036 10780833 10691612 10602779
4671 10602779 10496449 10388971 10265722 10204634 10143002 10060170 9976919 9882507 9764713 9645085
4661 9645085 9581178 9524776 9409490 9305418 9219852 9100869 8974035 8898755 8843696 8741760
4651 8741760 8663885 8612375 8527372 8394863 8314147 8229298 8123669 8023083 7932736 7819424 7761128
4640 7761128 7712918 7628394 7518755 7447315 7416906 7351596 7274819 7247124 7237035 7224114 7252102
4629 7252102 7359033 7545889 7834477 8140068 8276070 8225929 8139625 8022669 7795115 7493358
4619 7493358 7215918 6980062 6770052 6596336 6488164 6426049 6467953 6472344 6558992 6715132
4609 6715132 6823548 6939040 7052383 7142704 7233821 7368736 7535331 7749898 8009520 8259165
4599H259165J93172J24461P3573L2047J10545J59626J71154K01552J77321R518
4589I512134j14417j30511j44138j26816j35635q8734q3349j72207k22246k65923
4579H028158k27873k39391k68187k31434j81338j86731j92276j96921k00316j47555
4569E956136j98048j60362j48842j35990o5253l6083j2813K3844J05084J16082
4559E443755J42483K15618K89669L89931M65331N78261O88054Q52358R59828J101297
4549A1126585J112346J177519J085712J064779J047678J015578J091922J099462
4541A9821581J197196J242906J186372R90579P59060M23036R3197j96782k71742
4532B5245403m44810r06035j179447j193644j200957j149060j104299j037456
$$ plain form
4599 8259165 8452337 8576798 8650371 8682418 8792963 8952589 9123743 9325295 9502616 9512134
4589 9512134 9397717 9267206 9123068 8996252 8860617 8771883 8688534 8516327 8294081 8028158
4579 8028158 7800285 7560894 7292707 7061273 6879935 6693204 6500928 6304007 6103691 5956136
4569 5956136 5758088 5597726 5448884 5312894 5247641 5211558 5198745 5222589 5327673 5443755
4559 5443755 5586238 5801856 6091525 6481456 6946787 7525048 8213102 9065460 10025288 11126585
4549 11126585 12238931 13416450 14502162 15566941 16614619 17630197 18722119 19821581
4541 19821581 21018777 22261683 23448055 24438634 25197694 25620730 25713927 25517145 25245403
4532 25245403 24800593 23894558 22715111 21521467 20320510 19171450 18067151 17029695
4524A7029695j005339r76849j037695j107259j120216j098488r44479q18525p00553
4515H220292n68827m22998l24530k28677j20316k3198P5437K19349L37869M90834
4505G655235P30523R61503J228602J438753J346545J127953Q10283M97270M16405
4496A6213072O91738Q37965M83610M08190J050066J569159J588365J273782Q96560
4487B5012507N0012m29197k82151J25334q02632k060423j802367j339071r00093
4478A7571919n94927m56724o70414q02406q32696o39081p86836j339359j538694
4469I910782j379372j183725r04077o87099n49465m25750l81554k64464k51928
4460C883348j94722j23464j61814j30119j50516r8011p6584n4895p7491p8237
$$ plain form
4524 17029695 16024356 15047507 14009812 12902553 11782337 10683849 9739370 8920845 8220292
4515 8220292 7651465 7228467 6903937 6675260 6554944 6531746 6607183 6826532 7164401 7655235
4505 7655235 8385758 9347261 10575863 12014616 13361161 14489114 15299397 15796667 16213072
4496 16213072 16904810 17742775 18226385 18634575 19684641 21253800 22842165 24115947 25012507
4487 25012507 25062519 24633322 24351171 24476505 23673873 21613450 19811083 18472012 17571919
4478 17571919 16976992 16520268 15849854 15047448 14214752 13575671 12788835 11449476 9910782
4469 9910782 8531410 7347685 6443608 5756509 5207044 4781294 4399740 4135276 3883348
4460 3883348 3688626 3565162 3403348 3273229 3122713 3024702 2948118 2893223 2815732 2737495
4450B737495n1470n2753m3817n9004m6313o9191o5400m1235J2661l9771n9754
4439B221448j1774p2087j4184R956k5277j8170l5309j2591l8910j6683m5082l1769
4427A909568j0618k4732K465j6576l7818r386k1061m0805n7503l2716J616k3225
4415A639209m3723k5977n4404j8563K7983k5447m9395j9016l9596r227O111l6388
4403A351567l7766r085L872k0332j3964j3084O257Q768k6906n780K327K244L2310
4390A280428m906M820j8841q039J400l8262Q419J9100N694j9386O43K946j5147
4377A218869j0351K450K6973j5186k4069J3522J7328k1744q60K1754m2120j8576
4365A167990L4912k3825j0895K4695J2495m1625j6547K3593o245n806J2934J2089
$$ plain form
4450 2737495 2686025 2633272 2589455 2530451 2484138 2414947 2349547 2308312 2320973 2281202 2221448
4439 2221448 2209674 2137587 2123403 2133359 2108082 2089912 2054603 2042012 2003102 1986419 1941337 1909568
4427 1909568 1898950 1874218 1876683 1860107 1822289 1812903 1791842 1751037 1693534 1660818 1662434 1639209
4415 1639209 1595486 1569509 1515105 1496542 1524525 1499078 1449683 1430667 1391071 1381844 1387955 1351567
4403 1351567 1313801 1304716 1308588 1288256 1274292 1261208 1267465 1276233 1249327 1243547 1245874 1248118 1280428
4390 1280428 1275522 1280342 1261501 1253462 1254862 1216600 1225019 1244119 1249813 1230427 1231070 1234016 1218869
4377 1218869 1208518 1210968 1237941 1222755 1198686 1212208 1229536 1207792 1206932 1228686 1186566 1167990
4365 1167990 1202902 1179077 1168182 1192877 1205372 1163747 1147200 1170793 1164548 1158742 1171676 1183765
4353A183765J4028K4522M4639J2660J02902J15279J14311P9113N7221l1628k4981
4342A691831k8269m3883q6602r9880n8328m2988o5433m2068p864j923m2820j2070
4330A159703K3861k7507m8351j5325k4626k7744L7549J3457J1835j1330K5417
4319A116939k593j3791j2141L1479l275Q658L1799O710l1565J6740j6045M6779
4307A179694P362o1053L4172J7900j6772N4064M7374J4787N846K8833N480K7447
4295A345134J8755J26k1068K9201N0795O5971L1370P3193M7769N4186O6733Q0042
4283A842207P6396M3015R2983M2441P2620J03247J21076J30246J64344K02030
4273B890605K20603K11396K47174K42047K35725J44383J95226K13201J51931J76617
$$ plain form
4353 1183765 1197793 1222315 1266954 1279614 1382516 1497795 1612106 1691219 1748440 1716812 1691831
4342 1691831 1663562 1619679 1533077 1433197 1374869 1331881 1266448 1224380 1216516 1214593 1171773 1159703
4330 1159703 1183564 1156057 1107706 1092381 1067755 1040011 1077560 1091017 1102852 1091522 1116939
4319 1116939 1114346 1100555 1088414 1119893 1116618 1125276 1157075 1163785 1132220 1148960 1132915 1179694
4307 1179694 1187056 1126003 1160175 1178075 1161303 1215367 1262741 1277528 1283374 1312207 1317687 1345134
4295 1345134 1363889 1364015 1342947 1372148 1422943 1488914 1520284 1593477 1641246 1695432 1762165 1842207
4283 1842207 1918603 1961618 2054601 2097042 2169662 2272909 2393985 2524231 2688575 2890605
4273 2890605 3111208 3322604 3569778 3811825 4047550 4191933 4387159 4600360 4752291 4928908
4263D928908K06703K75299L24936L99026M87050N37797N23570N71864N42451M61900
4253I259504M25746L51550K64686K18122K21756K44560K77843L71932M76576N85241
4243A2697516O73192Q07718Q10895P40600P02229N04675K89901J65012K7871j29669
4233A7289940j47509j76200o9111K3020J56818L99481N63434O11344O53209O00584
4223A9905010L74766Q7626j80764m98263o74231p96373q58028p87400o55985m12326
4213A5504032k24979l5955J06275J48023O4223j12163l43148n16513o86536q28068
4203A3075191q91531q94638p89336o78646n28411l95794k89064j86670j37646
4194H283455j81216k06467l28577m43717m83782m47082m81721m61929m11024l89107
$$ plain form
4263 4928908 5135611 5410910 5735846 6134872 6621922 7159719 7683289 8255153 8797604 9259504
4253 9259504 9685250 10036800 10301486 10519608 10741364 10985924 11263767 11635699 12112275 12697516
4243 12697516 13370708 14178426 14989321 15729921 16432150 16936825 17226726 17391738 17419609 17289940
4233 17289940 17142431 16966231 16897120 16920140 17076958 17476439 18039873 18651217 19304426 19905010
4223 19905010 20279776 20367402 20186638 19688375 19014144 18217771 17359743 16572343 15916358 15504032
4213 15504032 15279053 15243098 15349373 15497396 15561619 15449456 15106308 14589795 13903259 13075191
4203 13075191 12183660 11289022 10499686 9821040 9292629 8896835 8607771 8421101 8283455
4194 8283455 8102239 7895772 7567195 7123478 6639696 6192614 5710893 5248964 4837940 4448833
4184D448833l14511k36855k02661j72440j39467j46068j41083j30689j68859j48034
4174B648166j14780j37048j30409j25947j33983r6117n5881n9889p2835q1465
4164A639812j6511l7988n6688k6261k7999q5253j9676J1409l2556l9129r951l2214
4152A266995l3844j3991k6105l5333k8502J4570j5420l9024n9875k1537M249k8899
4140I83284l5122k7035O489j851j5005Q063k2906j35J168o4076l0899K7015j9277
4127H09713l1640j654J1655p972j2717K40k2945O838m59J8704p886k5022l172
4114G33683r108R972k6176J3096n34j9591K3293k7201k1199L1770l293m6708o655
4101F51349K7836j2545L960J7990o707k9394j6508L334l7450j2540K7779J6845
$$ plain form
4184 4448833 4134322 3897467 3694806 3522366 3382899 3236831 3095748 2965059 2796200 2648166
4174 2648166 2533386 2396338 2265929 2139982 2005999 1909882 1854001 1794112 1721277 1639812
4164 1639812 1623301 1585313 1528625 1502364 1474365 1389112 1369436 1380845 1348289 1309160 1299209 1266995
4152 1266995 1233151 1219160 1193055 1157722 1129220 1143790 1128370 1089346 1029471 1007934 1012183 983284
4140 983284 948162 921127 927616 925765 910760 918823 895917 895782 896950 832874 801975 828990 809713
4127 809713 778073 776419 788074 780102 767385 767625 744680 751518 751059 769763 761877 736855 733683
4114 733683 724575 734547 708371 721467 720933 701342 724635 697434 676235 708005 704712 658004 651349
4101 651349 679185 666640 670600 688590 681883 652489 635981 639315 601865 589325 617104 633949
4089F33949k7191Q873M944J1928k748M427K5651J2472k1283M640J7620O406N67
4076F80255K4048j8904n873J2108J6940Q267k679N89K8927o68m529K3684o346
4063G55819j045l179J8018K5194N966L625j6429J0627K2269L296j6933K2746P32
4050H30706k504k4741O362L6426m6232l0968J1251L1475O819k6873o885J4081
4038G98917k188J0183n4739M5890Q195j3577J741J096K1252N396K08O237m113
4025H24498l2406n0379L2453J5678l2698O244J5390J367j2757l246J7170l1681
4013G49633o428k9462j5434J410j2913J2088k9943k2625J6776N628j8594j3166
4001F36970J4406o603K2823J3750l4641O107o970q380J8604m138O229J8425k247
$$ plain form
4089 633949 606758 615631 620575 632503 629755 634182 659833 672305 651022 655662 673282 679688 680255
4076 680255 704303 685399 679526 691634 708574 716841 714162 714751 743678 743010 738481 762165 755819
4063 755819 754774 751595 769613 794807 800773 804398 787969 798596 820865 824161 807228 829974 830706
4050 830706 828202 803461 809823 846249 800017 769049 780300 811775 818594 791721 784836 798917
4038 798917 796729 806912 752173 798063 806258 792681 794422 795518 816770 822166 822374 828611 824498
4025 824498 792092 741713 774166 789844 757146 763390 778780 780147 767390 764144 781314 749633
4013 749633 743205 713743 698309 699719 686806 698894 668951 646326 663102 668730 650136 636970
4001 636970 651376 644773 667596 681346 646705 652812 645842 637462 656066 651928 658157 676582 674335
3988F74335l93L295j0454J1369J7882k2256j9984J562P235K2341K1865J2697K4501
3975G43995K1360j8043K0626J8879M532n97J696Q506L763L8104k8917R437l1529
3962G91812K047l7770K1902L2067L1029l2024J9815L7946l6597j0203j4595K3119
3950H28548L1144N2043L5655O8653K4283J03774J79617K15061J93620P8011l1194
3939A779215j1413k4607j19584j23215q1500r1193o7311n4379l7679l7206m3656
3928A087472j6837K2808J0714m873J0627K6568K8906J9621n1792J9876O1589m471
3916A210208N9439M2085P3210J57093J80733J67641J22976Q740o553j9711q7042
3905A908819j47304j37795q9325p9844n5738o3220p4180k7927l2329k7979K7932
$$ plain form
3988 674335 673942 677237 666783 678152 696034 673778 653794 655356 662591 684932 706797 719494 743995
3975 743995 765355 747312 767938 786817 791349 790752 792448 800954 804717 842821 813904 823341 791812
3962 791812 793859 756089 777991 810058 841087 809063 828878 866824 830227 820024 805429 828548
3950 828548 859692 911735 947390 1016043 1040326 1144100 1323717 1538778 1732398 1810409 1779215
3939 1779215 1767802 1743195 1623611 1500396 1418896 1327703 1260392 1206013 1168334 1131128 1087472
3928 1087472 1070635 1093443 1104157 1099284 1109911 1136479 1165385 1185006 1133214 1153090 1214679 1210208
3916 1210208 1269647 1311732 1384942 1542035 1722768 1890409 2013385 2022125 2015572 1995861 1908819
3905 1908819 1761515 1623720 1534395 1454551 1398813 1335593 1261413 1233486 1201157 1173178 1201110
3894A201110m31r695j0807J176J1563m597K151j1463J7861k4923j2337k0627m1182
3881A097799l285n540K902k7530J8853K7174n634J0920K0454n543K4377j5160
3869A139787o570J4553j4103p27K6500J4568j786J5559K6278k6634l7780p839
3857A141806L70M1751N435K2435L8726L243J5278O937j7179J9247j818j7254m416
3844A254561N2761K6221J5438L6741J8495r02r683J7608o430j8923M4468M6377
3832A476732N4192O026L4504K6267O667L6777J6482N0362N4635k087J9285M9159
3820A829001L2008L9840P2628M3574L2289L9807O4313O1200R4411P7866O7589
3809B454526R6778R8364J05584J23830K19963J86477K16621K62158K99865L55237
$$ plain form
3894 1201110 1200679 1190984 1180177 1181353 1192916 1188319 1190470 1179007 1196868 1171945 1159608 1138981 1097799
3881 1097799 1094514 1088974 1091876 1064346 1083199 1110373 1104739 1115659 1136113 1130570 1154947 1139787
3869 1139787 1133217 1147770 1133667 1132940 1159440 1174008 1172222 1187781 1214059 1187425 1149645 1141806
3857 1141806 1142176 1183927 1189362 1211797 1250523 1253766 1269044 1275981 1258802 1278049 1276231 1258977 1254561
3844 1254561 1307322 1333543 1348981 1385722 1404217 1403315 1393632 1411240 1404810 1385887 1430355 1476732
3832 1476732 1530924 1536950 1571454 1597721 1604388 1641165 1657647 1708009 1762644 1760557 1779842 1829001
3820 1829001 1861009 1900849 1973477 2017051 2049340 2089147 2153460 2214660 2309071 2386937 2454526
3809 2454526 2551304 2649668 2755252 2879082 3099045 3285522 3502143 3764301 4064166 4419403
3799D419403L92677M65182O12390P22299Q22454R71854J133810J191883J232978
3790A1964930J295207J263113J217630J100035Q94036P18141N12287L42835J50383
3781A9458597J947p6044r4842j35258p0039j5756L1829J10024P6475J4117o0472
3770A9240578j75357l45116n65563o91509q53440j026579j093414j139919j130503
3761A2219178j103748j090239r95024q71328p05112o23900n26027m72711m00012
3752E431077l08013k57203k02940k19579j62345j44965j59784r4515r1656j05718
3742C684359n5450p9805o2881n7271l2698l2466k7110o6245l6866k5909k3667
3731C183991n9792m0911k7984n9371j8715j8318k3517m1025j9824m8101l0617
$$ plain form
3799 4419403 4812080 5277262 5889652 6611951 7434405 8406259 9540069 10731952 11964930
3790 11964930 13260137 14523250 15740880 16840915 17734951 18453092 18965379 19308214 19458597
3781 19458597 19460544 19384500 19289658 19154400 19084361 19068605 19100434 19210458 19286933 19301050 19240578
3770 19240578 19065221 18720105 18154542 17463033 16609593 15583014 14489600 13349681 12219178
3761 12219178 11115430 10025191 9030167 8158839 7453727 6829827 6303800 5831089 5431077
3752 5431077 5123064 4865861 4662921 4443342 4280997 4136032 3976248 3881733 3790077 3684359
3742 3684359 3628909 3549104 3486223 3428952 3396254 3363788 3336678 3270433 3233567 3207658 3183991
3731 3183991 3124199 3083288 3055304 2995933 2977218 2958900 2935383 2894358 2874534 2826433 2795816
3720B795816j1176p160j766o579J0288k3432K263K6692m5320J316K2110k3603
3708B739449j0148J6517p049O224m3972N499J7588J262J6575R50K6749L0999L8370
3695B839013J1751r384J7314L2918j8962l449J3727j5927j5386J8606j272R956
3683B878905L980J1131J4178J8195O183K4078J4688N7706J8317Q669L2390O9299
3671C157719N7127K5643K9129N5866O6022M8237K4446N8009Q8110O8205Q7574
3660C766087J27389J05674J08602Q9167J57153K11363J77184K37311K54974L05885
3650E540789L67882M15273M65979N30755N75294N90842O21204O32353O03580N46606
3640A0890557N80747N25984M30666L38123L19280K97078K56604L12133M25493
$$ plain form
3720 2795816 2784640 2777480 2775714 2769135 2779423 2755991 2758254 2784946 2739626 2740942 2763052 2739449
3708 2739449 2729301 2745818 2738769 2744993 2701021 2706520 2724108 2725370 2741945 2742895 2769644 2800643 2839013
3695 2839013 2850764 2841380 2858694 2891612 2872650 2869201 2882928 2867001 2851615 2870221 2868949 2878905
3683 2878905 2882885 2894016 2908194 2926389 2932572 2956650 2971338 3029044 3047361 3056030 3088420 3157719
3671 3157719 3214846 3240489 3269618 3325484 3391506 3439743 3464189 3522198 3610308 3678513 3766087
3660 3766087 3893476 3999150 4107752 4196919 4354072 4565435 4742619 4979930 5234904 5540789
3650 5540789 5908671 6323944 6789923 7320678 7895972 8486814 9108018 9740371 10343951 10890557
3640 10890557 11471304 11997288 12427954 12766077 13085357 13382435 13639039 13951172 14376665
3631A4376665O20513Q35838J149120J507511J948199K379919K677607K880592
3623B8375964L005993K932797K694389K331325J824366J249474O65991J49993
3615D3230292j83319m18979m47618l72723j51472J45616M65639O79152P11946
3606D3658534O10272M24625R1958l49650q44409j237565j557121j812593j903693
3597C7080358j850383j608495j261029r24217n11655k09426O8814K57574L35151
3588C1376692L48417K35803J6329k09744m09282p42713j035642j254889j421829
3579B6903142j499457j567068j556938j537169j427326j296911j156704r58149
3571A5903420p98559o54415m65159l40883j94106n5609K0385J61898L15223L91282
$$ plain form
3631 14376665 14997178 15833016 16982136 18489647 20437846 22817765 25495372 28375964
3623 28375964 31381957 34314754 37009143 39340468 41164834 42414308 43080299 43230292
3615 43230292 43046973 42627994 42180376 41807653 41656181 41801797 42267436 42946588 43658534
3606 43658534 44268806 44693431 44785389 44435739 43591330 42353765 40796644 38984051 37080358
3597 37080358 35229975 33621480 32360451 31436234 30924579 30715153 30783967 31041541 31376692
3588 31376692 31725109 31960912 31977241 31767497 31358215 30615502 29579860 28324971 26903142
3579 26903142 25403685 23836617 22279679 20742510 19315184 18018273 16861569 15903420
3571 15903420 15104861 14450446 13985287 13644404 13450298 13394689 13415074 13576972 13892195 14283477
3561A4283477N03181O69441P48077Q87236J002454J072548J102888J124300J143374
3552B2536976J062659R18592Q17002O29916M67671K11356l9874k15636m28636
3543B5960026o29998p42210q79870r43469j008482r83353r14646q72312p57253
3534A8228433o84294n99903m88725m00856k97811k15532j81188j97438j76794
3525A4985892j38434j68741j09520j08821q3952l7300j7080O8426J31644J21650
3515A4643764J36869K09791J50037J47158J44290J66619J46305J51087J57818
3506A6053738J69883K44073K80556L40900M34586N29686N67003N94013O45343
3497A9859781P00403P70883P76438Q48565Q77646Q77369J012003J095208J244669
$$ plain form
3561 14283477 14786658 15456099 16204176 17091412 18093866 19166414 20269302 21393602 22536976
3552 22536976 23599635 24518227 25335229 25965145 26432816 26644172 26604298 26388662 25960026
3543 25960026 25330028 24587818 23707948 22764479 21755997 20772644 19857998 18985686 18228433
3534 18228433 17544139 16944236 16455511 16054655 15756844 15541312 15360124 15162686 14985892
3525 14985892 14847458 14678717 14569197 14460376 14376424 14339124 14322044 14390470 14522114 14643764
3515 14643764 14780633 14990424 15140461 15287619 15431909 15598528 15744833 15895920 16053738
3506 16053738 16223621 16467694 16748250 17089150 17523736 18053422 18620425 19214438 19859781
3497 19859781 20560184 21331067 22107505 22956070 23833716 24711085 25723088 26818296 28062965
3488B8062965J383305J530730J701473J931820K127964K306703K524214K798004
3480D4367178L168835L533329L896758M282665M678347N002243N211380N374777
3472G9515512N440647N369489N175018M949708M708078M349556L995773L738685
3464A17242466L512243L247804K906207K498886K048925J421767O54285r9129
3456A33433454q88033j652429k379811l049763l632631m068912m421788m697441
3448A08642646m852484m861886m870996m807123m643741m443813m178763l801215
3440G2182625l284423k699030k032097j289149n04656L01406J000019J641872
3432F5316567K208974K496740K635973K513639K146949J681113J103917N64308
$$ plain form
3488 28062965 29446270 30977000 32678473 34610293 36738257 39044960 41569174 44367178
3480 44367178 47536013 51069342 54966100 59248765 63927112 68929355 74140735 79515512
3472 79515512 84956159 90325648 95500666 100450374 105158452 109508008 113503781 117242466
3464 117242466 120754709 124002513 126908720 129407606 131456531 132878298 133532583 133433454
3456 133433454 132545421 130892992 128513181 125463418 121830787 117761875 113340087 108642646
3448 108642646 103790162 98928276 94057280 89250157 84606416 80162603 75983840 72182625
3440 72182625 68898202 66199172 64167075 62877926 62373270 62674676 63674695 65316567
3432 65316567 67525541 70022281 72658254 75171893 77318842 78999955 80103872 80668180
3424H0668180L524n16068r24376j178791j327213j289255j185396r99123p02772
3415G2548710m82750k31835j27987l9764j63786l82542p19796j126161j618678
3406F7655411k189464k620673l011233l301922l492788l558395l520007l392128
3398D2568801l210072l024825k783082k503391k331646k091939j921804j713808
3390B2988234j518328j381991j211127j098310r71736q69468p87179p30114o15136
3381A3804845n57373m86655l96249m03459l63825k65344k41502j70165q0777o0008
3371A0779488k5562J9499R0150J47701K49752L39371L84965M47160M76420N28432
3361A3437376N32408N20649N16058M35584L62805K59457J09015k3278j54933k66925
$$ plain form
3424 80668180 80671704 80155636 79231260 78052469 76725256 75436001 74250605 73251482 72548710
3415 72548710 72065960 71834125 71706138 71666374 71502588 71120046 70400250 69274089 67655411
3406 67655411 65465947 62845274 59834041 56532119 53039331 49480936 45960929 42568801
3398 42568801 39358729 36333904 33550822 31047431 28715785 26623846 24702042 22988234
3390 22988234 21469906 20087915 18876788 17778478 16806742 15937274 15150095 14419981 13804845
3381 13804845 13247472 12760817 12364568 11961109 11597284 11331940 11090438 10920273 10839496 10779488
3371 10779488 10753926 10773425 10863575 11011276 11261028 11600399 11985364 12432524 12908944 13437376
3361 13437376 13969784 14490433 15006491 15442075 15804880 16064337 16173352 16150074 15995141 15728216
3351A5728216l42551m65266m51828m38757n08928n27214n51757n73341o25868
3342A1242706n64176n11143m61979m08606l70985l22382k57727j86002j22088
3333H037618p8499l9216q188K3683O2559Q5633J23984J77882K02417K25454L22741
3322I136068L26201M10194M59307N26698O77541P87186R11899J110787J360914
3313A5706795J632894J939724K346564K834730L418205L928300M443362M925158
3305D1175732N313585N561243N703380N697168N491999N102946M349999L410184
3297H1806236K278795R86680l20993j638320k855155l840976m695087n243161
3289F6478019n454653n373320n192561m936271m705751m502967m086352l611470
$$ plain form
3351 15728216 15385665 14920399 14468571 14029814 13520886 12993672 12441915 11868574 11242706
3342 11242706 10678530 10167387 9705408 9296802 8925817 8603435 8345708 8159706 8037618
3333 8037618 7959119 7919903 7911715 7935398 7997957 8083590 8207574 8385456 8587873 8813327 9136068
3322 9136068 9462269 9872463 10331770 10858468 11536009 12323195 13235094 14345881 15706795
3313 15706795 17339689 19279413 21625977 24460707 27878912 31807212 36250574 41175732
3305 41175732 46489317 52050560 57753940 63451108 68943107 74046053 78396052 81806236
3297 81806236 84085031 85071711 84750718 83112398 80257243 76416267 71721180 66478019
3289 66478019 61023366 55650046 50457485 45521214 40815463 36312496 32226144 28614674
3281B8614674l240100k923784k504040k113971j826496j551746j276220j036840
3273A2141477q76798p31743o50209n95183m38734l70832l54505l11878k68144
3264G543451j88428j60090l8821R6787K38621K78100K57402N8962j78273j93015
3254G714696k47294l81382m10269l87588k88355k16450j74202j32690r9528n1807
3244E325131j1703r056k1938J2112n36m6180k8826l7968o3341n7651j38013j00762
3232D821269j22265j42944j50654j24909j28224j28184j11211j25211q8744o6852
3222C632071o6007o9151q3788o8324q3175n7536n0238k5909k9828n0535j383j7992
3210C028205k5263L9485L4563n7291K9779J5580J7082L2522P7182N4218L2514
$$ plain form
3281 28614674 25374574 22450790 19946750 17832779 16006283 14454537 13178317 12141477
3273 12141477 11264679 10532936 9882727 9287544 8848810 8477978 8123473 7811595 7543451
3264 7543451 7355023 7194933 7156112 7252899 7491520 7769620 8027022 8085984 7907711 7714696
3254 7714696 7467402 7086020 6675751 6288163 5999808 5783358 5609156 5476466 5376938 5325131
3244 5325131 5313428 5304372 5282434 5294546 5294010 5247830 5219004 5181036 5117695 5060044 4922031 4821269
3232 4821269 4699004 4556060 4405406 4280497 4152273 4024089 3912878 3787667 3698923 3632071
3222 3632071 3566064 3496913 3413125 3344801 3261626 3204090 3153852 3127943 3098115 3047580 3046197 3028205
3210 3028205 3002942 3042427 3076990 3019699 3049478 3065058 3082140 3114662 3191844 3246062 3278576
3199C278576L0899L4137O8692M7910M8054M0449M6270P6407P8558Q0908O0768
3188C891628L9943K8584M1843N7843N2291K9821P097J6397J6827R5694L0205M4745
3176D352918O3342O9097L0562K6681Q0280O9673M4217J07005J22506Q6158J04511
3165E156950J14296Q2710Q7957J71079J22867J48415J55609J82254J72636K02936
3155F597709K45377K97253L44243L17102L54458M30186M18901L96649M22914L75511
3145A0200303L18164K39154J95347J69581J39110P2853M1203j5653l4933j164
3135A1323965L436J9063P0007Q5868J37252J57234J97262K01051K46604L17270
3125A2759012L56007L73250M91114O05371Q30096J188971J494010J703166J574567
$$ plain form
3199 3278576 3309475 3343612 3412304 3460214 3508268 3548717 3594987 3671394 3749952 3830860 3891628
3188 3891628 3931571 3960155 4001998 4059841 4112132 4141953 4149050 4165447 4182274 4277968 4308173 4352918
3176 4352918 4416260 4485357 4515919 4542600 4622880 4692553 4736770 4843775 4966281 5052439 5156950
3165 5156950 5271246 5353956 5441913 5612992 5735859 5884274 6039883 6222137 6394773 6597709
3155 6597709 6843086 7140339 7484582 7801684 8156142 8586328 9005229 9401878 9824792 10200303
3145 10200303 10518467 10757621 10952968 11122549 11261659 11334512 11375715 11360062 11325129 11323965
3135 11323965 11327401 11346464 11416471 11502339 11639591 11796825 11994087 12195138 12441742 12759012
3125 12759012 13115019 13488269 13979383 14584754 15414850 16603821 18097831 19800997 21375564
3116B1375564J004660L97744J52814j27571n85933q39794q83038q34656p32828
3107A8926962n71055m23091k47688k8901P0862J80322K57802L19062M73490N15632
3097A9473397O54196Q06625R19301J124445J377966J663316J876821K196097K496457
3088C2588621K789866L119525L532359M028304M829387O031612P760308J0189506
3080G4869488J3266464J6375322J8389107J8047962J5162373J0822222P208425
3073A74141363N415991N519555Q069372J3778263K0862377K5280786K3341559
3066B76409266J4420983K491808p166409j4265575k1476722k7405969k9655707
3059A93351675k8667937k5959950k2573279j8787908j5006102j1705049r052443
$$ plain form
3116 21375564 22380224 22777968 22930782 22803211 22217278 21377484 20494446 19659790 18926962
3107 18926962 18355907 17932816 17685128 17656227 17727089 17907411 18165213 18484275 18957765 19473397
3097 19473397 20127593 20934218 21853519 22977964 24355930 26019246 27896067 30092164 32588621
3088 32588621 35378487 38498012 42030371 46058675 50888062 56919674 64679982 74869488
3080 74869488 88135952 104511274 122900381 140948343 156110716 166932938 174141363
3073 174141363 179557354 185076909 193146281 206924544 227786921 253067707 276409266
3066 276409266 290830249 293322057 286155648 271890073 250413351 223007382 193351675
3059 193351675 164683738 138723788 116150509 97362601 82356499 70651450 61599007
3052F1599007p185250n915445n001844m263781l664607l164921k681499k310701
3044B7410959j977855j711011j493557j307906j207642j074373r53246q37468
3036A6847901p61762o64721o07832n76788n39579n14296m77252m40056m24758
3027A1840857m06573l94195k78700k68477k81199k81997l10858k76381k65124
3018I077353k42412j74095j85063j89887j22593k01747j95161j88408j99846k23527
3008G154614k71796k50893k59619k54602k12134j48519j83714j76188j31937j10371
2998E154841j38320j47282j29155j66359k06915j38682j76337j84350j73207j53482
2988C540752j18399j08346j22566j11937p8938r4134n6994o6549q6555l2223o2871
$$ plain form
3052 61599007 54413757 48498312 43496468 39232687 35568080 32403159 29721660 27410959
3044 27410959 25433104 23722093 22228536 20920630 19712988 18638615 17685369 16847901
3036 16847901 16086139 15421418 14813586 14236798 13697219 13182923 12705671 12265615 11840857
3027 11840857 11434284 11040089 10761389 10492912 10211713 9929716 9618858 9342477 9077353
3018 9077353 8834941 8660846 8475783 8285896 8163303 7961556 7766395 7577987 7378141 7154614
3008 7154614 6882818 6631925 6372306 6117704 5905570 5757051 5573337 5397149 5265212 5154841
2998 5154841 5016521 4869239 4740084 4573725 4366810 4228128 4051791 3867441 3694234 3540752
2988 3540752 3422353 3314007 3191441 3079504 3000566 2906432 2849438 2782889 2696334 2664111 2601240
2977B601240p5209m3493l4696l7853l8994n1975k0304n4058p6489n9520q2164
2966B026485l9672n6268p3151n8092k9718n9390p6683l0151k8028k7671m0716
2955A506945l6967l9591n0205n2795o9753n8698k5712r465j6104j1698k8853l6450
2943A070654j3052j7111k1541j7523k6838R243j3812r492L590p610k8188J5926
2931I44246l5288k058r545J7644k5500k0401K395l5327l0986k9516j2283k5171
2919G38210l0586k7317l9517n2102l117j7395j2748j9581j5599J9703j4838m6493
2907D78620j4488k0792O4o555J5898r570m938J3036J0095k4921K5330K190J0734
2894D74703K076k1472l1191J6702K6294k2781j2316J8023J5330J3541k3225m7905
$$ plain form
2977 2601240 2526031 2482538 2447842 2409989 2370995 2319020 2298716 2244658 2168169 2108649 2026485
2966 2026485 1986813 1930545 1857394 1799302 1769584 1710194 1633511 1603360 1575332 1547661 1506945
2955 1506945 1469978 1430387 1380182 1327387 1257634 1198936 1173224 1163759 1147655 1135957 1107104 1070654
2943 1070654 1057602 1040491 1018950 1001427 974589 983832 970020 960528 964118 956508 928320 944246
2931 944246 908958 906900 897355 914999 889499 869098 871493 836166 805180 775664 763381 738210
2919 738210 707624 680307 640790 588688 585571 568176 555428 535847 520248 539951 525113 478620
2907 478620 464132 443340 443404 436849 452747 443177 438239 451275 461370 436449 461779 463969 474703
2894 474703 476779 455307 424116 440818 467112 444331 432015 450038 465368 478909 455684 407779
2882D07779K0202p591J9403J1314j7376l1723o963j5819k4861j4570L0003k6036
2870C43762l8602J1311q171n7729m9762k449j4818k2528k7454k3887N604Q4R071
2857A24432l334l24O246J2949k4852l2170J0989R22p486L7739j8520J2835K1712
2844A41138m7658j347m524o151K0693j9314j8229k760J7122M400J579K0305p898
2831I7356J0713J7258j201K1884Q394p676M640j7790J5325k7500k0495k6256k890
2818G1762k2386K998O7041J7258l9212k5968M7662K3802L4157J8423Q960K9727
2806B34224J3662L4863L9073m370K4617K1648K8623O1055L9234K8630O3321N8569
2794F43149Q3940O7793O3393N9993J3917M1635O0426J28640J17078R5867J23275
$$ plain form
2882 407779 427981 420390 439793 451107 433731 402008 395045 379226 354365 339795 369798 343762
2870 343762 305160 316471 308300 250571 200809 198360 183542 161014 133560 109673 115277 115361 124432
2857 124432 121098 120774 127020 139969 115117 82947 93936 94858 87372 125111 106591 119426 141138
2844 141138 93480 92133 87609 81458 102151 82837 64608 61848 78970 83370 84949 105254 97356
2831 97356 108069 125327 124126 146010 154404 146728 151368 133578 148903 121403 100908 74652 71762
2818 71762 49376 52374 119415 136673 97461 71493 119155 142957 177114 195537 204497 234224
2806 234224 247886 282749 321822 317452 342069 363717 392340 453395 492629 521259 584580 643149
2794 643149 727089 794882 858275 918268 932185 973820 1034246 1162886 1279964 1375831 1499106
2783A499106J04665K8281k4375q0835j32183j42790j02566j56028j65792j23732
2773G03751p9281j05699n2559p426l4108m4082o721m0388j3937k1275o2740j5921
2761B19614k0933m1315j0464j5080m0469K3009P646k5386J6461l6107j2247L9281
2749A04010o488q420m721k5277k9311n837k6884k8857J3238J2775jJ6104J02j4774
2735d341j6025m984P944K4521J457P074q01j3557J1590R246l987j3079j6191j0349
2721b1482q144j9911p701L3271j2458J2536K8205J6622k3090K906l981n499R456
2708G30k3186k8254P128Q952J039K5711j5466r323O218K2548j9167l1431L8425
2695a6076k5230k2685M5454k1917k9402o75K0936L4002K932J4200k2969l0863
$$ plain form
2783 1499106 1603771 1632052 1607677 1526842 1394659 1251869 1149303 993275 827483 703751
2773 703751 624470 518771 466212 458786 424678 380596 373875 333487 319550 298275 235535 219614
2761 219614 198681 157366 146902 131822 91353 114362 122008 96622 113083 76976 64729 104010
2749 104010 97522 89102 84381 59104 29793 23956 -2928 -31785 -18547 -5772 -5773 10331 10433 -4341
2735 -4341 -20366 -25350 -17406 7115 8572 15646 14845 1288 12878 22124 18137 5058 -11133 -21482
2721 -21482 -29626 -49537 -57238 -23967 -36425 -23889 4316 20938 -2152 754 -3227 -8726 730
2708 730 -22456 -50710 -43582 -34630 -33591 -7880 -23346 -32669 -26451 -3903 -23070 -54501 -16076
2695 -16076 -41306 -63991 -18537 -40454 -69856 -70531 -49595 -15593 -12661 1539 -21430 -52293
2683e2293R700J8555J6048M841k2620j2370n12l9105K4393K4168q613J2990J1527
2670a3291L773j6994m1357J5192Q895k1458K9607r42K0184K4416J5404o970j0995
2657E464J6367J163o781k7460m996J7434j0914R6k3955j6101K0867Q285q733K2534
2643f730k8633K0141k408n347q416K7681m164J7956O005m2222j2547j6852j516
2630e7052K5598J7327m8821K0032N0510k36k1016L6426j9228p784L2670r90k0576
2617F860Q762j5346j7703j7127L0720j3965Q619O443J494K7505j0473M099M178
2604B4066j0061P902P047k0299K7884Q452k348K4921m9284K0069L1569n0064n911
2591A3943M3287j746n822J336J4727J4412K3048K2577P043O718K0884N3348Q481
$$ plain form
2683 -52293 -42593 -24038 -7990 -3149 -25769 -38139 -38651 -77756 -53363 -29195 -37808 -24818 -13291
2670 -13291 -9518 -26512 -67869 -52677 -43782 -65240 -35633 -36575 -16391 8025 23429 16459 5464
2657 5464 21831 22994 16213 -11247 -16243 1191 -9723 -9627 -33582 -49683 -28816 -20531 -29264 -6730
2643 -6730 -35363 -15222 -17630 -22977 -31393 -3712 -7876 10080 16085 -26137 -38684 -55536 -57052
2630 -57052 -31454 -14127 -62948 -42916 7594 7358 -13658 22768 3540 -4244 28426 27436 6860
2617 6860 15622 276 -17427 -34554 -3834 -17799 -9180 -2737 -1243 26262 15789 19888 24066
2604 24066 14005 21907 28954 8655 36539 44991 42643 67564 18280 38349 69918 19854 13943
2591 13943 57230 55484 49662 50998 65725 80137 103185 125762 132805 139523 160407 213755 222236
2578B22236j1860j948l1960j3888l6699j568l153m1368k4269m6270L63j164J1238
2565A9690j9392J5169L1941k2154k7315n40K1819Q896j14k1855k3601l334K6850
2552F060O103m3821j0821M4194O330j3007l1318q990L2503K1812L747N785m713
2539A3864K576J7322J9041k4499K31K78l78q180J1168K2560j7218J5897l085k9099
2525B0478K4662j0428j7834J1791M83m2135j2559M303J1754m395j6022L2443j192
2512A349m7664P044J3855R463l0862n4705K9841L0206o874j717O436m502K0934
2499b7196J2595J9085j8516K2954l0775J7202J8064n706n680n30k0488M936l4928
2486d8983L0434M446q718k026k015O213J2005J0331m0M967J0439L258j2365K1378
$$ plain form
2578 222236 210376 208428 176468 162580 125881 124313 121160 79792 55523 9253 9616 8452 19690
2565 19690 298 15467 47408 25254 -2061 -2601 19218 28114 28000 6145 -17456 -20790 6060
2552 6060 12163 -31658 -42479 1715 8045 -4962 -36280 -45270 -12767 9045 12792 18577 13864
2539 13864 16440 33762 52803 28304 28535 28813 28435 20255 31423 53983 36765 52662 49577 20478
2525 20478 45140 34712 16878 28669 29152 -12983 -25542 -21239 -9485 -13880 -29902 2541 1349
2512 1349 -46315 -39271 -25416 -15953 -46815 -101520 -71679 -41473 -48347 -50064 -43628 -48130 -27196
2499 -27196 -14601 4484 -14032 8922 -21853 -4651 13413 7707 2027 1497 -18991 -14055 -48983
2486 -48983 -18549 -14103 -22821 -24847 -26862 -20649 -8644 1687 1647 6614 17053 20311 7946 29324
2472B9324j7325j6554o995L169R969K0697l345o843j4287J3240K0225J1703J4726
2459E7704k9806j4094L2587J1955j9062m577m2565L1167k839j3301K252R035N1992
2446G0448J9661p185K1182R066j4661k2698m539J2890Q032j7619P655J9490k4203
2433G7519R284L6527J1631J4092j4577k1676K2356j7468j368j1886J5636j0161
2421A09909l238l2568J7705J6179j448Q576L8906k1753N78q139j6900K2576K3930
2408A54313J4125J4320l0327J7432M276l0333j1543K5179P245L2420J9183j5387
2396B00903r987M0535J8220j3977o175k783K5193k2787n518J4938R509J2375K327
2383B62773k0014m9435L62n551j4300L6030J0261L614J5047L2104Q073K1530l3295
$$ plain form
2472 29324 11999 -4555 -11550 -8381 1588 22285 18940 12097 -2190 11050 31275 42978 57704
2459 57704 27898 13804 46391 58346 39284 34707 -7858 23309 20470 7169 9421 18456 70448
2446 70448 90109 82924 104106 113172 98511 75813 71274 84164 92196 74577 82232 101722 77519
2433 77519 86803 123330 134961 149053 134476 112800 135156 117688 116320 104434 120070 109909
2421 109909 106671 74103 91808 107987 106539 115115 154021 132268 132846 124707 107807 130383 154313
2408 154313 168438 182758 152431 169863 174139 143806 132263 157442 164687 197107 216290 200903
2396 200903 190916 231451 249671 235694 229519 226736 251929 229142 223624 238562 248071 260446 262773
2383 262773 242759 193324 193686 188135 173835 209865 220126 223740 238787 270891 278964 300494 267199
2370B67199m370K4639J6096J1021k054L097j0851j2169L9473N6663K2189K2611
2358D33544J9435L4209m603L2584r572j5064L5777N6042J2053L8170K6249L9900
2346F98724Q879K6539M1472M5031L4822K6669O0223M1290O8651R2189Q5980J07935
2334A338404R1844O7992J24921K20836L20807L89952L93217L08510K75169L07998
2324C839650L50907L30921L83904N59097P89211J076904J707665K797259M818537
2315A6654055O977421P946816O509925K443285j686437j146334j692451m575764
2307C1430516n414345m947248m086373l612740k946513k186810j463029q60183
2299E913275n48679l96629l95491m14151l34792l08305k85977l08167k72881k90562
$$ plain form
2370 267199 262829 287468 303564 314585 312531 315628 304777 292608 332081 388744 410933 433544
2358 433544 452979 487188 482585 515169 505597 490533 526310 582352 594405 632575 658824 698724
2346 698724 707603 734142 775614 820645 855467 882136 942359 983649 1052300 1144489 1230469 1338404
2334 1338404 1430248 1498240 1623161 1843997 2164804 2554756 2947973 3256483 3531652 3839650
2324 3839650 4190557 4521478 4905382 5464479 6253690 7330594 9038259 11835518 16654055
2315 16654055 23631476 31578292 38088217 40531502 38845065 37698731 36006280 31430516
2307 31430516 26016171 21068923 16982550 13369810 10423297 8236487 6773458 5913275
2299 5913275 5364596 4967967 4572476 4158325 3823533 3515228 3229251 2921084 2648203 2357641
2289B357641k33634j71970j36196j49305j15076o6339l1980o5288p7179q5104
2279A225570p2011k5760j7398o7921l8950l509k5165o1872O884k4104p1463l8531
2267G85770k993n539j7063l4217k6571k12j0037j6585j6316m7537J1132l5248
2255E84584j9156m4067r537k9206l9927k6047j4251N951J7831k5239P382q883
2243C99435j3193k057j4319l1314j445p423n2767m220j5543j4869l2336k3200
2231A86749K9058l761O286J1701j4681l8296R022J2992m760P882l1865q254R776
2218A71849Q388o52K808l4682k0356k7394j1103N1153j9533l8300k0792K0391
2206H1777R779l3591K2313m1178J1714N7647K5907k9813k3470n911k2744J3798
$$ plain form
2289 2357641 2124007 1952037 1815841 1666536 1551460 1485121 1453141 1387853 1310674 1225570
2279 1225570 1153559 1127799 1110401 1042480 1003530 1000021 974856 912984 919868 895764 824301 785770
2267 785770 782777 777238 760175 725958 699387 699175 689138 672553 656237 608700 619832 584584
2255 584584 565428 521361 511824 482618 442691 416644 402393 408344 426175 400936 408318 399435
2243 399435 386242 384185 369866 338552 337107 329684 276917 272697 257154 242285 209949 186749
2231 186749 215807 212046 218332 230033 215352 177056 186078 199070 194310 202192 170327 162073 171849
2218 171849 180237 179585 182393 147711 127355 99961 88858 140011 120478 82178 61386 81777
2206 81777 91556 57965 80278 39100 50814 108461 134368 104555 81085 75174 52430 66228
2194F6228j5263l6464L4802O210j6631l0363J7315j3021k5368j337J9283J6761
2182B2152k8162k7019K7495L7781L783J867j9308J5099M983P687J8783q246J3358
2169G0253k2810m2275k162L5297K001m3476k2200j1853K060J3616K0429l618j9497
2156b4235L179K5135k6684k2565J8933k9527M8K5480K464K0083J1659k9945J5876
2143a0099r260Q807J7065j9481L739j3431P29K4503m966J1838l365p303k1178
2130b2402k3762l1130J5521K2126K5560l867j0665p050O451J3858m138j2911m5466
2117g7875p979K2401N3863q966l5551q991J6223J9619J7472R144l2903J6205J2810
2104d528n7050j2351j6805J4444p146Q766K2520J1731Q499r649N319J7584n5957
$$ plain form
2194 66228 50965 14501 49303 55513 38882 8519 25834 12813 -12555 -13892 5391 22152
2182 22152 -6010 -33029 -5534 32247 36030 37897 18589 33688 38671 46358 65141 56895 70253
2169 70253 47443 5168 3006 38303 40304 -3172 -25372 -37225 -35165 -21549 -1120 -4738 -24235
2156 -24235 -21056 4079 -22605 -45170 -26237 -55764 -55716 -30236 -27772 -7689 3970 -25975 -10099
2143 -10099 -19359 -10552 6513 -12968 -9229 -22660 -21931 2572 -2394 9444 6079 -1224 -22402
2130 -22402 -46164 -77294 -61773 -39647 -14087 -17954 -28619 -35669 -29218 -15360 -19498 -32409 -77875
2117 -77875 -85854 -63453 -9590 -18556 -54107 -63098 -46875 -27256 -9784 -640 -33543 -17338 -4528
2104 -4528 -61578 -73929 -90734 -76290 -83436 -74670 -52150 -40419 -31920 -41569 -36250 -18666 -74623
2091g4623J85J328K4292J6720m7745j3783j0873O90J156L0682K2746j1037n755
2078f6017J2215J2310r426L7311N280j4869l0896k4030J5873N142l3927L0327
2066f0707M845j6021L0525O110j3895k4698L591k205K8024J392p351K7155L312
2053a9923p076P020J5557m836j347R189J1774L7350M3174J7891J9091K0613l1438
2040A17039J4962J8129l9724l8454l2822l3537k0610m6787K6389J6897j3975J3851
2028a8642L7964n344l8936j569j6432Q895L0013q346l5318n955J5452L079Q545
2015b6594p955J6925o099q695j0529P590J9021K2333l8939k158J3298O066l2421
2002d8157j7832l3070K672K3409L0881N4197m3499N519j9060J0597K4845k1794
$$ plain form
2091 -74623 -74438 -73110 -48818 -32098 -79843 -93626 -104499 -103809 -102653 -71971 -49225 -60262 -66017
2078 -66017 -53802 -41492 -50918 -13607 -8327 -23196 -54092 -78122 -62249 -57107 -91034 -60707
2066 -60707 -55862 -71883 -41358 -35248 -49143 -73841 -70250 -72455 -44431 -43039 -50390 -23235 -19923
2053 -19923 -26999 -19979 -4422 -9258 -10605 -1416 10358 47708 90882 108773 127864 148477 117039
2040 117039 132001 150130 110406 71952 39130 5593 -15017 -61804 -35415 -18518 -32493 -18642
2028 -18642 19322 13978 -24958 -26527 -42959 -34064 -4051 -12397 -47715 -53670 -38218 -35139 -26594
2015 -26594 -34549 -17624 -23723 -32418 -42947 -35357 -16336 5997 -32942 -35100 -21802 -15736 -48157
2002 -48157 -65989 -99059 -96387 -72978 -42097 12100 -31399 -25880 -44940 -34343 -9498 -31292
1990c1292L003l0089j609n798j3948O796J2799j9462q077J4264J6322L5362j7097
1977c8826k2030j8497M387j9414L6263l3209j5633K6794M7428K8241m5700k0532
1965g0728J1616l226o677j6129K890J0198K0160J1434R507j2995J0992l1271l453
1952f7682J1650P243K3675l6680o629L148j6388R684K7641N562k723J0940K0201
1939a0358l0727k124K0421R676j2678l265K575j1856M34J8583k9892j2296K357
1926e9150J7463L3549p676k0489l3756R348K0939k1275N929M059J5915N5238n782
1913A4312m885P553j669j1281n5424m5270L1323J0756J0310O135j6403j4564J1155
1900e7952l5391j5311L6247J1055P526p262J1433L0118k4148j4179k0151J4117
$$ plain form
1990 -31292 -28289 -58378 -59987 -65785 -79733 -72937 -60138 -79600 -87677 -73413 -57091 -21729 -38826
1977 -38826 -60856 -79353 -74966 -94380 -58117 -91326 -106959 -80165 -32737 -4496 -50196 -70728
1965 -70728 -59112 -62338 -69015 -85144 -82254 -72056 -51896 -40462 -30955 -43950 -32958 -64229 -67682
1952 -67682 -56032 -48789 -25114 -61794 -68423 -65275 -81663 -71979 -44338 -38776 -41499 -30559 -10358
1939 -10358 -41085 -43209 -22788 -13112 -25790 -29055 -26480 -38336 -37902 -19319 -49211 -61507 -59150
1926 -59150 -41687 -8138 -15814 -36303 -70059 -60711 -39772 -61047 -55118 -51059 -35144 20094 14312
1913 14312 9427 16980 15311 4030 -51394 -96664 -65341 -54585 -44275 -38140 -54543 -69107 -57952
1900 -57952 -93343 -108654 -72407 -61352 -53826 -61088 -49655 -19537 -43685 -57864 -78015 -63898
1888f3898q62J089K1774l3102J857J4422p632N658J7649j5159K2197o724j7653
1875f0384L3379k2773J672K6158k4710j0275J2987J2956Q140k889k4533L3247
1863a7025J7864j4215k0010J214n7L4245j3777L163n257l995l0819J3627O851
1850b8191j165J4967P474m9574O868M6956k9679m375M441n04j750J2170K5997
1837C635l144n086l760J0553k8760o525L1847k3651l5898j2354o779K961J7158
1824e9803j164M0586j8939L974L3391k9218J0146P704l0895q490J8535N771o372
1811c4774J4181k763j3643L4176k193l665k1058j4672K0005l3464m850J7269J7676
1798b7775K458r03k6370O686j5251L148M4180J5690l8453K0878J6492j4335K7089
$$ plain form
1888 -63898 -64760 -63671 -41897 -74999 -73142 -58720 -66352 -60694 -43045 -58204 -36007 -42731 -60384
1875 -60384 -27005 -49778 -48106 -21948 -46658 -56933 -43946 -30990 -22850 -25739 -50272 -17025
1863 -17025 839 -13376 -33386 -32172 -32229 2016 -11761 -8598 -13855 -17850 -48669 -35042 -28191
1850 -28191 -29356 -14389 -6915 -56489 -49621 -2665 -32344 -36719 -32278 -32782 -34532 -22362 3635
1837 3635 491 -4595 -8355 2198 -26562 -33087 -1240 -24891 -60789 -73143 -79922 -76961 -59803
1824 -59803 -60967 -20381 -39320 -35346 -1955 -31173 -21027 -13323 -44218 -52708 -34173 -28402 -34774
1811 -34774 -20593 -23356 -36999 -2823 -5016 -8681 -29739 -44411 -24406 -57870 -62720 -45451 -27775
1798 -27775 -25317 -26220 -52590 -45904 -61155 -58007 -13827 1863 -36590 -15712 780 -13555 13534
1785A3534j9669m9047L9015O455j9693k5453J0982M157j6718L009L964O687L3649
1772i128k46k6619P51J5204L300J6546r252J06r87m6360j6381O304L4584l369
1758c5547l4428K6207K7497J2433k200l8690j01N762Q625q401j7882O486Q127
1745d2112j856M561K4341j1665m3713P854N3377k618m9254N909K4733l683Q488
1732b5638l618j2047j2900K4795k3020j1533K0058j1975k8142M4286O348p985
1720d1371j7737R664L6068m1226K8020J7788j127l42k7441l3055K5029l871L1675
1707a7926j0196k3922M281K6107L5514k2450j8451l952j4081J2755P139J4565
1695a0617l9608p941J7184J3028j2230N115K4873K502J0702K2639l6134j2776
$$ plain form
1785 13534 -6135 -55182 -16167 -9712 -29405 -54858 -43876 -39719 -56437 -53428 -49464 -42777 -9128
1772 -9128 -9374 -35993 -35242 -20038 -16738 -192 -9444 -9338 -10325 -56685 -73066 -66762 -32178 -35547
1758 -35547 -69975 -43768 -16271 -3838 -6038 -44728 -44829 -39067 -30442 -38843 -56725 -50239 -42112
1745 -42112 -43968 -39407 -15066 -26731 -70444 -62590 -9213 -11831 -61085 -55176 -30443 -34126 -25638
1732 -25638 -29256 -41303 -54203 -29408 -52428 -63961 -43903 -55878 -84020 -39734 -33386 -41371
1720 -41371 -59108 -49444 -13376 -54602 -26582 -8794 -9921 -10263 -37704 -70759 -45730 -49601 -17926
1707 -17926 -28122 -52044 -47763 -21656 13858 -8592 -27043 -30995 -45076 -32321 -25182 -10617
1695 -10617 -50225 -58166 -40982 -27954 -40184 -35069 -10196 -7694 3008 25647 -10487 -23263
1683b3263J0298n478N164m646j0517l550m551L5579Q977j2912M835m2676J4207
1670b8533J4944j3414j2359J6712n494j211J6839o858l131l0643l2385K9881L0967
1657b4685k003k7612K1254j6063K8456q092j5867M2726J7823j9328l6095K4805
1645a4681l459m210l2155k4884L9889M7242j5746m7725J6113L9103m664l9791
1633d4968k866J7425r202P551J7545J8721l4365p684o729M6647N911k0130j2405
1620b4549j21O428j2180J4987J140k250j8861J308K211k5740M1509M764l2544
1607d3898J6826j6528L7360n023l4148m680J4611J8109l3629j121M246J1979j3892
1594d9788K4270K4250j8246m37k2227o059L0246j70l0566K0977j0562J6502j8310
$$ plain form
1683 -23263 -12965 -18443 -13279 -17925 -28442 -31992 -36543 -964 8013 -4899 -64 -42740 -28533
1670 -28533 -13589 -27003 -39362 -22650 -28144 -29355 -12516 -19374 -22505 -53148 -85533 -55652 -24685
1657 -24685 -26688 -54300 -33046 -49109 -20653 -28745 -44612 -1886 15937 -3391 -39486 -14681
1645 -14681 -18140 -22350 -54505 -79389 -39500 7742 -8004 -55729 -39616 -513 -5177 -44968
1633 -44968 -47834 -30409 -39611 -32060 -14515 4206 -30159 -37843 -44572 2075 7986 -12144 -24549
1620 -24549 -24670 -18242 -30422 -15435 -14295 -16545 -35406 -34098 -31887 -57627 -16118 -11354 -43898
1607 -43898 -27072 -43600 -6240 -11263 -45411 -50091 -35480 -17371 -51000 -52121 -47875 -35896 -49788
1594 -49788 -25518 -1268 -19514 -19951 -42178 -48237 -17991 -18161 -48727 -27750 -38312 -21810 -40120
1581d0120m025p444J2693l2755L5900J0835o0100M1898R05J4665K2936k0784m5832
1568g1228j299L0248J5321J3859J9872j9239l2128K5881j3346L7042N310N672
1556A5965J5772l5288k2068J7005o360J0727M074j8093O755l634Q897M175j1312
1543a3385j2262j3270l6441m551K262N878J4445K6536l7043J2981K5517m263j4905
1530d8501k9771M5888L851k4813J9071K2459o052k2404J3777L2858j1869p638
1518a3144K85j0164N067L667j9052r441n19Q779j9500m589M410K0370L446K276
1504b8109K6219l4876j8751J20J2447J8911Q607k9745J4691J0415O031J771m818
1491a7087O187R649J048l1079J2479M5053m5416k2934L3091L746k5103K70K4873
$$ plain form
1581 -40120 -44145 -51589 -38896 -71651 -35751 -24916 -85016 -43118 -42213 -27548 -4612 -25396 -71228
1568 -71228 -72527 -42279 -26958 -13099 6773 -12466 -44594 -18713 -32059 4983 10293 15965
1556 15965 31737 -3551 -25619 -8614 -14974 -4247 -173 -18266 -11511 -15145 -6248 -2073 -13385
1543 -13385 -25647 -38917 -75358 -79909 -77647 -71769 -57324 -30788 -67831 -54850 -29333 -33596 -48501
1530 -48501 -78272 -32384 -28533 -53346 -34275 -11816 -17868 -40272 -26495 6363 -5506 -13144
1518 -13144 -12859 -23023 -17956 -14289 -33341 -42782 -43301 -34522 -54022 -58611 -54201 -33831 -30385 -28109
1504 -28109 -1890 -36766 -55517 -55397 -42950 -24039 -15432 -45177 -30486 -20071 -14040 -12269 -17087
1491 -17087 -10900 -1251 -203 -31282 -18803 26250 -19166 -42100 -9009 -5263 -30366 -30096 -5223
1478e223j7283k623K5318M205k8590p827j224N092J0101J0485j9117L3281J0247
1465A6842k0605J0325o3457J4047K8236j5476M134O073j4398K7445K5419j5251
1453C334k5298j39J731j4890l3081K3474M200J5640o764K123J4413j7987M549
1440b8695K7558j8732K55J7105j3903j4592j1979L2795m508N580p843L855m353
1427a7457J5665j8921M505J6480m816k5717M66o089o574l6280k7929P262K6669
1414g2736N0301j0734K4532k6932J0014J7144J261m4568n53Q361M964P029j1990
1401d3907j6274m059J1139J1532J9956r145K5015L0049R362m3880j160L255K8534
1388B0417j4285j6922j3488K8265K6160O9k427Q6o213m8691l884L9958k1013k5242
$$ plain form
1478 -5223 -22506 -25129 189 4394 -24196 -32023 -33247 -28155 -18054 -7569 -26686 6595 16842
1465 16842 -3763 6562 -56895 -42848 -14612 -30088 -25954 -19881 -34279 -6834 18585 3334
1453 3334 -21964 -22103 -20372 -35262 -68343 -44869 -40669 -25029 -31793 -29670 -15257 -33244 -28695
1440 -28695 -1137 -19869 -19614 -2509 -16412 -31004 -42983 -10188 -14696 -9116 -16959 -13104 -17457
1427 -17457 -1792 -20713 -16208 272 -4544 -30261 -29795 -35884 -42458 -78738 -106667 -99405 -72736
1414 -72736 -22435 -33169 -8637 -35569 -25555 -8411 -7150 -51718 -52271 -43910 -38946 -31917 -43907
1401 -43907 -60181 -64240 -53101 -41569 -21613 -30758 -5743 24306 33668 -10212 -11372 -8117 20417
1388 20417 6132 -10790 -24278 3987 30147 30216 27789 27875 21662 -27029 -30913 9045 -11968 -37210
1374c7210L5174J1876l5303j2643o742P341m524K1537J2735k087m299k5329L512
1361c5962n1Q158k9805p126L9959j2510Q357p874p652N080m143L5310L3764k8801
1347c296j7288K1115j6930O636j6219k3253J1553J7203J58K5207j7769j7703o307
1334c6893K648p144J2982J8234k6072j6372q20J8919K9403j37P251J5762K2146
1321C9907j8586k3824k0839J0187J9825J0271j3319Q268K3045k3473j0677j8159
1309a7374j3575R244L3471J0777j5331k8352l385q000J5099K0288k446k4462J825
1296b2221L2153m589k8249m957K7274K7915k0780o7530J8239O898p533M0267j5687
1283a8800O940L3458j995m4382K0292j3064j5069L3726J1554J608J482j6954J2671
$$ plain form
1374 -37210 -2036 9840 -25463 -38106 -44848 -37507 -42031 -20494 -7759 -9846 -14145 -39474 -35962
1361 -35962 -36013 -27855 -57660 -64786 -24827 -37337 -28980 -36854 -44506 -39426 -43569 -8259 25505 -3296
1347 -3296 -20584 531 -16399 -9763 -25982 -49235 -37682 -20479 -20321 4886 -12883 -30586 -36893
1334 -36893 -34245 -41389 -28407 -10173 -36245 -52617 -53437 -34518 -5115 -5252 1999 17761 39907
1321 39907 21321 -2503 -23342 -13155 6670 16941 3622 11890 34935 11462 785 -17374
1309 -17374 -30949 -21705 11766 22543 7212 -21140 -24525 -32525 -17426 2862 416 -24046 -22221
1296 -22221 9932 5343 -22906 -27863 -589 27326 6546 -60984 -42745 -35847 -43380 -3113 -18800
1283 -18800 -11860 21598 19603 -24779 -4487 -17551 -32620 1106 12660 14268 15750 -1204 11467
1270A1467k7222J0822R523k1361N107J3423N162J4223j4665k6479l203L0112J7800
1257B4709j5449j7644j1579o118M047Q785n512k339j3098q325k775J7446L0505
1244B653J2986m2551r475K7404L7727j3454l7030r428J2708N004K9964K2576k9415
1231I669k6162J5429k1147L0516j0383j8218q155L9076q785k1287n957j710O700
1218b0414j6147r31P230J0038J1494j4190J4999p230J7484Q009j4668N842J1242
1205A2758p099J5758K3534j3755o519l7186K1434J1981j0221q411J4250J9858
1193C6382Q838n0318k8817M446L9015l269k6054K365K5182K1623k8933k6868K0338
1180f070J0985k3025j7887r828R141K2371j6006J2336o536k1011j2385J3329L8555
$$ plain form
1270 11467 -15755 -4933 4590 -16771 -11664 1759 6921 21144 6479 -20000 -23203 6909 24709
1257 24709 9260 -8384 -19963 -26081 -22034 -13249 -18761 -21100 -34198 -42523 -45298 -27852 2653
1244 2653 15639 -26912 -36387 -8983 28744 15290 -21740 -31168 -18460 -13456 16508 39084 9669
1231 9669 -16493 -1064 -22211 8305 -2078 -20296 -28451 10625 1840 -19447 -25404 -27114 -20414
1218 -20414 -36561 -37492 -30262 -20224 -8730 -22920 -7921 -15151 2333 10342 -4326 1516 12758
1205 12758 5659 21417 44951 31196 24677 -12509 8925 20906 10685 2274 16524 36382
1193 36382 45220 -5098 -33915 -29469 9546 6277 -19777 -17412 7770 29393 460 -26408 -6070
1180 -6070 4915 -18110 -35997 -45825 -36684 -14313 -30319 -17983 -24519 -45530 -57915 -44586 -6031
1167f031L8343k5563k0867J7734k5808k0395M0455L2858l7923J2852K462Q487
1155A6604M496m5322j4673Q941J701K6683k156J1487J9465J1950n6146q815K5284
1142e01J3049j434J8141J3526M242m7389l3192M9198m067O397j1952j9145q643
1129b1770m984j1766L3591R141q449K765M050J5788L1271l2590k2953o030J1373
1116e63j411J4206j4757r730M483k4568J5132L7276j4467m512j6649L7500J2450
1103C4390j4172k8474j8078R833Q118q936j5780M2582j5176j6970p835N1628P402
1090B8532j8264k5530L8583M893m12J5689l8638P820j4810O568l598l2302O148
1077b5321M896r641J6895M544N200j4476L3879m037n161j1826R235K6283k975
$$ plain form
1167 -6031 32312 6749 -14118 3616 -22192 -42587 -2132 30726 -7197 5655 8117 16604
1155 16604 21100 -24222 -38895 -29954 -28253 -1570 -3726 7761 27226 39176 -16970 -25785 -501
1142 -501 12548 11114 29255 42781 47023 -366 -33558 15640 11573 17970 6018 -13127 -21770
1129 -21770 -26754 -38520 -4929 4212 -4237 -1472 2578 18366 49637 17047 -5906 -11936 -563
1116 -563 -1974 12232 -2525 -12255 -7772 -32340 -17208 20068 5601 1089 -15560 21940 34390
1103 34390 20218 -8256 -26334 -16501 -8383 -17319 -33099 9483 -5693 -22663 -30498 21130 28532
1090 28532 10268 -15262 23321 28214 27802 43491 4853 12673 -2137 4431 833 -31469 -25321
1077 -25321 -20425 -30066 -13171 -8627 -3427 -17903 15976 11939 6778 -5048 4187 30470 27495
1064B7495j5888j3449M364o9504J558J0953M7128K6057k5063j0786N834L118L96
1051g787J9335j7218N456N2070j938m6302J3788N012l5590j7861J2391K7393j829
1038F920m631P41m4268L4536J6220k877j4468P105J7533j6089K0799m0837n614
1025b4930K6399m849j5745R492l0076L2409L2222k2650m8889K0259L9246R725
1013B2613J400k5176m246J1902k3175P086Q953N031O925p102j8888K6992j9153
1000f838L642J1519j7555J5268j229k458k86j2737k916l8520J2512N3513j5034
987a119j6687M6116N402n6658M3569J2731j964m679J2585m0305j8269O650n127
974a7755J427j0637k0983J6148J1636L192O303R931j7601K39L4147K1662j7750
$$ plain form
1064 27495 11607 -1842 2522 -66982 -65424 -54471 -7343 18714 -6349 -17135 -11301 -8183 -7787
1051 -7787 11548 -5670 -214 51856 49918 3616 17404 22416 -13174 -31035 -18644 8749 6920
1038 6920 2289 3030 -41238 -6702 9518 6641 -7827 -722 16811 722 21521 -19316 -24930
1025 -24930 1469 -3380 -19125 -9633 -39709 -7300 24922 2272 -46617 -26358 12888 22613
1013 22613 24013 -1163 -5409 6493 -16682 -9596 -643 4388 11313 4211 -14677 12315 -6838
1000 -6838 -3196 8323 -9232 6036 4807 2349 2063 -10674 -13590 -52110 -39598 13915 -1119
987 -1119 -17806 28310 33712 -22946 20623 33354 31390 26711 39296 -1009 -19278 -12628 -17755
974 -17755 -16328 -26965 -47948 -31800 -20164 -16972 -10669 -738 -18339 -18100 16047 37709 19959
961A9959j0853L336L965j1915M853J3540k4983j466M084l040o537M970P718L4778
947C8409j7750j074p72J455M926N949m0807k6885M2924O490l6758J5870J1798
934C775M363J6535k41m0064k4907K6449J2018L5348m187k8705K5656K671P301
921C6012j3576n6821M281J9221J5765K1594j6740O554j684r055K0173M190j8727
908A1187k5016m001J080K9555K7523k3011j8095N521j9337J1263J0311j8430m342
895a5792l732J5313J4241Q117J1914k1136J3560j9486K7063k5041j2230j2793
883b0002K3668j4204m631j4413m997K7643L953L9214J5681k3816p795o363R442
870B3380j6410k0411J6999k371Q407J5069J8793k4176j0493m287Q873j1335r420
$$ plain form
961 19959 9106 12442 16407 4492 9345 22885 -2098 -3564 520 -2520 -9057 -4087 3631 38409
947 38409 20659 19585 18813 20268 25194 31143 -9664 -36549 6375 12865 -23893 -8023 3775
934 3775 8138 24673 24432 -15632 -40539 -14090 -2072 33276 29089 384 26040 28711 36012
921 36012 22436 -34385 -30104 -10883 4882 26476 9736 16290 14606 5551 25724 29914 11187
908 11187 -13829 -17830 -16750 12805 40328 17317 -778 4743 -14594 -3331 6980 -11450 -15792
895 -15792 -19524 -4211 10030 18147 30061 8925 22485 2999 30062 5021 -7209 -20002
883 -20002 3666 -10538 -15169 -29582 -34579 -6936 -2983 36231 51912 28096 20301 13938 23380
870 23380 6970 -13441 3558 1187 9594 24663 43456 19280 8787 4500 13373 2038 -7382
857g382l591O117j6162P893P6493l570m5136K4678Q252l2268l8783q72J2683P174
843d474N5247o129o929J5310o302j1629m2184K1872L3796k3256j86n634l6829
830a7327L7613L8313m9203j5103K6522p494l0098N203P965P875L5791J4387j457
817E2987p51r672r59m1191O55J8833k5785M3353j5389j5408k974o498j1462K5205
803A0944M408j902J1698O53Q451L190k3421J886j195k8479J2797J8660N816K27
789B3733K969k6649L848J6074m993K3422k3819J965k1651O123n681o30K9412L594
775B7717j003m283j1543n931k9223r293L0095K0559P04j481q645J8579L0650J9258
761G6160j5027n0409m6398M6921J6108j1387j0096K2038M278O626k2269k9112
$$ plain form
857 -7382 -10973 -4856 -21018 -13125 63368 59798 14662 39340 47592 15324 -23459 -24331 -11648 -4474
843 -4474 50773 44644 37715 53025 46723 35094 -7090 14782 48578 25322 25136 19502 -17327
830 -17327 20286 58599 9396 -5707 20815 13321 -16777 -11574 -3609 4266 40057 54444 52987
817 52987 52236 42564 41605 414 1069 19902 -5883 37470 22081 6673 3699 -2799 -14261 10944
803 10944 15352 13450 25148 25801 34252 37442 14021 15907 14712 -13767 -970 17690 23506 23733
789 23733 26702 53 3901 19975 14982 38404 14585 16550 -5101 1022 -4659 -5289 24123 27717
775 27717 26714 22431 10888 4957 -24266 -33559 -3464 17095 17799 16318 7673 26252 56902 76160
761 76160 61133 10724 -35674 11247 27355 15968 5872 27910 32188 38814 16545 -12567
749a2567J5230k3462K2733J8989l1047K1152N9166q945k9614r919j8923j5440
737a2647Q136j5031L6816j2542j4538J6551L238k5246L5186L5297l883m5891r606
724d160J7386K3960J506j6186J7492J6836k5354j9227N518J2430j0844j8158j3474
711a2275J6005K5886Q380j2848j1010L1775k7597l9834K0709R695m1749j1791
699d4654M1574j1028n288N393J5249L5881j364l7412j4360J2726M0188L4136k3234
686D7807L574P633n4779K853J5999o190J5456R100j8444L305L1356k2826o326
673B8518J3906j5589k360j8298j0616K2249j2682J258L5793j5315j1962q560m4
660F298j1134J7030K006K4605l1980k1819K4777L099j6679L4357J7297k4350J0117
$$ plain form
749 -12567 2663 -20799 1934 20923 -10124 11028 70194 61249 31635 21716 2793 -12647
737 -12647 -4511 -19542 17274 4732 -9806 6745 9983 -15263 19923 55220 51337 5446 -4160
724 -4160 13226 37186 38692 22506 39998 56834 31480 12253 17771 30201 19357 1199 -12275
711 -12275 3730 29616 37996 25148 14138 45913 18316 -21518 -809 8886 -32863 -44654
699 -44654 -3080 -14108 -19396 -14003 1246 37127 35763 -1649 -16009 -3283 36905 71041 47807
686 47807 51381 59014 4235 7088 23087 16897 32353 41453 23009 26314 57670 34844 28518
673 28518 42424 26835 24475 6177 -4439 17810 5128 6386 42179 26864 14902 6342 6298
660 6298 -4836 12194 14200 38805 6825 -14994 9783 12882 -3797 30560 47857 23507 33624
647C3624J8118k9316J3789j8399p946Q995m315K5877j1168n3482j4623N2041m958
634H237K0371n303l7435K4159K1817J3058P782m1126n976J7790j7407m487K0036
621B1516l5337L3052M6126k2380j7353J2341l4315K2923q265P063L160j7713n071
608E747K1595j8310J5555k5887J0262k919j4767J3199m139M9946p557n0040M046
595c269K4669j5765m9801j9908M3259Q754j4155O835L0004P346J0953k9405O463
582E980L0231j3864J8280J1890k0917m2188l775K7784O834K2775k2508r076L2687
569D4133l3555J033k951J435J3947K090n0236N8375K5356o5515k6457J2243J9522
556e80K7297M452k4832j1116K6042K840l436j5395R614O1944m8097j8380L4215
$$ plain form
647 33624 51742 22426 36215 17816 9870 18865 14550 40427 29259 -24223 -38846 13195 8237
634 8237 28608 23305 -14130 10029 31846 44904 52686 11560 5584 23374 5967 1480 21516
621 21516 -13821 19231 65357 42977 25624 37965 3650 26573 18308 25371 28531 10818 5747
608 5747 27342 9032 24587 -1300 8962 6043 -8724 4475 336 50282 42725 -7315 -3269
595 -3269 21400 5635 -44166 -64074 -20815 -12061 -26216 -19381 10623 17969 28922 -483 5980
582 5980 36211 22347 40627 52517 31600 -10588 -14363 13421 20255 43030 20522 11446 44133
569 44133 10578 11611 8660 10095 24042 26132 -24104 34271 59627 -5888 -32345 -20102 -580
556 -580 26717 31169 6337 -4779 21263 24103 20667 5272 14886 76830 28733 10353 44568
543D4568j1607k7864K27k679N3216J4542m0466j5818J6727k07J730k9797k8673
530b6101L9982M8688l437l0357j7135k295J6145m340q240K3191Q087o764L375
517D0799k8034O551J7386k3025P211J0044j3516L2760m334m7763J5934K1238m112
504C1139K271j023J5578R356n3809J3699K7960r875J983L834k3768J8051K3691
491E9087n655r94j5733m9948M099l819J5380l972k716n008J4203K8253j119m666
477B7392n305J2955m709k0765J2391N253P388j6216J0131O451J8723O392n1294
464H787j4451K1008J0048l4542j4509J2340L9895J6231j5161O720n527n616k5401
451a78j1348J6402Q987J0504K7536l4760j3672K622J6462l9128M1788K8267k7744
$$ plain form
543 44568 32961 5097 5324 2645 55861 70403 29937 14119 30846 30639 32369 2572 -26101
530 -26101 13881 62569 59132 28775 11640 9345 25490 21150 12910 36101 44188 37424 40799
517 40799 12765 19316 36702 13677 20888 30932 17416 50176 45842 -1921 14013 35251 31139
504 31139 33410 32387 47965 57321 3512 17211 45171 35296 37279 41113 17345 35396 59087
491 59087 53432 52438 36705 -13243 -9144 -12963 2417 -1555 -4271 -9279 4924 33177 32058 27392
477 27392 22087 35042 30333 9568 21959 27212 34600 18384 28515 34966 53689 60081 8787
464 8787 -5664 15344 25392 -9150 -23659 -11319 28576 44807 29646 36366 30839 25223 -178
451 -178 -11526 4876 13863 24367 51903 17143 3471 6093 22555 -16573 25215 53482 25738
438B5738K854j6226M554l64k0407j6662J1282j9146N9277P67j8661j6628Q916
425E294J0299J2479K988M172j7454K8645K118j6851M38r883J878K3131N356k9838
411B2772k9305j5949K1324L7128n094r479m277l1269L0007L7361R287M400j0363
398E6543o786L702l5616k0910L2503j1874J3622K2692j533r0O887J4386j6774
385E6752j3232L434L13J5923O878J8820k8460J403J1428n3631l7177L8482J2444
372C3377M603j5305o848K5596n018k0919J2863K1887j7100L375o732j8283L1124
359D2620R79j7868J5201j1044r509O69J3008j7912q066K1769J7173J2869k1701
346C8188k9757N420M670k6807L1879K183j690k348j7945L0352K2596r297j3956
$$ plain form
438 25738 28592 12366 16920 16556 -3851 -20513 -9231 -28377 30900 31667 13006 -3622 5294
425 5294 15593 28072 31060 35232 17778 46423 48541 31690 32128 22245 24123 47254 52610 22772
411 22772 -6533 -22482 -1158 35970 30876 21397 17120 -14149 15858 53219 62506 66906 56543
398 56543 49757 53459 17843 -3067 29436 17562 31184 53876 52343 52253 59140 73526 56752
385 56752 43520 46954 47267 63190 70068 88888 60428 61831 73259 19628 -17549 20933 33377
372 33377 37980 22675 15827 41423 36405 15486 28349 50236 33136 36511 29779 11496 42620
359 42620 43599 25731 40932 29888 20379 21048 34056 16144 8078 29847 47020 59889 38188
346 38188 8431 13851 18521 -8286 23593 25776 24086 21738 3793 34145 56741 47444 33488
333C3488J8705k9364j5617K6144p294J436l919o0J3075j1747J855N1501j7940
320F0263o947j5348k8710r640K2068j1191K291J4084j5530M0825O96L284j7773
307C8372k893M358J3681l2227l1254L5088J6224K492j9567k3667L3482L9929l2598
294D1420n570J1547l5373p807N2031O451J7222j3875k3190J3806L679K877m2000
281B1218J6441j2539K4161L31Q263J1010l1965j0549K8096j6498M68O412k2164
268B2685O699L5060l0378r980M2671L856j6685L1267l4534K0794n534k4181p173
255C4567q734j1479M1196K872j8721O428k469R071J0358k0888l522L3403L901
242G5983k2070l109k6130k622J9039K656J0303l7069l2158K4237J3006j2978K4980
$$ plain form
333 33488 52193 22829 7212 33356 26062 27498 23579 23519 36594 24847 26702 78203 60263
320 60263 53316 37968 9258 -382 21686 10495 12786 26870 11340 52165 52861 56145 38372
307 38372 35479 39837 53518 21291 -9963 25125 41349 43841 24274 607 34089 74018 41420
294 41420 35850 47397 12024 4217 56248 62699 79921 66046 42856 56662 60341 63218 21218
281 21218 37659 25120 49281 49612 57875 68885 36920 26371 54467 37969 38437 44849 22685
268 22685 29384 64444 34066 24086 66757 70613 53928 85195 50661 71455 65921 41740 34567
255 34567 25833 14354 55550 58422 39701 46129 43660 52731 63089 42201 38679 72082 75983
242 75983 53913 50804 24674 22052 41091 43747 54050 16981 -15177 9060 22066 9088 34068
229C4068K1536p747l1740l3732J646N0197R202j1032J164O56O035P768k9934J5691
215C3778J178k2702J5842J0497m6740L941P643K8964K3405o389j9405J7114j2186
202C4940J7148J2432l3142j0874J6959r532P073p554N3079n749k5945p317R388
189E0906k0864m47J9133j2135q206n938j445k1609K072J6156R920J1858O711L2
175D6144j3363M0359l515q184j9723J3944l725n728O43n146j9901P536J7742l2203
161A4880q956K5509K7049R085k0509j5273k5116l613J6363Q709J5387j950l061
148C8504j5205O613l108L270K612J9259l1004j8098P936J2520J4909J4877j8190
135C4895K9334r943Q908j4760j5330n864K9671j0214k8430n162o45J9982j2354
$$ plain form
229 34068 55604 47857 16117 -17615 -15969 34228 43430 32398 33562 34218 40253 48021 18087 33778
215 33778 34956 12254 28096 38593 -8147 -4206 3437 32401 55806 49417 30012 47126 34940
202 34940 52088 64520 31378 20504 37463 27931 35004 27450 80529 74780 48835 41518 50906
189 50906 30042 29595 48728 36593 28387 22449 21004 -605 1467 17623 27543 39401 46112 46144
175 46144 32781 73140 69625 61441 41718 55662 51937 46209 46852 41706 21805 29341 47083 14880
161 14880 5924 31433 58482 67567 47058 31785 6669 3056 19419 28128 43515 41565 38504
148 38504 23299 29912 26804 30074 32686 51945 20941 2843 10779 23299 38208 53085 34895
135 34895 64229 54286 63194 48434 33104 27240 56911 46697 18267 13105 12460 32442 20088
122B0088j6907J3829J671k149O320L1606j6964K1537K0246j037j2722j2511J6555
109F9562J1102j3902m1058j6299K0575o210J8487J5880r794n981j2275J2749K742
96D5578j7668j9355J3999K8613J5661k5463j6131m200J1818j803o424K0800P238
83E2663M132l008M118n993j2473k688K3509m7778J2219K2580k1929J0209J3237
70D8798o310J425Q322M617j7403n090O125q939J5540p715l909J3666p049J5712
56E7790j5819j3005J5029O960M81n415j3390j7702K9771k3446J5966K9099k3223
43D3096k5560J2670p564L6815o493j9874J0007K3267k5679K1320m828k0115M417
30D1479M824k2002j147L689j2025p141P249K5855J6143m611J4165n278k8685n469
$$ plain form
122 20088 3181 17010 18681 16532 22852 54458 37494 59031 79277 78240 65518 53007 69562
109 69562 80664 66762 25704 9405 29980 23770 42257 58137 48343 42362 30087 42836 45578
96 45578 27910 8555 22554 51167 66828 41365 25234 21034 32852 31049 24625 45425 52663
83 52663 56795 53787 57905 51912 39439 36751 60260 12482 24701 47281 25352 35561 48798
70 48798 42488 43913 52235 56852 39449 34359 40484 31545 47085 39370 35461 49127 42078 57790
56 57790 41971 28966 43995 50955 51436 46021 32631 14929 44700 21254 37220 66319 43096
43 43096 17536 30206 22642 59457 52964 33090 43097 66364 40685 62005 57177 37062 41479
30 41479 46303 24301 23154 26843 14818 7677 14926 40781 56924 52313 66478 61200 32515 27046
16B7046l780j2970R519K0808k786j875q35k0587J5840O300m89K6947j8934k8268
2A5936M1343J9131
0G6410
$$ plain form
16 27046 23266 10296 19815 40623 37837 35962 35127 14540 30380 36680 36191 63138 44204 15936
2 15936 57279 76410
0 76410
$$ Imaginary data points
##PAGE= N=2
##DATA TABLE= (X++(I..I)), XYDATA
16383a063959K9701J7911K4986o590m88K4390l67O406L0455J4244K2902L3753
16371h66656K014J6799J432Q040R034O620J7214j748j425J8925J6109L3868J1462
16358g28312J7821R65j7111J2171J6445K1891K6056n173O215K7461q612K2955
16346f07228L1869n805J2843L6736j8J9351L336O068J3643n977o356K7024J4420
16333d60094j0451J5572O042R985L3533O397q158K0532J0009J4231J2267j5639
16321c65774L3689L6008N116R004K1549O336J0734K9622j7177r440J2698K1230
16309b06405J4673r36J1178J6853J6782N833q498j3131L3224J5474k017R139L5670
16296g2161J883k2103J2947J2949J1282L2917K7973O745o349m626J8015K6061
$$ plain form
16383 -1063959 -1034258 -1016347 -991361 -997951 -998439 -974049 -974416 -968010 -937555 -923311 -900409 -866656
16371 -866656 -864642 -847843 -846411 -838371 -829337 -822717 -805503 -807251 -808676 -789751 -773642 -739774 -728312
16358 -728312 -710491 -709526 -726637 -714466 -698021 -676130 -650074 -655247 -649032 -621571 -630183 -607228
16346 -607228 -575359 -581164 -568321 -531585 -531603 -512252 -508916 -502848 -489205 -495182 -501538 -474514 -460094
16333 -460094 -470545 -454973 -448931 -438946 -405413 -399016 -407174 -386642 -376633 -362402 -350135 -365774
16321 -365774 -332085 -296077 -290961 -281957 -260408 -254072 -243338 -213716 -230893 -240333 -227635 -206405
16309 -206405 -191732 -192668 -181490 -164637 -147855 -142022 -150520 -163651 -130427 -114953 -116970 -107831 -72161
16296 -72161 -70278 -92381 -79434 -66485 -55203 -22286 5687 12432 6083 1457 19472 45533
16284D5533J5562O030k167j2738j6278J1869J9886K140k5208M4248R562J5613
16272A14052M5795J5652n813M784L6795k5486k2619L8641J8353J0139L1960J173
16260B63426j7589M551R082J4087N280J6074L1552M331j0536n106J312M915K4437
16247C45816K1143M584K313K2328j1998K609O842j2660Q002J570Q998O976J0304
16234D16827R744P822L1600P533j3137j2860J0471N321J951j801j4126r188J8275
16221D58432P375K7421K4635J3573n946k7828r29M1984J5820k4549k73K1891R495
16208E61101j3141l098Q736K8190L8167O073k9548Q11O023J8490j394J2459k6453
16195F06416q699K1394j6919N005K0645J5743k2713N667J7895N678l611L0620
$$ plain form
16284 45533 61095 67125 64958 52220 35942 47811 67697 69837 44629 88877 98439 114052
16272 114052 159847 175499 169686 174470 211265 185779 163160 201801 220154 230293 262253 263426
16260 263426 245837 250388 259470 273557 278837 294911 326463 330794 320258 315152 316464 321379 345816
16247 345816 366959 371543 373856 396184 384186 386795 393637 380977 388979 390549 399547 406523 416827
16234 416827 426571 434393 465993 473526 460389 447529 458000 463321 465272 463471 449345 440157 458432
16221 458432 465807 493228 517863 531436 525490 497662 496733 538717 554537 529988 529715 551606 561101
16208 561101 547960 544862 553598 581788 619955 626028 596480 597291 603314 621804 620410 632869 606416
16195 606416 597717 619111 602192 607197 627842 643585 620872 626539 644434 650112 646501 677121
16183F77121M774J1835Q196m8404j651Q719K0529J0050M844j3110M75J5945J2988
16170G12311m305j1520J9906k0803M119R321o700j0202K8841j5977j1431j6521
16158F77039M456K5444k057J1126J4451J1470L724j0873k8854Q079M3694R069
16146G66768m5085K7396J5371l1895O9946N998o6132K7244N275m1213K1527M988
16134G60188m632K8726k2402L839l506J1465J7631N919n789j8401Q012L6231j1564
16121H05717J3216k1723j4029K0219q910R213J3838M628m0556L702J8263N464
16109H09042j8279l9888L1004N2934j9122j4416j7573K2703M053J4673j6676K8984
16097H37439j6805k5383L1702J9154k8292O701M3098m7999l691K9714k2411J62
$$ plain form
16183 677121 681895 693730 701926 653522 651871 660590 681119 691169 696013 682903 683378 699323 712311
16170 712311 708006 696486 716392 695589 699708 709029 702329 692127 720968 704991 693560 677039
16158 677039 681495 706939 704882 716008 730459 741929 745653 734780 705926 714005 757699 766768
16146 766768 721683 749079 764450 732555 802501 808499 742367 769611 774886 733673 755200 760188
16134 760188 755556 784282 761880 765719 762213 773678 791309 797228 791439 773038 781050 817281 805717
16121 805717 818933 797210 783181 803400 794490 803703 817541 822169 781613 785315 803578 809042
16109 809042 790763 750875 781879 834813 815691 801275 783702 806405 810458 825131 808455 837439
16097 837439 820634 795251 826953 846107 817815 824516 867614 819615 815924 845638 823227 823389
16085H23389J2200l318J2403k6730L7237R20j867P326j5840l4710J9223Q790R749
16072H48772j5443p114m143l526J9449N644j559J4772J0968k374P630l6588k2899
16059H13589J1809K0059J057q555J2039Q39m616j7559L8254J3901k0831l887j7299
16046H38800Q137j9627j3603K1914J1095j1452q8J8788j1780N120j3408O628J5308
16033H55832J226K2430N150l0385P02M498n785r778N888j2243j8391N4426J6708
16020H90278l796o215l5886M454K1745q786J6667N996p111L320l0684J6420o015
16007H60387j4033K0361r035N6579Q24l4137j9328P94P691L3951j1857k5528J0502
15994H77171k2236n558p439j7040j5090N984n784K1685L7133Q370O127N135j2752
$$ plain form
16085 823389 835589 832271 844674 817944 855181 856101 854234 861560 845720 811010 830233 839023 848772
16072 848772 833329 826215 822072 818546 837995 843639 842080 856852 867820 865446 873076 836488 813589
16059 813589 825398 845457 846514 837959 849998 850837 846221 828662 866916 880817 859986 856099 838800
16046 838800 846937 827310 813707 835621 846716 835264 835176 853964 842184 847304 833896 840524 855832
16033 855832 857058 879488 884638 854253 854955 859453 853668 843890 849778 837535 819144 873570 890278
16020 890278 886482 880267 844381 848835 870580 861794 878461 884457 877346 880666 849982 866402 860387
16007 860387 846354 866715 857680 914259 915083 880946 861618 862412 870103 904054 892197 866669 877171
15994 877171 854935 849377 841938 824898 809808 815792 810008 831693 868826 877196 883323 888458 875706
15981H75706m7770R941J5653Q945k3512k4864K7907O837J0421J0329l7242j432
15969H30919J9167N044j0552j95J3511K3854k3335k731J914O166m425L486j7760
15956H45063j1819J1259n871o82J2741k4306K2185J7737J250j1418P190J4006
15944H77335k7835L999j531o932J798Q425m149O697J4681P990j2768l7158J4527
15931H45079K1853k394K4310j8102J4395r912l9206K961m945K8765N1000N11j3952
15918I00363j3410p632j1949J3125N106j5740l8137o421K2798q135M645M900j0940
15905H38573L2670j2319J675J3380j4505j9578p175K4299J0143p157L534O761
$$ plain form
15981 875706 827936 837877 853530 862475 838963 814099 842006 848843 859264 869593 832351 830919
15969 830919 850086 855130 844578 844383 857894 881748 858413 855682 857596 863762 859337 862823 845063
15956 845063 833244 844503 838632 837950 850691 826385 848570 866307 867557 856139 863329 877335
15944 877335 849500 853499 851968 845036 846834 855259 851110 857807 872488 880478 867710 830552 845079
15931 845079 866932 864538 888848 870746 885141 875229 836023 838984 834039 862804 913804 914315 900363
15918 900363 886953 879321 867372 880497 885603 869863 831726 825305 848103 839968 844613 849513 838573
15905 838573 871243 858924 860599 873979 859474 839896 832721 857020 867163 860006 863540 870301
$$ [...]
##END NTUPLES=NMR SPECTRUM
##END=
