##TITLE=1H_TG-2410-5
 200.13Hz, DMSO+CCl4.
 8 sc
 2.7.2026
##JCAMPDX= 6.0         $$ Bruker NMR JCAMP-DX V2.0
##DATA TYPE= NMR SPECTRUM
##DATA CLASS= NTUPLES
##ORIGIN= UXNMR, Bruker Analytische Messtechnik GmbH
##OWNER= pz
$$ XWIN-NMR		Version 3.5
$$ Thu Jul  2 14:06:07 2026 Russian Standard Time (UT+4h)  she@DPX200
##.OBSERVE FREQUENCY= 200.1313
##.OBSERVE NUCLEUS= ^1H
##.ACQUISITION MODE= SIMULTANEOUS
##.ACQUISITION SCHEME= undefined
##.AVERAGES= 8
##.DIGITISER RES= 18
##SPECTROMETER/DATA SYSTEM= spect
##.PULSE SEQUENCE= zg30
##.SOLVENT NAME= DMSO
##.SHIFT REFERENCE= (INTERNAL, DMSO, 0, 15.5012)
##AUDIT TRAIL= $$ (NUMBER, WHEN, WHO, WHERE, WHAT)
$$ ##TITLE= Audit trail, XWIN-NMR		Version 3.5
$$ ##JCAMPDX= 5.01
$$ ##ORIGIN= Bruker BioSpin GmbH
$$ ##OWNER= she
$$ F:/spectra/data/she/nmr/H-C/1/pdata/1/auditp.txt
$$ ##AUDIT TRAIL=  $$ (NUMBER, WHEN, WHO, WHERE, WHAT)
(   1,<2026-07-02 14:04:33.85 +0400>,<she>,<DPX200>,
      <created by zg, POWCHK disabled, PULCHK disabled
       configuration hash MD5:
       00 E9 B6 7A A2 85 ED C7 34 08 36 98 17 FE 4E 26
       data hash MD5: 16K
       05 31 D7 3A 6F C6 65 C4 6B 4B D4 0E 0F 6C 3F 02>)
(   2,<2026-07-02 14:04:38.81 +0400>,<she>,<DPX200>,
      <Start of raw data processing
       efp BC_mod = 2 LB = 0.25 FT_mod = 6 PKNL = 1 PHC0 = -4377.593 PHC1 = 9.192301 SI = 16K 
       data hash MD5: 16K
       87 E4 CD A4 FF BC 55 DD D2 D8 68 AE A8 BD 6B 38>)
(   3,<2026-07-02 14:05:09.26 +0400>,<she>,<DPX200>,
      <pk PHC0 = 169.2526 PHC1 = -13.4 
       data hash MD5: 16K
       0B 51 98 A8 4E FC 25 B3 50 58 25 9E 16 E3 7D 6E>)
(   4,<2026-07-02 14:05:13.48 +0400>,<she>,<DPX200>,
      <abs ABSG = 5 
       data hash MD5: 16K
       56 AF 23 F4 80 83 3C 61 87 14 1A 28 6E 6B B1 38>)
$$ ##END=
$$ 
$$ hash MD5
$$ 5F 9C 59 4A 83 5E B9 F8 52 35 6F B7 BF D6 FB 00
##$RELAX= 
##$RELAX= 
##$RELAX= 
##$RELAX= 
##$RELAX= 
##$RELAX= 
$$ Bruker specific parameters
$$ --------------------------
##$DU= <F:/spectra>
##$EXPNO= 1
##$NAME= <H-C>
##$PROCNO= 1
##$TYPE= <nmr>
##$USER= <she>
##$AMP= (0..31)
100 100 100 100 100 100 100 100 100 100 100 100 100 100 100 100 100 100 
100 100 100 100 100 100 100 100 100 100 100 100 100 100 
##$AQSEQ= 0
##$AQ_mod= 1
##$AUNM= <au_zg>
##$AUTOPOS= <>
##$BF1= 200.13
##$BF2= 200.13
##$BF3= 200.13
##$BF4= 200.13
##$BF5= 200.13
##$BF6= 200.13
##$BF7= 200.13
##$BF8= 200.13
##$BYTORDA= 1
##$CFDGTYP= 0
##$CFRGTYP= 5
##$CHEMSTR= <none>
##$CNST= (0..31)
1 1 145 1 1 1 1 1 1 1 1 1 1 1 1 1 1 1 1 1 1 1 1 1 1 1 1 1 1 1 1 1 
##$CPDPRG= <>
##$CPDPRG1= <>
##$CPDPRG2= <>
##$CPDPRG3= <>
##$CPDPRG4= <mlev>
##$CPDPRG5= <mlev>
##$CPDPRG6= <mlev>
##$CPDPRG7= <mlev>
##$CPDPRG8= <mlev>
##$CPDPRGB= <>
##$CPDPRGT= <>
##$D= (0..31)
0 0.7 0 0 0 0 0 0 0 0 0 0.03 0 0 0 0 0 0 0 0 0 0 0 0 0 0 0 0 0 0 0 0 
##$DATE= 1782986673
##$DBL= (0..7)
120 120 120 120 120 120 120 120 
##$DBP= (0..7)
150 150 150 150 150 150 150 150 
##$DBP07= 0
##$DBPNAM0= <>
##$DBPNAM1= <>
##$DBPNAM2= <>
##$DBPNAM3= <>
##$DBPNAM4= <>
$$ [...]
##$SUBNAM3= <"">
##$SUBNAM4= <"">
##$SUBNAM5= <"">
##$SUBNAM6= <"">
##$SUBNAM7= <"">
##$SUBNAM8= <"">
##$SUBNAM9= <"">
##$SW= 18.0517328524113
##$SWIBOX= (0..15)
0 0 2 0 0 0 0 0 0 0 0 0 0 0 0 0 
##$SW_h= 3612.71676300578
##$TD= 16384
##$TD0= 1
##$TE= 0
##$TE2= 300
##$TE3= 300
##$TEG= 300
##$TL= (0..7)
0 120 120 120 120 120 120 120 
##$TP= (0..7)
150 150 150 150 150 150 150 150 
##$TP07= 0
##$TPNAME0= <>
##$TPNAME1= <>
##$TPNAME2= <>
##$TPNAME3= <>
##$TPNAME4= <>
##$TPNAME5= <>
##$TPNAME6= <>
##$TPNAME7= <>
##$TPOAL= (0..7)
0.5 0.5 0.5 0.5 0.5 0.5 0.5 0.5 
##$TPOFFS= (0..7)
0 0 0 0 0 0 0 0 
##$TUNHIN= 0
##$TUNHOUT= 0
##$TUNXOUT= 0
##$USERA1= <user>
##$USERA2= <user>
##$USERA3= <user>
##$USERA4= <user>
##$USERA5= <user>
##$V9= 5
##$VALIST= <valist>
##$VCLIST= <CCCCCCCCCCCCCCC>
##$VD= 0
##$VDLIST= <DDDDDDDDDDDDDDD>
##$VPLIST= <PPPPPPPPPPPPPPP>
##$VTLIST= <TTTTTTTTTTTTTTT>
##$WBST= 1024
##$WBSW= 4
##$XGAIN= (0..3)
0 0 0 0 
##$XL= 0
##$YL= 0
##$YMAX_a= 829233
##$YMIN_a= -852429
##$ZGOPTNS= <>
##$ZL1= 120
##$ZL2= 120
##$ZL3= 120
##$ZL4= 120
##$ABSF1= 15.55077
##$ABSF2= -2.501081
##$ABSG= 5
##$ABSL= 3
##$ALPHA= 0
##$AQORDER= 0
##$ASSFAC= 0
##$ASSFACI= 0
##$ASSFACX= 0
##$ASSWID= 0
##$AUNMP= <proc_1d>
##$AZFE= 0.1
##$AZFW= 0.1
##$BCFW= 0
##$BC_mod= 2
##$BYTORDP= 0
##$COROFFS= 0
##$CY= -3
##$DATMOD= 1
##$DC= 0
##$DFILT= <>
##$DTYPP= 0
##$F1P= 0
##$F2P= 0
##$FCOR= 1
##$FTSIZE= 16384
##$FT_mod= 6
##$GAMMA= 0
##$GB= 0
##$INTBC= 1
##$INTSCL= 3.241238e-09
##$ISEN= 128
##$LB= 0.25
##$LEV0= 0
##$LPBIN= 0
##$MAXI= 10000
##$MC2= 0
##$MEAN= 0
##$ME_mod= 0
##$MI= 1.114404
##$NCOEF= 0
##$NC_proc= -5
##$NLEV= 6
##$NOISF1= 3.799351
##$NOISF2= 2.8
##$NSP= 0
##$NTH_PI= 0
##$NZP= 0
##$OFFSET= 15.50119
##$PC= 1
##$PHC0= -4208.34
##$PHC1= -4.207699
##$PH_mod= 1
##$PKNL= yes
##$PPARMOD= 0
##$PSCAL= 0
##$PSIGN= 0
##$REVERSE= no
##$SF= 200.130004105845
##$SI= 16384
##$SIGF1= 3
##$SIGF2= 2
##$SINO= 0.751879
##$SIOLD= 32768
##$SREGLST= <19F.Aceton>
##$SSB= 0
##$STSI= 16384
##$STSR= 0
##$SW_p= 3612.71676300578
##$SYMM= 0
##$S_DEV= 0
##$TDeff= 16384
##$TDoff= 0
##$TI= <>
##$TILT= no
##$TM1= 0
##$TM2= 0
##$TOPLEV= 0
##$USERP1= <user>
##$USERP2= <user>
##$USERP3= <user>
##$USERP4= <user>
##$USERP5= <user>
##$WDW= 1
##$XDIM= 16384
##$YMAX_p= 504835845
##$YMIN_p= -371934
$$ End of Bruker specific parameters
$$ ---------------------------------
##NTUPLES= NMR SPECTRUM
##VAR_NAME=  FREQUENCY,     SPECTRUM/REAL,   SPECTRUM/IMAG
##SYMBOL=    X,             R,               I
##VAR_TYPE=  INDEPENDENT,   DEPENDENT,       DEPENDENT
##VAR_FORM=  AFFN,          ASDF,            ASDF
##VAR_DIM=   16384,         16384,           16384
##UNITS=     HZ,            ARBITRARY UNITS, ARBITRARY UNITS
##FACTOR=    0.220516191357247, 1,           1
##FIRST=     3102.25325547898, 0,            0
##LAST=      -510.4635075268, 0,             0
##MIN=       -510.4635075268, -371934,       0
##MAX=       3102.25325547898, 504835845,    0
$$ Real data points
##PAGE= N=1
##DATA TABLE= (X++(R..R)), XYDATA
$$ [...]
6038A7303J6136r896o6694j6423L1974j044J3161l5180L3669k6492j7460n3305
$$ 17303 33439 23543 -43151 -59574 -27600 -28644 -15483 -50663 -16994 -43486 -60946 -114251
6026a14251L7442Q3029m6967l6546p3423j1148K3539K8948J4311N995J5362k2305
$$ -114251 -76809 6220 -40747 -77293 -150716 -161864 -138325 -109377 -95066 -89071 -73709 -96014
6014i6014K274L8252j10805n0604M2397K7380J08033r769L947J0916o1248K3169
$$ -96014 -93740 -55488 -166293 -216897 -174500 -147120 -39087 -48856 -44909 -33993 -95241 -72072
6002g2072K2775k303L2374K1262k3m7257K7007m6850j5024j8096L1837M6448j8088
$$ -72072 -49297 -51600 -19226 2036 2013 -45244 -18237 -65087 -80111 -98207 -66370 -19922 -38010
5989c8010k5335m5961K0961J6960j0832M0453N9471k1700o1410N7980R5246q6501
$$ -38010 -63345 -109306 -88345 -71385 -82217 -41764 17707 -3993 -65403 -7423 87823 1322
5977A322M00l0350L810j7644L7673J0580J9147l1702P4230J3552n5837o0622k221
$$ 1322 1722 -28628 -24818 -42462 -4789 5791 24938 -6764 67466 81018 25181 -35441 -37662
5964c7662L9518p1368j7832O0931k9739M9630J7245n4017Q213R143P2591l2270
$$ -37662 1856 -69512 -87344 -26413 -56152 -6522 10723 -43294 -35081 -25938 46653 14383
5952A4383L1041j1495j03016M7347j3656K6557K7851m6414j0414n7797J3619P9581
$$ 14383 45424 33929 -69087 -21740 -35396 -8839 19012 -27402 -37816 -95613 -81994 -2413
5940b413l9724l7427J04110L4334k3297O055q893J694j1882m5267J2163P564k3903
$$ -2413 -42137 -79564 24546 58880 35583 41638 32745 34439 22557 -22710 -10547 -2983 -26886
5927b6886L778K7993R124k2860L3979M9121k3804m0906o6088M2667M4790l7878
$$ -26886 -23108 4885 14009 -8851 25128 74249 50445 9539 -56549 -13882 30908 -6970
5915f970K7392J4275K2400M9501m0863k5014r0535J8251j848N651O555j8217L0320
$$ -6970 20422 34697 57097 106598 65735 40721 -49814 -31563 -33411 -27760 -21205 -39422 -9102
5902i102L8325N3681k0196k6836O9258O312P37K1151l1156l1423J7326k6858K2572
$$ -9102 29223 82904 62708 35872 105130 111442 112179 133330 102174 70751 88077 61219 83791
5889H3791M1526k4850n5285J0355J7336n3586k9829M1637J5735L53L0072L6240
$$ 83791 125317 100467 45182 55537 72873 19287 -10542 31095 46830 47183 77255 113495
5877A13495M7551L143j5366L8855Q233m5859J1441j2198k345j9467q851j07R135
$$ 113495 161046 164189 148823 187678 195911 150052 161493 149295 146950 127483 118632 118525 127660
5864A27660L2779M9598Q070P953J7418n831N9655P0211o063J4336J50739L7525
$$ 127660 160439 210037 218107 226060 243478 237647 297302 367513 361450 375786 526525 564050
5852E64050L0290L8334J12725J08672M5305M6750J2631K2693l6877M0241K835
$$ 564050 594340 632674 745399 854071 899376 946126 958757 981450 944573 984814 987649
5841I87649r716N5843J5387j9222N537p1552k9589k1477n3371l2279n7862q5955
$$ 987649 977933 1033776 1049163 1029941 1035478 963926 934337 912860 859489 827210 769348 683393
5829F83393p3639n7911OM9089k3582p8544O809o7899J9748l4622j8891J7362k1720
$$ 683393 609754 551843 551849 600938 577356 498812 505621 437722 457470 422848 403957 421319 399599
5816C99599L5346m0603k3163l2108K030O082K0055K1385m5565l7575l2176J6207
$$ 399599 434945 394342 371179 339071 341101 347183 367238 388623 343058 305483 273307 289514
5804B89514K5738k7170K947l7125K7945l5261j6924O2651j7626J9574L5142Q951
$$ 289514 315252 288082 291029 253904 281849 246588 229664 292315 274689 294263 329405 338356
5792C38356k8727l6420N1787Q335o35N768j6808O5713K7175L7863J0103L7898
$$ 338356 309629 273209 324996 333331 332696 338464 321656 387369 414544 452407 462510 500408
5780E00408J4391M1748L488k2287L0854O8067N2348R4887J33547Q6300J57700
$$ 500408 514799 556547 560035 537748 568602 636669 689017 783904 917451 1003751 1161451
5769A161451J29566J47572J83609K60007L34964N73826R32895J733085K701395
$$ 1161451 1291017 1438589 1622198 1882205 2217169 2790995 3723890 5456975 8158370
5760H158370L611136L624684K184204L67768l73012o59677j609671k094127k133970
$$ 8158370 11769506 15394190 17578394 17946162 17573150 16913473 15303802 13209675 11075705
5751A1075705j971673j664147j359137j204483r60158o01491l76793k41829k65054
$$ 11075705 9104032 7439885 6080748 4876265 3916107 3314616 2937823 2695994 2430940
5742B430940k68189k31823j95674j01437j80209r2188m827j3133j9927j19554
$$ 2430940 2162751 1930928 1735254 1633817 1453608 1361420 1356593 1343460 1323533 1203979
5732A203979p4089n1261m2817k2460n7146k9446l9392o7377M578N2085q515j2423
$$ 1203979 1129890 1078629 1035812 1013352 956206 926760 887368 819991 824569 876654 868139 855716
5720H55716p499K1862r2312n0673q360j9221J6064M1584j16497p500N0682m6704
$$ 855716 848217 870079 777767 727094 718734 699513 715577 757161 640664 633164 683846 637142
5708F37142K487j032N9336j1245n7061L0115Q2092q323r9130k3505L2431j1055
$$ 637142 639629 638597 697933 686688 629627 659742 741834 733511 634381 610876 643307 632252
5696F32252K3441M1140l6139j7977O3337k344l0264j5242j6202p045O0378l0247
$$ 632252 655693 696833 660694 642717 706054 703710 673446 658204 642002 634957 695335 665088
5684F65088n511l1673m5814N6416N2751l4145L8555j7083j6525K5568Q2415J7485
$$ 665088 659577 627904 582090 638506 691257 657112 695667 678584 662059 687627 770042 787527
5672G87527O203m1458P5259k1766o5494K6634p795k8012j613L7113K0284l0150
$$ 787527 793730 752272 827531 805765 740271 766905 759110 731098 729485 766598 786882 756732
5660G56732q0N4613k5211r079M9013K1991m834l6574J3333P3972Q7734j6998l3885
$$ 756732 756652 811265 786054 776975 825988 847979 843145 806571 819904 893876 981610 964612 930727
5647I30727N9639L0567M5848j5969M8782j2764N79P7249P2107P3240J08687O5592
$$ 930727 990366 1020933 1066781 1050812 1099594 1086830 1087409 1164658 1236765 1310005 1418692 1484284
5635A484284P540n7776J8536N6196K8502O1819k6625L4822j0645M5374R8479N8978
$$ 1484284 1491824 1434048 1452584 1508780 1537282 1599101 1572476 1607298 1596653 1642027 1740506 1799484
5623A799484m3019K1918Q1071N1210J6744k599o922J0474J00570L2929M6942Q3910
$$ 1799484 1756465 1778383 1859454 1910664 1927408 1924809 1917887 1928361 2028931 2061860 2108802 2192712
5611B192712J19255J28333J15961J17134J22902L0140R8937J28826Q2029P3972
$$ 2192712 2311967 2440300 2556261 2673395 2796297 2826437 2925374 3054200 3136229 3210201
5601C210201K0381N8483J31633R6748J12769P8342J38822P1659L3419O0486O2136
$$ 3210201 3230582 3289065 3420698 3517446 3630215 3708557 3847379 3919038 3952457 4012943 4075079
5590D075079O8184N8385O4644Q5034N4824L8884M0330O9083Q3975R2540Q7151
$$ 4075079 4143263 4201648 4266292 4351326 4406150 4445034 4485364 4554447 4638422 4730962 4818113
5579D818113J04960J42179R4841O7046R7215J53426M9738J51520R2343J85364
$$ 4818113 4923073 5065252 5160093 5227139 5324354 5477780 5527518 5679038 5771381 5956745
5569E956745K19539J84230K14319K31495L30185L69196L72884L45546N60714M79648
$$ 5956745 6176284 6360514 6574833 6806328 7136513 7505709 7878593 8224139 8784853 9264501
5559I264501N61721N99524P61988R47192R52501J074090J221571J350664J493726
$$ 9264501 9826222 10425746 11187734 12134926 13087427 14161517 15383088 16733752 18227478
5550A8227478J648897J961086K224713K702055L270748L945078N099150O652882
$$ 18227478 19876375 21837461 24062174 26764229 30034977 33980055 39079205 45732087
5542D5732087Q649740J1204006J4314442J7261011J9117408J8998745J6511391
$$ 45732087 54381827 65585833 79900275 97161286 116278694 135277439 151788830
5535A51788830J2292019P654348L562304M20445r77222m03772J645396M017277
$$ 151788830 164080849 171735197 175297501 175717946 174740724 174336952 175982348 179999625
5527A79999625N470258M998927K210723j821894o044686r940838j3175867j5455029
$$ 179999625 185469883 190468810 192679533 190857639 184812953 174872115 161696248 146241219
5519A46241219j6320426j6102900j5063063j3513148j1765130r845481q194882
$$ 146241219 129920793 113817893 98754830 85241682 73476552 63631071 55436189
5512E5436189o604898n383737m465607l762585l188874k767320k324975j886709
$$ 55436189 48831291 43447554 38981947 35219362 32030488 29263168 26938193 25051484
5504B5051484j689077j463782j295842j136989r75538r09431q84796p38446p74895
$$ 25051484 23362407 21898625 20602783 19465794 18490256 17580825 16696029 15957583 15182688
5495A5182688o90495n41189m89269n24629m99010n31310l85520l26975m65021
$$ 15182688 14492193 13951004 13461735 12937106 12438096 11906786 11521266 11194291 10729270
5486A0729270m50026m31818l89338l93693l24543l61635l09594k47767k56725
$$ 10729270 10279244 9847426 9458088 9064395 8739852 8378217 8068623 7820856 7564131
5477G564131l00707k66269k47749j75462j57456k10306k86366j71021j50090k12484
$$ 7564131 7263424 6997155 6749406 6573944 6416488 6206182 5919816 5748795 5598705 5386221
5467E386221j77929j55763j15291j12958r9165j58623j56765r1995o0632l8358
$$ 5386221 5208292 5052529 4937238 4824280 4725115 4566492 4409727 4317732 4257100 4218742
5457D218742j15409r8482j60202l5970j9665o3859m8361k5020n1262m2580r1565
$$ 4218742 4103333 4004851 3844649 3808679 3789014 3725155 3676794 3651774 3600512 3557932 3466367
5446C466367l870j829k1052r8767q279m5437o0871q975l1235j09768k4154l0362
$$ 3466367 3462497 3460668 3439616 3340849 3332570 3287133 3226262 3217287 3186052 3076284 3052130 3021768
5434C021768q6074r6821l3105k8516o0477m8147o907m4169k252k3688m6340l5367
$$ 3021768 2935694 2838873 2805768 2777252 2716775 2668628 2661721 2617552 2615300 2591612 2545272 2509905
5422B509905k4567l8545p4612L8619K1358k0871m1239P5571k0158p840j2454k8497
$$ 2509905 2485338 2446793 2372181 2410800 2432158 2411287 2370048 2445619 2425461 2417621 2405167 2376670
5410B376670K8504L4492l5689J6540J1627j6889N514K0637o889N3549J0683J659
$$ 2376670 2405174 2439666 2403977 2420517 2432144 2415255 2420769 2441406 2434517 2488066 2498749 2500408
5398B500408q1108K0100k4029p1689n5764R470N605p468j4893J9556j6757m5280
$$ 2500408 2419300 2439400 2415371 2343682 2287918 2297388 2302993 2295525 2280632 2300188 2283431 2238151
5386B238151K0358j1422r2202o6695j535M322m7993q3178J7047o746Q062M604
$$ 2238151 2258509 2247087 2154885 2088190 2086655 2090977 2042984 1959806 1976853 1970107 1978169 1982773
5374A982773j0931L3334m329j5502k5885J0351n6922j5618O6631p714J6104J6828
$$ 1982773 1971842 2005176 2000847 1985345 1959460 1969811 1912889 1897271 1963902 1956188 1972292 1989120
5362A989120j3738j9464n5129Q0086N5853M648O4880M7924l9979M460L2635L0502
$$ 1989120 1975382 1955918 1900789 1980875 2036728 2041376 2106256 2154180 2114201 2118661 2151296 2181798
5350B181798J2418M5594n387K6651N0104k9721j8374M2876K4388Q0143K5613N338
$$ 2181798 2194216 2239810 2234423 2261074 2311178 2281457 2263083 2305959 2330347 2410490 2436103 2441441
5338B441441L0675R015o9084m9176O5896L7099j5290n7959J03658J01648L9386
$$ 2441441 2472116 2481131 2412047 2362871 2428767 2465866 2450576 2392617 2496275 2597923 2637309
5327B637309M8047J24918Q8411J3316J56257O4495J69597K26673J97744K23456
$$ 2637309 2685356 2810274 2898685 2912001 3068258 3132753 3302350 3529023 3726767 3950223
5317C950223K30956K00946L15259L01034L85167M46337N23819O53664P79258R23264
$$ 3950223 4181179 4382125 4697384 4998418 5383585 5829922 6353741 7007405 7786663 8709927
5307H709927J124454J424157K015823K964526M683610O935954Q927844R390320
$$ 8709927 9834381 11258538 13274361 16238887 20922497 27858451 36786295 46176615
5299D6176615P339573L889529J077664p13809k477960l524193l275763j652409
$$ 46176615 53516188 57405717 58483381 57769572 55291612 51767419 48491656 46839247
5291D6839247R62726L709050N392797N014594K386981m34060k339389m123869
$$ 46839247 47801973 51511023 56903820 61918414 64305395 63871335 61531946 57408077
5283E7408077n909120o492681o569305n825501n221511m519682l716074k913244
$$ 57408077 51498957 45006276 38436971 32611470 27389959 22870277 19154203 16240959
5275A6240959k078635j588010j383800j097196q84685p55505o70353n47967l83907
$$ 16240959 14162324 12574314 11190514 10093318 9208633 8453128 7782775 7234808 6850901
5266F850901k85694l61717l41814k35651k54620k61742j59114j92776k09367j93338
$$ 6850901 6565207 6203490 5861676 5626025 5371405 5109663 4950549 4757773 4548406 4355068
5256D355068j28128j62282j48874n1263j19688j96290q7947n5721l4324j62198
$$ 4355068 4226940 4064658 3915784 3864521 3744833 3548543 3460596 3404875 3370551 3208353
5246C208353j56770n5684j45872j01270j3109p4419j06855o6209q0458q8941q9011
$$ 3208353 3051583 2995899 2850027 2748757 2735648 2661229 2554374 2488165 2407707 2318766 2229755
5235B229755j0593m3798o5452J2225p561m2303j25756L3407M4324J056N6033m0902
$$ 2229755 2219162 2175364 2109912 2122137 2114576 2072273 1946517 1979924 2024248 2025304 2081337 2040435
5223B040435O5455M0176L3986L1365L5954l7287M1197k5353J2256K9326M5175
$$ 2040435 2105890 2146066 2180052 2211417 2247371 2210084 2251281 2225928 2238184 2267510 2312685
5212B312685J1759n044j312j3318o3365K4319p2396n3109l9403K431p5805j17648
$$ 2312685 2324444 2319400 2318088 2304770 2241405 2265724 2193328 2140219 2100816 2103247 2027442 1909794
5200A909794p9964p8531l2341q3554j32715l9092l8763n1700J4662o9974j1342
$$ 1909794 1829830 1751299 1718958 1635404 1502689 1463597 1424834 1373134 1387796 1317822 1306480
5189A306480j0471n0060m9543K0188n883j21769R5199l2599m070q777O2518l9189
$$ 1306480 1296009 1245949 1196406 1216594 1210711 1088942 1184141 1151542 1147472 1138695 1201213 1162024
5177A162024M6664J7822m9109l5870L6268J2968l1992l1236L264j5456j7765P352
$$ 1162024 1208688 1226510 1177401 1141531 1177799 1190767 1158775 1127539 1130803 1115347 1097582 1104934
5165A104934m2320M4792p242n5214j4500k925L7351l8661n2397L4408o956n856
$$ 1104934 1062614 1107406 1100164 1044950 1030450 1027525 1064876 1026215 973818 1008226 1001270 995414
5153I95414o6177L8195M5549m2484o9749K3022q861J338k2310O0005j0478j1664
$$ 995414 929237 967432 1012981 970497 900748 923770 914909 916247 893937 953942 943464 931800
5141I31800R719n2099j981M3403j7505M1116M8215K4596n3913M481K1829k0902
$$ 931800 941519 889420 887439 930842 913337 954453 1002668 1027264 973351 977832 999661 978759
5129I78759k9728J296j1056P43L0621O1884L120o8330N183k0278P1972O0864o163
$$ 978759 949031 950327 939271 940014 970635 1032519 1035639 967309 972492 952214 1024186 1085050 1078887
5116A078887j6251Q5216l5404M270M9766J7196L3949l0219P7754k15J20689q107
$$ 1078887 1062636 1147852 1112448 1116718 1166484 1183680 1217629 1187410 1265164 1264949 1385638 1377531
5104A377531m4341l0921R231N0541K0099k3488k6872M853p2785K2308n2161p4450
$$ 1377531 1333190 1302269 1311500 1362041 1382140 1358652 1331780 1336633 1263848 1286156 1233995 1159545
5092A159545Q221m3397m2122l6482k2987o0644j871j2244m1997o197J7365n3718
$$ 1159545 1167766 1124369 1082247 1045765 1022778 962134 960263 948019 906022 899825 917190 863472
5080H63472P898J1217R6946k1960q6456j0245M5494O9127n4836L3931O6300J9967
$$ 863472 871370 882587 979533 957573 871117 860872 906366 975493 920657 954588 1020888 1040855
5068A040855j3320j4430j0788l126J391M3544j1105l4090J4490j1812K5348K095
$$ 1040855 1027535 1013105 1002317 999191 1000582 1044126 1033021 998931 1013421 1001609 1026957 1029052
5056A029052K1632N6925q0224n618m2985M9146P014J821P8642k6028l7577J1529
$$ 1029052 1050684 1107609 1027385 1021767 978782 1027928 1034942 1036763 1115405 1089377 1051800 1063329
5044A063329L5600r855k5173m0594m3277m1555J9706j5849k6153K5196R7288l2552
$$ 1063329 1098929 1089074 1063901 1023307 980030 938475 958181 942332 916179 941375 1038663 1006111
5032A006111K0395j9765o2532L014j1350M5630q093p145J684J03872k1282o3168
$$ 1006111 1026506 1006741 944209 947223 935873 981503 973410 966265 967949 1071821 1050539 987371
5020I87371j2631J8816O403K6530j7853J9484N4200k1851m2005j0025L5781L5847
$$ 987371 974740 993556 999959 1026489 1008636 1028120 1082320 1060469 1018464 1008439 1044220 1080067
5008A080067r960n5236k4757N3570j7228O344L0388M1406N4496o7020l4206Q5470
$$ 1080067 1070107 1014871 990114 1043684 1026456 1032800 1063188 1104594 1159090 1092070 1057864 1143334
4996A143334Q6430R2884N4065J36000J15102P0027M8806L2967n4171J4852J5744
$$ 1143334 1229764 1322648 1376713 1512713 1627815 1697842 1746648 1779615 1725444 1740296 1756040
4985A756040l0958l4891q5580P95q4060n6243J1638P805K0916K7327J1081j3826
$$ 1756040 1725082 1690191 1604611 1605406 1521346 1465103 1476741 1484546 1505462 1532789 1543870 1530044
4973A530044K8702k6450k3028o2456q805m2873m6770J737n6558M7366Q311K8812
$$ 1530044 1558746 1532296 1509268 1446812 1438007 1395134 1348364 1350101 1293543 1340909 1349220 1378032
4961A378032n1873j9527K1755M5925n8736j1286K1851o193l201P2058J3046k0945
$$ 1378032 1326159 1306632 1328387 1374312 1315576 1304290 1326141 1319948 1316747 1388805 1401851 1380906
4949A380906j555M8593J9477n3034l3755k6121K8169m2L8260R274k6277P8322
$$ 1380906 1379351 1427944 1447421 1394387 1360632 1334511 1362680 1362638 1400898 1410172 1383895 1462217
4937A462217K5047L4424M5663m8358o9986L4409N2270J1210l9316P9334j8088
$$ 1462217 1487264 1521688 1567351 1518993 1449007 1483416 1535686 1546896 1507580 1586914 1568826
4926A568826p0424M9338M5611K5857J7710o159M637j8823J2843N2657M4824K5474
$$ 1568826 1498402 1547740 1593351 1619208 1636918 1630759 1635396 1616573 1629416 1682073 1726897 1752371
4914A752371l8667R4985L6036m6185m837L0797p405O0518O0529L1003p9760k504
$$ 1752371 1713704 1808689 1844725 1798540 1793703 1824500 1817095 1877613 1938142 1969145 1889385 1886881
4902A886881J2953J26497j1933o7691k1350R0464L6066l1579N0231o111M4612
$$ 1886881 1899834 2026331 2014398 1946707 1925357 2015821 2051887 2020308 2070539 2064428 2109040
4891B109040L9563L1351L0649O952p853m399q50k9543J10124K2295r75L6410k5908
$$ 2109040 2148603 2179954 2210603 2217555 2209702 2205303 2204453 2174910 2285034 2307329 2306354 2342764 2316856
4878B316856K3309J2857O6672J034n7098Q0134P8884l029l658P484M7693M4623
$$ 2316856 2340165 2353022 2419694 2420728 2363630 2443764 2522648 2519619 2515961 2523445 2571138 2615761
4866B615761Q8193K5332q344O801O016J01250J11691p8113K3770J00467P4424
$$ 2615761 2703954 2729286 2720942 2727743 2733759 2835009 2946700 2868587 2892357 2992824 3067248
4855C067248R6634J33285J40189J78122N7661L1028L5970k1487M3532j2687j2405
$$ 3067248 3163882 3297167 3437356 3615478 3673139 3704167 3740137 3718650 3762182 3749495 3737090
4844C737090L500r865K4594M6206L8833J57755l3596O3189J56826R4442J74066
$$ 3737090 3740590 3730725 3755319 3801525 3840358 3998113 3964517 4027706 4184532 4278974 4453040
4833D453040J27092Q4168J96126K94291L48386O25275J133544J956749K523233
$$ 4453040 4580132 4664300 4860426 5154717 5503103 6128378 7261922 9218671 11741904
4824A1741904K715634J787863N27367j88851m66908j128465j404657j567171j369195
$$ 11741904 14457538 16245401 16772768 16583917 16117009 14988544 13583887 12016716 10647521
4815A0647521j062727j035885q20547n51383l59814k51099j30635j54396j59595
$$ 10647521 9584794 8548909 7728362 7176979 6817165 6566066 6435431 6281035 6121440
4806F121440j42881j27346q8970O1849K0973m6414p074J3853J3968P5171N7712
$$ 6121440 5978559 5851213 5762243 5824092 5845065 5798651 5791577 5805430 5819398 5894569 5952281
4795E952281K7163k460Q8516Q6944M3230N1667O0772L8596Q4546M4633M6830N6329
$$ 5952281 5979444 5976984 6065500 6152444 6195674 6247341 6308113 6346709 6431255 6475888 6522718 6579047
4783F579047L6271R3580Q5550M6516O3855O1723O5761N5462P7199J14614P5921
$$ 6579047 6615318 6708898 6794448 6840964 6904819 6966542 7032303 7087765 7164964 7279578 7355499
4772G355499M9426J10377N5188M9313O5900J24580R3214M8740N7240R9100Q9190
$$ 7355499 7404925 7515302 7570490 7619803 7685703 7810283 7903497 7952237 8009477 8108577 8197767
4761H197767J36700O7174N9448O1114L4413N8069J26956P4692P5877J65707M1972
$$ 8197767 8334467 8401641 8461089 8522203 8556616 8614685 8741641 8816333 8892210 9057917 9099889
4750I099889J05434R5754K2626K8631R4393J47704J13918J40176N2270K5182O4060
$$ 9099889 9205323 9301077 9323703 9352334 9446727 9594431 9708349 9848525 9900795 9925977 9990037
4739I990037R9707L0761K5887J05726R9288P1703L4764R4919O2468O8919Q4245
$$ 9990037 10089744 10120505 10146392 10252118 10351406 10423109 10457873 10552792 10615260 10684179 10768424
4728A0768424J0601P5194Q3008O9453K0746L7462P4018R7019J00247N6213M7485
$$ 10768424 10779025 10854219 10937227 11006680 11027426 11064888 11138906 11235925 11336172 11392385 11439870
4717A1439870Q5040R1626N2089Q1324j8836o263j505J29795N9249k5217m017M2755
$$ 11439870 11524910 11616536 11668625 11749949 11731113 11724850 11723345 11853140 11912389 11887172 11883155 11925910
4705A1925910L7596k5651R4421R994n3128L7794J0527J9949L0747o896L5064J1724
$$ 11925910 11963506 11937855 12032276 12042270 11989142 12026936 12037463 12057412 12088159 12081263 12116327 12128051
4693A2128051M3103l2221n7484j3612k1245K1038q8839k7309L6410o898k0957
$$ 12128051 12171154 12138933 12081449 12067837 12046592 12067630 11978791 11951482 11987892 11980994 11960037
4682A1960037l0075n2108r233J3738m2072o0224j2020J6882l0099q7702q9008
$$ 11960037 11929962 11877854 11868621 11882359 11840287 11780063 11768043 11784925 11754826 11667124 11578116
4671A1578116j4951K9681K331q550l2108K2428k3197j6288l92J8241n7302n5091
$$ 11578116 11563165 11592846 11595177 11586627 11554519 11576947 11553750 11537462 11537070 11555311 11498009 11442918
4659A1442918l7517p368n4779l8683P5616M7418p3252m7897n4485j29765l0346
$$ 11442918 11405401 11398033 11343254 11304571 11380187 11427605 11354353 11306456 11251971 11122206 11091860
4648A1091860m2827l5850q7080n0863k8781j48348o2993k6165j02076m1490j02600
$$ 11091860 11049033 11013183 10926103 10875240 10846459 10698111 10635118 10608953 10506877 10465387 10362787
4637A0362787l4439n7864q8638l6179q877J8518Q6227K04904L85314O14652O63537
$$ 10362787 10328348 10270484 10181846 10145667 10136790 10155308 10241535 10446439 10831753 11446405 12109942
4626A2109942N79738L07178M680k4835k67781m05601m29224m33511l47514k60348
$$ 12109942 12689680 12996858 13001538 12976703 12708922 12303321 11874097 11440586 11093072 10832724
4616A0832724j93064j81564r2096M4728J71288K28838M01385L83439K90395K82514
$$ 10832724 10639660 10458096 10366000 10410728 10582016 10810854 11212239 11595678 11886073 12168587
4606A2168587K82930K41905K08321M20541N64304N63812N89941M15077K20702
$$ 12168587 12451517 12693422 12901743 13322284 13886588 14450400 15040341 15455418 15676120
4597A5676120J24777J66911L10343L72947N80258N10273K95966J00362j65754
$$ 15676120 15800897 15967808 16278151 16651098 17231356 17741629 18037595 18137957 17972203
4588A7972203k74072k22978k07629k01544j42617j81082k39249l30097m66014
$$ 17972203 17698131 17475153 17267524 17065980 16923363 16742281 16503032 16172935 15706921
4579A5706921m10869m37485m06809k84680k44239k22469k29833k34925k49643
$$ 15706921 15296052 14858567 14451758 14167078 13922839 13700370 13470537 13235612 12985969
4570A2985969j28282r0257j8043N7117J36426L52751M69909O07422J003061J422445
$$ 12985969 12857687 12767430 12749387 12806504 12942930 13295681 13765590 14373012 15376073 16798518
4560A6798518J837120K409943L054650L656461M332261M939202N080823M703259
$$ 16798518 18635638 21045581 24100231 27756692 32088953 37028155 42108978 46812237
4552D6812237M063633L492699L188992L276414L760109M653280N801296O702916
$$ 46812237 50875870 54368569 57557561 60833975 64594084 69247364 75048660 81751576
4544H1751576O475585N001107K623424L99704j063956k174268l180204l579170
$$ 81751576 88227161 93228268 95851692 96251396 95187440 93013172 89832968 86253798
4536H6253798l755620l876313l779668l908288m150285m234744m292210m458594
$$ 86253798 82498178 78621865 74842197 70933909 66783624 62548880 58256670 53798076
4528E3798076m519588m658427m590846m423986m167422l689745l154122k664236
$$ 53798076 49278488 44620061 40029215 35605229 31437807 27748062 24593940 21929704
4520B1929704k158693j790360j344780j058163q57375o44353m66112l00290q1028
$$ 21929704 19771011 17980651 16635871 15577708 14720333 14075980 13609868 13309578 13228550
4511A3228550K55342P21358J220381J869717K096233J669066R59835K51232l741
$$ 13228550 13483892 14205250 15425631 17295348 19391581 21060647 22020482 22271714 22267973
4502B2267973j09091j95392q9833K59622J205920K462120L220835K949140J612414
$$ 22267973 22158882 21963490 21873657 22133279 23339199 25801319 29022154 31971294 33583708
4493C3583708j19706r30285j108647j510283j616684j781087j796116j179721
$$ 33583708 33464002 32533717 31425070 29914787 28298103 26517016 24720900 23541179
4485B3541179n49171k24328m66848q49073j094757j142535j215111j371924j447729
$$ 23541179 22992008 22767680 22300832 21451759 20357002 19214467 17999356 16627432 15179703
4476A5179703j587486j541457j447569j227087j023489p30349n47527l73666l25477
$$ 15179703 13592217 12050760 10603191 9376104 8352615 7622266 7074739 6701073 6375596
4467F375596l34953l00552j69758k39107j97600r5375j24315j34296j24512l6941
$$ 6375596 6040643 5740091 5570333 5331226 5133626 5038251 4913936 4779640 4655128 4618187
4457D618187r8188j03593j00354q2863k5634q3468p5343j52604o2768m0636m0826
$$ 4618187 4519999 4416406 4316052 4233189 4207555 4124087 4048744 3896140 3833372 3792736 3751910
4446C751910p253j05549K3200n4367k0892o123L9161k2219n9631o3168n8820p48
$$ 3751910 3744657 3639108 3662308 3607941 3587049 3580926 3620087 3597868 3538237 3475069 3416249 3415501
4434C415501k5690K7921N306k0254K6349j04533o5411j6661m6427p0178k5157
$$ 3415501 3389811 3417732 3423038 3402784 3429133 3324600 3259189 3242528 3196101 3125923 3100766
4423C100766l1766o0960j0863k2565j11970l3501j8903L4577r2020l6284k6856
$$ 3100766 3069000 3008040 2997177 2974612 2862642 2829141 2810238 2844815 2752795 2716511 2689655
4412B689655n9794J1602j1977o2694o8503L0355n8454k0138o1120k803j01360
$$ 2689655 2629861 2641463 2629486 2566792 2498289 2528644 2470190 2450052 2388932 2386129 2284769
4401B284769j9344N0496j6930j0935q604j6213j5847m3342J0674P060r052K4763
$$ 2284769 2265425 2315921 2298991 2288056 2279452 2263239 2247392 2204050 2214724 2221784 2212732 2237495
4389B237495k2597n1155o8803m5373M8033Q0850K9556r8830J6104k8244P2047
$$ 2237495 2214898 2163743 2094940 2049567 2097600 2178450 2208006 2109176 2125280 2097036 2169083
4378B169083m9829n961j2112n2006K9777J2287l2809L850l6191L952k9175q647
$$ 2169083 2119254 2113293 2101181 2049175 2078952 2091239 2058430 2062280 2026089 2030041 2000866 1992219
4366A992219K7286K2083m919n4754K6821m7167o76N9606M7454M6097M9678Q5352
$$ 1992219 2019505 2041588 2036669 1981915 2008736 1961569 1960893 2020499 2067953 2114050 2163728 2249080
4354B249080J06953R3371J85800K16363R4431j5138J298n5311r0107j56562o2814
$$ 2249080 2356033 2449404 2635204 2851567 2945998 2930860 2932158 2876847 2786740 2630178 2567364
4343B567364o1840j37036o3293o9818j26557j4029n6646j134N5133J9249m6882
$$ 2567364 2505524 2368488 2305195 2235377 2108820 2094791 2038145 2037011 2092144 2111393 2064511
4332B064511p931l7993O3580o353K6831m5106m3784K4491P8806L8779L298L5088
$$ 2064511 2056580 2018587 2082167 2075814 2102645 2057539 2013755 2038246 2117052 2155831 2159129 2194217
4320B194217k805N0887K6887m200O5549Q7503j2408O071O9176M8400K4509L3092
$$ 2194217 2191412 2242299 2269186 2264986 2330535 2418038 2405630 2411701 2480877 2529277 2553786 2586878
4308B586878Q871O850L8699K9627L1480O0370J7028R1090N0588L3433R9602J12072
$$ 2586878 2595749 2602599 2641298 2670925 2702405 2762775 2779803 2870893 2921481 2954914 3054516 3166588
4296C166588P0284R3735J00810J52522J71148J65624K78919J91891J54131J68012
$$ 3166588 3236872 3330607 3431417 3583939 3755087 3920711 4199630 4391521 4545652 4713664
4286D713664K09647K37373K49647K75117L07702M08709M20054N22737P15168Q04043
$$ 4713664 4923311 5160684 5410331 5685448 5993150 6401859 6821913 7344650 8059818 8863861
4276H863861P41605O81169N87305N32165M67650L53514M04217L85746M90035N84060
$$ 8863861 9605466 10286635 10873940 11406105 11873755 12227269 12631486 13017232 13507267 14091327
4266A4091327Q10275J077634J308542J525271J609215J457200J311992J062367
$$ 14091327 14901602 15979236 17287778 18813049 20422264 21879464 23191456 24253823
4258B4253823P49581N07689K65065J58163J73421K21517M41516P58005J087679
$$ 24253823 25003404 25511093 25776158 25934321 26107742 26329259 26770775 27528780 28616459
4249B8616459J458528J664476J714552J565273J282180Q76726M90248K3594l01703
$$ 28616459 30074987 31739463 33454015 35019288 36301468 37178194 37668442 37692036 37390333
4240C7390333o48867p55109n97790n48349l03139O1401K95854M94353O78976O30891
$$ 37390333 36741466 35986357 35388567 34840218 34537079 34598480 34894334 35388687 36067663 36698554
4230C6698554M21363K58565j41325n70859r27465j255030j471118j516451j476507
$$ 36698554 37119917 37378482 37237157 36666298 35738833 34483803 33012685 31496234 30019727
4221C0019727j271196j049530p71014n82691l96588k90722j78196k78833m58450
$$ 30019727 28748531 27699001 26927987 26345296 25948708 25657986 25479790 25200957 24742507
4212B4742507o98721r68339j128219j324398j374487j272887j268089j111702
$$ 24742507 24043786 23075447 21947228 20622830 19248343 17975456 16707367 15595665
4204A5595665q84239q09603o09194m47400l23700k97901m68862n41446n79778
$$ 15595665 14711426 13901823 13292629 12845229 12521529 12223628 11754766 11213320 10633542
4195A0633542n92017o84264o08315o41434o69023n50339m56363m15670k94247
$$ 10633542 10041525 9357261 8748946 8107512 7438489 6888150 6431787 6016117 5721870
4186E721870k27547j91459k23099k17534j76219k93410j99698k31702k18458j58002
$$ 5721870 5494323 5302864 5079765 4862231 4686012 4392602 4192904 3961202 3742744 3584742
4176C584742k11225j33396j45344j62281p2942j00793q1179p2612m3919k5769
$$ 3584742 3373517 3240121 3094777 2932496 2859554 2758761 2677582 2604970 2561051 2535282
4166B535282n7847r3110k1608l0251m9745o0522K0338j16195j06945L677j9193
$$ 2535282 2477435 2384325 2362717 2332466 2282721 2222199 2242537 2126342 2019397 2023074 2003881
4155B003881K8964l2346p1638m1420m0690K5776j5233J0043J521j11145m1255
$$ 2003881 2032845 2000499 1928861 1887441 1846751 1872527 1857294 1867337 1868858 1757713 1716458
4144A716458P543j118M608n3845j7820K049q2038q722M4957M3302p5262n5126
$$ 1716458 1724001 1722883 1727491 1673646 1655826 1657875 1575837 1567115 1612072 1655374 1580112 1524986
4132A524986m4856K592k6211m9303P3913n7425m0872J4383O9080j6065p941j21998
$$ 1524986 1480130 1482722 1456511 1407208 1481121 1423696 1382824 1397207 1466287 1450222 1442281 1320283
4120A320283m5120j4524J2643O4152K6277n2015j1495O4936o4837l9738K7629
$$ 1320283 1275163 1260639 1273282 1337434 1363711 1311696 1300201 1365137 1300300 1260562 1288191
4109A288191J5419M4536j0107n2341J7647N287M574M6394p0377k1791J8279K2913
$$ 1288191 1303610 1348146 1338039 1285698 1303345 1308632 1313206 1359600 1289223 1267432 1285711 1308624
4097A308624j4484o362r64k942j8965m778L6153m8767N5679J9915q726M1952P9694
$$ 1308624 1294140 1287778 1286814 1283872 1264907 1260129 1296282 1247515 1303194 1323109 1314383 1356335 1436029
4084A436029q0547J6667Q9410P8779l0661J5216N8259j02366p196Q0133K5364
$$ 1436029 1355482 1372149 1461559 1540338 1509677 1524893 1583152 1480786 1473590 1553723 1579087
4073A579087J9381K250N4057k6394Kn592j4876K903P175N9793M9444k6403o1144
$$ 1579087 1598468 1600718 1654775 1628381 1628383 1622791 1607915 1610818 1617993 1677786 1727230 1700827 1639683
4060A639683K8280j2456L7166N4597o1061K06l749l9517n155l0155J4692m6455
$$ 1639683 1667963 1655507 1692673 1747270 1686209 1686415 1682666 1643149 1637994 1607839 1622531 1576076
4048A576076J9020M5635k4088n064J0254J6123J2414m0444m5843K1582j9759L4407
$$ 1576076 1595096 1640731 1616643 1611579 1621833 1637956 1650370 1609926 1564083 1585665 1565906 1600313
4036A600313j7519N237M0527m6114p4705m5902N9761l0046L9613L1476r4399k0718
$$ 1600313 1582794 1588031 1628558 1582444 1507739 1461837 1521598 1491552 1531165 1562641 1468242 1447524
4024A447524K4302n6019p0691M5955P122n1206L097n8310J3396L2116j1388l5152
$$ 1447524 1471826 1415807 1345116 1391071 1398193 1346987 1350084 1291774 1305170 1337286 1325898 1290746
4012A290746l044k850m8456K9080J4627L2342j458j4568k1912l3024O6203k6548
$$ 1290746 1287702 1284852 1236396 1265476 1280103 1312445 1310987 1296419 1274507 1241483 1307686 1281138
4000A281138l2995L0549P4830k7500n2108M7346R4316L2791r4414J7803L9896
$$ 1281138 1248143 1278692 1353522 1326022 1273914 1321260 1415576 1448367 1353953 1371756 1411652
3989A411652K6311l9908J8785N640N8200N930n1992L5747P6510P2874Q4438Q1859
$$ 1411652 1437963 1398055 1416840 1422480 1480680 1486610 1434618 1470365 1546875 1619749 1704187 1786046
3977A786046j4353k0439j9831k9766L4399K6786p031j8146J2012M1393J3632k3015
$$ 1786046 1771693 1751254 1731423 1701657 1736056 1762842 1755811 1737665 1749677 1791070 1804702 1781687
3965A781687n7876N647j0557M441j4999J1887o399q6815J1982j0195k6643M2055
$$ 1781687 1723811 1729458 1718901 1723342 1708343 1720230 1713831 1627016 1638998 1628803 1602160 1644215
3953A644215N1581P7225N2914J80922L20160M45101M71980K63786O4792J7173
$$ 1644215 1695796 1773021 1825935 2006857 2327017 2772118 3244098 3507884 3572676 3589849
3943C589849N558j78164k34947k10442k21468j94183j44535n3503j16058j07647
$$ 3589849 3595407 3417243 3182296 2971854 2750386 2556203 2411668 2358165 2242107 2134460
3933B134460k1936K2404j3594K1970K1773m376J3329k4857N0660M0263L8663j7072
$$ 2134460 2112524 2134928 2121334 2143304 2165077 2160701 2174030 2149173 2199833 2240096 2278759 2261687
3921B261687p446M5783K40440K69228L27915M25402K85014N6638m8076q0608j51971
$$ 2261687 2254241 2300024 2540464 2809692 3137607 3563009 3848023 3904661 3856585 3775977 3624006
3910C624006j57210j86147k23079k20871j85919q6569n2980n9379q8662n760l3185
$$ 3624006 3466796 3280649 3057570 2836699 2650780 2564211 2511231 2451852 2363190 2357430 2324245
3899B324245o6897j1772P038J0317J9016K8544o4527L2360L4327K7869N3348J3825
$$ 2324245 2257348 2245576 2252614 2262931 2281947 2310491 2245964 2278324 2312651 2340520 2393868 2407693
3887B407693p107N8895L0836o3419n987Q5848L09O93J419J4471K7561K6684j1443
$$ 2407693 2400586 2459481 2490317 2426898 2420911 2506759 2507068 2507761 2509180 2523651 2551212 2577896 2566453
3874B566453N5735J7130j981j3232K9577L0275L2515K4209k3717J6095Q0946J00958
$$ 2566453 2622188 2639318 2637337 2624105 2653682 2683957 2716472 2740681 2716964 2733059 2814005 2914963
3862B914963K2590l6864J3177N8136M9966L0129R473K6864R4835J00667Q6048
$$ 2914963 2937553 2900689 2913866 2972002 3021968 3052097 3061570 3088434 3183269 3283936 3369984
3851C369984M4106L6426M4939J00134R7082R5556J37173R7567M8103M9561J20796
$$ 3369984 3414090 3450516 3495455 3595589 3692671 3788227 3925400 4022967 4071070 4120631 4241427
3840D241427J31871L7805K0157L6814M6153R6492P038R4177P6373P2740N2812
$$ 4241427 4373298 4411103 4431260 4468074 4514227 4610719 4617757 4711934 4788307 4861047 4913859
3829D913859L9288N0966O2391L1588O3652P2682J43316J15295J69350J19582J16468
$$ 4913859 4953147 5004113 5066504 5098092 5161744 5234426 5377742 5493037 5662387 5781969 5898437
3818E898437K12269K08217J94535K31878K81007L89227M20522L40721N04620N72960
$$ 5898437 6110706 6318923 6513458 6745336 7026343 7415570 7836092 8176813 8681433 9254393
3808I254393N85411O72366R10576R76584J164463J451555J728166K054977K463319
$$ 9254393 9839804 10512170 11422746 12399330 13563793 15015348 16743514 18798491 21261810
3799B1261810L010874L535880L992186M529412M851259M941751M902075M776590
$$ 21261810 24272684 27808564 31800750 36330162 41181421 46123172 51025247 55801837
3791E5801837M378956L726933K950174K267735J461855Q01240K08497k22577l64045
$$ 55801837 60180793 63907726 66857900 69125635 70587490 71388730 71597227 71374650 71010605
3782G1010605l52613j86359m5234J79144K98176L40444J12025j13627n46509j143696
$$ 71010605 70657992 70471633 70426399 70605543 70903719 71244163 71356188 71242561 70696052 69552356
3772F9552356j762436k423326l169120l652754l991301m389477m421739m380080
$$ 69552356 67789920 65366594 62197474 58544720 54553419 50163942 45742203 41362123
3764D1362123m224382l803880l484870l002317k661942k297969j963605j657277
$$ 41362123 37137741 33333861 29848991 26846674 24184732 21886763 19923158 18265881
3756A8265881j409262j197410j009207q92592p38423p03481n80025n13671m98904
$$ 18265881 16856619 15659209 14650002 13757410 13018987 12315506 11735481 11221810 10722906
3747A0722906l04025k47298k77405k96835k30533k78080k35505j68692j89965
$$ 10722906 10418881 10171583 9894178 9597343 9366810 9088730 8853225 8684533 8494568
3738H494568j47650j60893j86568k08399j92225q634j52865k37499k06405j86932
$$ 8494568 8346918 8186025 7999457 7791058 7598833 7590199 7437334 7199835 6993430 6806498
3728F806498r7128j44724r5527q5008p4653j22439n4840l0762m6672p8437m1128
$$ 6806498 6709370 6564646 6469119 6384111 6309458 6187019 6132179 6101417 6054745 5976308 5935180
3717E935180m5171j1930r3151n4952n1937o1514j0985m9408j5575j0795k8005
$$ 5935180 5890009 5878079 5784928 5729976 5678039 5616525 5605540 5556132 5540557 5529762 5501757
3706E501757R099Q573O357K3069m956M3628N0055m85L8795M3033J51989O359K137
$$ 5501757 5510856 5519429 5525786 5548855 5543899 5587527 5637582 5637097 5675892 5718925 5870914 5877273 5879410
3693E879410N5087O6640J8157l2256K3805k4310J0139M9234k4532L9164J40235
$$ 5879410 5934497 6001137 6019294 5987038 6010843 5986533 5996672 6045906 6021374 6060538 6200773
3682F200773J16160K0489K2856J3645J15007R2240R2259J05602J37470J23820
$$ 6200773 6316933 6337422 6360278 6373923 6488930 6581170 6673429 6779031 6916501 7040321
3672G040321K0614J34454J28678J79614J79078K51234K12807J66066K87477K49746
$$ 7040321 7060935 7195389 7324067 7503681 7682759 7933993 8146800 8312866 8600343 8850089
3662H850089K86744L99748L49044M45894N62188O69398P52430R24122J059139
$$ 8850089 9136833 9536581 9885625 10331519 10893707 11563105 12315535 13239657 14298796
3653A4298796J259893J376846J577019J826099J972292K017084K014640J884179
$$ 14298796 15558689 16935535 18512554 20338653 22310945 24328029 26342669 28226848
3645B8226848J822638J518447J171259Q28441N14104J19504k69425n84127o50856
$$ 28226848 30049486 31567933 32739192 33567633 34081737 34201241 33931816 33347689 32696833
3636C2696833o72185n49362l35166N4880O63273J170125J756585K327216K821020
$$ 32696833 32024648 31475286 31140120 31195000 31858273 33028398 34784983 37112199 39933219
3627C9933219K954099L034408K812743K488227K003074J418651Q39465L17919
$$ 39933219 42887318 45921726 48734469 51222696 53225770 54644421 55483886 55801805
3619E5801805j17348l30991l22184k22307K05740O37381Q84897J115658J296281
$$ 55801805 55684457 55353466 55031282 54808975 55014715 55652096 56536993 57652651 58948932
3610E8948932J276362J113827Q37248L64288L9658k56082m27034m21400j08273
$$ 58948932 60225294 61339121 62176369 62540657 62580315 62324233 61897199 61475799 61367526
3601F1367526L63901J056488J867989K631302L416505L971908M432112M611732
$$ 61367526 61731427 62787915 64655904 67287206 70703711 74675619 79107731 83719463
3593H3719463M409245M077947L177418K210928J173822j51748j402406k549503
$$ 83719463 88128708 92206655 95384073 97595001 98768823 98617075 97214669 94665166
3585I4665166l625979m483650n055350n411903n510077n409850n264308m690286
$$ 94665166 91039187 86555537 81500187 76088284 70578207 65168357 59904049 55213763
3577E5213763m251655l752745l231321k579980j968190j401601r41231n27332
$$ 55213763 50962108 47209363 43978042 41398062 39429872 38028271 37087040 36559708
3569C6559708j8261N01092R88998J438356J997126K442311K918792L389215L641957
$$ 36559708 36541447 37042539 38031537 39469893 41467019 43909330 46828122 50217337 53859294
3560E3859294M001419M321392M285820M274215M114942L799888L250052K624676
$$ 53859294 57860713 62182105 66467925 70742140 74857082 78656970 81907022 84531698
3552H4531698J839025J075937K58690n69894j446330k259229k878686l386917
$$ 84531698 86370723 87446660 87705350 87135456 85689126 83429897 80551211 77164294
3544G7164294l919355m046659m061203m119052l880894l621829l404811k881911
$$ 77164294 73244939 69198280 65137077 61018025 57137131 53515302 50110491 47228580
3536D7228580k479712k116108j866674j498250j249390j079572q26595p62593
$$ 47228580 44748868 42632760 40766086 39267836 38018446 36938874 36112279 35349686
3528C5349686p13836n97954n98971n45752l95894l12020j50709j5266L944Q9172
$$ 35349686 34635850 34037896 33438925 32893173 32497279 32185259 32034550 32019284 32023228 32112400
3518C2112400J93370J39279J95185K08543K11193J67720J29326L48685M39572
$$ 32112400 32305770 32445049 32640234 32848777 33059970 33227690 33357016 33705701 34145273
3509C4145273N74803O47414P99064J047487J184135J336324J426143J487484J645375
$$ 34145273 34720076 35367490 36166554 37214041 38398176 39734500 41160643 42648127 44293502
3500D4293502J603807J609466J578140J510171J452434J334875J416653J413278
$$ 44293502 45897309 47506775 49084915 50595086 52047520 53382395 54799048 56212326
3492E6212326J429184J600477J876173K076684K338081K732225L311173L968698
$$ 56212326 57641510 59241987 61118160 63194844 65532925 68265150 71576323 75545021
3484G5545021M702845N644509O507350P433399Q314024R063255R575554R902851
$$ 75545021 80247866 85892375 92399725 99833124 108147148 117210403 126785957 136688808
3476A36688808R918730R623944R249823Q577221Q075383P392236O833952O461119
$$ 136688808 146607538 156231482 165481305 174058526 182133909 189526145 196360097 202821216
3468B02821216O095739N790022N468750N081826M377266L535932K493710J212861
$$ 202821216 208916955 214706977 220175727 225257553 229634819 233170751 235664461 236877322
3460B36877322r0273j496541k908978m281256n549863o610771p400311q032669
$$ 236877322 236787049 235290508 232381530 228100274 222550411 215939640 208539329 200506660
3452B00506660q495178q730765q877357q877601q789210q553708q270140p856385
$$ 200506660 192011482 183280717 174403360 165525759 156736549 148182841 139912701 132056316
3444A32056316p342883o689598n841700m993320l937125k806183j657764p30357
$$ 132056316 124713433 118023835 112182135 107188815 103251690 100445507 98787743 98057386
3436I8057386R4018P52225J184235J287050J150226P74501L28446j47705p37765
$$ 98057386 98151404 98903629 100087864 101374914 102525140 103299641 103628087 103480382 102742617
3427A02742617j150694j599474j722124j782208j793174j590326j371731j040127
$$ 102742617 101591923 99992449 98270325 96488117 94694943 93104617 91732886 90692759
3419I0692759o81628l99188k09143r8010j84029m02467p99825j299583j726516
$$ 90692759 90011131 89611943 89402800 89304790 89120761 88718294 87918469 86618886 84892370
3410H4892370k371069k929499l301826l700474l910311l974047l939273l901504
$$ 84892370 82521301 79591802 76289976 72589502 68679191 64705144 60765871 56864367
3402E6864367l655161l432613l188005l036552k738923k443269k258812k065637
$$ 56864367 53209206 49776593 46588588 43552036 40813113 38369844 36111032 34045395
3394C4045395j851874j696646j547832j405449j308832j139424j040783j058074
$$ 34045395 32193521 30496875 28949043 27543594 26234762 25095338 24054555 22996481
3386B2996481r88299q81834q34504p19089n72306n44199m17676l59290k61483
$$ 22996481 22008182 21126348 20291844 19572755 19000449 18456250 18038574 17679284 17417801
3377A7417801j78686r9799j3048J28632J58939J54481L35834M73328N47967O14440
$$ 17417801 17239115 17139316 17126268 17254900 17413839 17568320 17904154 18377482 18925449 19539889
3367A9539889P06442Q05910R31200Q61605P98670P52635O78911M79762L34029
$$ 19539889 20246331 21052241 21983441 22845046 23643716 24396351 25075262 25555024 25889053
3358B5889053M9637k27984m17283n07651p29071p39951o78634p92082r31465r05165
$$ 25889053 25938690 25710706 25293423 24785772 24056701 23316750 22638116 21846034 20914569 20009404
3348B0009404q09887q07082q71304p35360o76651o18714n19847l84054l12784
$$ 20009404 19199517 18392435 17521131 16785771 16109120 15490406 14970559 14586505 14273721
3339A4273721k67161j82729o8873o908P969J33636J91041K79988L92142L87897
$$ 14273721 14006560 13823831 13754958 13748050 13756019 13889655 14080696 14360684 14752826 15140723
3329A5140723M83436N54392N24255P51995Q06781Q83470J058904J205112J439350
$$ 15140723 15624159 16178551 16702806 17454801 18261582 19145052 20203956 21409068 22848418
3320B2848418J707847K016425K455895K909339L462705M273641N106435O086238
$$ 22848418 24556265 26572690 29028585 31937924 35400629 39674270 44780705 50866943
3312E0866943P202957Q211383R100344R876543J0519554J0897988J1042248J0925744
$$ 50866943 58069900 66281283 75381627 85258170 95777724 106675712 117717960 128643704
3304A28643704J0277811R233900P652477N710501L424610R30528j564323l928702
$$ 128643704 138921515 148155415 155807892 161518393 164943003 165873531 164309208 160380506
3296A60380506o123379p887575r307091j0374916j0812094j0941440j0796273
$$ 160380506 154257127 146369552 137062461 126687545 115875451 104934011 94137738
3289I4137738j0233283r480400q605268p730815o802179n839116n078166m310873
$$ 94137738 83904455 74424055 65818787 58087972 51285793 45446677 40368511 36057638
3281C6057638l586150l105096k645070k224851j883124j620960j382383j125807
$$ 36057638 32471488 29366392 26721322 24496471 22613347 20992387 19610004 18484197
3273A8484197r79232q78919p66333o31902n83865m86892m63385m07756m40636
$$ 18484197 17504965 16626046 15859713 15227811 14643946 14157054 13693669 13285913 12845277
3264A2845277m22076m19142l80370k69558k49503k38494k67979k89458j32984
$$ 12845277 12423201 12004059 11623689 11354131 11104628 10866134 10598155 10308697 10175713
3255A0175713r7164j44086j28621n4717m4810l8815k4282L4673L3953N2936R4636
$$ 10175713 10078549 9934463 9805842 9751125 9706315 9667500 9643218 9677891 9711844 9764780 9859416
3244I859416L0738j6788m3566o0007q1055j17313j47629k43704l41237k47851
$$ 9859416 9890154 9873366 9829800 9769793 9688738 9571425 9423796 9180092 8838855 8591004
3234H591004l14610k68705l24498k77585k14411k39329j81823j33623k1840j17970
$$ 8591004 8276394 8007689 7683191 7405606 7191195 6951866 6770043 6636420 6614580 6496610
3224F496610l3116j07001n0988j14203m8278n1879j10094o2712l2335r051n0692
$$ 6496610 6463494 6356493 6305505 6191302 6143024 6091145 5981051 5918339 5886004 5876953 5826261
3213E826261K1958r058p2402k7431K0027n02p0970l8016K5169O0946J7793K7008
$$ 5826261 5848219 5839161 5766759 5739328 5759355 5758853 5687883 5649867 5675036 5735982 5753775 5780783
3201E780783O0723P7176N0564R7498J17653J09768J36752J83079J78201M1604
$$ 5780783 5841506 5918682 5969246 6066744 6184397 6294165 6430917 6613996 6792197 6833801
3191F833801Q4410Q4732J26509N9409J01001J25112K02536J35087J45427J25666
$$ 6833801 6918211 7002943 7129452 7188861 7289862 7414974 7617510 7752597 7898024 8023690
3181H023690R7630J73297J54041J20943J42291L5384R3408J50746J59345J53101
$$ 8023690 8121320 8294617 8448658 8569601 8711892 8747276 8840684 8991430 9150775 9303876
3171I303876J04767J42234J59475J18912J26671J46814J22800Q8330J08377J45144
$$ 9303876 9408643 9550877 9710352 9829264 9955935 10102749 10225549 10313879 10422256 10567400
3161A0567400J78196K28053K41239K68075L66706L56566L54865M24715M80807
$$ 10567400 10745596 10973649 11214888 11482963 11849669 12206235 12561100 12985815 13466622
3152A3466622N69322N36808N54864M51148L62709L44823K50804J51519J19059
$$ 13466622 14035944 14572752 15127616 15578764 15941473 16286296 16537100 16688619 16807678
3143A6807678J82498K83140J69092J26367K47195J88788K75749K27585J51675
$$ 16807678 16990176 17273316 17442408 17568775 17815970 18004758 18280507 18508092 18659767
3134A8659767K49320L02536K74780L92627M23792M07194M83260N99925P92633
$$ 18659767 18909087 19211623 19486403 19879030 20302822 20710016 21193276 21793201 22585834
3125B2585834R88234J313107J549404J513270J067783P16614L79919M0704k77083
$$ 22585834 23574068 24887175 26436579 27949849 29017632 29734246 30114165 30154869 29877786
3116B9877786m08956m93619l93295k09541n9157J23099L62353N17008O80638Q63816
$$ 29877786 29468830 28975211 28581916 28372375 28313218 28436317 28798670 29315678 29996316 30860132
3106C0860132R22354J186243J349677J564797J841797K185027K584378K903952
$$ 30860132 31782486 32968729 34318406 35883203 37725000 39910027 42494405 45398357
3098D5398357L251302L729493M265656N027734N822551O730750P799195Q985138
$$ 45398357 48649659 52379152 56644808 61672542 67495093 74225843 82025038 91010176
3090I1010176J0470585J2471813J5549329K0118551K7053448L6703392M8086099
$$ 91010176 101480761 113952574 129501903 149620454 176673902 213377294 261463393
3083B61463393N8051868O1732491N5658716M0642989K2025299N261089p583727
$$ 261463393 319515261 381247752 436906468 477549457 499574756 504835845 497252118
3076D97252118j5346071j6205854j0361035k012135L028001O59204p863787j7586550
$$ 497252118 481906047 465700193 455339158 453327023 456355024 457014228 449150441 431563891
3068D31563891k5418087l2258541l7709521m0136949l9322060l6283185l2192558
$$ 431563891 406145804 373887263 336177742 296040793 256718733 220435548 188242990
3061A88242990k7751751k3068292j8563873j4569716j1622058r681370q254921
$$ 188242990 160491239 137422947 118859074 104289358 92667300 82985930 74731009
3054G4731009p153693o109048n282224m407330l690743l041986k577881k157368
$$ 74731009 67577316 61468268 56186044 51778714 48087971 45045985 42468104 40310736
3046D0310736j894510j700835j584487j490067j476053j315369j228131j151428
$$ 40310736 38416226 36715391 35130904 33640837 32164784 30849415 29621284 28469856
3038B8469856j100039r58154r49885r64422r47152r85657r52983q76526q39937
$$ 28469856 27369817 26411663 25461778 24497356 23550204 22564547 21611564 20735038 19895101
3029A9895101p87959p16763p36002o18045n98240o32313n84798m68899m09806
$$ 19895101 19107142 18390379 17654377 17036332 16438092 15805779 15220981 14752082 14342276
3020A4342276m06245m09588m43207m34814l70899m91471m80483k91995l33333
$$ 14342276 13936031 13526443 13083236 12648422 12277523 11786052 11305569 11013574 10680241
3011A0680241m19723l90450l00520l08553k71462k70320k67577k68856k26566
$$ 10680241 10260518 9870068 9569548 9260995 8989533 8719213 8451636 8182780 7956214
3002G956214k24913j81342j52254k12809j66223j38084k9876j7690j02100m7872
$$ 7956214 7731301 7549959 7397705 7184896 7018673 6880589 6850713 6833023 6730923 6683051
2992F683051K334j1111j43733j57467j02344k28804j05467j57635j61751j42826
$$ 6683051 6685385 6674274 6530541 6373074 6270730 6041926 5936459 5778824 5617073 5474247
2982E474247j12199n9600j78273j52823j17667j36427n4073j0760j30450j11183
$$ 5474247 5362048 5302448 5124175 4971352 4853685 4717258 4663185 4652425 4521975 4410792
2972D410792j4031j17187n3202p9944r4393q2083n8109N248l7218K5563L7845
$$ 4410792 4396761 4279574 4226372 4146428 4052035 3969952 3911843 3917091 3879873 3905436 3943281
2961C943281n60k5661r1293k1164l1639q2740K8411K1206r9521q950j3217j3088
$$ 3943281 3942721 3917060 3825767 3804603 3772964 3690224 3718635 3739841 3640320 3631370 3618153 3605065
2949C605065l6230m4421r0655o3054r241j82366q1712r8140m5975j07084m2594
$$ 3605065 3568835 3524414 3433759 3370705 3361464 3179098 3097386 2999246 2953271 2846187 2803593
2938B803593o8415m5233r1959j15985p7491j7376R268r3622j20703n6505j2952
$$ 2803593 2735178 2689945 2597986 2482001 2404510 2387134 2396402 2302780 2182077 2125572 2112620
2927B112620p9165P601q2288J0317j03249j0954o8936n3652j1668n4624p406m8464
$$ 2112620 2033455 2041056 1958768 1969085 1865836 1854882 1785946 1732294 1720626 1666002 1658596 1610132
2915A610132R605l2909p8257j2587k837n0126n3430o51N461p2861L6330j0603
$$ 1610132 1619737 1586828 1508571 1495984 1493147 1443021 1389591 1388940 1394401 1321540 1357870 1347267
2903A347267j3989m7734J3422k840o4558j1984J0776M6688M4701n9382l954k7927
$$ 1347267 1333278 1285544 1298966 1296126 1231568 1219584 1230360 1277048 1321749 1262367 1258413 1230486
2891A230486j1828P540l7885j173j547p3468o8184P4982l229l0452m4911l0440
$$ 1230486 1218658 1226198 1188313 1187140 1185593 1112125 1043941 1118923 1115694 1085242 1040331 1009891
2879A009891j21939n0580l5990m6026J0731o4436J3309r750m9602o6794j9880
$$ 1009891 887952 837372 801382 755356 766087 701651 714960 705210 655608 588814 568934
2868E68934j5545l1706l3510O371q582p2445P417o774k6963K373K3242N192l0772
$$ 568934 553389 521683 488173 494544 485962 413517 420934 414160 387197 389570 412812 418004 387232
2855C87232o250P2711K0489k0128m5975M9635R9441n556k0474M1595k6349L3425
$$ 387232 380982 453693 474182 454054 408079 457714 557155 551599 531125 572720 546371 579796
2843E79796J45473k3259o9174p33j1790O0628L6177j8092Q766n3876m8289m2195
$$ 579796 725269 702010 632836 632103 620313 680941 717118 699026 707792 653916 605627 563432
2831E63432K1609K9601j0300J3013k0667l595k3665M5063n141m2830n360K0531
$$ 563432 585041 614642 604342 617355 596688 593093 569428 614491 609350 566520 561160 581691
2819E81691J3584l5348R280O456N9495M4771M5487M9403M2132J01402j5915N8647
$$ 581691 595275 559927 569207 575663 635158 679929 725416 774819 816951 918353 902438 961085
2807I61085L2845N3612J89126O4578O4491J68049K67204J90930L12452K38274
$$ 961085 993930 1047542 1236668 1301246 1365737 1533786 1800990 1991920 2304372 2542646
2797B542646J27311O8666L9841l0712q1448l5297m7252j4424L1346q947m6208
$$ 2542646 2669957 2738623 2778464 2747752 2666304 2631007 2583755 2569331 2600677 2591730 2545522
2786B545522j23349j61546k00934k36513j89652k02287k08869j32776j55764r7166
$$ 2545522 2422173 2260627 2059693 1823180 1633528 1431241 1222372 1089596 933832 836666
2776H36666k6360j00860j08319n5582o3681J702m1471k8475m6128o2408m8581
$$ 836666 810306 709446 601127 545545 481864 483566 442095 413620 367492 305084 256503
2765B56503j8014J05892l9953K5823R170n7420l0121k5192L3589j2036M5845M6470
$$ 256503 238489 344381 304428 330251 339421 282001 251880 226688 260277 248241 294086 340556
2753C40556J6088l7068k4559J9637l838m1560J5377r1567k0188M5142k3223J9414
$$ 340556 356644 319576 295017 314654 310816 269256 284633 193066 172878 218020 194797 214211
2741B14211K8469J0309J9552K6106j6096L4374j517j0056n2855p9881q658q893
$$ 214211 242680 252989 272541 298647 282551 316925 315408 305352 252497 172616 163958 155065
2729A55065L6221P24j4116K4468l2582M5635l4769J7440P373k4080N0943j5054
$$ 155065 191286 192010 177894 202362 169780 215415 180646 198086 205459 181379 232322 217268
2717B17268j06565K6236J9519R1265m9845q9014M377Q9519l7569J471l1392k9559
$$ 217268 110703 136939 156458 247723 197878 108864 113241 202760 165191 166662 135270 105711
2705A05711Q121j2217K5812j1168K0193m2203K6628m8529K6736J11792k0094p0159
$$ 105711 113832 101615 127427 116259 136452 94249 120877 72348 99084 210876 190782 120623
2693A20623j1404K308j6625q798M1684M568m1700m3882J0148J9993J0173P5574
$$ 120623 109219 111527 94902 86104 127788 132356 90656 46774 56922 76915 87088 162662
2681A62662M6593J4663j2617j0867l4724j5449J9380J4030P7596o397j16180L318
$$ 162662 209255 223918 211301 200434 165710 150261 169641 183671 261267 254870 138690 142008
2669A42008L976P5853o287m9507L750l6380N800l932Q320n644p0879l7321k3220
$$ 142008 145984 221837 215550 166043 169793 133413 139213 135281 143601 137957 67078 29757 6537
2656F537K6913N0957K946J4024o5828o839J5840M2607L0153k2949o8440o449K7629
$$ 6537 33450 84407 87353 101377 35549 28710 44550 87157 117310 94361 25921 19472 47101
2643D7101K8445n8060L3429p7879p036J01760M8042l0085J10238M0440j31272
$$ 47101 75546 17486 50915 -26964 -34000 67760 115802 85717 195955 236395 105123
2632A05123k4500Q059K8190J998r999J3151L3489k2222l7767k0726q698J0965
$$ 105123 80623 88682 116872 118870 108871 122022 155511 133289 95522 74796 66098 77063
2620G7063K5634j1133J7410K1430k7725m9669M4495Q592J1468j3436l6223K936
$$ 77063 102697 91564 108974 130404 102679 53010 97505 106097 117565 104129 67906 70842
2608G0842j2362r057M8418O217m2039k4859N8676L3930r9293m210R4881J1298
$$ 70842 58480 49423 97841 104058 62019 37160 95836 129766 30473 26263 121144 132442
2596A32442M8744R759l1815N6676J3759k3951M891K0813J8773Q4654R1744N0601
$$ 132442 181186 190945 159130 215806 229565 205614 210505 231318 250091 334745 426489 477090
2584D77090J01149O2926j7988l6600r2160m7794j9800n8087j4198k4734m767o5540
$$ 477090 578239 641165 623177 586577 494417 446623 426823 368736 354538 329804 325037 259497
2572B59497j0403n0674o1654M8363l5471K4997j4325k5045m1703N7350J8288R441
$$ 259497 249094 198420 136766 185129 149658 174655 160330 135285 93582 150932 169220 178661
2560A78661n0485j8381j3558N9255j8916m3460j1124n1066M8354m064q648n4233
$$ 178661 128176 109795 96237 155492 136576 93116 81992 30926 79280 75216 66568 12335
2548A2335M1240Q917j3413J0538j06m5232J305K5774j2806K9216n625L4840o149
$$ 12335 53575 62492 49079 59617 59511 14279 15584 41358 28552 57768 52143 86983 80834
2535H0834q291m8332M4461M9193K3101q370m5879m6786J8805j0656n0842M4153
$$ 80834 72543 24211 68672 117865 140966 132596 86717 39931 58736 48080 -2762 41391
2523D1391O0142L5533R903J1100n5386K0953J470l6076j6464j6279J1706O1308
$$ 41391 101533 137066 146969 158069 102683 123636 125106 89030 72566 56287 67993 129301
2511A29301R75N383l0096m9571J0661R3346l1868p3704K5342q080J4098K2335
$$ 129301 130276 135659 105563 55992 66653 159999 128131 54427 79769 71689 85787 108122
2499A08122J734J7287K2486K3472n6191m3836L4875L5574m3238K3778K299k0434
$$ 108122 109856 127143 149629 173101 116910 73074 107949 143523 100285 124063 126362 105928
2487A05928m584L0945n8555j6343M000l1117K7636j1632J5398k5495l3572P2526
$$ 105928 101344 132289 73734 57391 61391 30274 57910 46278 61676 36181 2609 75135
2475G5135R013l552K5701j221L1116l1582k6726L6881l5294K1852N3631k480J733
$$ 75135 84148 80596 106297 105076 136192 104610 77884 114765 79471 101323 154954 152474 154207
2462A54207M1859k6793j9438P042K8652J3729L5488K1293j5740l0899k0056k6037
$$ 154207 196066 169273 149835 156877 185529 199258 234746 256039 240299 209400 189344 163307
2450A63307j6252N744M2574J8200k7178M1024k1155M9634L469M16l0593R839n533
$$ 163307 147055 152799 195373 213573 186395 227419 206264 255898 259367 259783 229190 239029 233496
2437B33496L0124P3220m0159m3272k1514J5956M4699J6515n1222q726o970K3842
$$ 233496 263620 336840 296681 253409 231895 247851 292550 309065 257843 249117 242147 265989
2425B65989J1266M9856K5024l8610R480m4032J4573O1344K6480R015j2273K3649
$$ 265989 277255 327111 352135 313525 323005 278973 293546 354890 381370 390385 378112 401761
2413D01761m1869L9607Q7756p5651N6728J5436q0931o184J2152l6481m2363J9116
$$ 401761 359892 399499 487255 411604 468332 483768 402837 396653 408805 372324 329961 349077
2401C49077L4879M2424k238K1940p236P6638J7555m5606Q9859j6148j9647J12819
$$ 349077 383956 426380 424142 446082 438846 515484 533039 487433 577292 561144 541497 654316
2389F54316M8154J28o370k1041J8895L7150L4381J660l3055K6228p7954k7563
$$ 654316 702470 702598 696228 675187 694082 731232 765613 767273 734218 760446 682492 654929
2377F54929J01181L510K3974j1728J9943O3085L4775P6305N6122l0710Q3893N8502
$$ 654929 756110 759620 783594 771866 791809 854894 889669 965974 1022096 991386 1075279 1133781
2365A133781m6562M9544P6997j4156J5398J9686O519K2615J2075J0356o608J3964
$$ 1133781 1087219 1136763 1213760 1199604 1215002 1234688 1241207 1263822 1275897 1286253 1279645 1293609
2353A293609k6022l9831M5269J3291P2347N2740J79526J17434R9651J14043R8844
$$ 1293609 1267587 1227756 1273025 1286316 1358663 1411403 1590929 1708363 1808014 1922057 2020901
2342B020901Q7739K16361J59384J65241K41605M08132M39465N70457N75051P19059
$$ 2020901 2108640 2325001 2484385 2649626 2891231 3299363 3738828 4309285 4884336 5603395
2332E603395N81104M62398M15423N73964M48027O37935P54911J228770J757060
$$ 5603395 6184499 6646897 7062320 7636284 8084311 8722246 9477157 10705927 12462987
2323A2462987K757529M481884Q580199J3154561J6360746J5514628Q115893O91282
$$ 12462987 15220516 19702400 28282599 41437160 57797906 73312534 81428427 82119709
2315H2119709k320059m563935q929436j0239159r993777q508276p144948o360825
$$ 82119709 79799650 75235715 66306279 56067120 46073343 37565067 30420119 24059294
2307B4059294n126942l562902k151067j336850j023380q17684r95165r55552q76923
$$ 24059294 18932352 15369450 13218383 11881533 10858153 10040469 9045304 8089752 7212829
2298G212829o84084o89347n57101m62880l80437l30914l32429k86718j48660j39462
$$ 7212829 6528745 5839398 5282297 4819417 4438980 4108066 3775637 3488919 3340259 3200797
2288C200797j36063q2740j09609r2341n1996k3824k2135j42852j31291j29062
$$ 3200797 3064734 2981994 2872385 2780044 2728048 2704224 2682089 2539237 2407946 2278884
2278B278884j00760p3187n6870k5796p9229j83047q5925o7582j12273m9294q7481
$$ 2278884 2178124 2104937 2048067 2022271 1943042 1759995 1674070 1606488 1494215 1444921 1357440
2267A357440m2741m1353m2384m0526j6071k1526q2262l0278R904k0437n9698j4899
$$ 1357440 1314699 1273346 1230962 1190436 1174365 1152839 1070577 1040299 1050203 1029766 970068 955169
2255I55169j6352m7226n3951j09543k8549l4165l6421l9223m2321K766l1168l2803
$$ 955169 938817 891591 837640 728097 699548 665383 628962 589739 547418 550184 519016 486213
2243D86213K8317j4962J9988K0312J9277o5401j5060l8111M9897L9489K2668j2497
$$ 486213 514530 499568 519556 539868 559145 493744 478684 440573 490470 529959 552627 540130
2231E40130m0773k7461N0878m5904M435n5609j1423l5023L6152n715q3211r9809
$$ 540130 499357 471896 522774 476870 481305 425696 414273 379250 415402 409687 326476 226667
2219B26667r902K4802L8741l3336M442M9828l3445n962M4826j3133N2880m7084
$$ 226667 216765 241567 280308 246972 251414 301242 267797 261835 306661 293528 346408 299324
2207B99324j0366j4696m0838M3821n2710M0695J7204m6866j1930m982N262K6775
$$ 299324 288958 274262 233424 277245 224535 265230 282434 235568 223638 218656 223918 250693
2195B50693Q6560q822p1116K8191K6695O0691r5338n1042L0824m3044N0134l975
$$ 250693 337253 328431 257315 285506 312201 372892 277554 226512 257336 214292 264426 260451
2183B60451j4176j177K513n552j987k6859l5191j6958l7294J728l815O1383k2981
$$ 260451 246275 245098 247611 242059 240072 213213 178022 161064 123770 125498 121683 183066 160085
2170A60085J2650J4240J6060p550o2425J6330k175k2743M0122J8812K9076n2816
$$ 160085 172735 186975 203035 195485 133060 149390 147215 124472 164594 183406 212482 159666
2158A59666k0855m6794k2067M1281J5037N541L453r8059k7323j866k2843J5672
$$ 159666 138811 92017 69950 111231 126268 131809 135262 37203 9880 8014 -14829 843
2146H43K9563l5268O8541K6363K604m2741j7315r781p3397N1358K5834k165K857
$$ 843 30406 -4862 63679 90042 92646 49905 32590 22809 -50588 770 26604 24439 27296
2133B7296m785m0123K4004K0262q1870J2274L5158Q689r808m6112O3072J7916
$$ 27296 22511 -17612 6392 26654 -55216 -42942 -7784 905 -8903 -55015 8057 25973
2121B5973O8276o8447L1319r880k1929j3363j3513O3645L050l4713k1325n610
$$ 25973 94249 25802 57121 47241 25312 11949 -1564 62081 65131 30418 9093 3483
2109C483m8430K4316O4895p6380Q501P416l7737Q2436p2711j223K8653k4704M438
$$ 3483 -44947 -20631 44264 -32116 -23615 -16199 -53936 28500 -44211 -45434 -16781 -41485 -37047
2096c7047o265J3650R51L9911J3827l1986N236K7341M4881o4728l7576J0899L4212
$$ -37047 -43312 -29662 -28711 11200 25027 -6959 -1723 25618 70499 5771 -31805 -20906 13306
2083A3306O996j7579j24882P8263M9265M1848L9938m8517k9894k8676K6115j1584
$$ 13306 20302 2723 -122159 -43896 5369 47217 87155 38638 8744 -19932 6183 -5401
2071e401K8221o6909M3334M2033J383k6889P516L2595l2224n7560P2210P0403
$$ -5401 22820 -44089 -755 41278 42661 15772 23288 55883 23659 -33901 38309 108712
2059A08712o5162l2316M1002K1338p543M5379j1977K4918J16335J9053P8375O8684
$$ 108712 43550 11234 52236 73574 66031 111410 99433 124351 240686 259739 338114 406798
2047D06798o454P133j0816r6571q0249K5920m2082j4863q7883l3424j7447k3689
$$ 406798 400344 407477 396661 300090 219841 245761 203679 188816 100933 67509 50062 26373
2035B6373N2864p6809o3854j799J2911k5779m9768N4870j4796L7447P0019o290
$$ 26373 79237 2428 -61426 -63225 -50314 -76093 -125861 -70991 -85787 -48340 21679 15389
2023A5389M126R373k0410J7727l1076K5796j1601r0759J2039J275j1207P2995
$$ 15389 19515 28888 8478 26205 -4871 20925 9324 -81435 -69396 -68121 -79328 -6333
2011f333n96l3877K8340L1369J8118k1872n7893L47j838J1801J160m3169M9452
$$ -6333 -6929 -40806 -12466 18903 37021 15149 -42744 -42397 -44235 -32434 -31274 -74443 -24991
1998b4991j8118o9144N2050k2411K7604p732J7761R8659j4862m1377J9093o9847
$$ -24991 -43109 -112253 -60203 -82614 -55010 -62742 -44981 53678 38816 -2561 16532 -53315
1986e3315j5208K8508M6515n6723r7998N3284J8927O6293m8789K3563J3964l2670
$$ -53315 -68523 -40015 6500 -50223 -148221 -94937 -76010 -9717 -58506 -34943 -20979 -53649
1974e3649J927M5162n2794l4469q853M8269q617M6595J4625O5310k2018j3177
$$ -53649 -51722 -6560 -59354 -93823 -102676 -54407 -63024 -16429 -1804 63506 41488 28311
1962B8311M0732n2369m2972k5434N630O3874l6466p2452K063J7110J0631m81J8332
$$ 28311 69043 16674 -26298 -51732 -46102 17772 -18694 -91146 -89083 -71973 -61342 -61823 -43491
1949d3491j3439L7224l6486j3880J574J9805l3770n2638N6874j1166R158j4841
$$ -43491 -56930 -19706 -56192 -70072 -68498 -48693 -82463 -135101 -78227 -89393 -80235 -95076
1937i5076M2147L1339Q208L5757J8435j3479J895l304o8867L0727J6106m6576
$$ -95076 -52929 -21590 -13382 22375 40810 27331 29226 25922 -42945 -12218 3888 -42688
1925d2688K3794N1976r600k3936j7413O1409k9869m1505J8466p9822J7367J05215
$$ -42688 -18894 33082 23482 -454 -17867 43542 13673 -27832 -9366 -89188 -71821 33394
1913C3394Q249k5437P43k2999j5305j8336L5782N5841l8130m6731L4962K8572
$$ 33394 41643 16206 16949 -6050 -21355 -39691 -3909 51932 13802 -32929 2033 30605
1901C0605J1670r264J0027J2112j00181j9289J2283O7253L46l197K830m6799L7779
$$ 30605 42275 33011 43038 55150 -45031 -64320 -52037 15216 15562 12365 15195 -31604 6175
1888F175k2600l2762J1224q902J9277m377J3534j6051n5225l2494N2643m504o395
$$ 6175 -16425 -49187 -37963 -46865 -27588 -31965 -18431 -34482 -89707 -122201 -69558 -74062 -80457
1875h0457N1315K4387l8197R715J8960R28l8607J5948M7113j5880j8036o4189
$$ -80457 -29142 -4755 -42952 -33237 -14277 -13349 -51956 -36008 11105 -4775 -22811 -87000
1863h7000J8649l7820l5812N7632k5432n881P621N8080k1592l1013L0242N5963
$$ -87000 -68351 -106171 -141983 -84351 -109783 -115664 -108043 -49963 -71555 -102568 -72326 -16363
1851a6363O3742o6194l8180J8192N0012M1802n7350o2609O846R641p867M1699
$$ -16363 47379 -18815 -56995 -38803 11209 53011 -4339 -66948 -60102 -50461 -58328 -16629
1839a6629K7771q0365l5612O0403L3513l8399J9364J115k4039p944L5443P2043
$$ -16629 11142 -69223 -104835 -44432 -10919 -49318 -29954 -28839 -52878 -60822 -25379 46664
1827D6664q3311M8127J6465o5725k3372M1224k4400l760J2318L0358M2535p2240
$$ 46664 -36647 11480 27945 -37780 -61152 -19928 -44328 -48088 -35770 -5412 37123 -35117
1815c5117P847k0738k5078J6119j2414K3793P225m1130O6920l0166m646K3646
$$ -35117 -27270 -48008 -73086 -56967 -69381 -45588 -38363 -79493 -12573 -42739 -47385 -23739
1803b3739p3131O135O8496P9178L5411p0856n8709K1169O4591m2140r3053J5081
$$ -23739 -96870 -90735 -22239 56939 92350 21494 -37215 -16046 48545 6405 -86648 -71567
1791g1567K1419k2799n702J2197j338k3510N3451M3889K29l1051M71m1674k0346
$$ -71567 -50148 -72947 -78649 -66452 -67790 -91300 -37849 6040 6269 -24782 -24311 -65985 -86331
1778h6331K1867l7382L3308N5122k1780j7185P821K8861J7679m4308R972R2947
$$ -86331 -64464 -101846 -68538 -13416 -35196 -52381 -44560 -15699 1980 -42328 -32356 60591
1766F0591n6195j4725K4713j7129j2790n2199j2387O1834r318l1590p180K5034
$$ 60591 4396 -10329 14384 -2745 -15535 -67734 -80121 -18287 -27605 -59195 -66375 -41341
1754d1341l2347j224L4633N461j2656j9282O431Q424O1092k4776r558m10k1627
$$ -41341 -73688 -74912 -40279 -34818 -47474 -66756 -60325 -51901 9191 -15585 -25143 -25553 -47180
1741d7180N2394J1370j8689J0302l8514l157K725k3138k1937J5920L8415J8723
$$ -47180 5214 16584 -2105 8197 -30317 -33474 -30749 -53887 -75824 -59904 -21489 -2766
1729b766n2092K9905k52o9865j1684L2147L3374j3097J9248m3770P0565k2316
$$ -2766 -54858 -24953 -25205 -95070 -106754 -74607 -41233 -54330 -35082 -78852 -8287 -30603
1717c0603j5544j74l6460J9091j3936m40Q658L4521k098J3333m2719N9350O007
$$ -30603 -46147 -46321 -82781 -63690 -77626 -78066 -69408 -34887 -36985 -23652 -66371 -7021 -1014
1704a014l5771Q1696k2943J593l3395j3274M2924l6639k2395n9236N1763M2736
$$ -1014 -36785 44911 21968 23561 -9834 -23108 19816 -16823 -39218 -98454 -46691 -3955
1692c955P899k1072L7324M6005J5604k1136l49j7759m2701k3813J205Q301M1096
$$ -3955 3944 -17128 20196 66201 81805 60669 60320 42561 -140 -23953 -22748 -14447 26649
1679B6649m0087k0000N5475p3137j4557L5802L166p426L8983J4728k3218q617
$$ 26649 -13438 -33438 22037 -51100 -65657 -29855 -26689 -34115 4868 19596 -3622 -12239
1667a2239N5407M157J6136L4102j06276K471j7993K2105l4198n5739K8273M8434
$$ -12239 43168 47325 63461 97563 -8713 -6242 -24235 -2130 -36328 -92067 -63794 -15360
1655a5360K0825l794n485m8788r772k3684J6620K9667M9964j02437Q624Q5256
$$ -15360 5465 1671 -3814 -52602 -62374 -86058 -69438 -39771 10193 -92244 -83620 1636
1643A636k3539j1702r944L4139n5472P5948p432j5800L1819q1765M4277k1621
$$ 1636 -21903 -33605 -43549 -9410 -64882 11066 3634 -12166 19653 -62112 -17835 -39456
1631c9456K3379k480l2460l6063N9582L0883L5187m7344K1091l4359r317J8008
$$ -39456 -16077 -18557 -51017 -87080 -27498 3385 38572 -8772 12319 -22040 -31357 -13349
1619a3349K7810N3310o6529l7020j0400k5582M0153R876l6334l2716P4225K4078
$$ -13349 14461 67771 1242 -35778 -46178 -71760 -31607 -21731 -58065 -90781 -16556 7522
1607G522n8930O8633l6811m4875l1363J8089M4057M229R321K7221k9368j1842
$$ 7522 -51408 17225 -19586 -64461 -95824 -77735 -33678 -29449 -20128 7093 -22275 -34117
1595c4117j5478K1122J2798l8248j177M6773l8168J4819m8560M8524M3257j8243
$$ -34117 -49595 -28473 -15675 -53923 -55100 -8327 -46495 -31676 -80236 -31712 11545 -6698
1583f698m3198j6019L1777m3026j05618N1560L2724k2597j3030Q9200K691q8891
$$ -6698 -49896 -65915 -34138 -77164 -182782 -131222 -98498 -121095 -134125 -44925 -42234 -131125
1571a31125M6790M5724P642q904m2460L735L4346k3167K9572o733Q258r780N2959
$$ -131125 -84335 -38611 -30969 -39873 -82333 -78598 -44252 -67419 -37847 -44580 -36322 -46102 6857
1558F857k8959J4233k6522j9240J4586M9147j269J1813J6210J1133n7271j5564
$$ 6857 -22102 -7869 -34391 -53631 -39045 10102 8833 20646 36856 47989 -9282 -24846
1546b4846L3474m4571j5470k2414K1110L2096l2263K4203M0057o3122N4526N778
$$ -24846 8628 -35943 -51413 -73827 -52717 -20621 -52884 -28681 11376 -51746 2780 8558
1534H558n7986M2970P2551k1451j9859M5330m7427j5376m0161J716M4671o082
$$ 8558 -49428 -6458 66093 44642 24783 70113 22686 7310 -32851 -31135 13536 7454
1522G454o5026M0000O0259o9637j2461L6480J0068k1817k3948O266L6121k7616
$$ 7454 -57572 -17572 42687 -26950 -39411 -2931 7137 -14680 -38628 -32362 3759 -23857
1510b3857K3114j4381j9740J7147M244l6504L4426J7219k1186l3757K433O4987
$$ -23857 -743 -15124 -34864 -17717 -13473 -49977 -15551 1668 -19518 -53275 -50842 14145
1498A4145J7631p077L4985m4044k1665L9137m4599l7931p789q91j2296N5772R6256
$$ 14145 31776 24699 59684 15640 -6025 33112 -11487 -49418 -57207 -58098 -70394 -14622 81634
1485H1634k1840q2593l5986j77m368L4291n1251N5025k426r170m343L8768k5523
$$ 81634 59794 -22799 -58785 -58962 -63330 -29039 -80290 -25265 -27691 -36861 -41204 -2436 -27959
1472b7959l5259j3355K5072P7058m7773l9783j5581M3695M1662L4285k9544r3461
$$ -27959 -63218 -76573 -51501 25557 -22216 -61999 -77580 -33885 7777 42062 12518 -80943
1460h0943K8202M3331p9810J905K8410r737r553M5983j4828J6982n8J9655j2266
$$ -80943 -52741 -9410 -89220 -87315 -58905 -68642 -78195 -32212 -47040 -30058 -30116 -10461 -22727
1447b2727P987l2712J8539Q3808K246l2133l6313j9895L8994k4422l5160k3281
$$ -22727 -14740 -47452 -28913 54895 57141 25008 -11305 -31200 7794 -16628 -51788 -75069
1435g5069N1834o5077N0201K0017m3027L7760l0071L1418R0349m6113j1985j5439
$$ -75069 -23235 -88312 -38111 -18094 -61121 -23361 -53432 -22014 68335 22222 10237 -5202
1423e202k1548j7449L8066k993j6026N961M2547j9202m835m2317L2252R0477l3627
$$ -5202 -26750 -44199 -6133 -9126 -25152 -19191 23356 4154 -681 -42998 -10746 79731 46104
1410D6104K2669r4389j3270J3529n035n4259O2659M1720J928k9140o8225l1934
$$ 46104 68773 -25616 -38886 -25357 -30392 -84651 -21992 19728 21656 -7484 -75709 -107643
1398a07643L2506N0979M3811L2134m4828l5060K592R494J8048o4068J4435P210
$$ -107643 -75137 -24158 19653 51787 6959 -28101 -25509 -16015 2033 -62035 -47600 -40390
1386d0390J2822K3482m3020o776M4064o8817R9582L063l0572O4936j5314r0333
$$ -40390 -27568 -4086 -47106 -53882 -9818 -78635 20947 24010 -6562 58374 43060 -47273
1374d7273n767K2123n1077q951J19326J071l3985l6344K3624o691m7423J7261
$$ -47273 -53040 -30917 -81994 -90945 28381 29452 -4533 -40877 -17253 -23944 -71367 -54106
1362e4106o017M7739j42K9359L1089k7466m954m3977J4575N9364j9623m9641l1263
$$ -54106 -60123 -12384 -12526 16833 47922 20456 15502 -28475 -13900 45464 25841 -23800 -55063
1349e5063j4169J2853N4629M4570J9258j7305l1551j0289n5988k3595Q0133k4976
$$ -55063 -69232 -56379 -1750 42820 62078 44773 13222 2933 -53055 -76650 3483 -21493
1337b1493q0517K2903M5185j8817J4745R191l3995k3167Q0148J6777M8282N142
$$ -21493 -102010 -79107 -33922 -52739 -37994 -28803 -62798 -85965 -5817 10960 59242 64384
1325F4384n7900r6771Q7208N5605n7762o1415M134j7503M8103M459L1849K9460
$$ 64384 6484 -90287 -3079 52526 -5236 -66651 -62517 -80020 -31917 -27458 4391 33851
1313C3851p1707j6010K7368L5533Q396k5697J3916r705k8302M5213k8987N9597
$$ 33851 -37856 -53866 -26498 9035 17431 -8266 5650 -4055 -32357 12856 -16131 43466
1301D3466m3036l3192M0877j976J1416J6588l0312M093J8876m3880j6797k4698
$$ 43466 430 -32762 8115 6139 17555 34143 3831 7924 26800 -17080 -33877 -58575
1289e8575L4431R066M3763M7662k2651o1484R410K5651p959l4597J4297n247j367
$$ -58575 -24144 -15078 28685 76347 53696 -7788 1622 27273 19314 -15283 -986 -6233 -7600
1276g600M3153L4659J859n1859K7217l6650M2376j1071n7185j3543K7768N870
$$ -7600 35553 70212 72071 20212 47429 10779 53155 42084 -15101 -28644 -876 4994
1264D994O5168l4954J6344j9352k8736K9694J3017l4716j0356j256k6416L1524
$$ 4994 70162 35208 51552 32200 3464 33158 46175 11459 1103 -153 -26569 4955
1252D955j0510Q5770M3172j4400m4062n1058J8758o5778l581M2378o530k5890
$$ 4955 -5555 80215 123387 108987 64925 13867 32625 -33153 -36734 5644 -886 -26776
1240b6776K1600N93j3010o688l6546N0919O744K9845n6032o9892Q2394L2681n4770
$$ -26776 -5176 -4583 -17593 -24281 -60827 -9908 -3164 26681 -29351 -99243 -16849 15832 -38938
1227c8938Q0566k5762K4242K5614J5991K7461p9466L5492k7031o1551k9724j2674
$$ -38938 41628 15866 40108 65722 81713 109174 29708 65200 38169 -23382 -53106 -65780
1215f5780L0349L170K4623j8174p4290L2188j4519l8517L9371M2630J0701K1335
$$ -65780 -35431 -32261 -7638 -25812 -100102 -67914 -82433 -120950 -81579 -38949 -28248 -6913
1203f913J0967m870R2912l0760q8091j5348P0841n757J0981O067r399r55k7231
$$ -6913 4054 -816 92096 61336 -26755 -42103 28738 22981 33962 40029 30630 29675 2444
1190B444J4338J0571q3577L5888P0929k1590o1797r315O1953n3525q918J0320
$$ 2444 16782 27353 -56224 -20336 50593 29003 -32794 -42109 19844 -33681 -42599 -32279
1178c2279J2653M6766N8200l5416l0551k4742j5047k3116J45L8924J482n777L992
$$ -32279 -19626 27140 85340 49924 19373 -5369 -20416 -43532 -43387 -4463 -2981 -8758 -4766
1165d766m6538J0207L162k3091M0289M173N3287l6535m5273J5248j1386j339N3021
$$ -4766 -51304 -41097 -37935 -61026 -20737 -16564 36723 188 -45085 -29837 -41223 -42562 10459
1152A0459R19n1643O9264J3355k8m7395j03544M6911J2077m836o0738M4575N2062
$$ 10459 11378 -40265 28999 42354 42326 -5069 -108613 -61702 -49625 -54461 -115199 -70624 -18562
1139a8562l049l9321j9015J10172K9257n7674r4378J4760L2822K2731j9879M0984
$$ -18562 -21611 -60932 -79947 30225 59482 1808 -92570 -77810 -44988 -22257 -42136 -1152
1127a152O5607p996l740m6724o2262L6745N4700m9543m3628q212P0784j2349m4393
$$ -1152 64455 56459 52719 5995 -56267 -19522 35178 -14365 -57993 -66205 4579 -7770 -52163
1114e2163o42j3799M8349j7853K9272m6343M9201k067O257R143J9674K836l3885
$$ -52163 -52805 -66604 -18255 -36108 -6836 -53179 -3978 -6045 212 9355 29029 31865 -2020
1101b020k9841j6296L6533R6752J734j7638m9202R219l6581l7035N4779o2203
$$ -2020 -31861 -48157 -11624 85128 86862 69224 20022 29241 -7340 -44375 10404 -51799
1089e1799N6858O4934j05546o8379P9411K741L7275j432o9823O421N0501K1547
$$ -51799 5059 69993 -35553 -103932 -24521 -21780 15495 14063 -55760 -49339 1162 22709
1077B2709j2704J789j8523p1311K8437L3770M1418l9513K0853l4500K2479k1708
$$ 22709 10005 11794 -6729 -78040 -49603 -15833 25585 -13928 6925 -27575 -5096 -26804
1065b6804p6603J2378M2438P5802K8213p3296j2907M8035N648k0618K3706n0274
$$ -26804 -103407 -91029 -48591 27211 55424 -17872 -30779 17256 22904 2286 25992 -24282
1053b4282k2494P8288M6594k4988p3514n3900J0787N2324M1614M0529n8404K5698
$$ -24282 -46776 31512 78106 53118 -20396 -74296 -63509 -11185 30429 70958 12554 38252
1041C8252n7216l6750r275L5667R004L9947j6219N0382J3776n7659m2387J5583
$$ 38252 -18964 -55714 -64989 -29322 -20318 19629 3410 53792 67568 9909 -32478 -16895
1029a6895K8577j9273m9340q395O289J6810k2282M6381R776n9582K1018M525L4707
$$ -16895 11682 -7591 -56931 -65326 -59037 -42227 -64509 -18128 -8352 -67934 -46916 -42391 -7684
1016g684N948Q834n583O0882j2647k0602l4070j4417l9327j5527o350n871J7378
$$ -7684 -1736 7098 1515 62397 49750 29148 -4922 -19339 -58666 -74193 -80543 -86414 -69036
1003f9036R7578n8240j5051j7502L2724j3880o3163J5781K2455M3676J8046n2232
$$ -69036 28542 -29698 -44749 -62251 -29527 -43407 -106570 -90789 -68334 -24658 -6612 -58844
991e8844o3750L0741M6852o5232O6213O569N4112k5188l1753J9763Q897M8474
$$ -58844 -122594 -91853 -45001 -110233 -44020 -37451 16661 -8527 -40280 -20517 -11620 36854
979C6854j3933K8815Q070j1307n0970o1169P928N7278n18o911l0928K1254n3991
$$ 36854 22921 51736 59806 48499 -2471 -63640 -55712 1566 1048 -5863 -36791 -15537 -69528
966f9528n368M4371Q3172j3048l9294l5606J8949r72K2636R268L111J0657o1406
$$ -69528 -74896 -30525 52647 39599 305 -35301 -16352 -17324 5312 14580 17691 28348 -33058
953c3058j1881J6895K3609l4952N917l7799K5494K0293P644R089J1130K7339l8613
$$ -33058 -44939 -28044 -4435 -39387 -33470 -71269 -45775 -25482 -17838 -8749 2381 29720 -8893
940h893k8260K5627P1919p5311M3341N1127n841N813n2937l1148j2687p798L5617
$$ -8893 -37153 -11526 60393 -14918 28423 79550 73709 79522 26585 -4563 -17250 -25048 10569
927A0569n2525l0817Q8977L045j1171K2575l6498k7906K2447J2565m5210l9953
$$ 10569 -41956 -72773 16204 19249 8078 30653 -5845 -33751 -11304 1261 -43949 -83902
915h3902O4537J6956K7336p9837o7545J03254L354l49J9195J1693q554M7213k7790
$$ -83902 -19365 -2409 24927 -54910 -122455 -19201 -15847 -16196 2999 14692 6138 53351 25561
902B5561j4761M046m395L868M7993K5693n258n5376j9683n4102j7511J3113N6472
$$ 25561 10800 14846 10451 14319 62312 88005 82747 27371 7688 -46414 -63925 -50812 5660
889E660N300M860j6053l1262j8019j9028M4906l2017K4518J6345k4104L2094k4002
$$ 5660 10960 15820 -233 -31495 -49514 -68542 -23636 -55653 -31135 -14790 -38894 -6800 -30802
876c0802l5434N0505P122M2151K5622l0980l4970n01J1784J5141Q45J6444K4198
$$ -30802 -66236 -15731 -8609 33542 59164 28184 -6786 -7287 4497 19638 20483 36927 61125
863F1125J1198j00069n0992Q5450M2011K3340m6633j4165P3375J6002k9738n8668
$$ 61125 72323 -27746 -78738 6712 48723 72063 25430 11265 84640 100642 70904 12236
851A2236j5091O210m7598q61J8374n574L8142o2736R156K0221J6367K9975K2520
$$ 12236 -2855 3355 -44243 -45104 -26730 -32304 5838 -56898 -47742 -27521 -11154 18821 41341
838D1341p9473j7810N3347k3607L5757K618L6010l0579P352J5865j3909n547m2487
$$ 41341 -38132 -55942 -2595 -26202 9555 12173 48183 17604 24956 40821 26912 21365 -21122
825b1122L422J8835m8052L92K1823K1759K9780l9140L0418J0072K3479j1564n8019
$$ -21122 -17700 1135 -46917 -46525 -24702 -2943 26837 -12303 18115 28187 51666 40102 -17917
812a7917K3419J3965l1291K3533J9202k6038j3494j8265j4855K5063K5698k913
$$ -17917 5502 19467 -11824 11709 30911 4873 -8621 -26886 -41741 -16678 9020 6107
800F107Q285L4836p0904n9296r009O7420p555O0187p4294q448M9077N8277n2031
$$ 6107 14392 49228 -21676 -80972 -89981 -22561 -30116 30071 -44223 -52671 -3594 54683 2652
787B652o7080K8265M1597p643L641l7896L6546M8661Q288l0170n1337L7649J2563
$$ 2652 -64428 -36163 5434 -2209 1432 -36464 82 48743 57031 26861 -24476 13173 25736
774B5736J4105o0497l3377K0073L2571L8875K2632j8382N297k8134m5437J7447
$$ 25736 39841 -20656 -54033 -33960 -1389 37486 60118 41736 47033 18899 -26538 -9091
762i091m343K33l9750l0632P9486j9794N7318j0129m655m8616Q0455r81m3880
$$ -9091 -13434 -13201 -52951 -83583 -4097 -23891 33427 23298 18643 -29973 50482 49501 5621
749E621k8459J7421K509L7l644J2609k9772Q68M6345P1272l3375p0681J2767J8156
$$ 5621 -22838 -5417 -2908 -2871 -6515 6094 -23678 -22810 23535 94807 61432 -9249 3518 21674
735B1674m3266p192M3275j1450q880j8292L7553j0535O139l5786K7366J256p863
$$ 21674 -21592 -28784 14491 3041 -5839 -24131 13422 2887 9026 -26760 606 1862 -6001
722f001M7983J493K583m4169K7271l9646l44L4828k3170j6237M0043l7411k7959
$$ -6001 41982 43475 46058 1889 29160 -10486 -10830 23998 828 -15409 24634 -12777 -40736
709d0736k7791L8489K7749j5734N957k9231N1386N255j9433Q232m0646k1583L3409
$$ -40736 -68527 -30038 -2289 -18023 -12066 -41297 10089 15344 -4089 4143 -36503 -58086 -24677
696b4677K0573M52L6331k6144p2828O1905r4L4477K1177l2753j3701J5095J249
$$ -24677 -4104 -3652 32679 6535 -66293 -4388 -4482 29995 51172 18419 4718 19813 21062
683B1062N580l8689L8117M4968p2077l1995M301P5311l0989m7458R6254J984m3404
$$ 21062 26642 -12047 26070 71038 -1039 -33034 -28733 46578 15589 -31869 64385 66369 22965
670B2965k7250M635K6345J266l5100k1147K6038k5992M764P3830m5641R573n2221
$$ 22965 -4285 350 26695 27961 -7139 -28286 -2248 -28240 -23476 50354 4713 14286 -37935
657c7935L3803L2244p7202o1485P4908Q4620p1263L5612K4332j7506m2332M1744
$$ -37935 -4132 28112 -49090 -110575 -35667 48953 -22310 13302 37634 20128 -22204 19540
645A9540J66k4672l9329m5423M4336N9385K167k0370n2267m2380k73L3115O9724
$$ 19540 19706 -4966 -44295 -89718 -45382 14003 16170 -4200 -56467 -98847 -99120 -66005 3719
632C719j1076j7494M9540M203o5160N0736K8294P1232k630n4255k9240n3205m846
$$ 3719 -7357 -24851 24689 28892 -36268 14468 42762 113994 111364 57109 27869 -25336 -30182
619c0182j5463j3227K1065J7336O9512k0894m4051L255N7922J7053r595p9535
$$ -30182 -45645 -58872 -37807 -20471 49041 28147 -15904 -12649 45273 62326 52731 -26804
607b6804j2722m0717J207P4913O3746o9195j8768n266M5797Q8380l4996j3966
$$ -26804 -39526 -80243 -79036 -4123 59623 -9572 -28340 -33606 12191 100571 65575 51609
595E1609j6825m0174n4194L6352q669M9907j4116N9349P556l9532l5153M557j0383
$$ 51609 34784 -5390 -59584 -23232 -31901 18006 3890 63239 70795 31263 -3890 667 -9716
582i716P6386K7758n5751l1175J5812l8928j4053J6321O867J4419m187L9517L8260
$$ -9716 66670 94428 38677 7502 23314 -15614 -29667 -13346 -6479 7940 3753 43270 81530
569H1530o060m224J1893m2515m0590M1326L6270k9422l0357k2870k7549Q1616
$$ 81530 75470 71246 83139 40624 34 41360 77630 48208 17851 -5019 -32568 49048
557D9048j4220J836K8042j7790j3556j6279K6551j9841p2470k1126l4840K2263
$$ 49048 34828 36664 64706 46916 33360 17081 43632 23791 -48679 -69805 -104645 -82382
545h2382P4030p41l6347J9502N4834N936k4832o1373n701K2000J7067q883j6940
$$ -82382 -8352 -9093 -45440 -25938 28896 34832 10000 -51373 -57074 -35074 -18007 -26890 -43830
532d3830J4824M6764k7174Q4557k2997j02358k6060R0651O9535o1153k6757k2346
$$ -43830 -29006 17758 -9416 75141 52144 -50214 -76274 14377 83912 22759 -3998 -26344
520b6344Q2506P4183m7408p7757K277j1673j0366L5947J7047k8605l9276M2345
$$ -26344 56162 130345 82937 5180 7457 -4216 -14582 21365 38412 9807 -29469 12876
508A2876J5336n6206l6499P6394r867r0454L1984R0171M0779q9410m9415P7474
$$ 12876 28212 -27994 -64493 11901 2034 -88420 -56436 33735 74514 -14896 -64311 13163
496A3163j525l4767M747O2061R256j5783m1234r965R893j369L2083m4075k1328
$$ 13163 11638 -23129 -18382 43679 52935 37152 -4082 -14047 -4154 -5523 26560 -17515 -38843
483c8843M8905j0743n7754L8530K6302n829L2703K9356p2218k5439N7686L1088
$$ -38843 10062 -681 -58435 -19905 6397 568 33271 62627 -9591 -35030 22656 53744
471E3744J8935j0571l8896o901J1152R399k6109m6701J956J4959O657l0269j0887
$$ 53744 72679 62108 23212 16311 27463 36862 10753 -35948 -33992 -19033 -12376 -42645 -53532
458e3532l4868J07363J7776p6067L7120N3703J053m7412o5156L035N9372N820
$$ -53532 -88400 18963 36739 -39328 -2208 51495 52548 5136 -60020 -56985 2387 8207
446H207K4379Q191j2325j1920j8923P0218k8050k1323l6629j9877L9770J5828
$$ 8207 32586 40777 28452 16532 -2391 67827 39777 18454 -18175 -38052 1718 17546
434A7546K2180q5091m9445K4264O1788L5218K6456j7241o8794j512J03073l2135
$$ 17546 39726 -45365 -94810 -70546 -8758 26460 52916 35675 -33119 -34631 68442 36307
422C6307p6522m9441M0747L2738k6881K3923r884J6446P5087l4529m4405P5798
$$ 36307 -40215 -89656 -48909 -16171 -43052 -19129 -29013 -12567 62520 27991 -16414 59384
410E9384o041R487K102o5600M8462P8143m9834m1325k0349n9156M4484N9138j9081
$$ 59384 53343 62830 64932 -668 47794 125937 76103 34778 14429 -44727 -243 58895 39814
397C9814o7946K0136k0098j7525N9409m2214j9P386j2057K7211q998J2139m8214
$$ 39814 -28132 -7996 -28094 -45619 13790 -28424 -28443 -21057 -33114 -5903 -14901 -2762 -50976
384e0976O3565O1088J6178m5750j5385m9280K183M1529l6822n1240J3517L6877
$$ -50976 12589 73677 89855 44105 28720 -20560 -18377 23152 -13670 -64910 -51393 -14516
372a4516j3495M4064m6037l7976O7485M0538K7986O929K4o722j4531j0838m2851
$$ -14516 -28011 16053 -29984 -67960 -475 40063 68049 74978 75002 68280 53749 42911 60
359F0l4996k8686M4954O1047L7097r0723L632Q7096N473m1123k3934j6598L3173
$$ 60 -34936 -63622 -18668 42379 79476 -11247 -7615 79481 84954 43831 19897 3299 36472
346C6472l4494K5696j6026n6750l116J7352M6957l4371P378P341M7961M1598l8553
$$ 36472 1978 27674 11648 -45102 -48218 -30866 16091 -18280 -10902 -3561 44400 85998 47445
333D7445j9739j7020R889q938K065M6544J1761J5643m1979K158K8474J0884n8170
$$ 47445 27706 10686 20575 11637 13702 60246 72007 87650 45671 47829 76303 87187 29017
320B9017p6329l6535N5766J39865p6757l4762m0410p093P8231K2922m4695q756
$$ 29017 -47312 -83847 -28081 111784 35027 265 -40145 -47238 30993 53915 9220 464
308D64J8114J041m3640N2478q737J1081J9189o8187M4266L4106K6993L188k4926
$$ 464 18578 19619 -24021 28457 19720 30801 49990 -18197 26069 60175 87168 90356 65430
295F5430o2210j05159J01296M4094j7907j9474O824N0528k5572K086N3918J134
$$ 65430 3220 -101939 -643 43451 25544 6070 12894 63422 37850 39936 93854 94988
283I4988l7833l6426J9691L4390k8608J5551J118N810o9225J1822k0534K1788
$$ 94988 57155 20729 40420 74810 46202 61753 62871 68681 -544 11278 -9256 12532
271A2532Q355j7982k6112K4666j1074R4093K0086o5022o8837L1866L2296O910
$$ 12532 20887 2905 -23207 1459 -9615 84478 104564 39542 -29295 2571 34867 41777
259D1777n7430M9839J336l2056L3326k7801J335m8972L4476r017P1800l0667q3842
$$ 41777 -15653 34186 35522 3466 36792 8991 10326 -38646 -4170 -13187 58613 27946 -55896
246e5896k0863L2065O8910l7326o514N5430J4075k1170K5368j0053m9412L8810
$$ -55896 -76759 -44694 24216 -13110 -19624 35806 49881 28711 54079 44026 -5386 33424
234C3424m0191k8183K5390M2993M2151o766m8793p0235R658K4336K4420J3201
$$ 33424 -6767 -34950 -9560 33433 75584 68818 20025 -50210 -40552 -16216 8204 21405
222B1405p0430K0025J7039J8918j6336n754M7060m460j5027m7575j4568N1977
$$ 21405 -49025 -29000 -11961 6957 -9379 -15133 31927 27467 12440 -35135 -49703 2274
210B274R478N7857L5129l0820p1197J6461m3570l0931J5993K4196M546k8996J5175
$$ 2274 11752 69609 104738 73918 2721 19182 -24388 -55319 -39326 -15130 -10584 -39580 -24405
197b4405L184J3690L5906L046j6188J8468j6791R293M372m273j6882l403j7301
$$ -24405 -21221 -7531 28375 31421 15233 33701 16910 26203 30575 26302 9420 6017 -11284
184a1284J1825K0181M8140j9669O545n7167K9624M1016l3037m9627k3550N135
$$ -11284 541 20722 68862 49193 55738 -1429 28195 69211 36174 -13453 -37003 -31868
172c1868M9106M6850k793n226p2297M529L4194K6119m2408n140L2592K1739m6830
$$ -31868 17238 64088 61295 56069 -16228 -11699 22495 48614 6206 1066 33658 55397 8567
159H567n2346q367M4798J8870q334m446m2935J0694L5299P426J8430N277m560
$$ 8567 -43779 -52146 -7348 11522 3188 -1258 -44193 -33499 1800 9226 27656 32933 28373
146B8373k7138l7032l493N5187O7000o0661p4340j148K4033N5567k2032J6629
$$ 28373 1235 -35797 -39290 15897 82897 22236 -52104 -53252 -29219 26348 4316 20945
134B0945q27j6695R885j5989P7187m8446q601M9132L0025k0553l9047j5888o327
$$ 20945 20118 3423 13308 -2681 74506 26060 17459 66591 96616 76063 37016 21128 14801
121A4801J5538l6753m1847O595M5661M1549J1441k6418j4155j9759l2116M9809
$$ 14801 30339 -6414 -48261 -41666 3995 45544 56985 30567 16412 -3347 -35463 14346
109A4346K7048k8644m232J2680m5632j1610k89K9143L9158j9850j3546J6383J3874
$$ 14346 41394 12750 8518 21198 -24434 -36044 -36333 -7190 31968 12118 -1428 14955 28829
96B8829n6437L6146k1451j6652K2767M9415m3884j096K1492M2361j1836o3782
$$ 28829 -27608 8538 -12913 -29565 -6798 42617 -1267 -2363 19129 61490 49654 -14128
84a4128l5899N318k0446k9916J5171M7026K7802J291j8402j6840L8002j8851L7139
$$ -14128 -50027 -44709 -65155 -95071 -79900 -32874 -5072 -3781 -22183 -39023 -1021 -19872 17267
71A7267Q820k9823O670J0790k596K1428k4375r279K7355K047k678K546m9877K4770
$$ 17267 26087 -3736 2934 13724 11128 32556 8181 -1098 26257 28304 25626 28172 -21705 3065
57C065o6K5006j8539l0095k2480m032k7068L6180K2435K6445K9315k3321K72K241
$$ 3065 2999 28005 9466 -20629 -43109 -47141 -74209 -38029 -15594 10851 40166 16845 17117 19358
43A9358K8071o6465k8806J9299q466r384N1129k8585J6336l6287j951K837J9020
$$ 19358 47429 -19036 -47842 -28543 -37009 -46393 4736 -23849 -7513 -43800 -45751 -42914 -23894
30b3894L4265M022K4487j2610l3351K1339P59k1192P145k3380L623J7966L0487
$$ -23894 10371 14393 38880 26270 -7081 14258 15017 -6175 970 -22410 -18787 -821 29666
17B9666j8654m512j8908l0063Q2N918J6402l995M372J2319J6414O566j8376k159
$$ 29666 11012 6500 -12408 -42471 -42389 -36471 -20069 -24064 -19692 -7373 9041 15607 -2769 -4928
3d928O227K6786M6161
$$ -4928 1299 28085 74246
0G4246
$$ 74246
$$ Imaginary data points
##PAGE= N=2
##DATA TABLE= (X++(I..I)), XYDATA
16383a996581J1348m13K9422P4930J1297j8685M6795J06640j809k1868L880N2177
$$ -1996581 -1985233 -1985646 -1956224 -1881294 -1869997 -1888682 -1841887 -1735247 -1737056 -1758924 -1755044 -1702867
16371a702867J8833M1367L2226M760K8943J4398k2509J6257K3395N7336P7876
$$ -1702867 -1684034 -1642667 -1610441 -1605681 -1576738 -1562340 -1584849 -1568592 -1545197 -1487861 -1409985
16360a409985l673L1532L1533j1475N943m2130O6078O5618P976Q387J7971N2822
$$ -1409985 -1413658 -1382126 -1350593 -1362068 -1356125 -1398255 -1332177 -1266559 -1258583 -1250196 -1232225 -1179403
16348a179403K3497M3157M7205K5272M525L4761Q383J3641L762J2176j6026J02049
$$ -1179403 -1155906 -1112749 -1065544 -1040272 -1035747 -1000986 -992603 -978962 -975200 -963024 -979050 -877001
16336h77001q445j174L0046L3002K9619L639K2319K6452K5165r207O3559J8223
$$ -877001 -885446 -886620 -856574 -823572 -793953 -790314 -767995 -741543 -716378 -725585 -662026 -643803
16324f43803k3001j2328N5048N8484p935J5950R9661m232n259l5906M408K7504
$$ -643803 -666804 -679132 -624084 -565600 -573535 -557585 -457924 -462156 -467415 -503321 -498913 -471409
16312d71409K7152Q3963m088l2412Q7388M2702p630j9191K7521O9304n807K1639
$$ -471409 -444257 -360294 -364382 -396794 -309406 -266704 -274334 -293525 -266004 -196700 -202507 -180868
16300a80868L7139L8287L971L2254n0131K2813l326r091L5588O799O9984j1344
$$ -180868 -143729 -105442 -101471 -69217 -119348 -96535 -99861 -108952 -73364 -66565 3419 -7925
16288g925J7968p353J6683P2973J9682J96J8318L0898J1245K6578J4989l0822
$$ -7925 10043 2690 19373 92346 112028 112224 130542 161440 172685 199263 214252 183430
16276A83430K5946K8742N1577p110L8992r070k8856J7566j8910Q4507L2542k2371
$$ 183430 209376 238118 289695 282585 321577 312507 283651 301217 282307 366814 399356 376985
16264C76985L8478O5700J2890K7476L094K6316M906m9610P290O207L114M063L5206
$$ 376985 415463 481163 494053 521529 524623 550939 555845 506235 513525 519732 522846 526909 562115
16251E62115O31k2919K9354L2586J8762L7570O553k8517O7527R1257j1140L712
$$ 562115 562746 539827 569181 601767 620529 658099 664652 636135 703662 794919 783779 787491
16239G87491K6251j1016k9473k096P057M0134M2579R594m2215N806M4278p031
$$ 787491 813742 802726 773253 771157 778214 818348 860927 870521 828306 834112 878390 871359
16227H71359N7055L3662j6682K9368J2115j8729K3891J4401K879K8427r835J5606
$$ 871359 928414 962076 945394 974762 986877 968148 992039 1006440 1009319 1037746 1027911 1043517
16215A043517P085m2526O5141L5950l2815l6205M4535O5141k8504J3912m3784
$$ 1043517 1050602 1008076 1073217 1109167 1076352 1040147 1084682 1149823 1121319 1135231 1091447
16204A091447k2197O5622K1441P42K6222r644j0513K0787L6742n266p3537J4819
$$ 1091447 1069250 1134872 1156313 1157055 1183277 1173633 1163120 1183907 1220649 1215383 1141846 1156665
16192A156665O3773L59j050R138K4272L6782K1487l4453l4208K7304n582R3785
$$ 1156665 1220438 1220797 1219747 1228885 1253157 1289939 1311426 1276973 1242765 1270069 1264487 1358272
16180A358272r762o6541J8024M5579m5550K5575Q984O109M1130k473n3083J0571
$$ 1358272 1348510 1281969 1299993 1345572 1300022 1325597 1334581 1340690 1381820 1379347 1326264 1336835
16168A336835O4886p647K4065k4530K7220J1639r727l863L6942N7916o7051K9045
$$ 1336835 1401721 1394074 1418139 1393609 1420829 1432468 1422741 1418878 1455820 1513736 1446685 1475730
16156A475730k1240k3503L1437j1228K8097L0494k9487l3848L8782k9346N9352
$$ 1475730 1454490 1430987 1462424 1451196 1479293 1509787 1480300 1446452 1485234 1455888 1515240
16145A515240L4586k4391P662K1017m7343L6482j0742K2776P2638n1731n3667
$$ 1515240 1549826 1525435 1533097 1554114 1506771 1543253 1532511 1555287 1627925 1576194 1522527
16134A522527L5204m8144k9570M1017l0867l4776M2953N8811r672j147l6144K1847
$$ 1522527 1557731 1509587 1480017 1521034 1490167 1455391 1498344 1557155 1547483 1546336 1510192 1532039
16122A532039M7784l0444K4674M53n1888O8970J0647K9700j4830K0592l5015M1335
$$ 1532039 1579823 1549379 1574053 1574506 1522618 1591588 1602235 1631935 1617105 1637697 1602682 1644017
16110A644017m3363k9625k4862J3883Q8499j8344l637j6659j8125o1949Q706L0109
$$ 1644017 1600654 1571029 1546167 1560050 1648549 1630205 1626568 1609909 1591784 1529835 1538541 1568650
16098A568650L6465k1830L5203J0464L8029K8141p6422L5168o7359k4135M9891
$$ 1568650 1605115 1583285 1618488 1628952 1666981 1695122 1618700 1653868 1586509 1562374 1612265
16087A612265K3077k0964k3853N0338L731k0890o2686N5716L6820r578l6458M5653
$$ 1612265 1635342 1614378 1590525 1640863 1644594 1623704 1561018 1616734 1653554 1643976 1607518 1653171
16075A653171j996J2400J3348q5238L1691K1989k6818N183m9796O808n864j8296
$$ 1653171 1651175 1663575 1676923 1591685 1623376 1645365 1618547 1623730 1573934 1580742 1574878 1556582
16063A556582P8371K0815O0326L0992j02012p119l4500O2272N9006k9599m1429
$$ 1556582 1634953 1655768 1716094 1747086 1645074 1637955 1603455 1665727 1724733 1695134 1653705
$$ [...]
##END NTUPLES=NMR SPECTRUM
##END=
