##TITLE=1H_TF-2410-1
 200.13Hz, CDCl3.
 8 sc
 30.6.2026
##JCAMPDX= 6.0         $$ Bruker NMR JCAMP-DX V2.0
##DATA TYPE= NMR SPECTRUM
##DATA CLASS= NTUPLES
##ORIGIN= UXNMR, Bruker Analytische Messtechnik GmbH
##OWNER= pz
$$ XWIN-NMR		Version 3.5
$$ Tue Jun 30 13:29:38 2026 Russian Standard Time (UT+4h)  she@DPX200
##.OBSERVE FREQUENCY= 200.1313
##.OBSERVE NUCLEUS= ^1H
##.ACQUISITION MODE= SIMULTANEOUS
##.ACQUISITION SCHEME= undefined
##.AVERAGES= 8
##.DIGITISER RES= 18
##SPECTROMETER/DATA SYSTEM= spect
##.PULSE SEQUENCE= zg30
##.SOLVENT NAME= CDCl3
##.SHIFT REFERENCE= (INTERNAL, CDCl3, 0, 15.5155)
##AUDIT TRAIL= $$ (NUMBER, WHEN, WHO, WHERE, WHAT)
$$ ##TITLE= Audit trail, XWIN-NMR		Version 3.5
$$ ##JCAMPDX= 5.01
$$ ##ORIGIN= Bruker BioSpin GmbH
$$ ##OWNER= she
$$ F:/spectra/data/she/nmr/H-C/1/pdata/1/auditp.txt
$$ ##AUDIT TRAIL=  $$ (NUMBER, WHEN, WHO, WHERE, WHAT)
(   1,<2026-06-30 13:27:31.06 +0400>,<she>,<DPX200>,
      <created by zg, POWCHK disabled, PULCHK disabled
       configuration hash MD5:
       00 E9 B6 7A A2 85 ED C7 34 08 36 98 17 FE 4E 26
       data hash MD5: 16K
       F7 4F 3F 34 B2 C0 45 7D F8 69 73 62 15 5F 45 E3>)
(   2,<2026-06-30 13:28:09.68 +0400>,<she>,<DPX200>,
      <Start of raw data processing
       efp BC_mod = 2 LB = 0.25 FT_mod = 6 PKNL = 1 PHC0 = -4380.927 PHC1 = 12.1923 SI = 16K 
       data hash MD5: 16K
       B6 0B 03 85 7F 3B 8C C6 21 BE 59 46 2B 10 92 3F>)
(   3,<2026-06-30 13:28:31.25 +0400>,<she>,<DPX200>,
      <pk PHC0 = -1.344937 PHC1 = 3.400001 
       data hash MD5: 16K
       FA 80 9E 42 AA D7 82 14 8B 7E F6 30 13 2A EA F7>)
(   4,<2026-06-30 13:28:34.75 +0400>,<she>,<DPX200>,
      <abs ABSG = 5 
       data hash MD5: 16K
       FB 56 F7 03 3A 3C 3D 6D EA 9E FF 54 5A 73 14 1D>)
$$ ##END=
$$ 
$$ hash MD5
$$ 1C AE 55 06 C8 5C 15 B0 6B 5D CD 64 ED 37 52 93
##$RELAX= 
##$RELAX= 
##$RELAX= 
##$RELAX= 
##$RELAX= 
##$RELAX= 
$$ Bruker specific parameters
$$ --------------------------
##$DU= <F:/spectra>
##$EXPNO= 1
##$NAME= <H-C>
##$PROCNO= 1
##$TYPE= <nmr>
##$USER= <she>
##$AMP= (0..31)
100 100 100 100 100 100 100 100 100 100 100 100 100 100 100 100 100 100 
100 100 100 100 100 100 100 100 100 100 100 100 100 100 
##$AQSEQ= 0
##$AQ_mod= 1
##$AUNM= <au_zg>
##$AUTOPOS= <>
##$BF1= 200.13
##$BF2= 200.13
##$BF3= 200.13
##$BF4= 200.13
##$BF5= 200.13
##$BF6= 200.13
##$BF7= 200.13
##$BF8= 200.13
##$BYTORDA= 1
##$CFDGTYP= 0
##$CFRGTYP= 5
##$CHEMSTR= <none>
##$CNST= (0..31)
1 1 145 1 1 1 1 1 1 1 1 1 1 1 1 1 1 1 1 1 1 1 1 1 1 1 1 1 1 1 1 1 
##$CPDPRG= <>
##$CPDPRG1= <>
##$CPDPRG2= <>
##$CPDPRG3= <>
##$CPDPRG4= <mlev>
##$CPDPRG5= <mlev>
##$CPDPRG6= <mlev>
##$CPDPRG7= <mlev>
##$CPDPRG8= <mlev>
##$CPDPRGB= <>
##$CPDPRGT= <>
##$D= (0..31)
0 0.7 0 0 0 0 0 0 0 0 0 0.03 0 0 0 0 0 0 0 0 0 0 0 0 0 0 0 0 0 0 0 0 
##$DATE= 1782811650
##$DBL= (0..7)
120 120 120 120 120 120 120 120 
##$DBP= (0..7)
150 150 150 150 150 150 150 150 
##$DBP07= 0
##$DBPNAM0= <>
##$DBPNAM1= <>
##$DBPNAM2= <>
##$DBPNAM3= <>
##$DBPNAM4= <>
$$ [...]
##$SUBNAM3= <"">
##$SUBNAM4= <"">
##$SUBNAM5= <"">
##$SUBNAM6= <"">
##$SUBNAM7= <"">
##$SUBNAM8= <"">
##$SUBNAM9= <"">
##$SW= 18.0517328524113
##$SWIBOX= (0..15)
0 0 2 0 0 0 0 0 0 0 0 0 0 0 0 0 
##$SW_h= 3612.71676300578
##$TD= 16384
##$TD0= 1
##$TE= 0
##$TE2= 300
##$TE3= 300
##$TEG= 300
##$TL= (0..7)
0 120 120 120 120 120 120 120 
##$TP= (0..7)
150 150 150 150 150 150 150 150 
##$TP07= 0
##$TPNAME0= <>
##$TPNAME1= <>
##$TPNAME2= <>
##$TPNAME3= <>
##$TPNAME4= <>
##$TPNAME5= <>
##$TPNAME6= <>
##$TPNAME7= <>
##$TPOAL= (0..7)
0.5 0.5 0.5 0.5 0.5 0.5 0.5 0.5 
##$TPOFFS= (0..7)
0 0 0 0 0 0 0 0 
##$TUNHIN= 0
##$TUNHOUT= 0
##$TUNXOUT= 0
##$USERA1= <user>
##$USERA2= <user>
##$USERA3= <user>
##$USERA4= <user>
##$USERA5= <user>
##$V9= 5
##$VALIST= <valist>
##$VCLIST= <CCCCCCCCCCCCCCC>
##$VD= 0
##$VDLIST= <DDDDDDDDDDDDDDD>
##$VPLIST= <PPPPPPPPPPPPPPP>
##$VTLIST= <TTTTTTTTTTTTTTT>
##$WBST= 1024
##$WBSW= 4
##$XGAIN= (0..3)
0 0 0 0 
##$XL= 0
##$YL= 0
##$YMAX_a= 572101
##$YMIN_a= -468044
##$ZGOPTNS= <>
##$ZL1= 120
##$ZL2= 120
##$ZL3= 120
##$ZL4= 120
##$ABSF1= 15.49898
##$ABSF2= -2.55287
##$ABSG= 5
##$ABSL= 3
##$ALPHA= 0
##$AQORDER= 0
##$ASSFAC= 0
##$ASSFACI= 0
##$ASSFACX= 0
##$ASSWID= 0
##$AUNMP= <proc_1d>
##$AZFE= 0.1
##$AZFW= 0.1
##$BCFW= 0
##$BC_mod= 2
##$BYTORDP= 0
##$COROFFS= 0
##$CY= -3
##$DATMOD= 1
##$DC= 0
##$DFILT= <>
##$DTYPP= 0
##$F1P= 0
##$F2P= 0
##$FCOR= 1
##$FTSIZE= 16384
##$FT_mod= 6
##$GAMMA= 0
##$GB= 0
##$INTBC= 1
##$INTSCL= 3.241238e-09
##$ISEN= 128
##$LB= 0.25
##$LEV0= 0
##$LPBIN= 0
##$MAXI= 10000
##$MC2= 0
##$MEAN= 0
##$ME_mod= 0
##$MI= 1.114404
##$NCOEF= 0
##$NC_proc= -5
##$NLEV= 6
##$NOISF1= 3.799351
##$NOISF2= 2.8
##$NSP= 0
##$NTH_PI= 0
##$NZP= 0
##$OFFSET= 15.51551
##$PC= 1
##$PHC0= -4382.271
##$PHC1= 15.5923
##$PH_mod= 1
##$PKNL= yes
##$PPARMOD= 0
##$PSCAL= 0
##$PSIGN= 0
##$REVERSE= no
##$SF= 200.130001238585
##$SI= 16384
##$SIGF1= 3
##$SIGF2= 2
##$SINO= 0.751879
##$SIOLD= 32768
##$SREGLST= <19F.Aceton>
##$SSB= 0
##$STSI= 16384
##$STSR= 0
##$SW_p= 3612.71676300578
##$SYMM= 0
##$S_DEV= 0
##$TDeff= 16384
##$TDoff= 0
##$TI= <>
##$TILT= no
##$TM1= 0
##$TM2= 0
##$TOPLEV= 0
##$USERP1= <user>
##$USERP2= <user>
##$USERP3= <user>
##$USERP4= <user>
##$USERP5= <user>
##$WDW= 1
##$XDIM= 16384
##$YMAX_p= 533909617
##$YMIN_p= -97479
$$ End of Bruker specific parameters
$$ ---------------------------------
##NTUPLES= NMR SPECTRUM
##VAR_NAME=  FREQUENCY,     SPECTRUM/REAL,   SPECTRUM/IMAG
##SYMBOL=    X,             R,               I
##VAR_TYPE=  INDEPENDENT,   DEPENDENT,       DEPENDENT
##VAR_FORM=  AFFN,          ASDF,            ASDF
##VAR_DIM=   16384,         16384,           16384
##UNITS=     HZ,            ARBITRARY UNITS, ARBITRARY UNITS
##FACTOR=    0.220516191357247, 1,           1
##FIRST=     3105.11895654752, 0,            0
##LAST=      -507.597806458256, 0,           0
##MIN=       -507.597806458256, -97479,      0
##MAX=       3105.11895654752, 533909617,    0
$$ Real data points
##PAGE= N=1
##DATA TABLE= (X++(R..R)), XYDATA
$$ [...]
6274E0184l8149K4052l2808j678J5853J2759j6078L9986n928l8103R439j526r846
$$ 50184 12035 36087 3279 1601 17454 30213 14135 54121 48193 10090 19529 18003 8157
6261H157K6734K1442m1380r510j7152L3829k9204j2953K2801L0783J7666K719
$$ 8157 34891 56333 14953 5443 -11709 22120 -7084 -20037 2764 33547 51213 53932
6249E3932m243m857L0474J524r876j5030k3260N92J1879J7708j493j291J1100
$$ 53932 49689 44832 75306 76830 66954 51924 28664 29256 41135 58843 57350 56059 67159
6236F7159j3783j4762Q707k3663K266r087L553N15L4959J4777J9220j7912p1125
$$ 67159 53376 38614 47321 23658 25924 16837 20390 20905 55864 70641 89861 71949 824
6223H24K778J9823K0834j1141J3124n551n718J6721j7762r250J2365o895j8560
$$ 824 3602 23425 44259 33118 46242 40691 34973 51694 33932 24682 37047 30152 11592
6210A1592K6908j8782L0130j3371K848k1504L6505j2915N988k0873K0452K541
$$ 11592 38500 19718 49848 36477 39325 17821 54326 41411 47399 26526 46978 49519
6198D9519o455j2845J5818J0360l5505L0706k8478R761j6748K3809m462J8366
$$ 49519 43064 30219 46037 56397 20892 51598 23120 32881 16133 39942 35480 53846
6186E3846l8270L7678q655J1138J3629o144m791o832K2908o825L5629j1930o318
$$ 53846 15576 53254 44599 55737 69366 63222 58431 51599 74507 67682 103311 91381 85063
6173H5063J3984J9762l4934k63N4095J6650k8068K8937L628m615j2508j2062J6462
$$ 85063 99047 118809 83875 83612 137707 154357 126289 155226 158854 154239 141731 129669 146131
6160A46131Q466K0011M788Q058l6260K1717k0450j3785k04j2046J1721L3234m127
$$ 146131 154597 174608 179396 187454 151194 172911 152461 138676 138472 126426 138147 171381 167254
6147A67254j92j7467K0665l0116j6319N189L569l5887R884j1403n0854O709K5712
$$ 167254 167062 149595 170260 140144 123825 129014 132583 96696 106580 95177 44323 51032 76744
6134G6744J009l0405l964K0672J0035L218L3131j7201L904l3314n985J2320o293
$$ 76744 77753 47348 43384 64056 74091 77309 110440 93239 97143 63829 57844 70164 63871
6121F3871k0441l9827N3860j5724o637M0567j2590n49J9817m9266k4988n218L7146
$$ 63871 43430 3603 57463 41739 35102 75669 63079 62530 82347 33081 8093 2875 40021
6108D0021l309L2181K0687J449q792n6120K5810J630j2232K1721J8605m5083J3759
$$ 40021 36712 68893 89580 91029 82237 26117 51927 53557 41325 63046 81651 36568 50327
6095E0327n284L2261j1541o406j3182J6881k1425k2773L5173J3257l4613J2126
$$ 50327 45043 77304 65763 59357 46175 63056 41631 18858 54031 67288 32675 44801
6083D4801J6635J605J547l238L5566K0668j712j642q678l4550K3028Q989k6393
$$ 44801 61436 63041 64588 61350 96916 117584 115872 114230 105552 71002 94030 103019 76626
6070G6626O982j7150m667N306j984K2433N63K8337k2767j8582l4054J7747J018
$$ 76626 83608 66458 61791 67097 65113 87546 88109 116446 93679 75097 41043 58790 59808
6057E9808j0794K0456m545L398n223M127j790M0085k7175K7267M039L0693p646
$$ 59808 49014 69470 64925 68323 63100 67227 65437 105522 78347 105614 109653 140346 132700
6044A32700l4086M885K0739j7715j4953p393j595m63J9648p412j0702J0718M1805
$$ 132700 98614 103499 124238 106523 91570 84177 82582 82119 101767 94355 83653 94371 136176
6031A36176J7256o1155k9847j2225L7991k0568k9087J7195K5303J8880k2244j528
$$ 136176 153432 92277 62430 50205 88196 67628 38541 55736 81039 99919 77675 76147
6019G6147J9527k6251J3302n575L9338L3095p171P847o58J2002r598L0447j1885
$$ 76147 95674 69423 82725 77150 116488 149583 142412 150259 149601 161603 152005 182452 170567
6006A70567m1442K8418k2557j4141J2881M065m6998j17N7392k3724m7565k9739
$$ 170567 129125 157543 134986 120845 133726 137791 90793 90676 148068 124344 76779 47040
5994D7040L6418N5506j1016K960K039J1499j1643j7441j9461L6919M2183K1779
$$ 47040 83458 138964 127948 130908 132947 144446 132803 115362 95901 132820 175003 196782
5982A96782Q909L3499J712p998k8226K4285Q560l0284j4441k3471K4872l329m7252
$$ 196782 205691 239190 240902 232904 204678 228963 237523 207239 192798 169327 194199 190870 143618
5969A43618n373K8823j5347J3955j0205j2709K9067K7763J1391J4846J7399J7573
$$ 143618 138245 167068 151721 165676 155471 142762 171829 199592 210983 225829 243228 260801
5957B60801L1531O8372P4692L1894L9738J2599J1955m41K9753k6906m8710q815
$$ 260801 292332 360704 435396 467290 507028 519627 531582 531141 560894 533988 485278 476463
5945D76463n159k1975k0588K5726j8486r693n0332J2059j7801k1154k7761M0306
$$ 476463 471304 449329 428741 454467 435981 426288 375956 388015 370214 349060 321299 361605
5933C61605l2050o2731k620j5709J9140J8185K8004J6207J4468N908p837r937
$$ 361605 329555 266824 264204 248495 267635 285820 313824 330031 344499 350407 342570 332633
5921C32633l2821n5079J4851l2137j8563k5222o842N892J811j1662j0303j5833
$$ 332633 299812 244733 259584 227447 208884 183662 176820 182712 184523 172861 162558 146725
5909A46725j5796K4339J2884J6488L223R021l27K820r582K8182P589k8194j360
$$ 146725 130929 155268 168152 184640 187863 196884 196557 199377 189795 217977 225566 197372 196012
5896A96012L5665m691J7172Q379j7203m366j23R853j0015j7484r593J62K2060
$$ 196012 231677 226986 244158 252537 235334 230968 230845 240698 230683 213199 203606 203768 225828
5883B25828j912o3R201J3215j8395k455R911k5175K195l811K4562m344j3726Q999
$$ 225828 223916 223853 233054 246269 227874 225419 235330 210155 212350 208539 233101 228757 215031 224030
5869B24030l8075K510j0336M671L4026O668p176j1479L3317l4622n555r538J5008
$$ 224030 185955 188465 178129 182800 216826 223494 216318 204839 238156 203534 197979 188441 203449
5856B03449K4552J5934l6006k4886J595J8006j5559n650K9740J2923q21j2519
$$ 203449 228001 243935 207929 183043 184638 202644 187085 181435 211175 224098 223277 210758
5844B10758P187J2909j274p363j1021k5177j0685p861M2367m024j2176L0879J8361
$$ 210758 217945 230854 229580 222217 211196 186019 175334 167473 209840 205816 193640 224519 242880
5831B42880K6451k6076o47j3069n187O170J0844M907j2972K585J1708K8022m9178
$$ 242880 269331 243255 242608 229539 224352 230522 241366 246273 233301 235886 247594 275616 226438
5818B26438l907j5557O6304j9065K5563K9279l4042k1989K4504K590k3537L3665
$$ 226438 222531 206974 273278 254213 279776 309055 275013 253024 277528 280118 256581 290246
5806B90246L6916k2348n6450R047K0801j0l1556K5440K7237M6209J1184j7259
$$ 290246 327162 304814 248364 257411 278212 278202 246646 272086 299323 345532 356716 339457
5794C39457R95J6612j941m0886K571Q528N0184j4694K1793K4222j5034j6440J2711
$$ 339457 340452 357064 355123 314237 316808 325336 375520 360826 382619 406841 391807 375367 388078
5781C88078J8457k2621j8644l206L6472l451K9150n940L34o1399M3162k1030L875
$$ 388078 406535 383914 365270 362064 398536 395085 424235 418295 418629 357230 400392 379362 383237
5768C83237L1117k9036k2235K3485L3615o81J9272J6515K1753j3860K6093k9100
$$ 383237 414354 385318 363083 386568 420183 419502 438774 455289 477042 463182 489275 460175
5756D60175j0780J4184J1897L6874N470k357l836K4199l0018L8405L5806L7829
$$ 460175 449395 463579 475476 512350 517820 515463 511627 535826 505808 544213 580019 617848
5744F17848P578q303j381K0415k0548k9329K1949k4562J5008j3475M2241K0649
$$ 617848 625426 617123 615742 636157 615609 586280 608229 583667 598675 585200 627441 648090
5732F48090K2999k749J7759J2469K4906l3307L9299P5470K3434l744j8810M2260
$$ 648090 671089 668340 686099 698568 723474 690167 729466 804936 828370 824626 805816 848076
5720H48076j4784Q868L1987M5789L5896K5526M4147L5180q053N5852N8015Q0926
$$ 848076 833292 842160 874147 919936 955832 981358 1025505 1060685 1052632 1108484 1166499 1247425
5708A247425O3957L5943J6288M6794M9744k4141L478K3493L6902O115L8727N3813
$$ 1247425 1311382 1347325 1363613 1410407 1460151 1436010 1439488 1462981 1499883 1505998 1544725 1598538
5696A598538L2683L5047K1822j2785k3397j0357M93k6306j9767L3075j2790M0569
$$ 1598538 1631221 1666268 1688090 1675305 1651908 1641551 1642044 1615738 1595971 1629046 1616256 1656825
5684A656825O8510j6874K6870O0709N5456L1448J4569L7936P6931L4373K4499
$$ 1656825 1725335 1708461 1735331 1796040 1851496 1882944 1897513 1935449 2012380 2046753 2071252
5673B071252N9010N3874N6367P4819L7244J09861J13290R1863J22779P2741J57717
$$ 2071252 2130262 2184136 2240503 2315322 2352566 2462427 2575717 2667580 2790359 2863100 3020817
5662C020817K14655K06056J86202K25934K86285L02509L39751L30503M26756N08993
$$ 3020817 3235472 3441528 3627730 3853664 4139949 4442458 4782209 5112712 5539468 6048461
5652F048461N01255N53516O30147O37649P60494R28059J166149J475473J904669
$$ 6048461 6549716 7103232 7733379 8371028 9131522 10059581 11225730 12701203 14605872
5643A4605872K522846L415635M473028N472168O171682O454808N766786L882945
$$ 14605872 17128718 20544353 25017381 30489549 36661231 43116039 48882825 52765770
5635E2765770J653263O3497r76501j374276q78727J69829J210119J935934J928156
$$ 52765770 54419033 54482530 53506029 52131753 51253026 51422855 52632974 54568908 56497064
5626E6497064J100486n73217k588048l855136m593307n152960n406439n213405
$$ 56497064 57597550 57024333 54436285 50581149 45987842 40834882 35428443 30215038
5618C0215038m758336m230727l635434k885297k285514j790271j444145j085978
$$ 30215038 25456702 21225975 17590541 14705244 12419730 10629459 9185314 8099336
5610H099336q79630o37091n41375m70721l74047l26051k64960k22169k40654k11330
$$ 8099336 7219706 6582615 6041240 5570519 5196472 4870421 4605461 4383292 4142638 3931308
5600C931308j73058j97629j73538j38259p5205j01442j41234q1896q1021q4527
$$ 3931308 3758250 3560621 3387083 3248824 3173619 3072177 2930943 2849047 2768026 2683499
5590B683499j10083n6694n8575q5945q5677p6505n6259p6157o5223j05192n8285
$$ 2683499 2573416 2516722 2458147 2372202 2286525 2210020 2153761 2077604 2012381 1907189 1848904
5579A848904o7792l6590l9824j3485l0057n5534o1564l5428m0756n5588n5156
$$ 1848904 1781112 1744522 1704698 1691213 1661156 1605622 1544058 1508630 1467874 1412286 1357130
5568A357130n0201J6268k5703l3664o068m1775p6624k019J0595J293k5072m4114
$$ 1357130 1306929 1323197 1297494 1263830 1257762 1215987 1139363 1137344 1147939 1149232 1124160 1080046
5556A080046J3739L7758p283k5641o3610m0702m427k1983K7013k1279m437L1086
$$ 1080046 1093785 1131543 1124260 1098619 1035009 994307 989880 967897 994910 973631 969194 1000280
5544A000280Q557k9241k4225j9777k4098L3066j5952j9255K0976Q884l8975K8727
$$ 1000280 1008837 979596 955371 935594 911496 944562 928610 909355 930331 939215 900240 928967
5532I28967J630k699j9490n1000L012j9179N882J1803M991K7513K7335m1878J1077
$$ 928967 930597 927898 908408 857408 860420 841241 847123 858926 863917 891430 918765 876887 887964
5519H87964m1489L668l054R26r031j6817M972L0391M3883j4494K9259J7926o902
$$ 887964 846475 850143 847089 848015 838984 822167 827139 857530 901413 886919 916178 934104 927202
5506I27202k1849J7292j2147J2319J6895R346K289r16K7366k5271k586Q205J9818
$$ 927202 905353 922645 910498 922817 939712 949058 951347 950431 977797 952526 949940 958145 977963
5493I77963l677L7233K5260J53K7434K999p852k0266N0732K2818j8740J3206M9042
$$ 977963 974286 1011519 1036779 1036932 1064366 1067365 1059513 1039247 1089979 1112797 1094057 1107263 1156305
5480A156305O645O0476P562L4877L1875l6996M186m703M2001M0365M4961m378
$$ 1156305 1162950 1223426 1230988 1265865 1297740 1260744 1264930 1260227 1302228 1342593 1387554 1383176
5468A383176K3288O489L4829Q886J5219r928J2063R072J7975N7719M9113N905
$$ 1383176 1406464 1412953 1447782 1456668 1471887 1461959 1474022 1483094 1501069 1558788 1607901 1613806
5456A613806l937P8029L5697M0106K2388K0917J2193N1199L4476j1759M6184M1926
$$ 1613806 1609869 1687898 1723595 1763701 1786089 1807006 1819199 1870398 1904874 1893115 1939299 1981225
5444A981225M1828L1965O1202P7689J08976N7649M3734N7054P1931O6377P7719
$$ 1981225 2023053 2055018 2116220 2193909 2302885 2360534 2404268 2461322 2533253 2599630 2677349
5433B677349M9316M9349Q4783P8932J44070R5077J39930J16276J06574J48547
$$ 2677349 2726665 2776014 2860797 2939729 3083799 3178876 3318806 3435082 3541656 3690203
5423C690203J90231K24237K61745K45743K74178L59665L40850L75664M33366M94573
$$ 3690203 3880434 4104671 4366416 4612159 4886337 5246002 5586852 5962516 6395882 6890455
5413F890455N16940N71359O36296P34699Q34280R13810J075223J241796J488472
$$ 6890455 7407395 7978754 8615050 9349749 10184029 11097839 12173062 13414858 14903330
5404A4903330J804345K418167L260277M606140O373765Q105609R483021R591463
$$ 14903330 16707675 19125842 22386119 26992259 33366024 41471633 50954654 60546117
5396F0546117P680608L743445j35473k194611l118593l450263k662847r54464
$$ 60546117 68226725 71970170 71834697 69640086 66521493 63071230 60408383 59453919
5388E9453919J243347L366590M817239M655940J989459j847026m575380n971656
$$ 59453919 60697266 64063856 68881095 73537035 75526494 73679468 69104088 63132432
5380F3132432o914270p263213p084671o516977n918793n129806m209019l229087
$$ 63132432 56218162 48954949 41870278 35353301 29434508 24304702 20095683 16866596
5372A6866596k454549j911906j537886j288039r74233p14332n97663m93296l94851
$$ 16866596 14412047 12500141 10962255 9674216 8699983 7985651 7387988 6894692 6499841
5363F499841l63244k97452k92006l03401l06706k30113k05357k08043j72284j54912
$$ 6499841 6136597 5839145 5547139 5243738 4937032 4706919 4501562 4293519 4121235 3966323
5353C966323j12566j49583j69979j47842j00124j31282j24553j17361q9480j16847
$$ 3966323 3853757 3704174 3534195 3386353 3286229 3154947 3030394 2913033 2823553 2706706
5343B706706j21175p9423r1298n4672r4018j15006p4338m1182n6520o7338r1377
$$ 2706706 2585531 2506108 2414810 2360138 2266120 2151114 2076776 2035594 1979074 1911736 1820359
5332A820359m6477k9513n2280r1245m9781m0435m2105q075l2778j1456m031P171
$$ 1820359 1773882 1744369 1692089 1600844 1551063 1510628 1468523 1460448 1427670 1416214 1412183 1419354
5320A419354j110l4485l1595j8226L839n3208l1587j9043K6872o7716k5603l475
$$ 1419354 1418244 1383759 1352164 1333938 1337777 1284569 1252982 1233939 1260811 1193095 1167492 1164017
5308A164017j5113k9133n0397m1161k7893l6731o8478l4627o1064N540k4998J4527
$$ 1164017 1148904 1119771 1069374 1028213 1000320 963589 895111 860484 799420 804960 779962 794489
5296G94489n017l2308n2851q906m5726k3446j6525O924P706l2313j3727k2320
$$ 794489 789472 757164 704313 695407 649681 626235 609710 616634 624340 592027 578300 555980
5284E55980K2485n5656o198l3045J3977p894J4455l7156k0691o192j7241k9643
$$ 555980 578465 522809 516611 483566 497543 489649 504104 466948 446257 440065 422824 393181
5272C93181r403J1533m7183J5914k4088N493q66J3657Q966k2360j102R076k5454
$$ 393181 383778 395311 348128 364042 339954 345447 344581 358238 367204 344844 343742 352818 327364
5259C27364j0029J2053k4689M1913m0373K2944p773j7012m3992j5321J6090l0093
$$ 327364 317335 329388 304699 346612 306239 329183 321410 304398 260406 245085 261175 231082
5247B31082K2876n530M4406j7076j0843n0441L9630k6818K406k3732n481m184
$$ 231082 253958 248428 292834 275758 264915 214474 254104 227286 229692 205960 200479 196295
5235A96295k1265j3444J3151J1120l8166P6898m9166j6443j4120K2499k0497J3178
$$ 196295 175030 161586 174737 185857 147691 224589 175423 158980 144860 167359 146862 160040
5223A60040m8510m5883J9367K4896K9845l0516N935m571K7811m2473K0342J072
$$ 160040 111530 65647 85014 109910 139755 109239 115174 110603 138414 95941 116283 117355
5211A17355K6540j1311l285k3109o835L2502m225M966o7069p094j1367L0668m2525
$$ 117355 143895 132584 129299 106190 99355 131857 127632 132598 65529 58435 47068 77736 35211
5198C5211K9070o139l503J8467o975j3551k757K1500k3116j5947J5422L5196n5043
$$ 35211 64281 58142 54639 73106 66131 52580 49823 71323 48207 32260 47682 82878 27835
5185B7835J2502k4570L5045k2165L5636L662m934J1345Q24k6799k7607N3182k9877
$$ 27835 40337 15767 50812 28647 64283 67945 63011 74356 75180 48381 20774 73956 44079
5172D4079J550j2362M3427j0701N629j918l4630M0268l4205J7769n848j8023r019
$$ 44079 45629 33267 76694 65993 71622 69704 35074 75342 41137 58906 53058 35035 26016
5159B6016L5215q098J2937o9637K988K5571Q892N1947m0256l5774l7581K1821
$$ 26016 61231 53133 66070 -3567 -579 24992 33884 85831 45575 9801 -27780 -5959
5147e959J3208Q497j9671K1220o0894N069J4428J6992j8181l704M5360q742L0828
$$ -5959 7249 15746 -3925 17295 -43599 -38530 -24102 -7110 -25291 -28995 16365 7623 38451
5134C8451l4539O374O97N758J6911J6318m2292R23M02j1868j976n29J9033j6820
$$ 38451 3912 10286 10983 16741 33652 49970 7678 8601 9003 -2865 -4841 -5370 13663 -3157
5120c157L0824r300K1970l324J0360k9058L8495p068o92M968r245J8307L611J5300
$$ -3157 27667 18367 40337 37013 47373 18315 56810 49742 49050 54018 44773 63080 66691 81991
5106H1991k189J0378j3888k6912m2948J1981J4K1312O574K8206n085k260J0602
$$ 81991 79802 90180 76292 49380 6432 18413 18427 39739 46313 74519 69434 67174 77776
5093G7776m986L873l4502J6603o453R134L0783O6215J0163O1265Q3793N9489J9340
$$ 77776 72790 76663 42161 58764 52311 61445 92228 158443 168606 229871 313664 373153 392493
5080C92493m543j753j8329J3692j3968o6753l2418L7684J2155K2993J5308j2744
$$ 392493 387950 386197 367868 381560 367592 300839 268421 306105 318260 341253 356561 343817
5068C43817K4823K058l6261k3981l5158j7380l1542q9632l0881l0137o779o937
$$ 343817 368640 370698 334437 310456 275298 257918 226376 136744 105863 75726 68947 62010
5056F2010J7787j2886j2947L9386k9184l5488j0819J2689j2512j8413J1776K6182
$$ 62010 79797 66911 53964 93350 64166 28678 17859 30548 18036 -377 11399 37581
5044C7581m967L7611L6320m0128k0286K76l1402M174K6687J3486q633M383n1051
$$ 37581 32614 70225 106545 66417 46131 46407 15005 19179 45866 59352 50719 55102 4051
5031D051j6874k1173L2830K9383r125o522J1328m423J6626n781m5702J3899J5500
$$ 4051 -12823 -33996 -1166 28217 19092 12570 23898 19475 36101 30320 -15382 -1483 14017
5018A4017r482L872M7945k2209j7040l5448K8840j1557J3346k1734K680N4114
$$ 14017 4535 8407 56352 34143 17103 -18345 10495 -1062 12284 -9450 -6770 47344
5006D7344l173n516l2054P828l7538J5206O317J7510J6888P194k7485O095K2526
$$ 47344 44171 38655 6601 14429 -23109 -7903 -1586 15924 32812 40006 12521 18616 41142
4993D1142k4519N920J8398K6467n1596k1640k3134J6682M6809o877o611m1007
$$ 41142 16623 22543 40941 67408 15812 -5828 -28962 -12280 34529 27652 21041 -19966
4981a9966J1724L0861O178j2893L328m0040R909P559K6304j7113N9946J5436l8803
$$ -19966 -8242 22619 28797 15904 19232 -20808 -10899 -3340 22964 5851 65797 81233 42430
4968D2430J0129N489j2451l8634K0380Q363j1655j0943K0541O65O4022n1657j1964
$$ 42430 52559 58048 45597 6963 27343 35706 24051 13108 33649 34314 98336 46679 34715
4955C4715L0247J073M165m8250k1526Q201K5198Q624L4629j4221m190j7311L823
$$ 34715 64962 66035 70200 21950 424 8625 33823 42447 77076 62855 58665 41354 45177
4942D5177p40q624L0643J88n676r214P963m5367O0464R648J5221m1836k4600J1312
$$ 45177 44437 35813 66456 66644 60968 51754 59717 14350 74814 84462 99683 57847 33247 44559
4928D4559J5311k0738K3273K3517l4692K7171l3349Q070o311K1740j0052K6259
$$ 44559 59870 39132 62405 85922 51230 78401 45052 53122 46811 68551 58499 84758
4916H4758n113j5612Q093M526R773k9466K9638j6404N762K0180l4982l5174J2620
$$ 84758 79645 64033 72126 76652 86425 56959 86597 70193 75955 96135 61153 25979 38599
4903C8599k3334j346J9774m738J138J9047J5816j1348j722J7648J1572j0918N3996
$$ 38599 15265 13919 33693 28955 30093 49140 64956 53608 51886 69534 81106 70188 124184
4890A24184k7453m1090j8851r528n603K2214P628l6700L3235p978J4573r47J453
$$ 124184 96731 55641 36790 27262 21659 43873 51501 14801 48036 40058 54631 53684 55137
4877E5137J0942L866Q340J0803M513J5529K730Q721M2018j8086M9034o785P391
$$ 55137 66079 69945 78285 89088 93601 109130 111860 120581 162599 144513 193547 186762 194153
4864A94153J2166J7137K9739K7296K9647P655J3256J1337J0227o856k6347l2717
$$ 194153 206319 223456 253195 280491 310138 317793 331049 342386 352613 345757 319410 286693
4852B86693Q372P17K8854L6685L2424L9998k0865m7493m4482j6447k079j6563
$$ 286693 295065 295782 324636 361321 393745 433743 412878 365385 320903 304456 302377 285814
4840B85814n7961P71P550K2592j7610J3331j2412m1170j0591j2807j9452o512
$$ 285814 227853 228624 236174 258766 241156 254487 242075 200905 190314 177507 158055 151543
4828A51543N199j701J7905l4519O126J2162j7686l6199o647j6043q963Q327L8441
$$ 151543 156742 155041 172946 138427 144553 156715 139029 102830 96183 80140 71177 79504 117945
4815A17945k0344k4222L3856P39l8109r981J3730K8121M1708N868l215m8799L4448
$$ 117945 97601 73379 107235 107974 69865 59884 73614 101735 143443 149311 146096 97297 131745
4802A31745M613o4228j2336n925M4075k1554K4161R780J2998r198j5577p36K8456
$$ 131745 136358 72130 59794 53869 97944 76390 100551 110331 123329 114131 98554 97818 126274
4789A26274J2112m9440J2056L6064m9213J5335P208k9220L6348L0279Q096n958
$$ 126274 138386 88946 101002 137066 87853 103188 110396 81176 117524 147803 155899 149941
4777A49941j0952n663R311J4449j5007m6842r371l472n1Q683J1658J4592k5610
$$ 149941 138989 133326 142637 157086 142079 95237 85866 82394 82343 91026 102684 117276 91666
4764I1666j4480K5066J0968j4441m609j140K0486L1532Q089K2520O465J4994j7476
$$ 91666 77186 102252 113220 98779 94170 93030 113516 145048 153137 175657 182122 197116 179640
4751A79640r995R897j5335J6998K3853m2194K869k6540j6743K764J5048L481j0600
$$ 179640 169645 179542 164207 181205 205058 162864 165733 139193 122450 125214 140262 143743 133143
4738A33143Q685k3138K5525j179j5672m848L2405N441k9866K6596K1373L1538
$$ 133143 141828 118690 144215 143036 127364 122516 154921 160362 130496 157092 178465 210003
4726B10003k7513K4575o257k2847r031j843k5895K6083L0001r792n9639k5915
$$ 210003 182490 207065 200808 177961 168930 167087 141192 167275 197276 187484 127845 101930
4714A01930J2140J9628N335O284L2503n444n158k6230n953J5420K3154k0240L7076
$$ 101930 114070 133698 139033 145317 177820 172376 167218 140988 135035 150455 173609 153369 190445
4701A90445n0496j6120j0357K6074L5934k5158j6322j2096J1445K063M2234m8985
$$ 190445 139949 123829 113472 139546 175480 150322 134000 121904 133349 135412 177646 128661
4689A28661K7568L7038m962m0853k8481J5134j1605M382l0822L4611m916R625
$$ 128661 156229 193267 188305 147452 118971 134105 122500 126882 96060 130671 125755 135380
4677A35380J7593J1102m5227J3913J8798J6877J3909m1822j9568J4771L6340L595
$$ 135380 152973 164075 118848 132761 151559 168436 182345 140523 120955 135726 172066 175661
4665A75661J7886o1010R032j6810M7620J1999j0981k4442k874o002J9361K4351
$$ 175661 193547 132537 141569 124759 172379 184378 173397 148955 146081 140079 159440 183791
4653A83791o6192J2475J6556L0952k6837K3989l2185L72J050M8674j5513j0692
$$ 183791 117599 130074 146630 177582 150745 174734 142549 142921 143971 192645 177132 166440
4641A66440n524j5328j3136J5260L0370n1610O894L743M2668k2911K5139j3970
$$ 166440 160916 145588 132452 147712 178082 126472 133366 137109 179777 156866 182005 168035
4629A68035J5163K3120o524R199k0601N943J765P328k2242M4907R205j6498J728
$$ 168035 183198 206318 199794 208993 188392 194335 196100 203428 181186 226093 235298 218800 220528
4616B20528O268k7663K1112K792j5459k4296l079J0842O738M7149k1456q542k5554
$$ 220528 226796 199133 220245 223037 207578 183282 180203 191045 197783 244932 223476 214934 189380
4603A89380K8866n2287R210N7667k7655q762K3417L2306l0254N756j5633J8251
$$ 189380 218246 165959 175169 232836 205181 196419 219836 252142 221888 227644 212011 230262
4591B30262J0340L8752k5057j5882L2940j2858J5527k5360J3024l5373Q662k155
$$ 230262 240602 279354 254297 238415 271355 258497 274024 248664 261688 226315 234977 232822
4579B32822j214q991N6447k3191L1876q668j623K1849J8002O4731j7940P466k3834
$$ 232822 231608 222617 279064 255873 287749 279081 277458 299307 317309 382040 364100 371566 347732
4566C47732K6069l0921M5561L827j6863m781O817R813r551p588J877J5683J2431
$$ 347732 373801 342880 388441 392268 375405 370624 377441 387254 377703 370115 371992 387675 400106
4553D00106R653k2011O2575j4342J1040j5781K8786j1062J8004L1925l3734Q094
$$ 400106 409759 387748 450323 435981 447021 431240 460026 448964 466968 498893 465159 473253
4541D73253p557K5311k7380N724O028K8911m7060J0338k29r474k2963N542O091
$$ 473253 465696 491007 463627 469351 475379 504290 457230 467568 467339 457865 434902 440444 446535
4528D46535L4371L622l8894L0290j1680L152k2888m3368J1337K2971K9382j0720
$$ 446535 480906 484528 445634 475924 464244 467396 444508 401140 412477 435448 464830 454110
4516D54110k2632p115J47j9139m794K2949N0092k7398Q568o943k9401l4675k0967
$$ 454110 431478 424363 424510 405371 400577 423526 473618 446220 454788 447845 418444 383769 362802
4503C62802M0105k4560J5759M081J1823j5102J1448n149K5965k5356K15K5661
$$ 362802 402907 378347 394106 398187 410010 394908 406356 401207 427172 401816 402031 427692
4491D27692k2427L4412K5310N272r30J5984N945K6348m8099j0911K1348P79P021
$$ 427692 405265 439677 464987 470259 469329 485313 491258 517606 469507 458596 479944 480723 487744
4478D87744l571j3727l5367N9933j5361L0324k5013N409k0912J8987J458l567
$$ 487744 484173 470446 435079 495012 479651 509975 484962 490371 469459 488446 489904 486337
4466D86337P749n789N7621m2467L8K7124J5524j1123M9515j4374N0337K4415k206
$$ 486337 494086 488297 545918 503451 503489 530613 546137 535014 584529 570155 620492 644907 642701
4453F42701M054q462L7401K6814Q0843M1922P9228J16153J22981R6870P8875N1752
$$ 642701 646755 638293 675694 702508 783351 825273 904501 1020654 1143635 1240505 1319380 1371132
4441A371132P7274J0474m3313l2401m0232p6997r8780p7841j12918m0171m4879
$$ 1371132 1448406 1458880 1415567 1383166 1342934 1265937 1167157 1089316 976398 936227 891348
4430H91348n181l7780m4820k7995m0174L2600l936K8541N279N4400l011K9031
$$ 891348 886167 848387 803567 775572 735398 767998 764062 792603 797882 852282 849271 878302
4418H78302K5648L7323K6762j1350k5364j7159P4672j4570N4145P3731O8173J5693
$$ 878302 903950 941273 968035 956685 931321 914162 988834 974264 1028409 1102140 1170313 1186006
4406A186006M1937K524r767j1771K0870k8990l4706K3373M2289L4522L6171O5343
$$ 1186006 1227943 1230467 1220700 1208929 1229799 1200809 1166103 1189476 1231765 1266287 1302458 1367801
4394A367801j5298o522l0956J2794p820k1373K159K4794q217m2835K7304r266
$$ 1367801 1352503 1345981 1315025 1327819 1319999 1298626 1300785 1325579 1317362 1274527 1301831 1292565
4382A292565M0600P063N6415Q024K9310n033P049R191J7928N444O79N7606j3840
$$ 1292565 1333165 1340228 1396643 1404667 1433977 1428944 1435993 1445184 1463112 1468556 1469235 1526841 1513001
4369A513001K9278L3722O7874k4858Q4771M341P868K4885O0459N8544J28561M9939
$$ 1513001 1542279 1576001 1643875 1619017 1703788 1708129 1715997 1740882 1801341 1859885 1988446 2038385
4357B038385j7963Q4052J0183J1712J3133M3993p6858K3619R901M9243P015M846
$$ 2038385 2020422 2104474 2114657 2126369 2139502 2183495 2106637 2130256 2140157 2189400 2196415 2201261
4345B201261M6259O3685P6051J269J12438M8500N6434J9680O6112J1951P3703
$$ 2201261 2247520 2311205 2387256 2388525 2500963 2549463 2605897 2625577 2691689 2703640 2777343
4334B777343Q1466Q5421O3631Q2799J04119M7601J35069J11691J60487R9946J92231
$$ 2777343 2858809 2944230 3007861 3090660 3194779 3242380 3377449 3489140 3649627 3749573 3941804
4323C941804J59875K51118K00418K44024K54405L38852L94791M20187N56472O80545
$$ 3941804 4101679 4352797 4553215 4797239 5051644 5390496 5785287 6205474 6761946 7442491
4313G442491Q98536J063492J332850J477427J715844J811106J816898J640041
$$ 7442491 8341027 9404519 10737369 12214796 13930640 15741746 17558644 19198685
4305A9198685J414869J210758J169752J486709K219968L253187M229365N196652
$$ 19198685 20613554 21824312 22994064 24480773 26700741 29953928 34183293 39379945
4297C9379945N254434L882836J390726n31978j353047j920084j938044j108851
$$ 39379945 44634379 48517215 49907941 49375963 48022916 46102832 44164788 43055937
4289D3055937M40333K172899L751476M662819L870000O58831k400974l470566
$$ 43055937 43496270 45669169 49420645 54083464 57953464 58612295 56211321 52740755
4281E2740755m042438m439259l959841l117297j893103o92937L36876R30950L45610
$$ 52740755 48698317 44259058 40299217 37181920 35288817 34595880 34932756 35863706 36209316
4272C6209316q95489j633828j702258j889969j735149j519087j196958r31802
$$ 36209316 35313827 33679999 31977741 30087772 28352623 26833536 25636578 24704776
4264B4704776n69418j23077L55260O84891O60627O43434L76062K41143L0822O337
$$ 24704776 24135358 24012281 24367541 25052432 25713059 26356493 26732555 26973698 27004520 27010857
4254B7010857l3758L2546M9135J45198L28420O04364Q41602J006938J059177P55300
$$ 27010857 26977099 27009645 27058780 27203978 27532398 28136762 28978364 29985302 31044479 31799779
4244C1799779M16002j11379m69398p58103p97749q30141p48356p31474n39856
$$ 31799779 32215781 32104402 31635004 30876901 30079152 29249011 28500655 27769181 27229325
4235B7229325l42642q5159J60579K50038J67851k06739m19643p66848q99763j037608
$$ 27229325 26886683 26801524 26962103 27212141 27379992 27173253 26753610 25986762 25086999 24049391
4225B4049391j056412j113360j022468j011677q83769p69493o35708n44344m73050
$$ 24049391 22992979 21879619 20857151 19845474 18961705 18192212 17556504 17012160 16539110
4216A6539110m67267n84852n82163o43378n75889o29832o28098o72854o26568
$$ 16539110 16071843 15486991 14904828 14261450 13685561 13055729 12427631 11754777 11128209
4207A1128209o85060o82133o78932n81024n12194m75290m39978l84049k93290
$$ 11128209 10443149 9761016 9082084 8501060 7988866 7513576 7073598 6689549 6396259
4198F396259k65489k02852j76472k12479k57712k40550l21750k90761k48618k56155
$$ 6396259 6130770 5927918 5751446 5538967 5281255 5040705 4718955 4428194 4179576 3923421
4188C923421k29630j87289j44675j20638j38843j12887j02669q0219j06427j33577
$$ 3923421 3693791 3506502 3361827 3241189 3102346 2989459 2886790 2806571 2700144 2566567
4178B566567r9619r1803n5140m9922k4918p1447j07716q9616o5111n6048p5734
$$ 2566567 2466948 2375145 2320005 2270083 2245165 2173718 2066002 1976386 1911275 1855227 1779493
4167A779493o9568k3071l1013m2285n4003k1281m2342j9935o6259m6523n0373
$$ 1779493 1709925 1686854 1655841 1613556 1559553 1538272 1495930 1475995 1409736 1363213 1312840
4156A312840l2743M033m3628m5844m8904l0147l1657J1441L534l2441n1961J3554
$$ 1312840 1280097 1284130 1240502 1194658 1145754 1115607 1083950 1095391 1098925 1066484 1014523 1028077
4144A028077k2568o223M3j1282k1237q160n1325l1506P678k4007j1825m0312N7528
$$ 1028077 1005509 999286 999329 988047 966810 958650 907325 875819 883497 859490 847665 807353 864881
4131H64881Q333j2131k8661l5512k9285L4883l7714l003k8664k8967J6029K7546
$$ 864881 873214 861083 832422 796910 767625 802508 764794 761791 733127 704160 720189 747735
4119G47735n640k2438j8122J0087M0403j9416p881Q73L6344l6904M7256k2095
$$ 747735 742095 719657 701535 711622 752025 732609 724728 725601 761945 725041 772297 750202
4107G50202J8325l4644j9636p703J4261J1530j0149l1718j9384K9439O254n963
$$ 750202 768527 733883 714247 706544 720805 732335 722186 690468 671084 700523 706777 700814
4095G00814l8874l460m870l922j5371M6622l8325j1047o290o179j1440l1027J1480
$$ 700814 661940 658480 653610 649688 634317 680939 642614 631567 625277 619098 607658 576631 588111
4082E88111k1307k1923L05J8716k3828J3984j7885j4989O324K1022m398O9J5019
$$ 588111 566804 544881 545186 563902 540074 554058 536173 521184 527508 548530 544132 544201 559220
4069E59220j7631J7507K377j0871p739k4249R584l7046k7446L2388j9824n452
$$ 559220 541589 559096 561473 550602 542863 518614 528198 491152 463706 496094 476270 470818
4057D70818k0672J9483j3795k3920L253R503J3564j7485J9646N454p289l715L3252
$$ 470818 450146 469629 455834 431914 435167 444670 458234 440749 460395 465849 458560 454845 488097
4044D88097J4113j0521j9044k7966K831j7J310j8297J3201J05K6543q455j3034
$$ 488097 502210 491689 472645 444679 447510 447493 448803 430506 443707 443812 470355 461900 448866
4031D48866J3651R207j0060k0064J5744k1464L2406K5453K907k3904r58j1024
$$ 448866 462517 471724 461664 441600 457344 435880 468286 493739 496646 472742 471784 460760
4019D60760N2488j8902j7403L0602j7209l0586j5970N6106L173K0650n003j975
$$ 460760 513248 494346 476943 507545 490336 459750 443780 499886 503059 523709 518706 516731
4007E16731J305K6502r882n78n366L0987L2548R032j6480k5687O286M641L1031
$$ 516731 518036 544538 534656 534078 528712 559699 592247 601279 584799 559112 565398 570039 601070
3994F01070j7848J4545J1880L207n0553J9786J5595M1939L550K4410m968l2425
$$ 601070 583222 597767 609647 612854 562301 582087 597682 639621 643171 667581 662613 630188
3982F30188j3151K0498O010J304K0695k4260L5684j6963K2121L5911K1727J837
$$ 630188 617037 637535 643545 644849 665544 641284 676968 660005 682126 718037 739764 741601
3970G41601N985k9057K090K9755L7160J7586m7411J6728L2230L7697P910J623
$$ 741601 747586 718529 720619 750374 787534 805120 757709 774437 806667 844364 852274 853897
3958H53897K4907K6264J7770O190J5201j4318N5554M3496k912J1233P9022J7275
$$ 853897 878804 905068 922838 929028 944229 929911 985465 1028961 1026049 1037282 1116304 1133579
3946A133579O515L7583M2249J5356N049R666O302n338k3892O391M6831N253j1010
$$ 1133579 1140094 1177677 1219926 1235282 1240331 1249997 1256299 1250961 1227069 1233460 1280291 1285544 1274534
3933A274534J2342j1792n892J4383j3445o154M2464j693l5166J1206j5408j699
$$ 1274534 1286876 1275084 1269192 1283575 1270130 1263976 1306440 1304747 1269581 1280787 1265379 1263680
3921A263680l9061q995q587K5644j6473m6347K2115M954q770j7345J2566K7068
$$ 1263680 1224619 1215624 1207037 1232681 1216208 1169861 1191976 1196930 1188160 1170815 1183381 1210449
3909A210449N5062m9794K6770J8883j9932R07l482k2327k858L3766J9511p695
$$ 1210449 1265511 1215717 1242487 1261370 1241438 1242345 1238863 1216536 1213678 1247444 1266955 1259260
3897A259260k359J5124N00J6727l2896K1714R698L4486L1085O068J0531K9500
$$ 1259260 1256901 1272025 1272525 1289252 1256356 1278070 1287768 1322254 1353339 1359407 1369938 1399438
3885A399438N190R993L4039N8824K4828J3568R0030n692K6204L4169K7873n848
$$ 1399438 1404628 1414621 1448660 1507484 1532312 1545880 1635910 1630218 1656422 1690591 1718464 1712616
3873A712616L7021L2009M6433P010N2795Q407K1459J1568J425N4578K7408J0871
$$ 1712616 1749637 1781646 1828079 1835089 1887884 1896291 1917750 1929318 1930743 1985321 2012729 2023600
3861B023600J0469K4265k596O0973K2316M138R472M5734J9987M5228N8119M1014
$$ 2023600 2034069 2058334 2055738 2116711 2139027 2143165 2152637 2198371 2218358 2263586 2321705 2362719
3849B362719O3887P7280N5827P7054J06012R8437J26984J09785J49730K11632
$$ 2362719 2426606 2503886 2559713 2636767 2742779 2841216 2968200 3077985 3227715 3439347
3839C439347J88329K02823K16388K47120L29456L61270M13411N13592O68023P95178
$$ 3439347 3627676 3830499 4046887 4294007 4623463 4984733 5398144 5911736 6579759 7374937
3829G374937R45512J131731J308200J464178J515997J569793J534640J466592
$$ 7374937 8320449 9452180 10760380 12224558 13740555 15310348 16844988 18311580
3821A8311580J304924J043997Q45311N59109K88607L0334q4669k12350k75895
$$ 18311580 19616504 20660501 21505812 22064921 22353528 22383862 22299193 22086843 21810948
3812B1810948k25378j87980n8872K6660R9689J13420J09246K0486j37742l59401
$$ 21810948 21585570 21397590 21338718 21365378 21465067 21578487 21687733 21708219 21570477 21211076
3802B1211076n51146p88288r66488j149893j318409j401534j420593j366513j298575
$$ 21211076 20659930 19871642 18905154 17755261 16436852 15035318 13614725 12248212 10949637
3793A0949637j154799j043251q54238p76849n91891n41537m42771l61836k68102
$$ 10949637 9794838 8751587 7897349 7120500 6528609 5987072 5544301 5182465 4914363
3784D914363k41657k36354j85893j24755r2789j13494m5036m7637k1540l4145
$$ 4914363 4672706 4436352 4250459 4125704 4032915 3919421 3874385 3826748 3805208 3771063
3774C771063Q813n0380N0851n273J9475L8699L0205N2663K2478M1729n258r813
$$ 3771063 3779876 3729496 3780347 3775074 3794549 3833248 3863453 3916116 3938594 3980323 3975065 3965252
3762C965252K2223R4684k1167M1221l311L1461R1835L6628N4010M7647P7834K380
$$ 3965252 3987475 4082159 4060992 4102213 4098902 4130363 4222198 4258826 4312836 4360483 4438317 4440697
3750D440697O8008J8691L1018j432M5449j3315n3846k3871l8311l530K1507j1352
$$ 4440697 4508705 4527396 4558414 4556982 4602431 4589116 4535270 4511399 4473088 4469558 4491065 4479713
3738D479713p67q876L4562K4075L208O1807L8966Q1936k451j2501r436K0957j9526
$$ 4479713 4478946 4470070 4504632 4528707 4531915 4593722 4632688 4714624 4712173 4699672 4690236 4711193 4691667
3725D691667l3838q826K2211O695O317N9631J4908K8089N5345L9338l117K5180
$$ 4691667 4657829 4649003 4671214 4677909 4684226 4743857 4758765 4786854 4842199 4881537 4878420 4903600
3713D903600L3219K0535N5435K4223L8144M1411N6859M7522Q2330N5920L4500
$$ 4903600 4936819 4957354 5012789 5037012 5075156 5116567 5173426 5220948 5303278 5359198 5393698
3702E393698P1632Q9850O0645J01337Q5950Q2769J44102J17141J50675J39921
$$ 5393698 5465330 5555180 5615825 5717162 5803112 5885881 6029983 6147124 6297799 6437720
3692F437720J73566J54917K57253K14553K60653L02836L77480M20643M36002N01607
$$ 6437720 6611286 6766203 7023456 7238009 7498662 7801498 8178978 8599621 9035623 9537230
3682I537230N84331O91833P27961Q96661R50003J071724J145403J208367J252373
$$ 9537230 10121561 10813394 11541355 12438016 13388019 14459743 15605146 16813513 18065886
3673A8065886J337344J401111J556732J770928K109974K529660K970443L437722
$$ 18065886 19403230 20804341 22361073 24132001 26241975 28771635 31742078 35179800
3665C5179800L791289M133290M224975M110325L703822L199702K454181J624463
$$ 35179800 38971089 43104379 47329354 51439679 55143501 58343203 60797384 62421847
3657F2421847P57013q8839o62739j066176j070151q89855m83752j14635M00780
$$ 62421847 63178860 63090021 62427282 61361106 60290955 59401100 58917348 58802713 59203493
3648E9203493P55373Q84946P75162N28303j9839o61158j401889k202552k859248
$$ 59203493 59958866 60843812 61618974 62147277 62127438 61466280 60064391 57861839 55002591
3639E5002591l419921l763401l912815l788490l544267l133492k700133k130542
$$ 55002591 51582670 47819269 43906454 40117964 36573697 33440205 30740072 28609530
3631B8609530j503973r20578l74237J79671O06290R56065J235352J352942J359861
$$ 28609530 27105557 26184979 25810742 25990413 26596703 27552768 28788120 30141062 31500923
3622C1500923J365997J173945J096899Q88043N92487J95755k29826o53045j002736
$$ 31500923 32866920 34040865 35137764 36025807 36618294 36814049 36584223 35931178 34928442
3613C4928442j266341j439289j506159j460541j407040j352558j079545q15153
$$ 34928442 33662101 32222812 30716653 29256112 27849072 26496514 25416969 24601816
3605B4601816m94683j29596K75549O54396J002663J312990J607982J728167J872513
$$ 24601816 24107133 23977537 24253086 24907482 25910145 27223135 28831117 30559284 32431797
3596C2431797J849466J840400J702636J553697J337496J126695R48598P31710
$$ 32431797 34281263 36121663 37824299 39377996 40715492 41842187 42790785 43522495
3588D3522495N89381M23906K85035L9417j58734m72978p40203j072678j333668
$$ 43522495 44111876 44535782 44820817 44860234 44701500 44228522 43488319 42415641 41081973
3579D1081973j608041j913184k113046k309239k345951k332431k224761k174673
$$ 41081973 39473932 37560748 35447702 33138463 30792512 28460081 26235320 24060647
3571B4060647j939005j742336j509918j336556j060670q34459o93677n59105m59643
$$ 24060647 22121642 20379306 18869388 17532832 16472162 15637703 14944026 14384921 13925278
3562A3925278l66971k67723j80112j63237l5970m5119l2518k4564N9719L9509
$$ 13925278 13558307 13290584 13110472 12947235 12911265 12866146 12833628 12809064 12868783 12908292
3552A2908292J18847J24078J72268J80041K25778K50576L50726L68893M39075
$$ 12908292 13027139 13151217 13323485 13503526 13729304 13979880 14330606 14699499 15138574
3543A5138574N14662N86046O04193O44258O55922O33717O46230O31669N63962
$$ 15138574 15653236 16239282 16843475 17487733 18143655 18777372 19423602 20055271 20619233
3534B0619233N10886M89593M44033M39105M08015M49887M84685M98529N33118
$$ 20619233 21130119 21619712 22063745 22502850 22910865 23360752 23845437 24343966 24877084
3525B4877084O19087P03494P90056Q45792Q65828P71180O11630M61685K81949
$$ 24877084 25496171 26199665 26989721 27835513 28701341 29472521 30084151 30545836 30827785
3516C0827785R4628m6142j73567l53176m48459n94116o08502o00185n22266l77786
$$ 30827785 30922413 30876271 30702704 30349528 29901069 29306953 28698451 28098266 27576000 27198214
3506B7198214l02415r3711M9952K00094L68796N84785P05228R21344J075012J312404
$$ 27198214 26895799 26802088 26852040 27052134 27420930 28005715 28710943 29632287 30707299 32019703
3496C2019703J515469J798515K058803K475122K909340L595648M349441N389306
$$ 32019703 33535172 35333687 37392490 39867612 42776952 46372600 50722041 56111347
3488E6111347O632964P918479R238308J0317940J0975844J1302002J1170123J0591050
$$ 56111347 62744311 70662790 79901098 90219038 101194882 112496884 123667007 134258057
3480A34258057R666927Q373932P010927N735629M914752M796656N467729O736645
$$ 134258057 143924984 152298916 159309843 165045472 169960224 174756880 180224609 186961254
3472A86961254Q316521R795779J0929923J1521151J1347229J0633740R381720
$$ 186961254 195277775 205073554 216003477 227524628 238871857 249505597 258887317
3465B58887317P553248N148531K149106j030691m050131o558964q318920r193460
$$ 258887317 266440565 271589096 273738202 272707511 268657380 262098416 253779496 244586036
3457B44586036r531916r421241r042060q458295p794843p035552o446388n979405
$$ 244586036 235054120 225632879 216590819 208132524 200337681 193302129 186855741 180876336
3449A80876336n800196n868442o111993o522178p003078p549395q010512q384378
$$ 180876336 175076140 169207698 163095705 156573527 149570449 142021054 134010542 125626164
3441A25626164q639072q681585q521365q248014p794710p252004o622861n945178
$$ 125626164 116987092 108305507 99784142 91536128 83741418 76489414 69866553 63921375
3433F3921375n263190m539460l906608l280610k740095k216842j818829j436319
$$ 63921375 58658185 54118725 50212117 46931507 44191412 41974570 40155741 38719422
3425C8719422j120920p59274m80073j78447J44845M18579P07746R13804J078517
$$ 38719422 37598502 36839228 36359155 36180708 36325553 36744132 37451878 38365682 39444199
3416C9444199J105550J239388J347764J489424J441454J432733J264852Q03242
$$ 39444199 40549749 41789137 43136901 44626325 46067779 47500512 48765364 49568606
3408D9568606L39286O1975j35016k97799l90181m29154l58755l14211j25263L2838
$$ 49568606 49907892 49969867 49834851 49537052 49146871 48717717 48358962 48044751 47919488 47952326
3398D7952326J88353J68643K63077K18809M9673j98594m42759p25468j051376
$$ 47952326 48140679 48309322 48572399 48791208 48840881 48642287 48199528 47474060 46422684
3389D6422684j296869j576755j688243j750873j724326j678232j510298j479271
$$ 46422684 45125815 43549060 41860817 40109944 38385618 36707386 35197088 33717817
3381C3717817j525545j521450j312147j172571j096514r36188q44162p57068o46280
$$ 33717817 32192272 30670822 29358675 28186104 27089590 26153402 25309240 24552172 23905892
3372B3905892m97880m18623l19124l10286k94887l52679l37232l01013k85865
$$ 23905892 23408012 22989389 22670265 22359979 22065092 21712413 21375181 21074168 20788303
3363B0788303k46253k51529j92797j56515j15242j02002q5327p9372j7346l314
$$ 20788303 20542050 20290521 20097724 19941209 19825967 19723965 19638638 19559266 19541920 19538606
3353A9538606J19150J34578J57220J86132L1954n1138j36777j45108j39203j23765
$$ 19538606 19657756 19792334 19949554 20135686 20167640 20116502 19979725 19834617 19695414 19571649
3343A9571649r1387q7130p9324o0460m0948j3440N0722P6854J04544J72082K76260
$$ 19571649 19480262 19393132 19313808 19253348 19212400 19198960 19249682 19326536 19431080 19603162 19879422
3332A9879422L38985M80925O44941Q67968J175078J515140J945711K389393K803142
$$ 19879422 20218407 20699332 21344273 22212241 23387319 24902459 26848170 29237563 32040705
3323C2040705L079708L189966L280892L321328L502608L744719L944948M088309
$$ 32040705 35120413 38310379 41591271 44912599 48415207 52159926 56104874 60193183
3315F0193183M003574L740372L334929K987431K652667K338646K095256J904598
$$ 60193183 64196757 67937129 71272058 74259489 76912156 79250802 81346058 83250656
3307H3250656J774584J650342J530519J261686Q29134K21716m06960j071739j609980
$$ 83250656 85025240 86675582 88206101 89467787 90296921 90518637 90111677 89039938 87429958
3298H7429958k071998k411775k797283l096644l245857l524077l604191l676741
$$ 87429958 85357960 82946185 80148902 77052258 73806401 70282324 66678133 63001392
3290F3001392l728374l765921l760296l753345l765862l683430l552038l362943
$$ 63001392 59273018 55507097 51746801 47993456 44227594 40544164 36992126 33629183
3282C3629183l124734k859193k629672k351334k047336j768670j513577j282207
$$ 33629183 30504449 27645256 25015584 22664250 20616914 18848244 17334667 16052460
3274A6052460j072548q84227p67309o55461n78496m36902l81290l25289k47278
$$ 16052460 14979912 14095685 13328376 12672915 12094419 11657517 11276227 10950938 10703660
3265A0703660k61625k06947j81856j53950j39330j25638j26959p8870l7419j7191
$$ 10703660 10442035 10235088 10053232 9899282 9759952 9634314 9507355 9428485 9391066 9373875
3255I373875P0617J30858J27863J89513K04332K45018K14307K11308J16225R1920
$$ 9373875 9444492 9575350 9703213 9892726 10097058 10342076 10556383 10767691 10883916 10975836
3245A0975836K4304p2888r6282j64121k75476l20793k86254l28727l05833k95173
$$ 10975836 11000140 10927252 10830970 10666849 10391373 10070580 9784326 9455599 9149766 8854593
3235H854593k52971k36262k03539j78931j45764k17614k33425k10421k54973k38778
$$ 8854593 8601622 8365360 8161821 7982890 7837126 7619512 7386087 7175666 6920693 6681915
3225F681915k44684j92633j57032j07211j42524j31523j05522o3694q5341j14459
$$ 6681915 6437231 6244598 6087566 5980355 5837831 5706308 5600786 5537092 5451751 5337292
3215E337292j57714j34856j22664r1593n5910m3113k2799k4521N1139L0110N0958
$$ 5337292 5179578 5044722 4922058 4830465 4774555 4731442 4708643 4684122 4735261 4765371 4816329
3204D816329n800K1279J4284N4498K2909L3049R1415K3614O2033Q5045M9187L6149
$$ 4816329 4810529 4831808 4846092 4900590 4923499 4956548 5047963 5071577 5133610 5218655 5267842 5303991
3192E303991R4682N9429O6020J1011N8805P6594O5109P2558Q1383J03873J00300
$$ 5303991 5398673 5458102 5524122 5535133 5593938 5670532 5735641 5808199 5889582 5993455 6093755
3181F093755J45617J41329J14315O3456M9134l3551l6587j17150j00860r4093
$$ 6093755 6239372 6380701 6495016 6558472 6607606 6574055 6537468 6420318 6319458 6225365
3171F225365j54259q4079r5603j4125K5584J05631J34282J82238J70495Q9669
$$ 6225365 6071106 5987027 5891424 5877299 5902883 6008514 6142796 6325034 6495529 6585198
3161F585198P5475P2649q636K2212N133L3990O1617n18N4685j1350N1812J600
$$ 6585198 6660673 6733322 6724686 6746898 6752031 6786021 6847638 6847120 6901805 6890455 6942267 6943867
3149F943867N8050O7017R0553P3187J19136J15691R2856J68055K09210J85830
$$ 6943867 7001917 7068934 7159487 7232674 7351810 7467501 7560357 7728412 7937622 8123452
3139H123452J33470J81821J04137R4233N3180J32689R8698J35910J79602J88629
$$ 8123452 8256922 8438743 8542880 8637113 8690293 8822982 8921680 9057590 9237192 9425821
3129I425821J91520J84506K59061J57187K52913K53864L32023K97223K94098K04376
$$ 9425821 9617341 9801847 10060908 10218095 10471008 10724872 11056895 11354118 11648216 11852592
3119A1852592K29550J93833K00598J91406K04233K76142K20642L24992L21052
$$ 11852592 12082142 12275975 12476573 12667979 12872212 13148354 13368996 13693988 14015040
3110A4015040L53441L87716M79035M87866N63987N45887N65911O08257O68028
$$ 14015040 14368481 14756197 15235232 15723098 16287085 16832972 17398883 18007140 18675168
3101A8675168O81018P71592Q88719J020777J154215J281484J467554J619058J808708
$$ 18675168 19356186 20127778 21016497 22037274 23191489 24472973 25940527 27559585 29368293
3092B9368293K025037K364912K713593L064668L453573L979384M501071N162657
$$ 29368293 31393330 33758242 36471835 39536503 42990076 46969460 51470531 56633188
3084E6633188N906659O565911P390524Q276340R506520J1363429J4416522J9471498
$$ 56633188 62539847 69105758 76496282 84772622 94279142 105642571 120059093 139530591
3076A39530591K7238317L8067890N1093803O3114282O9504688O6504482N1788022
$$ 139530591 166768908 204836798 255930601 319044883 388549571 455054053 506842075
3069E06842075K7067542k39311k0262495l0852777l5330266l6118423l5898996
$$ 506842075 533909617 533670306 513407811 482555034 447224768 411106345 375207349
3062C75207349l7173262l9202353l9221614l6366876l2134405k8014876k4292062
$$ 375207349 338034087 298831734 259610120 223243244 191108839 163093963 138801901
3055A38801901k0919299j7715746j4825719j1869667r295654p268048n877072
$$ 138801901 117882602 100166856 85341137 73471470 64175816 56907768 51030696
3048E1030696m862180l983583l299308k748939k308802j862093j542823j316438
$$ 51030696 46168516 42184933 38885625 36136686 33827884 31965791 30422968 29106530
3040B9106530j127944j027754j005584q65927q71015p97361p60304p80533p28174
$$ 29106530 27978586 26950832 25945248 25079321 24208306 23410945 22650641 21870108 21141934
3031B1141934p78118p47443p13586o43346o77168n84070o10658n26007n47893
$$ 21141934 20363816 19616373 18902787 18259441 17582273 16998203 16387545 15861538 15313645
3022A5313645m98444m78852m52485l90790l74335l55815m07467l89949m20621
$$ 15313645 14815201 14336349 13883864 13493074 13118739 12762924 12355457 11965508 11544887
3013A1544887l91698l62120l19869l21778l00442l16561l00151k65666l57651
$$ 11544887 11153189 10791069 10471200 10149422 9848980 9532419 9232268 8966602 8608951
3004H608951k90129k65487k45771k28938k03108j77197j95362j70794j79659j57002
$$ 8608951 8318822 8053335 7807564 7578626 7375518 7198321 7002959 6832165 6652506 6495504
2994F495504j23078q5329j49237j43840j42300j19121r5924p1575j18800r5182
$$ 6495504 6372426 6287097 6137860 5994020 5851720 5732599 5636675 5565100 5446300 5351118
2984E351118q5546j32781j71576j85101j75989j84102j77407r9561p4448j1040
$$ 5351118 5265572 5132791 4961215 4776114 4600125 4416023 4238616 4139055 4064607 4053567
2974D053567M5798J977J5804M9329M0832M87j9596p6424j25053j35859j53960
$$ 4053567 4099365 4101342 4117146 4166475 4207307 4207794 4188198 4111774 3986721 3850862 3696902
2963C696902j00298j10339j54059j72357j05174j26824q2806k1544q1632o8773
$$ 3696902 3596604 3486265 3332206 3159849 3054675 2927851 2845045 2823501 2741869 2673096
2953B673096k6675l5234k978k6278j6280R075l3536k6891l4358N390l1309R669
$$ 2673096 2646421 2611187 2608209 2581931 2565651 2574726 2541190 2514299 2479941 2485331 2454022 2463691
2941B463691p204l735o9080o3774r1079j13429m7382n1171p237q726M0104M5862
$$ 2463691 2456487 2452752 2383672 2319898 2228819 2115390 2068008 2016837 2009600 2000874 2040978 2086840
2929B086840L0903K0717p498k1827o0902j14220j25281j00252o2487n2592K063
$$ 2086840 2117743 2138460 2130962 2109135 2048233 1934013 1808732 1708480 1645993 1593401 1595464
2918A595464n0304l1392l884j4796k6887p3881j14668k4548l1m0314j7068L8279
$$ 1595464 1545160 1513768 1509884 1495088 1468201 1394320 1279652 1255104 1255073 1214759 1197691 1235970
2906A235970M5198M7198K4873l4140K8931k4820J2318k3166l6767p2386p2716
$$ 1235970 1281168 1328366 1353239 1319099 1348030 1323210 1335528 1312362 1275595 1203209 1130493
2895A130493n4145n0895n2896p7623J944M017J0021j560P2996J6366O166K776
$$ 1130493 1076348 1025453 972557 894934 896878 900895 910916 909356 982352 998718 1004884 1007660
2883A007660J6300m4209k1282l5852n2255m8625o0887o7555j8159j6974m4620
$$ 1007660 1023960 979751 958469 922617 870362 821737 760850 693295 675136 658162 613542
2872F13542K7031k4633j096L8875j0580k9983M8408N907L7846L97o08j7002j0839
$$ 613542 640573 615940 614844 653719 643139 613156 661564 667471 705317 705714 705106 688104 677265
2859F77265J9657J7497K3162K5167l283k0107k3274l5061k281l5657k7951m5570
$$ 677265 696922 714419 737581 762748 759465 739358 716084 681023 678742 643085 615134 569564
2847E69564j7835k2357l345k2538j9678L9088K1375j6151j8140K8448j9145k5264
$$ 569564 551729 529372 526027 503489 483811 522899 544274 528123 509983 538431 519286 494022
2835D94022q383o257N111p469J6675r834m5345L5765j4653j0323k7933l5679r278
$$ 494022 485639 479382 484493 477024 493699 483865 438520 474285 459632 449309 421376 385697 376419
2822C76419J3900l2776K882K5922J7275k4867r27Q335K122q719p161N584J3591
$$ 376419 390319 357543 360425 386347 403622 378755 377828 386163 388285 379566 372405 377989 391580
2809C91580J4046K9507L2212J3629M3783Q048L0127n483L5566M6543L8308R4346
$$ 391580 405626 435133 467345 480974 524757 532805 562932 557449 593015 639558 677866 772212
2797G72212K8369K8427P5269J00276J11149J89324K04923L08274L35077L50455
$$ 772212 800581 829008 904277 1004553 1115702 1305026 1509949 1818223 2153300 2503755
2787B503755L17452J91250M8317m6542r8921j55347j79380j58300j91013k56253
$$ 2503755 2821207 3012457 3060774 3014232 2915311 2759964 2580584 2422284 2231271 1975018
2777A975018j98707j93948j98671k03152j28085j10545j11779n7989o3888p6775
$$ 1975018 1776311 1582363 1383692 1180540 1052455 941910 830131 772142 708254 631479
2767F31479m3407l1636j4117k3544m6749l6423L2263n0400J4753m3231J468j6071
$$ 631479 588072 556436 542319 518775 472026 435603 467866 417466 432219 388988 390456 374385
2755C74385l7042J2085K8590r992k720k8765j0549m417n0354K0903j2172P768
$$ 374385 337343 349428 378018 368026 365306 336541 325992 321575 271221 292124 279952 287720
2743B87720k5504k2495l5787q511l676K0727k0296J3454Q307n0491J1490L7050
$$ 287720 262216 239721 203934 195423 191747 212474 192178 205632 213939 163448 174938 211988
2731B11988L2279j0896K7767r96K7860j5934K6908o917j4304m0590l999J6885
$$ 211988 244267 233371 261138 260142 288002 272068 298976 292059 277755 237165 233166 250051
2719B50051J9574J8047l4875j0904r518L869l1541o641k8689M3257K961j3010
$$ 250051 269625 287672 252797 241893 232375 236244 204703 198062 169373 212630 215591 202581
2707B02581m0951k5056J5069m477q271L146M1430j6981j8500k2830K5557j6616
$$ 202581 161630 136574 151643 147166 138895 142041 183471 166490 147990 125160 150717 134101
2695A34101L3374j7408l0869L454K9782M627q3133J8088j4187L1698P474O8966
$$ 134101 167475 150067 119198 122652 152434 157061 73928 92016 77829 109527 117001 185967
2683A85967l9501k3975L469o478K6724J9087K9514k9717N2994o0411J4669o1783
$$ 185967 146466 122491 125960 119482 146206 165293 194807 165090 218084 157673 172342 110559
2671A10559K4487J4644n913J9247K2047j5194p3278M4985l3576K6206o0452L5019
$$ 110559 135046 149690 143777 163024 185071 169877 96599 141584 108008 134214 73762 108781
2659A08781l0357J0956k430K6941k1728K7150J0460n1135l627j0222J8600m4797
$$ 108781 78424 89380 86950 113891 92163 119313 129773 78638 75011 64789 83389 38592
2647C8592L0017L193K6386l7047M3393j3632j721q295J0460K7972K820K3705j6357
$$ 38592 68609 71802 98188 61141 104534 90902 89181 80886 91346 119318 122138 145843 129486
2634A29486L3422n2122K1519k9021K9159k4616J8527r641k048o429k9118M7611
$$ 129486 162908 110786 132305 103284 132443 107827 126354 116713 114665 108236 79118 126729
2622A26729k9071J1955J1065J8736l4468M6203k3063j2132m7221j4455j3219P90
$$ 126729 97658 109613 120678 139414 104946 151149 128086 115954 68733 54278 41059 41849
2610D1849k3477r270O5274n6074L5869k1525K0283J073K8942j9381J0267l73l0677
$$ 41849 18372 9102 74376 18302 54171 32646 52929 54002 82944 63563 73830 73457 42780
2597D2780M439L5934J567m0188K3030k4508J7334l2380K1604J2722L6841J6533
$$ 42780 47219 83153 84720 44532 67562 43054 60388 28008 49612 62334 99175 115708
2585A15708j2777M006j1988p68p544N3642m9211J4781q730n976k8327L7967k427
$$ 115708 102931 106937 94949 94181 86637 140279 91068 105849 97119 91143 62816 100783 98356
2572I8356K4608K7739l0826L6516j4935K5959p5960M4846j7630L9337m6213l873
$$ 98356 122964 150703 119877 156393 141458 167417 91457 136303 118673 158010 111797 107924
2560A07924k9212L5690N802j4463R512J2319k0138l3370M4097l1570J8419j7877
$$ 107924 78712 114402 120204 105741 115253 127572 107434 74064 118161 86591 105010 87133
2548H7133L0548l4434K7917p626l574j5617l7731L6646O996J0117o1995n904l196
$$ 87133 117681 83247 111164 103538 99964 84347 46616 83262 90258 100375 38380 32476 29280
2535B9280M8026l3133j287j511Q633k5670K8790j2317K6651O108j4888L5376k5827
$$ 29280 77306 44173 42886 41375 50008 24338 53128 40811 67462 73570 58682 94058 68231
2522F8231J1571p2511L7818R891M4122l3591p973L84l894L585K0816l001m0075
$$ 68231 79802 7291 45109 55000 99122 65531 57558 57942 54048 57633 78449 75448 35373
2509C5373n152K6919L2152k4697k4339J3728k672n376J6305J3821K1948J733j0057
$$ 35373 30221 57140 89292 64595 40256 53984 51312 45936 62241 76062 98010 99743 89686
2496H9686M4229j7192k4465J4068n874j8572j9591J3330j388n63m890q281K911
$$ 89686 133915 116723 92258 106326 100452 81880 62289 75619 74231 73668 68778 60497 63408
2483F3408K257K4142K5320l5552o1M28k211l173R235j4453Q607K4416m2249K3007
$$ 63408 65665 89807 115127 79575 79514 79942 77731 74558 83793 69340 77947 102363 60114 83121
2469H3121o411J8365l4653O7726q368k6998O922J4225l255R2p11j8675M4769k8281
$$ 83121 76710 95075 60422 128148 119780 92782 99704 113929 110674 110766 110055 91380 136149 107868
2455A07868j3464o494J2262m5260M8084n649J0540k1733j7245k3187p867L7923
$$ 107868 94404 87910 100172 54912 102996 97347 107887 86154 68909 45722 37855 75778
2443G5778j6648J7136J905J0844k9290o008K0336L1339k4135K1499k0286j2279
$$ 75778 59130 76266 78171 89015 59725 53717 74053 105392 81257 102756 82470 70191
2431G0191J1463j9844R596J3932K0633k1572j0522R519K0073L414J7228k9969
$$ 70191 81654 61810 71406 85338 105971 84399 73877 83396 103469 106883 124111 94142
2419I4142K6308J8639l0101k5784P387m806L6372L0580j2100j3503L7311o121
$$ 94142 120450 139089 108988 83204 90591 85785 122157 152737 140637 127134 164445 158324
2407A58324m0662l6257m1349J0637j2255L3016J762M6355l2408M0692J5973J9057
$$ 158324 117662 81405 40056 50693 38438 71454 73216 119571 87163 127855 143828 162885
2395A62885l5191K7793Q495J4846l131k7309m7542j1304J0528q267M0584k4893
$$ 162885 127694 155487 163982 178828 175697 148388 100846 89542 100070 91803 132387 107494
2383A07494M331n092J1835R14N3823k1667p220l859L7524j8374p649r534O439
$$ 107494 111825 106733 118568 119482 173305 151638 144418 140559 178083 159709 152060 142526 148965
2370A48965J2298K2099L3436k2662J6162j898L354n459L9777k762j4555J3162
$$ 148965 161263 183362 216798 194136 210298 208400 211754 206295 246072 243310 228755 241917
2358B41917J9609j5527n893Q04o858N973M244L6442k280J5497Q412L6368k8110
$$ 241917 261526 245999 240106 240910 234052 240025 244269 280711 278431 293928 302340 338708 310598
2345C10598m122m825K6918k1208K4174o095J2156J1916M6064J9491L4462P324
$$ 310598 306476 301651 328569 307361 331535 325440 337596 349512 395576 415067 449529 456853
2333D56853K6522J5076M4884L4186K2760N9925J04164O9453M7501Q4107J16126
$$ 456853 483375 498451 543335 577521 600281 660206 764370 833823 881324 965431 1081557
2322A081557J78516J68770K19154K59470K40605J29596J31908P7455J21100J49969
$$ 1081557 1260073 1428843 1647997 1907467 2148072 2277668 2409576 2487031 2608131 2758100
2312B758100K61152L90649N78673Q95178J631624K591085L580095M407563M298357
$$ 2758100 3019252 3409901 3988574 4883752 6515376 9106461 12686556 17094119 21392476
2303B1392476K364539n47939j755652j987671k526818k611488k485254k206467
$$ 21392476 23757015 23209076 21453424 19465753 16938935 14327447 11842193 9635726
2295I635726j969650j763968j327757q00044m80001l36915k74586k34644k67644
$$ 9635726 7666076 5902108 4574351 3774307 3294306 2957391 2682805 2448161 2180517
2286B180517j97369j72607j50883j47070j00531j39928o3925r3929n4535p1653
$$ 2180517 1983148 1810541 1659658 1512588 1412057 1272129 1208204 1114275 1059740 988087
2276I88087m2773k3821n5906k4835q082k2389l6030l7845l7463m4299j648L310
$$ 988087 945314 921493 865587 840752 832670 810281 774251 736406 698943 654644 652996 656306
2264F56306k8992J3893p4472M784l2511k2241m4949m2577L1015O053j0253l2955
$$ 656306 627314 641207 566735 571519 539008 516767 471818 429241 460256 466309 456056 423101
2252D23101k4547J074K001l3557Q94r406j7090j5406j493j4170K4712k6633j5398
$$ 423101 398554 399628 401629 368072 368966 359560 342470 327064 325571 311401 336113 309480 294082
2239B94082K1706O202l3617l2073j2120k811l541k8629o857j2898K4649o636O363
$$ 294082 315788 321990 288373 256300 244180 241369 237828 209199 202342 189444 214093 207457 213820
2226B13820l7850R192Q322J356J2820J2627J57L61m2425j7534J2203k4023l2183
$$ 213820 175970 185162 193484 194840 207660 220287 220444 220805 178380 160846 173049 149026 116843
2213A16843J4538J8884R22N173j9896j9210O091J3770K0626o561j3113K5272m122
$$ 116843 131381 150265 151187 156360 136464 117254 123345 137115 157741 151180 138067 163339 159217
2200A59217l9098J1619k0703K5708n3132J221L8928P516j7373k0972l0742J6209
$$ 159217 120119 131738 111035 136743 83611 84832 123760 131276 113903 92931 62189 78398
2188G8398J9924N236J1481j4006Q348m705k9634J4017n081L2963J825k4848Q023
$$ 78398 98322 103558 115039 101033 109381 104676 75042 89059 83978 116941 118766 93918 101941
2175A01941J0840l6825k9018J5030J1908r064j0992Q210N493m938k6337M0404
$$ 101941 112781 75956 46938 61968 73876 64812 53820 62030 67523 62585 36248 76652
2163G6652j1142J048l939N1760j1209J453j6925J0800j5422j5607j0167m4252
$$ 76652 65510 66558 62619 114379 103170 104623 87698 98498 83076 67469 57302 13050
2151A3050M9463K8547l3177l4978K4178k986N780j7237K3199j9559L5499M17j7019
$$ 13050 62513 91060 57883 22905 47083 44097 49877 32640 55839 36280 71779 72196 55177
2138E5177p807j5703K79k3465O4467p944L4990l3301k335m3573L029j683J5132
$$ 55177 47370 31667 31946 8481 72948 65004 99994 66693 64358 20785 23814 22131 37263
2125C7263P246j2894p493n538m621k9483N1595Q281Q902r530r270M477J2493k0467
$$ 37263 44509 31615 24122 18584 13963 -15520 36075 44356 53258 43728 34458 38935 51428 30961
2111C0961k43K6451j9222j9894K621R406k2383K8422j4829K5166m4583n340N442
$$ 30961 30718 57169 37947 18053 20674 30080 7697 36119 21290 46456 1873 -3467 1975
2098A975J5138K7039n959r429k6002K1070j8149L6000k9333L867j5479J2813J3799
$$ 1975 17113 44152 38193 28764 2762 23832 5683 41683 12350 16217 738 13551 27350
2085B7350k6991J8243q304p465l9204K8635p337N684l4170L8898j0829k6789K8464
$$ 27350 359 18602 10298 2833 -36371 -7736 -15073 -9389 -43559 -4661 -15490 -42279 -13815
2072a3815J5241k369n83N436J1575K4750k6160j7318l6215K8975j8914O0612m2520
$$ -13815 1426 -943 -1526 3910 15485 40235 14075 -3243 -39458 -10483 -29397 31215 -11305
2059a1305L5925k0769N767k9797k1318M868J3095M0551k1010J1407k6260P463
$$ -11305 24620 3851 9618 -20179 -41497 -36629 -23534 17017 -3993 7414 -18846 -11383
2047a1383l3643N4958J131K1330j302J830m767j5747O378j0371O1507K222N5332
$$ -11383 -45026 9932 11063 32393 31091 32921 28154 12407 18785 8414 69921 72143 127475
2034A27475k0247J7987j1427n877m0889r526j8672j2105o192J4862J2699k3211
$$ 127475 107228 125215 113788 107911 67022 57496 38824 26719 20527 35389 48088 24877
2022B4877R682m6567O1148j5671P986j9379j5307k2061L0680O750Q308P755m6610
$$ 24877 34559 -12008 49140 33469 41455 22076 6769 -15292 15388 22138 30446 38201 -8409
2009h409M1377r768m568n03j2812K592J0301k6237L82L8787l215j9746O939K1852
$$ -8409 32968 23200 18632 18129 5317 7909 18210 -8027 -7645 31142 27927 8181 15120 36972
1995C6972m6156K0556K8539J1785l9159o789M2783j7116o564Q312m206l2912K9741
$$ 36972 -9184 11372 39911 51696 12537 5748 48531 31415 24851 33163 28957 -3955 25786
1982B5786n860J3405m536j2687k5311K6220L715n844q181J9844p223L0330K4442
$$ 25786 19926 33331 28795 16108 -9203 17017 20732 14888 6707 26551 19328 49658 74100
1969G4100m8604J1616k4910J0216n460M368m8688L8584n647j180P352m6210J4965
$$ 74100 25496 37112 12202 22418 16958 21326 -27362 11222 5575 4395 11747 -34463 -19498
1956a9498L5711n1199M700P5440j4107j874k461m154K484k0651r634Q926j3049
$$ -19498 16213 -34986 -30286 45154 31047 29173 26712 22558 25042 4391 -5243 3683 -9366
1943i366j1913M203K1812O022j9841K2259O257k4741k2979o0K6669J1693J9039
$$ -9366 -21279 -17076 4736 10758 -9083 13176 19433 -5308 -28287 -28347 -1678 10015 29054
1930B9054j5925j0955J8476J478J7881l3710J1301k3753M9037J2350o021m6530
$$ 29054 13129 2174 20650 22128 40009 6299 17600 -6153 42884 55234 49213 2683
1918B683J7359j9614l0919K8221J9429n740k0072L6845n5034N187j7061M5938
$$ 2683 20042 428 -30491 -2270 17159 11419 -8653 28192 -26842 -21655 -38716 7222
1906G222r164L6223P39k1535l1030j4904k5523o588M5905N7123k4460l8234K2535
$$ 7222 -1942 34281 35020 13485 -17545 -32449 -57972 -64560 -18655 38468 14008 -24226 -1691
1893a691K616p082n3117M9054O677K981O23J3195k2432L1093K8635o137J3572
$$ -1691 925 -6157 -59274 -10220 -3543 -562 61 13256 -9176 21917 50552 44415 57987
1880E7987l2640m469K778K5919k8701J237j666L9939l4472m608n069J1260r13
$$ 57987 25347 20878 23656 49575 20874 22111 20445 60384 25912 21304 16235 27495 26582
1867B6582R303j638k2724Q386k6092n865R220K8999R709J6636m5581j1515K245
$$ 26582 35885 34247 11523 19909 -6183 -12048 -2828 26171 35880 52516 6935 -4580 -2335
1854b335J1856J1581j0503K5302Q907J6312j7522k011k6816j8974k930k4245m48
$$ -2335 9521 21102 10599 35901 44808 61120 43598 41587 14771 -4203 -7133 -31378 -31826
1841c1826n551M7601k2294L1904m6177L6491l3266l4155P308L8611J1756l0866
$$ -31826 -37377 10224 -12070 19834 -26343 10148 -23118 -57273 -49965 -11354 402 -30464
1829c0464L765k4434L3309j2597L4652l9670r091O373P2083m1294k2654K7230
$$ -30464 -26699 -51133 -17824 -30421 4231 -35439 -44530 -38157 33926 -7368 -30022 -2792
1817b792M9340k3204m7116j201k5506N0064J3919O1897k0661r535m4664K2338
$$ -2792 46548 23344 -23772 -24973 -50479 -415 13504 75401 54740 45205 541 22879
1805B2879m964j9853j1538j574k203M64M0601j2475K0137m1209L2099l6408R148
$$ 22879 17915 -1938 -13476 -15050 -17253 -16789 23812 11337 31474 -9735 22364 -14044 -4896
1792d896j3805L4743o941K2797L3439M076j9672k6050L1034l9770o406r20L6251
$$ -4896 -18701 16042 9101 31898 65337 69413 49741 23691 54725 14955 8549 7629 43880
1779D3880k9441N880l534n12j8406j0462K2537J0334L857P136R254k6905J4632
$$ 43880 14439 20319 16785 16273 -2133 -12595 9942 20276 24133 31269 40523 13618 28250
1766B8250K12P972N322k0482l0801L2342K1611l0160j6406k3173K9896l5142K8608
$$ 28250 28462 36434 41756 21274 -9527 22815 44426 14266 -2140 -25313 4583 -30559 -1951
1753a951n572M0930j7571j7184Q181K7521L63j2912R052m9348J9330m5258K7754
$$ -1951 -7523 33407 15836 -1348 6833 34354 34717 21805 30857 -18491 839 -44419 -16665
1740a6665K3289J794j9066K1409l9859J9812J3799J5572o621j5843L0133k003
$$ -16665 6624 8418 -10648 10761 -29098 -9286 4513 20085 13464 -2379 27754 25751
1728B5751o842j9305N6188m9055p877k4864J8726j5758n472K1457K9991l6198
$$ 25751 18909 -396 55792 6737 -1140 -26004 -7278 -23036 -28508 -7051 22940 -13258
1716a3258L9447k4154m015J8444l9650j9074l3776K9949j3889K8304Q672J847
$$ -13258 26189 2035 -1980 16464 -23186 -42260 -76036 -46087 -59976 -31672 -23000 -21153
1704b1153r070J0185Q868K419n572p156K9741J7439M588j871r921Q045R480k2467
$$ -21153 -30223 -20038 -11170 -8751 -14323 -21479 8262 25701 30289 28418 18497 26542 36022 13555
1690A3555p207k2198m834P059K4219M2778j8387l4147n866K3493l207Q971j2846
$$ 13555 6348 -15850 -20684 -13625 10594 53372 34985 838 -5028 18465 15258 24229 11383
1677A1383l909j7246J9034k6708Q866q866O4387j9871j7417p994l222J5682n250
$$ 11383 7474 -9772 9262 -17446 -8580 -17446 46941 27070 9653 1659 -1563 14119 8869
1664H869q384M487J369k6140r647K1431O558l5843L2424k9279Q509L5883K239
$$ 8869 485 4972 6341 -19799 -29446 -8015 -1457 -37300 -4876 -34155 -25646 10237 12476
1651A2476j2589r717o663k0060O132l288L6174J9913k0001k1693J3919L125K8501
$$ 12476 -113 -9830 -16493 -36553 -30421 -33709 2465 22378 2377 -19316 -5397 -2272 26229
1638B6229O220l0255j9358q7K909J9249N1242k673j3016j8189M353m147K1809
$$ 26229 32449 2194 -17164 -17251 -14342 4907 56149 53476 40460 22271 26624 22477 44286
1625D4286m992j1338m931j4048J2664r637n42j5137j7122Q214j2660L1046J7524
$$ 44286 39294 27956 23025 8977 21641 12004 11462 -3675 -20797 -12583 -25243 5803 23327
1612B3327J6784m8285j5081O737M1477o880j8794j4834L1333R459J1827k2378
$$ 23327 40111 -8174 -23255 -16518 24959 18079 -715 -15549 15784 25243 37070 14692
1600A4692m870J6044J2655k2180p642J0846j4211K2096r905J7661k0333l0872
$$ 14692 9822 25866 38521 16341 8699 19545 5334 27430 17525 35186 14853 -16019
1588a6019k5897M3775j7256K8078j6793N209K0580j6546j1098k3291k478K6229
$$ -16019 -41916 1859 -15397 12681 -4112 1097 21677 5131 -5967 -29258 -31736 -5507
1576e507R819m2658L3349j9899M4210o881J3993k1910k7615k2740L4116J3317
$$ -5507 4312 -38346 -4997 -24896 19314 12433 26426 4516 -23099 -45839 -11723 1594
1564A594k5328K1236l5784M5214j2493k7805k3221N2329j2271L8056k9319J558
$$ 1594 -23734 -2498 -38282 6932 -5561 -33366 -56587 -4258 -16529 21527 -7792 -6234
1552f234J8886j0937R550m2750L1622Q831J1165m4253M688j6664J525k368L6623
$$ -6234 12652 1715 11265 -31485 137 8968 20133 -24120 -19432 -36096 -34571 -36939 -316
1539c16j9906k5847K6651R43j2465K6925L6831l3455M9446l8097k6230O17J3055
$$ -316 -20222 -46069 -19418 -18475 -30940 -4015 32816 -639 48807 10710 -15520 -14903 -1848
1526a848R410n081p319j9846J7207k6340K6870k0579o036l7448N6114L3384J515
$$ -1848 7562 2481 -4838 -24684 -7477 -33817 -6947 -27526 -33562 -71010 -14896 18488 20003
1513B0003k6131J1380R343k5440j7546j8650J9326j6994J6252j8678N7864l5325
$$ 20003 -6128 5252 14595 -10845 -28391 -47041 -27715 -44709 -28457 -47135 10729 -24596
1501b4596J5057L025M6276n0087j6605K402M723J6419p597j0929N388J5766k7002
$$ -24596 -9539 -6514 39762 -10325 -26930 -24528 -19805 -3386 -10983 -21912 -16524 -758 -27760
1488b7760M6586k1571k659k0829k9506K7746K0609J105k728J5898K251m25k8798
$$ -27760 18826 -2745 -5404 -26233 -55739 -27993 -7384 -6279 -9007 6891 9142 8717 -20081
1475b0081K8626n1732K3786n001o86r21P207m0601J2958N2326K4793N567j8205
$$ -20081 8545 -43187 -19401 -24402 -25088 -26009 -18802 -59403 -46445 5881 30674 36241 18036
1462A8036j9100k2551O2778l4424O0373k8990J5726l0319j8728l08J5965j430
$$ 18036 -1064 -23615 39163 4739 65112 36122 51848 21529 2801 2493 18458 17028
1450A7028j2568J4931r410q627j6573M1047q675M77L497P22k2097m754j2581p480
$$ 17028 4460 19391 9981 1354 -15219 25828 17153 17630 21127 21849 -248 -5002 -17583 -25063
1436b5063M7265n454K8141j2945k6003j4016K1862o449j0887j7044J7266k495
$$ -25063 22202 16748 44889 31944 5941 -8075 13787 7338 -3549 -20593 -3327 -5822
1424e822J225k1797J281K0751Q294J9671k9268o223J0338k379M704O4634p2712
$$ -5822 -4597 -26394 -25113 -4362 3932 23603 -5665 -11888 -1550 -3929 775 65409 -7303
1411g303j0312M2571k9875J5623J337L565j5792J1271r032K8141R492J0568j3286
$$ -7303 -17615 24956 -4919 10704 12041 15606 -186 11085 2053 30194 39686 50254 36968
1398C6968R461p847O900k57k2709k695J4701J9759k7532J8875r552p491m2111
$$ 36968 46429 38582 45482 45225 22516 19821 34522 54281 26749 45624 36072 28581 -13530
1385a3530L6661k2055q118l798k2607L2864j24k4574K5976J4220j7156j5171j3266
$$ -13530 23131 1076 -7042 -10840 -33447 -583 -707 -25281 695 14915 -2241 -17412 -30678
1372c0678J9864P522J7295j8231P912L682j2198j1524J508L5009j1855j5003J8259
$$ -30678 -10814 -3292 14003 -4228 3684 7366 -4832 -16356 -14848 20161 8306 -6697 11562
1359A1562J442m1276J1456p831K5387j0380R733q190K3895L48k2240Q273k0933
$$ 11562 13004 -28272 -16816 -24647 740 -9640 93 -8097 15798 16146 -6094 2179 -18754
1346a8754k84l364L0489R281K8164j3417Q902m1411j6754K0090K1606J1310o788
$$ -18754 -19038 -22402 8087 17368 45532 32115 41017 -394 -17148 2942 24548 35858 29070
1333B9070k6785o027j0184k7302O0959P870j8274k0285L1313m071L481Q717O231
$$ 29070 2285 -3742 -13926 -41228 19731 27601 9327 -10958 20355 16284 19765 28482 34713
1320C4713j469j1723o033j8193L7798k0323n577j9314L0292j7382q73l3113K4561
$$ 34713 33244 21521 15488 -2705 35093 14770 9193 -10121 20171 2789 1916 -31197 -6636
1307f636L4074q0274j697K4032K364k1907J398P910L9528j6448R274n219K4299
$$ -6636 27438 -52836 -54533 -30501 -28137 -50044 -48646 -40736 -1208 -17656 -8382 -13601 10698
1294A0698j0012j0107l643j6098L62n79K4415l9160N0608j7537P369k2877K0583
$$ 10698 686 -9421 -13064 -29162 -28800 -29379 -4964 -44124 6484 -11053 -3684 -26561 -5978
1281e978r0p078R613M279J3111l0601K8128j5050M9916k3360J138l9142L1766
$$ -5978 -6068 -13146 -3533 746 13857 -16744 11384 -3666 46250 22890 24028 -15114 16652
1268A6652l9298n893J5240L3029j9525l1619K0198j0101J5814k4591K4691j2290
$$ 16652 -22646 -28539 -13299 19730 205 -31414 -11216 -21317 -5503 -30094 -5403 -17693
1256a7693n367j9552K3758l599M9743m3489K610J7376J4036J1495m0696O954k3397
$$ -17693 -23060 -42612 -18854 -22453 27290 -16199 -13589 3787 17823 29318 -11378 -4424 -27821
1243b7821J3211R526K7398m4276N69k5042M6015j6698k5335Q544J4256K6674l8191
$$ -27821 -14610 -5084 22314 -21962 -21393 -46435 -420 -17118 -42453 -33909 -19653 7021 -31170
1230c1170K2498Q304L1362m8029J154k7111K9315k7167j0151K8479Q832K1744
$$ -31170 -8672 -368 30994 -17035 -15881 -42992 -13677 -40844 -50995 -22516 -13684 8060
1218H060j3523K5856j3677r270k9310L7246J4752q288J0796k8759O355N251j2287
$$ 8060 -5463 20393 6716 -2554 -31864 5382 20134 11846 22642 -6117 238 5489 -6798
1205f798j8518N6534j5700j5141k760J8205Q600k073l7965K5502L962k7453K8618
$$ -6798 -25316 31218 15518 377 -2383 15822 24422 22349 -15616 9886 13848 -13605 15013
1192A5013m4945L3254j8060K1641l6786k510Q776l805N888K2536k1587r001N469
$$ 15013 -29932 3322 -14738 6903 -29883 -32393 -23617 -27422 -21534 1002 -20585 -29586 -24117
1179b4117j4700K6202P459K9045m7027K3352P997K6862l5545j8204r206J6492
$$ -24117 -38817 -12615 -5156 23889 -23138 214 8211 35073 -472 -18676 -27882 -11390
1167a1390l047l1527K8756J0927L9298n1402J8405j6889q468J0471R415k3094
$$ -11390 -14437 -45964 -17208 -6281 33017 -18385 20 -16869 -25337 -14866 -5451 -28545
1155b8545l39K269L8045M495j3995m056m1217M9449l1331L7729j7457j5193j7706
$$ -28545 -28884 -26615 11430 15925 1930 -2126 -43343 6106 -25225 12504 -4953 -20146 -37852
1142c7852R054K2325J3032k0382j2666K0225k4595M7497r492K5933j5705j407
$$ -37852 -28798 -6473 6559 -13823 -26489 -6264 -30859 16638 7146 33079 17374 15967
1130A5967n526M992l1445J1778L4962l7681R181j4000K4973O784K1603l5367k8376
$$ 15967 10441 15433 -16012 -4234 30728 -6953 2228 -11772 13201 19985 41588 6221 -22155
1117b2155j4595j5045K9701K278L32n60J4544j4791j9477J0032M0081k4914K7263
$$ -22155 -36750 -51795 -22094 -19816 -19484 -20044 -5500 -20291 -39768 -29736 10345 -14569 12694
1104A2694M206m972Q158O402R971j3115J8296j8575L0894o5356K9543K984p821
$$ 12694 16900 11928 20086 26488 36459 23344 41640 23065 53959 -11397 18146 21130 13309
1091A3309j6865p723q423K026J5676j5890J7538k6119K985j6586M6040r981M7241
$$ 13309 -3556 -11279 -19702 -17676 -2000 -17890 -352 -26471 -23486 -40072 5968 -4013 43228
1078D3228m2002O825k591K5349j6037n430K923j7451M4642M085l4567l1233N0745
$$ 43228 1226 8051 5460 30809 14772 9342 12265 -5186 39456 43541 8974 -22259 28486
1065B8486n3897J1371J7438j4998o157L8405Q548l3220J4213J7083k1197n212
$$ 28486 -25411 -14040 3398 -11600 -17757 20648 29196 -4024 10189 27272 6075 863
1053H63j096j2712N0714j6100k0714k7078l0134J1603J1050K2202m1048K5319
$$ 863 -233 -12945 37769 21669 955 -26123 -56257 -44654 -33604 -11402 -52450 -27131
1041b7131m270K9306p831o351l7938M0867L1718J1752k9194l1607J1774k6776
$$ -27131 -31401 -2095 -9926 -16277 -54215 -13348 18370 30122 928 -30679 -18905 -45681
1029d5681M4835k5480J663O33L6334k4725j7572j894K3635Q524K5608j8974l4270
$$ -45681 -846 -26326 -24663 -24030 12304 -12421 -29993 -31887 -8252 272 25880 6906 -27364
1016b7364J4654m104O91P803K6830j2843l611O624p099j6108o347J0930p978j5457
$$ -27364 -12710 -16814 -16123 -8320 18510 5667 2056 8680 1581 -14527 -20874 -9944 -17922 -33379
1002c3379j1339M8045R234k910m0987L3624P922p846M4724l5646o035o946p127
$$ -33379 -44718 3327 12561 9651 -31336 2288 10210 2364 47088 11442 5407 -1539 -8666
989h666k578K4002j1959j3984j4997K1823P042K9208j4154j4983N767O826j1004
$$ -8666 -11244 12758 799 -13185 -28182 -6359 683 29891 15737 754 6521 13347 2343
976B343l9828K3436J9648K2833j1085n4090l3449M4489q199L0230k1875l0341
$$ 2343 -37485 -14049 5599 28432 17347 -36743 -70192 -25703 -33902 -3672 -25547 -55888
964e5888K1596k3785N1753L663K9661l6278R599L963J1851k962p850l5125K2762
$$ -55888 -34292 -58077 -6324 -2661 27000 -9278 321 4284 16135 13173 5323 -29802 -7040
951g040j0306o691R400Q421J1752l9032J7816n21N1321j0277P359j0565j600m0263
$$ -7040 -17346 -24037 -14637 -6216 5536 -33496 -15680 -16201 35120 24843 32202 21637 20037 -20226
937b0226o881K9101K5426m592j5628J3146j0238l587j3684J695P982J2913j334
$$ -20226 -27107 1994 27420 22828 7200 20346 10108 6521 -7163 -5468 2514 15427 14093
924A4093k7628J5844J4758R165j8890j3902l400K3923k0393O752J1871M2737k7020
$$ 14093 -13535 2309 17067 26232 7342 -6560 -9960 13963 -6430 322 12193 54930 27910
911B7910n1874J3604J0982O327j9300L1611k4948j4177J3860l039J1430q64l6239
$$ 27910 -23964 -10360 622 6949 -12351 19260 -5688 -19865 -6005 -9044 2386 1522 -34717
898c4717Q354K8756P167j5991j2031M610O306J2832J4782j9409p430Q426J7656
$$ -34717 -26363 2393 9560 -6431 -18462 -13852 -7546 5286 20068 659 -6771 1655 19311
885A9311j2019j954J3040J3976j587m0031P685N9495k9114j9858j6652k891O989
$$ 19311 7292 5338 18378 32354 30767 -9264 -1579 57916 28802 8944 -7708 -10599 -3610
872c610M427K0494l4558R372j9626J8576K7829K16k9077j4105k6185J6080P193
$$ -3610 817 21311 -13247 -3875 -23501 -4925 22904 23120 -5957 -20062 -46247 -30167 -22974
859b2974K6337K0139p224j3368J2115J4899n6124j5828J6437k1599n930O9333
$$ -22974 3363 23502 16278 2910 15025 29924 -26200 -42028 -25591 -47190 -53120 16213
847A6213J1827k1501j9148q457K9183l2079O288j7901l175J775J4106J3695j5274
$$ 16213 28040 6539 -12609 -21066 8117 -23962 -17674 -35575 -38750 -36975 -22869 -9174 -24448
834b4448L9133m956J6056k3733k309j3705K2864J6244j6181k1717P996K2885Q646
$$ -24448 14685 9729 25785 2052 -257 -13962 8902 25146 8965 -12752 -4756 18129 26775
821B6775k1344N83J8134k4599j2463J6435K7142j9403m801j0598J5872p554j9349
$$ 26775 5431 6014 24148 -451 -12914 3521 30663 11260 6459 -4139 11733 4179 -15170
808a5170J8759m6092K6073j90M4812j3879j1128N174K9330J926k9051L384M1934
$$ -15170 3589 -42503 -16430 -16620 28192 14313 3185 8359 37689 39615 10564 13948 55882
795E5882k1879l493j1955l5641O8935k5447N4264k6720r558n2028R45R523R298
$$ 55882 34003 30510 18555 -17086 51849 26402 80666 53946 44388 -7640 -6695 2828 12126
782A2126J160p769m112k402L1629l4045p094m780K3802L385o033l7301M6279k8041
$$ 12126 13286 5517 1405 -997 30632 -3413 -10507 -15287 8515 11900 5867 -31434 14845 -13196
768a3196L799k537k1711J1655P961K3366l737J5911m3720K8065J0983L6395m8539
$$ -13196 -9397 -11934 -33645 -21990 -14029 9337 5600 21511 -22209 5856 16839 53234 4695
755D695P276j5082l361j8135N359J7122l5948K1253k2750L5491j1600L594n148
$$ 4695 11971 -3111 -6472 -24607 -19248 -2126 -38074 -16821 -39571 -4080 -15680 -12086 -17234
742a7234K0717n588J8902k532j486o100k9820J0516j5369N4186r734J4939l0524
$$ -17234 3483 -2105 16797 14265 12779 6679 -23141 -12625 -27994 26192 16458 31397 873
729H73K5062p060M003k5333k6204L9620p810M5962l0596j8670p853N3739n6856
$$ 873 25935 18875 22878 -2455 -28659 10961 3151 49113 18517 -153 -8006 45733 -11123
716a1123J7056J6610j8925K2475P350j9770k1104M7236k1395N1584n2314r733
$$ -11123 5933 22543 3618 26093 33443 13673 -7431 39805 18410 69994 17680 7947
704G947l2461p384k8832K8846J4002j6960L2496p672K4507n0646K4862m3650N6584
$$ 7947 -24514 -31898 -60730 -31884 -17882 -34842 -2346 -10018 14489 -36157 -11295 -54945 1639
691A639K2323J1009q1450K9160J1294J6532K6429j5435j6116p089J6974n6443
$$ 1639 23962 34971 -46479 -17319 -6025 10507 36936 21501 5385 -1704 15270 -41173
679d1173M8192o646J0192o1337L0097J9173P159k5954p232M251j5312K9778o918
$$ -41173 7019 373 10565 -50772 -20675 -1502 5657 -20297 -27529 -23278 -38590 -8812 -15730
666a5730m261n938L1543k0836L0552k2534j3338J6384J7225k5192p515M3783l9305
$$ -15730 -19991 -25929 5614 -15222 15330 -7204 -20542 -4158 13067 -12125 -19640 24143 -15162
653a5162J0374r620K0406k1754K5720Q043j8264Q989j8502M190n351R214M475
$$ -15162 -4788 -14408 5998 -15756 9964 18007 -257 8732 -9770 -5580 -10931 -1717 2758
640B758n087j5292M829R260L0879o332p408r717J6976k4727j4265M3577J6892
$$ 2758 -2329 -17621 -12792 -3532 27347 21015 13607 3890 20866 -3861 -18126 25451 42343
627D2343q865m5712J543n258M309k3319L1961n648O2243k1593k9259K369l5429
$$ 42343 33478 -12234 -10691 -15949 -11640 -34959 -2998 -8646 53597 32004 2745 5114 -30315
614c0315K2356Q786J8990l2742K2665l4276J3443k9535M9226j1511q198J8094
$$ -30315 -7959 827 19817 -12925 9740 -24536 -11093 -40628 8598 -2913 -11111 6983
602F983k5479M6653r261J2951k6814j5497k6089K5461L010k9337m778M8082K306
$$ 6983 -18496 28157 18896 31847 5033 -10464 -36553 -11092 -8082 -37419 -42197 5885 8191
589H191n9271J7328J4537J6066J0645n8k3058K5373K808j0821j2106n410O03M7965
$$ 8191 -51080 -33752 -19215 -3149 7496 7438 -15620 9753 12561 1740 -10366 -15776 -15173 32792
575C2792j0546k5173Q022J3669R859k6276J0558k833j1794p469J5167J0527m4729
$$ 32792 22246 -2927 5095 18764 28623 2347 12905 10072 -1722 -9191 5976 16503 -28226
562b8226K9822M3940j4692n256j2880N546j5593j9183L281K4017K1175L488l2359
$$ -28226 1596 45536 30844 25588 12708 18254 2661 -16522 -13241 10776 31951 35439 3080
549C080L5458k4295j0352k0171m800l910L0160j906p335L8349j7240K7053J2246
$$ 3080 38538 14243 3891 -16280 -21080 -24990 5170 3264 -4071 34278 17038 44091 56337
536E6337j6814k826k46j8576p68k8166J4067J2515R570n2543k0827k1282K8274
$$ 56337 39523 36697 36451 17875 17107 -11059 3008 15523 25093 -27450 -48277 -69559 -41285
523d1285K8956J0978l754j8416l234L7457J8894n3764M8470k6673P353k1459q116
$$ -41285 -12329 -1351 -5105 -23521 -26755 10702 29596 -24168 24302 -2371 4982 -16477 -24593
510b4593p368Q169r333l030J8651K032Q985M3755j0407k1665k2788p115J618k5891
$$ -24593 -31961 -23792 -33125 -36155 -17504 -15472 -6487 37268 26861 5196 -17592 -24707 -23089 -48980
496d8980J6353L8669R546n368L5225j7967k8123K6939k9033J000L724j5219K0223
$$ -48980 -32627 6042 15588 10220 45445 27478 -645 26294 -2739 -1739 1985 -13234 6989
483F989M426J4266k1194J1637k4606K6858Q496m2568j9953K1050J8374L1389j3261
$$ 6989 11415 25681 4487 16124 -8482 18376 26872 -15696 -35649 -14599 3775 35164 21903
470B1903k6557p298J9725J6786K2790r947l0667l64L381j5792j1589L351O534
$$ 21903 -4654 -11952 7773 24559 47349 37402 6735 6371 9752 -6040 -17629 -14278 -7744
457g744L3380K897j2721l1555q995L0303O961J94j6749L0538J8233M721n5172
$$ -7744 25636 28533 15812 -15743 -24738 5565 12526 12720 -4029 26509 44742 49463 -5709
444e709n507J9633J2975k9559m357M502m6854L8502J4389J7105j076k0288j5933
$$ -5709 -11216 8417 21392 -8167 -12524 -8022 -54876 -16374 -1985 15120 14044 -6244 -22177
431b2177N4902J0530m4810k8517L995L0619O725l568k336J4621k1755n279k1426
$$ -22177 32725 43255 -1555 -30072 -26077 4542 11267 7699 5363 19984 -1771 -7050 -28476
418b8476j0455L4756o136j0992M886K8224j0163j0931j3632K507O875K3399K0053
$$ -28476 -38931 -4175 -10311 -21303 -16417 11807 1644 -9287 -22919 -20412 -13537 9862 29915
405B9915j3278m0790o107K3253j6916K2698j3526J2689J0412J6896J2476o2k4631
$$ 29915 16637 -24153 -30260 -7007 -23923 -1225 -14751 -2062 8350 25246 37722 37660 13029
392A3029n488J1081o898k1381m340L8072N767m311o621l1453R591J9522L098J5638
$$ 13029 7541 18622 11724 -9657 -13997 24075 29842 25531 18910 -12543 -2952 16570 19668 35306
378C5306l3717K2593j6079k8581j4135K8201L7113P279r012j3017j431k6844k7097
$$ 35306 1589 24182 8103 -20478 -34613 -6412 30701 37980 28968 15951 14520 -12324 -39421
365c9421J5886L4162J7753o748j0932j8464R151J7986k1684j0771j192J3800j0959
$$ -39421 -23535 10627 28380 21632 10700 -7764 1387 19373 -2311 -13082 -14274 -474 -11433
352a1433j2328J4496j0746K4484j5257j0186J1474j9822m4400L4195J3589j4819
$$ -11433 -23761 -9265 -20011 4473 -10784 -20970 -9496 -29318 -73718 -39523 -25934 -40753
340d0753Q517L6977K7769j9775k3458K021p791j962P383J5929M456p591K0732
$$ -40753 -32236 4741 32510 12735 -10723 -8702 -16493 -18455 -11072 4857 9313 1722 22454
327B2454j4306j824L3282K663j6158j2131j6283J9483R91j3125k0114J4557j634
$$ 22454 8148 6324 39606 42269 26111 13980 -2303 17180 18171 5046 -15068 -511 -2145
314b145j056O388j3951M2265M630j0580r635K2977l0461l900J0159j9696J9181
$$ -2145 -3201 3187 -10764 31501 36131 25551 15916 38893 8432 4532 14691 -5005 14176
301A4176k92j1503j6774J2635r037J997L9690P469l1553J1741r499j4875j452
$$ 14176 13884 2381 -14393 -1758 -10795 -8798 30892 38361 6808 18549 9050 -5825 -7277
288g277Q920j2232k0804L346K0903J3930J4692j595k8685l7747M1056j1570N58
$$ -7277 1643 -10589 -31393 -28047 -7144 6786 21478 19883 -8802 -46549 -5493 -17063 -16505
275a6505r369J1083O199K3464r92j0164q665K0685J3434j7766l118k3698K2059
$$ -16505 -25874 -14791 -8592 14872 13880 3716 -4949 15736 29170 11404 8286 -15412 6647
262F647o268P467k2361K8720k2899R809L811m815l696J2071K5795l728K9192j9643
$$ 6647 379 7846 -14515 14205 -8694 1115 4926 111 -3585 8486 34281 30553 59745 40102
248D0102N123k0015k2824k825L6187m6226L3015k005k213J1565l3684j3069J7987
$$ 40102 45225 25210 2386 -439 35748 -10478 22537 20532 18319 29884 -3800 -16869 1118
235A118m290j397Q651l2410j0897o820K9966J4048N5011m9436J1738k4146q623
$$ 1118 -3172 -4569 4082 -28328 -39225 -46045 -16079 -2031 52980 3544 15282 -8864 -17487
222a7487j3361k3007N2070r874J5040m7456M399K7593j1082J5037n986j0586L2562
$$ -17487 -30848 -53855 -1785 -11659 3381 -44075 -39676 -12083 -23165 -8128 -14114 -24700 7862
209G862J6686K100l1730K9409k1346J3932Q324k3789R704l1669J9185L9026k1290
$$ 7862 24548 26648 -5082 24327 2981 16913 25237 1448 11152 -20517 -1332 37694 16404
196A6404k0299K5203j3999l191J7065O335k3638L019K2637m6114l8053M2544r182
$$ 16404 -3895 21308 7309 4118 21183 27518 3880 6899 29536 -16578 -54631 -12087 -21269
183b1269Q1555q663k3014l6669K3548J1934L295j2452j6618l3518L3101n53j573
$$ -21269 60286 51623 28609 -8060 15488 27422 30717 18265 1647 -31871 1230 677 -896
170h96Q324l0572r224K8395K0125j0019L4289l8490M2901l9114j2341k0518L1466
$$ -896 7428 -23144 -32368 -3973 16152 6133 40422 1932 44833 5719 -6622 -27140 4326
157D326o469m530J9043l2469L6806j8314p63j9860l870q565N5644j2929L2975
$$ 4326 -2143 -6673 12370 -20099 16707 -1607 -2370 -22230 -26100 -34665 20979 8050 41025
144D1025p694n0743L4640J4587k0968l6008L3065k4895K3926j5478K5696m7511
$$ 41025 33331 -17412 17228 31815 10847 -25161 7904 -16991 6935 -8543 17153 -30358
132c0358J515J2521J3254P206M599k6630j3408J2632p261J4904l5364K2276k2671
$$ -30358 -28843 -16322 -3068 4138 8737 -17893 -31301 -18669 -25930 -11026 -46390 -24114 -46785
119d6785K7088k6118M2748J3962K9400j6366k003L870k6366K2442j1566J8519
$$ -46785 -19697 -45815 -3067 10895 40295 23929 21926 25796 -570 21872 10306 28825
107B8825l3985J7502r643j2316q743L0578j6562J0835J3984P748o918p013Q305
$$ 28825 -5160 12342 2699 -9617 -18360 12218 -4344 6491 20475 28223 21305 14292 22597
94B2597R46J5776k3919j4855j6076J4538J1128k4211J2605R777j1755j5628K9952
$$ 22597 23543 39319 15400 545 -15531 -993 10135 -14076 -1471 8306 -3449 -19077 10875
81A0875k8815P32O297K666L927r164j6043k05J2876j1051K3547K1896j425m06
$$ 10875 -17940 -17208 -10911 -8245 -4318 -13482 -29525 -29730 -16854 -27905 -4358 17538 16113 15707
67A5707K1356m4709K0063J708L373l2738J0026j0144l556K1765k4205J9331j6452
$$ 15707 37063 -7646 12417 14125 17498 -15240 -5214 -15358 -18914 2851 -21354 -2023 -18475
54a8475K2298J2331K836j1765L9371j8656j5850P031Q662J020k0186q582j182
$$ -18475 3823 16154 18990 7225 46596 27940 12090 19121 27783 28803 8617 35 -1147
41a147L5299j4393M243l0555J4252o396j3783j9441L918L1240N916j0114j1381
$$ -1147 34152 19759 24002 -6553 7699 1303 -12480 -31921 -28003 3237 9153 -961 -12342
28a2342J7126k6915P020j3108M3603l021n194j0405L4144j9163n3131L8484L52
$$ -12342 4784 -22131 -15111 -28219 15384 12363 7169 -3236 30908 11745 -41386 -2902 -2550
15b550J5119m471P040M337J0357j9116n672k2557K0769r598m471j7719m564M2537
$$ -2550 12569 8098 15138 19475 29832 10716 5044 -17513 3256 -6342 -10813 -28532 -33096 9441
1I441n180
$$ 9441 4261
0D261
$$ 4261
$$ Imaginary data points
##PAGE= N=2
##DATA TABLE= (X++(I..I)), XYDATA
16383a278762j9855K9054M7391K1116r776K2070K2046K2251P971O822N743K4928
$$ -1278762 -1298617 -1269563 -1222172 -1201056 -1210832 -1188762 -1166716 -1144465 -1136494 -1129672 -1123929 -1099001
16371a099001L341N5720Q127K7757K4092J9025J2420k8903K9685J0923K2468K3300
$$ -1099001 -1095660 -1039940 -1031813 -1004056 -979964 -960939 -948519 -977422 -947737 -936814 -914346 -891046
16359h91046L6887o201J7067j0401m577J9571Q312J050J9867L5862n49L4581L1160
$$ -891046 -854159 -860360 -843293 -853694 -858271 -838700 -830388 -829338 -809471 -773609 -774158 -739577 -708417
16346g08417M311N669M0130J1469j9268J2903L3283J2235J6293J3155N464O4269
$$ -708417 -704106 -698437 -658307 -646838 -666106 -653203 -619920 -607685 -591392 -578237 -572773 -508504
16334e08504K866Q110j6321K9053M851J5342K015K5254M9827J3781m235m009L6080
$$ -508504 -505638 -497528 -513849 -484796 -479945 -464603 -462588 -437334 -387507 -373726 -377961 -381970 -345890
16321c45890j3204K1786J5285L2211k6364J3524M6173J8118J0635M1734J5571
$$ -345890 -359094 -337308 -322023 -289812 -316176 -302652 -256479 -238361 -227726 -185992 -170421
16310a70421k5466J7289L7268J5627o317K4500K534P323J7161J8751M050M523
$$ -170421 -195887 -178598 -141330 -125703 -132020 -107520 -104986 -97663 -80502 -61751 -57701 -53178
16298e3178P654k626K3237o216M5594L8666j8569p802J8305J8868M3421l3667
$$ -53178 -45524 -48150 -24913 -31129 14465 53131 34562 26760 45065 63933 107354 73687
16286G3687J1235J6380J3922L3998J244j1226n052J6550J5355L6664L2016l987
$$ 73687 84922 101302 115224 149222 150466 139240 134188 150738 166093 202757 234773 230786
16274B30786j2238L1708K2491J3723K725J3978m021K2832Q021l314k2296O523
$$ 230786 218548 250256 272747 286470 289195 303173 299152 321984 330005 326691 304395 310918
16262C10918K0588J9831K2830j1625K0733p412R988k168J9480J9423J6810L5695
$$ 310918 331506 351337 374167 362542 383275 375863 385851 383683 403163 422586 439396 475091
16250D75091J3964K988m727J5133J4194P571l0276m199J1960M6195j879J3003
$$ 475091 489055 492043 487316 502449 516643 524214 493938 489739 501699 547894 546015 559018
16238E59018j8184J0820J3470M171K0326j1099L82M5116K5475k0087K8577r816
$$ 559018 540834 551654 565124 569295 589621 578522 578904 624020 649495 629408 657985 648169
16226F48169J6415k8799m142j89m467K9996j620J2794J5378K7704k0697L5453
$$ 648169 664584 635785 631643 631454 626987 656983 655363 668157 683535 711239 690542 725995
16214G25995m765O097R928M9612j1515j5572J5714Q809J0538J4790k833p011L1881
$$ 725995 721230 727327 737255 786867 775352 759780 775494 784303 794841 809631 806798 799787 831668
16201H31668q879J7817J7651j2623j5363J4890k1064J1494J8200K5009M077m195
$$ 831668 822789 840606 858257 845634 830271 845161 824097 835591 853791 878800 882877 878682
16189H78682J6292j1849n376n2251N0031L3270j0311K538K7496K929k8297J5921
$$ 878682 894974 883125 877749 825498 875529 908799 898488 901026 928522 931451 903154 919075
16177I19075k3446J1071J2042M5971l1326L420p56r397l125L7607n323k9623J3493
$$ 919075 895629 906700 918742 964713 933387 936807 936051 926654 923529 961136 955813 926190 939683
16164I39683J685J0591K244K3317j0814N840k930K4971R834K5256J5402n694J0541
$$ 939683 941368 951959 954203 977520 966706 972546 969616 994587 1004421 1029677 1045079 1039385 1049926
16151A049926k947J6978k1239Q065m0345k0511p857M3100Q547l861j8802K3890
$$ 1049926 1046979 1063957 1042718 1050783 1010438 989927 982070 1025170 1033717 1029856 1011054 1034944
16139A034944k827P487L7939k8064k0163l591K8167Q696k1525L8866L6857l9431
$$ 1034944 1032117 1039604 1077543 1049479 1029316 1025725 1053892 1062588 1041063 1079929 1116786 1077355
16127A077355J2301O781r452J060l3286K7110m40o043j8241n092M2783J2495l5700
$$ 1077355 1089656 1096437 1086985 1088045 1054759 1081869 1081429 1075386 1057145 1052053 1094836 1107331 1071631
16114A071631P215L1356j4505K4345m0759L9089J9485N889K371l9282j193k252
$$ 1071631 1078846 1110202 1095697 1120042 1079283 1118372 1137857 1143746 1146117 1106835 1105642 1103390
16102A103390J677k0512J7330P396M5276J1730J4696m4980J5902K312K266m158
$$ 1103390 1105067 1084555 1101885 1109281 1154557 1166287 1180983 1136003 1151905 1154217 1156483 1152325
16090A152325R508j505n08j6978n6378K7208m0157M6960J0584K2804l5556J603
$$ 1152325 1161833 1160328 1159820 1142842 1086464 1113672 1073515 1120475 1131059 1153863 1118307 1119910
16078A119910M733K9700j9052J9334l053J2520O891j0853n2849J7884L4579q566
$$ 1119910 1124643 1154343 1135291 1154625 1151572 1164092 1170983 1160130 1107281 1125165 1159744 1151178
16066A151178J887k9981q87J1474O205j786O686O754J8657l53k6904M143J6318
$$ 1151178 1153065 1123084 1122197 1133671 1139876 1138090 1144776 1151530 1170187 1169834 1142930 1147073 1163391
16053A163391j7877q854M855K7663q381M0912l6037j4087J5207J362N429j6859
$$ 1163391 1145514 1136660 1141515 1169178 1160797 1201709 1165672 1151585 1166792 1168154 1173583 1156724
16041A156724k4419q15k375J3927K0405k6701J3690J7755j192l8589M7682k302
$$ 1156724 1132305 1131490 1129115 1143042 1163447 1136746 1150436 1168191 1166999 1128410 1176092 1173790
16029A173790J2674m9840K413j282O821q577n129J4697O690M1325k8508J6309
$$ 1173790 1186464 1136624 1139037 1137755 1144576 1135999 1130870 1145567 1152257 1193582 1165074 1181383
16017A181383k6685L7425k4225j621j1195L4056J0852j1811l9767l791J4113J4281
$$ 1181383 1154698 1192123 1167898 1166277 1155082 1189138 1199990 1188179 1148412 1144621 1158734 1173015
16005A173015Q702k9899K3784k3711N7774r145k3118l9551M428K7306J8102n503
$$ 1173015 1181717 1151818 1175602 1151891 1209665 1200520 1177402 1137851 1142279 1169585 1187687 1182184
15993A182184m4549R474J4816J0965j4107R849l6075O507k0525K4035P001K2406
$$ 1182184 1137635 1147109 1161925 1172890 1158783 1168632 1132557 1139064 1118539 1142574 1149575 1171981
15981A171981K6727j7568j6089k0677O358K4768L087m0251K9967J034m6390Q381
$$ 1171981 1198708 1181140 1165051 1144374 1150732 1175500 1178587 1138336 1168303 1169337 1122947 1131328
15969A131328j1688M6080m418J4896k5958k090K3122j1239j2129J1127R144o827
$$ 1131328 1119640 1165720 1161302 1176198 1150240 1148150 1171272 1160033 1147904 1159031 1168175 1161348
15957A161348J0374j7242N9112l6332J4179l9229j0715l6836L3123J7163l40Q927
$$ 1161348 1171722 1154480 1213592 1177260 1191439 1152210 1141495 1104659 1137782 1154945 1154605 1163532
15945A163532Q827M804N191K1409j4582J2604l8844J5313j8289K5621l7964K9874
$$ 1163532 1172359 1177163 1182354 1203763 1189181 1201785 1162941 1178254 1159965 1185586 1147622 1177496
15933A177496l2265J9499J6154J6391p396P320o253n141P67P47p819j9714K6162
$$ 1177496 1145231 1164730 1180884 1197275 1189879 1197199 1190946 1185805 1186572 1187319 1179500 1159786 1185948
$$ [...]
##END NTUPLES=NMR SPECTRUM
##END=
