##TITLE=1H_TG-2409-X21
 200.13Hz, CDCl3.
 8 sc
 17.6.2026
##JCAMPDX= 6.0         $$ Bruker NMR JCAMP-DX V2.0
##DATA TYPE= NMR SPECTRUM
##DATA CLASS= NTUPLES
##ORIGIN= UXNMR, Bruker Analytische Messtechnik GmbH
##OWNER= pz
$$ XWIN-NMR		Version 3.5
$$ Wed Jun 17 13:47:35 2026 Russian Standard Time (UT+4h)  she@DPX200
##.OBSERVE FREQUENCY= 200.1313
##.OBSERVE NUCLEUS= ^1H
##.ACQUISITION MODE= SIMULTANEOUS
##.ACQUISITION SCHEME= undefined
##.AVERAGES= 8
##.DIGITISER RES= 18
##SPECTROMETER/DATA SYSTEM= spect
##.PULSE SEQUENCE= zg30
##.SOLVENT NAME= CDCl3
##.SHIFT REFERENCE= (INTERNAL, CDCl3, 0, 15.4858)
##AUDIT TRAIL= $$ (NUMBER, WHEN, WHO, WHERE, WHAT)
$$ ##TITLE= Audit trail, XWIN-NMR		Version 3.5
$$ ##JCAMPDX= 5.01
$$ ##ORIGIN= Bruker BioSpin GmbH
$$ ##OWNER= she
$$ F:/spectra/data/she/nmr/H-C/1/pdata/1/auditp.txt
$$ ##AUDIT TRAIL=  $$ (NUMBER, WHEN, WHO, WHERE, WHAT)
(   1,<2026-06-17 13:46:02.76 +0400>,<she>,<DPX200>,
      <created by zg, POWCHK disabled, PULCHK disabled
       configuration hash MD5:
       00 E9 B6 7A A2 85 ED C7 34 08 36 98 17 FE 4E 26
       data hash MD5: 16K
       35 FA C6 4B 6E CA 90 A6 D1 D8 8D 15 EF 79 73 94>)
(   2,<2026-06-17 13:46:06.28 +0400>,<she>,<DPX200>,
      <Start of raw data processing
       efp BC_mod = 2 LB = 0.25 FT_mod = 6 PKNL = 1 PHC0 = -4384.413 PHC1 = 22.39229 SI = 16K 
       data hash MD5: 16K
       FC 43 DF 60 4A 37 6D 4D B9 23 63 E8 6B 16 86 97>)
(   3,<2026-06-17 13:46:22.40 +0400>,<she>,<DPX200>,
      <pk PHC0 = 161.7735 PHC1 = -1.999999 
       data hash MD5: 16K
       D5 0D 3D AB 6F FA 95 3E D4 19 D2 55 30 31 D2 3E>)
(   4,<2026-06-17 13:46:26.37 +0400>,<she>,<DPX200>,
      <abs ABSG = 5 
       data hash MD5: 16K
       A2 65 67 52 06 12 8B 28 C0 8A 28 6A 75 BD A9 26>)
(   5,<2026-06-17 13:47:03.78 +0400>,<she>,<DPX200>,
      <pk PHC0 = 15.26671 PHC1 = -20.2 
       data hash MD5: 16K
       FF 52 A2 E7 52 E0 33 9E E7 CC B4 28 75 D0 9D F5>)
$$ ##END=
$$ 
$$ hash MD5
$$ 8B 3A 95 C6 F9 DA 95 2B 74 9F B7 B4 DC 15 BA E0
##$RELAX= 
##$RELAX= 
##$RELAX= 
##$RELAX= 
##$RELAX= 
##$RELAX= 
$$ Bruker specific parameters
$$ --------------------------
##$DU= <F:/spectra>
##$EXPNO= 1
##$NAME= <H-C>
##$PROCNO= 1
##$TYPE= <nmr>
##$USER= <she>
##$AMP= (0..31)
100 100 100 100 100 100 100 100 100 100 100 100 100 100 100 100 100 100 
100 100 100 100 100 100 100 100 100 100 100 100 100 100 
##$AQSEQ= 0
##$AQ_mod= 1
##$AUNM= <au_zg>
##$AUTOPOS= <>
##$BF1= 200.13
##$BF2= 200.13
##$BF3= 200.13
##$BF4= 200.13
##$BF5= 200.13
##$BF6= 200.13
##$BF7= 200.13
##$BF8= 200.13
##$BYTORDA= 1
##$CFDGTYP= 0
##$CFRGTYP= 5
##$CHEMSTR= <none>
##$CNST= (0..31)
1 1 145 1 1 1 1 1 1 1 1 1 1 1 1 1 1 1 1 1 1 1 1 1 1 1 1 1 1 1 1 1 
##$CPDPRG= <>
##$CPDPRG1= <>
##$CPDPRG2= <>
##$CPDPRG3= <>
##$CPDPRG4= <mlev>
##$CPDPRG5= <mlev>
##$CPDPRG6= <mlev>
##$CPDPRG7= <mlev>
##$CPDPRG8= <mlev>
##$CPDPRGB= <>
##$CPDPRGT= <>
##$D= (0..31)
0 0.7 0 0 0 0 0 0 0 0 0 0.03 0 0 0 0 0 0 0 0 0 0 0 0 0 0 0 0 0 0 0 0 
##$DATE= 1781689562
##$DBL= (0..7)
$$ [...]
##$SUBNAM3= <"">
##$SUBNAM4= <"">
##$SUBNAM5= <"">
##$SUBNAM6= <"">
##$SUBNAM7= <"">
##$SUBNAM8= <"">
##$SUBNAM9= <"">
##$SW= 18.0517328524113
##$SWIBOX= (0..15)
0 0 2 0 0 0 0 0 0 0 0 0 0 0 0 0 
##$SW_h= 3612.71676300578
##$TD= 16384
##$TD0= 1
##$TE= 0
##$TE2= 300
##$TE3= 300
##$TEG= 300
##$TL= (0..7)
0 120 120 120 120 120 120 120 
##$TP= (0..7)
150 150 150 150 150 150 150 150 
##$TP07= 0
##$TPNAME0= <>
##$TPNAME1= <>
##$TPNAME2= <>
##$TPNAME3= <>
##$TPNAME4= <>
##$TPNAME5= <>
##$TPNAME6= <>
##$TPNAME7= <>
##$TPOAL= (0..7)
0.5 0.5 0.5 0.5 0.5 0.5 0.5 0.5 
##$TPOFFS= (0..7)
0 0 0 0 0 0 0 0 
##$TUNHIN= 0
##$TUNHOUT= 0
##$TUNXOUT= 0
##$USERA1= <user>
##$USERA2= <user>
##$USERA3= <user>
##$USERA4= <user>
##$USERA5= <user>
##$V9= 5
##$VALIST= <valist>
##$VCLIST= <CCCCCCCCCCCCCCC>
##$VD= 0
##$VDLIST= <DDDDDDDDDDDDDDD>
##$VPLIST= <PPPPPPPPPPPPPPP>
##$VTLIST= <TTTTTTTTTTTTTTT>
##$WBST= 1024
##$WBSW= 4
##$XGAIN= (0..3)
0 0 0 0 
##$XL= 0
##$YL= 0
##$YMAX_a= 122558
##$YMIN_a= -117444
##$ZGOPTNS= <>
##$ZL1= 120
##$ZL2= 120
##$ZL3= 120
##$ZL4= 120
##$ABSF1= 15.48576
##$ABSF2= -2.56609
##$ABSG= 5
##$ABSL= 3
##$ALPHA= 0
##$AQORDER= 0
##$ASSFAC= 0
##$ASSFACI= 0
##$ASSFACX= 0
##$ASSWID= 0
##$AUNMP= <proc_1d>
##$AZFE= 0.1
##$AZFW= 0.1
##$BCFW= 0
##$BC_mod= 2
##$BYTORDP= 0
##$COROFFS= 0
##$CY= -3
##$DATMOD= 1
##$DC= 0
##$DFILT= <>
##$DTYPP= 0
##$F1P= 0
##$F2P= 0
##$FCOR= 1
##$FTSIZE= 16384
##$FT_mod= 6
##$GAMMA= 0
##$GB= 0
##$INTBC= 1
##$INTSCL= 3.241238e-09
##$ISEN= 128
##$LB= 0.25
##$LEV0= 0
##$LPBIN= 0
##$MAXI= 10000
##$MC2= 0
##$MEAN= 0
##$ME_mod= 0
##$MI= 1.114404
##$NCOEF= 0
##$NC_proc= -8
##$NLEV= 6
##$NOISF1= 3.799351
##$NOISF2= 2.8
##$NSP= 0
##$NTH_PI= 0
##$NZP= 0
##$OFFSET= 15.48576
##$PC= 1
##$PHC0= -4207.374
##$PHC1= 0.1922894
##$PH_mod= 1
##$PKNL= yes
##$PPARMOD= 0
##$PSCAL= 0
##$PSIGN= 0
##$REVERSE= no
##$SF= 200.130007193104
##$SI= 16384
##$SIGF1= 3
##$SIGF2= 2
##$SINO= 0.751879
##$SIOLD= 32768
##$SREGLST= <19F.Aceton>
##$SSB= 0
##$STSI= 16384
##$STSR= 0
##$SW_p= 3612.71676300578
##$SYMM= 0
##$S_DEV= 0
##$TDeff= 16384
##$TDoff= 0
##$TI= <>
##$TILT= no
##$TM1= 0
##$TM2= 0
##$TOPLEV= 0
##$USERP1= <user>
##$USERP2= <user>
##$USERP3= <user>
##$USERP4= <user>
##$USERP5= <user>
##$WDW= 1
##$XDIM= 16384
##$YMAX_p= 519238687
##$YMIN_p= -16469246
$$ End of Bruker specific parameters
$$ ---------------------------------
##NTUPLES= NMR SPECTRUM
##VAR_NAME=  FREQUENCY,     SPECTRUM/REAL,   SPECTRUM/IMAG
##SYMBOL=    X,             R,               I
##VAR_TYPE=  INDEPENDENT,   DEPENDENT,       DEPENDENT
##VAR_FORM=  AFFN,          ASDF,            ASDF
##VAR_DIM=   16384,         16384,           16384
##UNITS=     HZ,            ARBITRARY UNITS, ARBITRARY UNITS
##FACTOR=    0.220516191357247, 1,           1
##FIRST=     3099.16520717773, 0,            0
##LAST=      -513.551555828051, 0,           0
##MIN=       -513.551555828051, -16469246,   0
##MAX=       3099.16520717773, 519238687,    0
$$ Real data points
##PAGE= N=1
##DATA TABLE= (X++(R..R)), XYDATA
$$ [...]
$$ plain form
4994 16687430 16108925 16404470 15502115 16039973 15840173 17435826 16250283 16849599 16423512
4985 16423512 15769323 16722765 16585818 15580894 14274201 15266622 15041142 16218827 16221357
4976 16221357 15863405 14537988 14972181 16241053 15394784 16141422 17018517 16174707 15709008
4967 15709008 16755429 17120728 17023789 17540325 17494452 16241548 18220222 17844993 17785283
4958 17785283 17909922 16863402 17190597 16991446 16841149 18002361 18835225 16624103 18226676
4949 18226676 18313182 18111715 18477009 18498624 18864823 18660307 18807679 19224752 18215623 18623370
4939 18623370 19481171 17246797 17657970 16745192 15345865 15151060 16681293 16603064 16862425
4930 16862425 17262837 16753402 16046133 16453498 17471250 17505452 17567825 17149583 18229531
$$ packed form
4994A6687430n78505K95545r02355N37858j99800J595653j185543N99316m26087
4985A6423512o54189R53442j36947j004924j306693R92421k25480J177685K530
4976A6221357l57952j325417M34193J268872q46269P46638Q77095q43810m65699
4967A5709008J046421L65299r6939N16536m5873j252904J978674l75229n9710
4958A7785283J24639j046520L27195j99151j50297J161212Q32864k211122J602573
4949A8226676Q6506k01467L65294K1615L66199k04516J47372M17073j009129M07747
4939A8623370Q57801k234374M11173r12778j399327j94805J530233p8229K59361
4930A6862425M00412n09435p07269M07365J017752L4202O2373m18242J079948
$$ plain form
4921 18229531 18749589 19057987 19192983 18890951 18618197 19164512 19039374 19006561 19234107 17939561
4911 17939561 18001468 17840160 17273287 18448825 17117790 16303163 16138798 17800256 18332944
4902 18332944 18118600 18941897 18703680 18545107 19262381 19732469 19881926 19722894 18701449
4893 18701449 17860256 18640702 18586200 17960200 18718889 18661980 17300499 17128561 16817452 16747921
4883 16747921 15672799 16272786 15111030 14411706 14309735 14121530 14363315 14270091 13784804
4874 13784804 14030404 15017016 13767077 13880154 15307367 13711548 13955316 14685844 13788060
4865 13788060 13744232 14192981 14237900 13648041 13591630 14829356 14059165 13777068 13779774 12551124
4855 12551124 12610941 12634327 12532489 12598238 12428972 11711468 11274222 12295632 12555211 11390342
$$ packed form
4921A8229531N20058L08398J34996l02032k72754N46315j25138l2813K27546j294546
4911A7939561O1907j61308n66873J175538j331035q14627j64365J661458N32688
4902A8332944k14344Q23297k38217j58573P17274M70088J49457j59032j021445
4893A8701449q41193P80446n4502o26000P58689n6909j361481j71938l11109o9531
4883A6747921j075122N99987j161756o99324j01971j88205K41785r3224m85287
4874A3784804K45600R86612j249939J13077J427213j595819K43768P30528q97784
4865A3788060m3828M48749M4919n89859n6411J237726p70191k82097K706j228650
4855A2551124N9817K3386j01838O5749j69266p17504m37246J021410K59579j164869
$$ plain form
4845 11390342 13269225 13111087 12184561 12111994 12570496 11604944 10738729 12540473 12930953
4836 12930953 11295380 12181074 13687136 11895127 11610813 11980404 10684792 10778971 11919717
4827 11919717 12749114 12768948 13208311 12998544 13334106 13388923 13425804 13544568 13866358 12570332
4817 12570332 12668422 13920964 13606443 12814549 13118872 14073682 14502422 14437681 14039253 14433873
4807 14433873 15414074 15063355 15335100 15479671 15548683 14887319 16390654 16381586 15780324 15687675
4797 15687675 15335518 14457681 16286125 16638138 15835735 15155820 15049402 15814702 14546712
4788 14546712 14961140 15431505 14160873 15301694 15466251 16108979 17142341 17031258 17343881
4779 17343881 16143947 16283557 17465505 16464499 17619251 18196769 16886193 17931205
$$ packed form
4845A1390342J878883j58138r26526p2567M58502r65552q66215J801744L90480
4836A2930953j635573Q85694J506062j792009k84314L69591j295612R4179J140746
4827A1919717Q29397J9834M39363k09767L35562N4817L6881J18764L21790j296026
4817A2570332R8090J252542l14521p91894L04323R54810M28740o4741l98428L94620
4807A4433873R80201l50719K71745J44571O9012o61364J503335r068o01262r2649
4797A5687675l52157q77837J828444L52013q02403o79915j06418P65300j267990
4788A4546712M14428M70365j270632J140821J64557O42728J033362j11083L12623
4779A7343881j199934J39610J181948j001006J154752N77518j310576J045012
$$ plain form
4771 17931205 17831240 17558864 17886420 18607756 18327576 17847747 18367779 18889296 18786859 19797148
4761 19797148 19012081 18442265 19271340 20213884 19891237 20947344 21615113 22197291 23180771
4752 23180771 22673745 22692659 21877507 22319219 22721666 22916731 24360849 23570308 24845628
4743 24845628 25507599 24680694 25836153 26611404 26184264 27883088 28007275 28618862 28887122
4734 28887122 29137916 29239186 28849397 30340625 31424790 30847648 31959185 32202946 30797398
4725 30797398 30870659 30744362 30462693 30471095 31880921 32559040 31962394 33363209 34297561 33127628
4715 33127628 33915961 33847536 33398899 34511660 34817233 36124701 35395356 35698914 37264822
4706 37264822 35746487 35942027 35749563 34724250 35183318 34726719 34668499 35416339 34295594
$$ packed form
4771A7931205r9965k72376L27556P21336k80180m79829N20032N21517j02437J010289
4761A9797148p85067n69816Q29075R42544l22647J056107O67769N82178R83480
4752B3180771n07026J8914q15152M41712M02447J95065J444118p90541J275320
4743B4845628O61971q26905J155459P75251m27140J698824J24187O11587K68260
4734B8887122K50794J01270l89789J491228J084165n77142J111537K43761j405548
4725C0797398P3261j26297k81669Q402J409826O78119n96646J400815R34352j169933
4715C3127628P88333o8425m48637J112761L05573J307468p29345L03558J565908
4706C7264822j518335J95540j92464j025313M59068m56599n8220P47840j120745
$$ plain form
4697 34295594 33574247 34218518 33257296 31591979 31087787 31033380 29616982 29810359 30111537
4688 30111537 29571065 28943044 27719173 27021948 26410148 25718925 25197795 25051726 23451630
4679 23451630 23959273 24282448 23497931 23852782 23076764 23644178 23172863 21974007 22302177
4670 22302177 21618566 20408299 20397670 20159332 20035884 19424338 19359892 18477260 18471904 18673233
4660 18673233 16608391 16026636 15065922 14341228 14458535 14581440 13752835 13207045 13128448
4651 13128448 12390872 11342124 10812889 10689617 10503748 9264990 9040915 10357272 10345714
4642 10345714 11158581 11036775 10482394 9155615 9768755 11527156 12232464 11303220 11755738
4633 11755738 11823556 11939782 12704474 11745505 10359491 10217472 9268643 9957731 11621599
$$ packed form
4697C4295594p21347O44271r61222j665317n04192n4407j416398J93377L01178
4688C0111537n40472o28021j223871o97225o11800o91223n21130j46069j600096
4679B3451630N07643L23175p84517L54851p76018N67414m71315j198856L28170
4670B2302177o83611j210267j0629k38338j23448o11546o4446q82632n356K01329
4660A8673233k064842n81755r60714p24694J17307J22905q28605n45790p8597
4651A3128448p37576j048748n29235j23272j85869j238758k24075J316357j1558
4642A0345714Q12867j21806n54381j326779O13140J758401P05308r29244M52518
4633A1755738O7818J16226P64692r58969j386014j42019r48829O89088J663868
$$ plain form
4624 11621599 10653593 10208871 9762832 10182241 9278177 10339808 11300049 10661296 11665637
4615 11665637 12640252 13012577 13676944 12907592 14889055 16192894 15960736 17633021 19136404
4606 19136404 19203302 19462849 20778386 21403312 20745523 21323289 21842253 20585264 19828080
4597 19828080 19677212 17720903 15994840 14843262 13424347 12154652 11509386 10931971 11949865
4588 11949865 10851421 10846622 9866685 10570465 9582750 9322445 9908778 10335548 9890618 10173936
4578 10173936 10607195 10235669 9618824 9316556 10379225 9945704 9195168 9329047 11167885
4569 11167885 10327607 11486100 12116501 11444373 10601464 9796578 10688325 11098057 11279823
4560 11279823 12003348 13188428 12367181 12700180 13146478 12652928 12035919 13267759 11944341
$$ packed form
4624A1621599r68006m44722m46039M19409r04064J061631R60241o38753J004341
4615A1665637R74615L72325O64367p69352J981463J303839k32158J672285J503383
4606A9136404O6898K59547J315537O24926o57789N77766N18964j256989p57184
4597A9828080j50868j956309j726063j151578j418915j269695o45266n77415J017894
4588A1949865j098444m799r79937P03780r87715k60305N86333M26770m44930K83318
4578A0173936M33259l71526o16845l02268J062669m33521p50536J33879J838838
4569A1167885q40278J158493O30401o72128q42909q04886Q91747M09732J81766
4560A1279823P23525J185080q21247L32999M46298m93550o17009J231840j323418
$$ plain form
4551 11944341 13635791 13905598 15528799 17204848 16321507 17519884 17363411 18466837 18909411
4542 18909411 19566604 20555972 22463199 23527251 26137775 25733160 26975655 27607081 28343999
4533 28343999 30059417 31538815 32701414 34250070 37145135 39253424 40786086 44181279
4525 44181279 48148899 51028693 56694909 62937433 66261255 72310161 77163211 82389204
4517 82389204 88779487 95378387 101645748 106948286 110286301 112927715 111609570 107938305
4509 107938305 100976113 93498736 83467489 74692220 66651185 59031405 51868280 46521972
4501 46521972 40259484 35410056 32052467 29717419 25581920 23577290 23793780 22000823
4493 22000823 21815668 21373419 20375371 19854247 18476477 17246719 17166826 15825802 15693511
$$ packed form
4551A1944341J691450K69807J623201J676049q83341J198377j56473J103426M42574
4542A8909411O57193R89368J907227J064052K610524m04615J242495O31426P36918
4533B8343999J715418J479398J162599J548656K895065K108289J532662L395193
4525D4181279L967620K879794N666216O242524L323822O048906M853050N225993
4517H2389204O390283O598900O267361N302538L338015K641414j318145l671265
4509A07938305o962192p477377j0031247q775269q041035p619780p163125n346308
4501D6521972o262488m849428l357589k335048m135499k004630K16490j792957
4493B2000823j85155m42249r98048n21124j377770j229758p9893j341024j32291
$$ plain form
4484 15693511 16111466 15348647 15298073 16135864 15736980 14944214 14237233 13198832 11767494
4475 11767494 11367353 11284159 11090057 11512784 12909312 12189622 12517767 11616402 9418237
4466 9418237 9237353 9361770 8916635 10144049 10660299 10388405 9389348 9754904 9788518 8767079
4456 8767079 8495826 10284274 9280489 11048940 11931075 10020008 8972448 8197091 7975031
4447 7975031 8413183 9089367 9472191 9886541 10294404 11240671 10761070 10596897 11756820
4438 11756820 10976669 12252207 12805044 12937284 11981900 12137174 11329067 10991642 11699733
4429 11699733 11910755 10771615 12049854 10353309 8638982 9456310 8685843 7773651 7143993
4420 7143993 7076550 7279002 8431674 9410566 8953906 8638192 8074111 7357119 7717859 6179332
$$ packed form
4484A5693511M17955p62819n0574Q37791l98884p92766p06981j038401j431338
4475A1767494m00141q3194j94102M22727J396528p19690L28145r01365k198165
4466I418237j80884J24417m45135J227414N16250k71894r99057L65556L3614j021439
4456H767079k71253J788448j003785J768451Q82135j911067j047560p75357k22060
4447G975031M38152O76184L82824M14350M07863R46267m79601j64173J159923
4438A1756820p80151J275538N52837J32240r55384J55274q08107l37425P08091
4429A1699733K11022j139140J278239j696545j714327Q17328p70467r12192o29658
4420G143993o7443K02452J152672R78892m56660l15714n64081p16992L60740j538527
$$ plain form
4410 6179332 6440645 6592295 6555683 7583334 7557468 7493796 7943490 7410272 6830717 6434832
4400 6434832 6746020 8046627 7777465 8418309 8738909 8535551 9857103 8937661 9087181
4391 9087181 9501541 8878719 8849229 10412804 11054474 13453578 14639948 16971610 18244880
4382 18244880 20204995 22648808 21804221 22801194 23518586 22120235 21102532 18936331 16796390
4373 16796390 16545473 14442200 13099807 13099065 12690323 12453828 12280154 12342983 12719937 11511520
4363 11511520 11249129 10831679 9933551 10153330 11432636 12137225 11064623 11602938 11808211
4354 11808211 10813412 10720317 11904735 12703707 12490242 13072515 14024523 13360848 12992364
4345 12992364 13259215 12417522 12788058 13218568 13447295 13275050 13495999 13213831 13057086
$$ packed form
4410F179332K61313J51650l6612J027651k5866o3672M49694n33218n79555l95885
4400F434832L11188J300607k69162O40844L20600k03358J321552r19442J49520
4391I087181M14360o22822k9490J563575O41670K399104J186370K331662J273270
4382A8244880J960115K443813q44587R96973P17392j398351j017703k166201k139941
4373A6796390k50917k103273j342393p42m08742k36495j73674O2829L76954j208417
4363A1511520k62391m17450q98128K19779J279306P04589j072602N38315K05273
4354A1808211r94799r3095J184418P98972k13465N82273R52008o63675l68484
4345A2992364K66851q41693L70536M30510K28727j72245K20949k82168j56745
$$ plain form
4336 13057086 13235959 13335263 13313753 13681629 14121131 13771170 13432520 12692746 12676436 13203243
4326 13203243 12561891 12775587 13777423 14056973 14643303 14301794 14267049 13991731 14225295
4317 14225295 15321208 16338380 16458865 18083626 20095920 22198601 26171199 31019002
4309 31019002 38759346 49258665 60276090 64236986 63532855 61843621 56040522 48460934
4301 48460934 41357504 35881214 30616589 27614096 23622918 20986033 19434545 19471733
4293 19471733 17903855 17366171 17161212 16723045 15949032 15233927 13978949 14064304 14366741
4284 14366741 14437915 13908539 13844920 13084606 13498498 13501090 13133997 13637506 13770198 12406891
4274 12406891 12728420 13456959 13448614 13709256 13471603 13453124 11570676 11890971 13318837 12871288
$$ packed form
4336A3057086J78873R9304k1510L67876M39502l49961l38650p39774j6310N26807
4326A3203243o41352K13696J001836K79550N86330l41509l4745k75318K33564
4317A4225295J095913J017172J20485J624761K012294K102681L972598M847803
4309C1019002P740344J0499319J1017425L960896p04131j689234n803099p579588
4301D8460934p103430n476290n264625l002493l991178k636885j551488L7188
4293A9471733j567878n37684k04959m38167p74013p15105j254978Q5355L02437
4284A4366741P1174n29376o3619p60314M13892K592l67093N03509J32692j363307
4274A2406891L21529P28539q345K60642k37653j8479j882448L20295J427866m47549
$$ plain form
4264 12871288 12364980 13172355 12855724 12440463 13481466 12373510 11507442 11922237 12713698
4255 12713698 11660431 12009124 12503996 11454118 12005944 11576030 11292491 11133998 10178885
4246 10178885 10830481 11097559 10941246 11393947 10193420 10599416 10189242 10429587 10674899
4237 10674899 10077067 9913033 10637882 9282039 10277685 10164510 10899414 9954416 10759173
4228 10759173 10238205 9606711 9960622 10300888 9271235 9761394 10721492 10323747 11359020
4219 11359020 11898410 10498041 10324817 10480209 11147398 9919180 10053740 9107412 7933251
4210 7933251 8783101 9816458 8189101 8723088 8854827 7920630 8245533 8960834 8548203
4201 8548203 7426601 7791530 7230723 7595907 8295770 7720673 8082577 8068506 6659636
$$ packed form
4264A2871288n06308Q07375l16631m15261J041003j107956q66068M14795P91461
4255A2713698j053267L48693M94872j049878N51826m29914k83539j58493r55113
4246A0178885O51596K67078j56313M52701j200527M05996m10174K40345K45312
4237A0674899n97832j64034P24849j355843R95646j13175P34904r44998Q04757
4228A0759173n20968o31494L53911L40266j029653M90159R60098l97745J035273
4219A1359020N39390j400369j73224J55392O67189j228218J34560r46328j174161
4210G933251Q49850J033357j627357N33987J31739r34197L24903P15301m12631
4201H548203j121602L64929n60807L65184O99863n75097L61904j4071j408870
$$ plain form
4192 6659636 8212073 9402974 7167155 7083329 9416579 9683755 9492757 10356998 10441847
4183 10441847 9252773 8375004 9727334 9572766 9144657 10376991 9849729 10190079 10550215
4174 10550215 10323097 9968913 8801654 7809317 7882541 9059479 8975906 8217938 9628369
4165 9628369 9554972 8657997 9824949 11564212 9941424 9906509 10315216 10316972 9902246 10165911
4155 10165911 10649432 9529785 8629026 9309301 9364715 9536900 9355191 9755593 10580892
4146 10580892 10831490 10103747 10976006 11016410 9326534 9498210 10763849 10150952 9854637
4137 9854637 10690123 10850729 10275792 11577218 10116394 9634144 8770643 10163837 10662034
4128 10662034 11418714 12826650 13613027 13524622 13771050 13127430 12559405 12440120 11622794
$$ packed form
4192F659636J552437J190901k235819q3826K333250K67176j90998Q64241Q4849
4183A0441847j189074q77769J352330j54568m28109J232334n27262L40350L60136
4174A0550215k27118l54184j167259r92337P3224J176938q3573p57968J410431
4165I628369p3397q96975J166952J739263j622788l4915M08707J756m14726K63665
4155A0165911M83521j119647r00759O80275N5414J72185j81709M00402Q25299
4146A0580892K50598p27743Q72259M0404j689876J71676J265639o12897k96315
4137I854637Q35486J60606n74937J301426j460824m82250q63501J393194M98197
4128A0662034P56680J407936P86377q8405K46428o43620n68025j19285q17326
$$ plain form
4119 11622794 11702583 12676515 12484714 12264946 13667125 13287439 12692528 12664472 12925193 13021159
4109 13021159 12878816 12900386 12321188 12968590 13390228 13889448 14401527 15533696 14690617
4100 14690617 14382992 15272865 15710665 13740814 15563161 16544015 15622794 17523606 18390010
4091 18390010 18066910 18356677 19589899 20257984 20177245 19800738 20750017 20410646 20417440 20839347
4081 20839347 21367073 21307908 21614934 21200598 22879639 23568250 22818368 23920114 24180342
4072 24180342 24475978 25241342 25589275 26437319 25708620 26000511 26557101 26288197 25721073
4063 25721073 26583553 26400297 25776633 26398229 28089090 27014490 28046795 28290840 28194949
4054 28194949 29686932 29962324 29901869 29443301 30452419 31448658 31826623 32592898 32563964
$$ packed form
4119A1622794P9789R73932j91801k19768J402179l79686n94911k8056K60721R5966
4109A3021159j42343K1570n79198O47402M21638M99220N12079J132169q43079
4100A4690617l07625Q89873M37800j969851J822347R80854r21221J900812Q66404
4091A8390010l23100K89767J233222O68085q0739l76507R49279l39371O794M21907
4081B0839347N27726n9165L07026m14336J679041O88611p49882J101746K60228
4072B4180342K95636P65364L47933Q48044p28699K91891N56590k68904n67124
4063B5721073Q62480j83256o23664O21596J690861j074600J032305K44045r5891
4054B8194949J491983K75392o0455m58568J009118R96239L77965P66275k8934
$$ plain form
4045 32563964 32667541 32809391 32706965 31832966 33175129 33671471 33563107 33481999 34738843
4036 34738843 34651066 36348553 36541607 37930650 37753572 37630126 37830341 39391450 39532251
4027 39532251 38977602 41294679 40689852 42042048 43069831 42943289 43324622 44663232 47124810
4018 47124810 47393528 47397137 50108204 50987057 51315432 53848499 54060044 55750247 57434880
4009 57434880 58436412 58567788 60445810 59703449 58851088 58507762 60219473 60921612 60597632
4000 60597632 62852510 62623021 63270861 65579982 66868636 66631255 67872402 66677366 66986793
3991 66986793 67844553 68532235 67266782 67250214 66458104 65896214 65626539 66034940 65723630
3982 65723630 64382198 64226423 63690188 63236491 63467704 63987976 63217431 63195807 62573024
$$ packed form
4045C2563964J03577J41850j02426q73999J342163M96342j08364q1108J256844
4036C4738843q7777J697487J93054J389043j77078j23446K00215J561109J40801
4027C9532251n54649K317077o04827J352196J027783j26542L81333J338610K461578
4018D7124810K68718L609K711067Q78853L28375K533067K11545J690203J684633
4009E7434880J001532J31376J878022p42361q52361l43326J711711P02139l23980
4000F0597632K254878k29489O47840K309121J288654k37381J241147j195036L09427
3991F6986793Q57760O87682j265453j6568p92110n61890k69675M08401l11310
3982F5723630j341432j55775n36235m53697K31213N20272p70545k1624o22783
$$ plain form
3973 62573024 61796597 62993289 61272679 60382500 59479125 57516300 56277060 56351571 53518061
3964 53518061 52885713 53327711 53102766 52332829 51075431 50653381 50757298 50663346 51660456
3955 51660456 50337186 50412507 49840480 49604462 49322074 49019161 49539628 48041638 46559442
3946 46559442 47216491 47353224 47873518 47499419 46917197 47507837 46117825 46948272 45965930
3937 45965930 45163187 46281981 44336969 42786433 43840462 41764812 41852651 42375702 40410102
3928 40410102 41008102 40625342 41020305 39655879 39448244 39688276 38617709 37856717 39781028
3919 39781028 38646884 37970056 39180478 38269595 39281184 38813002 38789069 38739821 39041499
3910 39041499 38110973 38429408 38754974 40710739 40749104 41229847 41803607 41590527 41016735
$$ packed form
3973F2573024p76427J196692j720610q90179r03375j962825j239240P4511k833510
3964E3518061o32348M41998k24945p69937j257398m22050J03917r3952R97110
3955E1660456j323270P5321n72027k36018k82388l02913N20467j497990j482196
3946D6559442O57049J36733N20294l74099n82222N90640j390012Q30447r82342
3937D5965930q02743J118794j945012j550536J054029k075650Q7839N23051j965600
3928D0410102N98000l82760L94963j364426k07635K40032j070567p60992J924311
3919C9781028j134144o76828J210422r10883J011589m68182k3933m9248L01678
3910C9041499r30526L18435L25566J955765L8365M80743N73760k13080n73792
$$ plain form
3901 41016735 40988564 40971154 39836627 40977032 40538335 40566210 40485547 40625550 41499842 40199653
3891 40199653 39901520 40503851 40182297 40480295 43431819 42861751 42715260 43846949 44590582
3882 44590582 44480470 45855540 46763946 46461637 47045763 47527167 48792883 48692505 48627056
3873 48627056 47977093 47008434 46273593 46967710 47049491 46889998 46330933 47076648 46366757 45240897
3863 45240897 45625326 45501316 45176479 44650222 44792681 43595666 44198202 45308647 44336993
3854 44336993 43830355 45079395 43597259 42968465 44913567 44594656 43946228 44457920 45060194
3845 45060194 44852595 45918697 47278648 47184005 46489948 48507743 47294554 46693856 48736776
3836 48736776 47142513 47224935 46660758 45305660 44841342 45159393 44982110 44025634 42137815
$$ packed form
3901D1016735k8171j7410j134527J140405m38697K7875q0663J40003Q74292j300189
3891D0199653k98133O02331l21554K97998K951524n70068j46491J131689P43633
3882D4590582j10112J375070R08406l02309N84126M81404J265716j00378o5449
3873D8627056o49963r68659p34841O94117Q1781j59493n59065P45715p09891j125860
3863D5240897L84429j24010l24837n26257J42459j197015O02536J110445r71654
3854D4336993n06638J249040j482136o28794J945102l18911o48428N11692O02274
3845D5060194k07599J066102J359951r4643o94057K017795j213189o00698K042920
3836D8736776j594263Q2422n64177j355098m64318L18051j77283r56476j887819
$$ plain form
3827 42137815 42097496 40610637 39853940 39509810 38582111 38413320 38381034 38971018 38557476 38499079
3817 38499079 38107433 37226302 36586651 35234623 36449388 36675617 36264561 36637516 36720803
3808 36720803 34782831 34010057 33585523 33971971 33440403 33182407 34037835 33172338 33811273
3799 33811273 35369510 35396984 34528874 33825663 33366636 34086390 32771672 33360871 34272935
3790 34272935 34455216 33684828 34094069 34178543 32574394 31716874 31873998 31538316 32093629
3781 32093629 32532175 32786376 33130409 32193511 31810046 31500544 29842122 29484046 28349608
3772 28349608 27962190 27913097 28276928 26948793 26503521 24525320 23507520 22470360 21932320
3763 21932320 21856817 22276542 21968403 21967028 21353326 20546809 20936358 19347531 19991742 20169770
$$ packed form
3827D2137815m0319j486859p56697l44130r27699j68791l2286N89984m13542n8397
3817C8499079l91646q81131o39651j352028J214765K26229m11056L72955Q3287
3808C6720803j937972p72774m24534L86448n31568k57996Q55428q65497O38935
3799C3811273J558237K7474q68110p03211m59027P19754j314718N89199R12064
3790C4272935J82281p70388M09241Q4474j604149q57520J57124l35682N55313
3781C2093629M38546K54201L44033r36898l83465l09502j658422l58076j134438
3772B8349608l87418m9093L63831j328135m45272j978201j017800j037160n38040
3763B1932320p5503M19725l08139j375o13702q06517L89549j588827O44211J78028
$$ plain form
3753 20169770 19570605 19658494 20721417 20916276 20662989 20644691 20836300 21175862 20355412 21784534
3743 21784534 21941489 21708445 22219305 21706739 21794087 21113811 22469687 22432573 20123897
3734 20123897 20578173 21638900 19601741 19799909 20163240 19658908 18588293 19401057 18739487
3725 18739487 17356614 17389872 17496071 16913621 16825038 18114010 17238511 16573698 18011551
3716 18011551 15869974 15235750 17490035 17142664 17065126 17536854 17102943 16973855 17883997
3707 17883997 19235470 17722860 17302628 18346056 18713103 16496228 18086053 18088487 16110604
3698 16110604 16331823 16696785 16785816 16532808 17092398 17342188 17125502 17188795 17103270 16268365
3688 16268365 16183590 15522988 15930596 15625966 14969101 16645683 17081989 16220718 15609535
$$ packed form
3753B0169770n99165Q7889J062923J94859k53287j8298J91609L39562q20450J429122
3743B1784534J56955k33044N10860n12566Q7348o80276J355876l7114k308676
3734B0123897M54276J060727k037159J98168L63331n04332j070615Q12764o61570
3725A8739487j382873L3258J06199n82450q8583J288972q75499o64813J437853
3716A8011551k141577o34224K254285l47371p7538M71728m33911j29088R10142
3707A7883997J351473j512610m20232J043428L67047k216875J589825K434j977883
3698A6110604K21219L64962Q9031k53008N59590K49790k16686O3293q5525q34905
3688A6268365q4775o60602M07608l04630o56865J676582M36306q61271o11183
$$ plain form
3679 15609535 15533541 13862559 13910936 13915434 13642145 14426174 13761114 14221530 13379084 14532341
3669 14532341 15389707 13712499 14330844 14622801 13069332 14169029 13105027 13987701 13449755
3660 13449755 12946482 12204065 11451661 11574133 12711685 12598435 12841849 12968548 13158007
3651 13158007 13984332 14529411 13957363 14108527 13588423 11916838 11038665 11627442 11942441
3642 11942441 11012293 11709579 12371497 11685162 10953266 9970280 9562603 9564773 9910720 10167002
3632 10167002 10260710 10943065 10898761 10961587 9612668 9260023 9893217 8292280 8331612 9103884
3622 9103884 8712549 9339079 8541321 7813757 8962891 8434497 8740653 7383931 7718779
3613 7718779 8932263 8014405 8509348 8802861 6841749 5787175 7561316 6310165 6874569
$$ packed form
3679A5609535p5994j670982M8377M498k73289P84029o65060M60416q42446J153257
3669A4532341Q57366j677208O18345K91957j553469J099697j064002Q82674n37946
3660A3449755n03273p42417p52404J22472J137552j13250K43414J26699J89459
3651A3158007Q26325N45079n72048J51164n20104j671585q78173N88777L14999
3642A1942441r30148O97286O61918o86335p31896r82986m07677K170L45947K56282
3632A0167002R3708O82355m4304O2826j348919l52645O33194j600937L9332P72272
3622I103884l91335O26530p97758p27564J149134n28394L06156j356722L34848
3613G718779J213484r17858M94943K93513j961112j054574J774141j251151N64404
$$ plain form
3604 6874569 7695742 8042889 6205036 6971300 6576183 5974475 6201264 6482954 6080208
3595 6080208 6459976 6276788 6903759 7785312 6763286 7208774 7028362 6427510 5996877
3586 5996877 6576432 7861596 7620256 6581543 6960542 7054612 6518541 7607001 7634746
3577 7634746 7309083 7228103 7009697 7486617 8663297 7770859 7932581 7985215 6820834 6379031
3567 6379031 6594719 7143897 7149255 7426874 9274373 8358964 7081668 8962222 8034119
3558 8034119 5857264 6743895 6631810 6522220 8091316 8654227 8257406 7538431 7056960
3549 7056960 6793923 7403325 7064409 7379533 7151877 7484467 7292557 8207903 8802866 8517571
3539 8517571 7881863 9219750 8436804 7593195 9008723 8862232 8719051 8890677 9663027
$$ packed form
3604F874569Q21173L47147j837853P66264l95117o01708K26789K81690m02746
3595F080208L79768j83188O26971Q81553j022026M45488j80412o00852m30633
3586E996877N79555J285164k41340j038713L78999R4070n36071J088460K7745
3577G634746l25663q0980k18406M76920J176680q92438J61722N2634j164381m41803
3567F379031K15688N49178N358K77619J847499r15409j277296J880554r28103
3558H034119k176855Q86631j12085j09590J569096N62911l96821p18975m81471
3549G056960k63037O09402l38916L15124k27656L32590j91910R15346N94963k85295
3539H517571o35708J337887p82946q43609J415528j46491j43181J71626P72350
$$ plain form
3530 9663027 8890870 8767517 8904140 10086263 9538024 9842348 9630447 10679571 11227258
3521 11227258 10505047 11213850 9617673 9604038 9233115 9689564 9692180 9777202 9942122 11206246
3511 11206246 9644057 9141293 10080175 9783390 9153975 9784930 11644172 11353573 12314442
3502 12314442 12987701 12083574 11220687 11869575 11066978 11381329 11356261 12063377 12744040 11979318
3492 11979318 13341700 13815666 14915373 14715952 14364949 15047617 15414898 14497612 15081233
3483 15081233 16369522 16545131 16600748 16394150 15983700 15434503 15910880 16144658 15500996
3474 15500996 16912886 19124323 20242731 21438498 22114612 22180057 22137935 22395010 22110556
3465 22110556 21286080 22857415 22254522 21421037 22713241 22120602 22211432 23602792 22759310
$$ packed form
3530I663027p72157j23353J36623J182123n48239L04324k11901J049124N47687
3521A1227258p22211P08803j596177j3635l70923M56449K616Q5022J64920J264124
3511A1206246j562189n02764R38882k96785o29415O30955J859242k90599R60869
3502A2314442O73259r04127q62887O48888q02597L14351k5068P07116O80663p64722
3492A1979318J362382M73966J099707j99421l51003O82668L67281r17286N83621
3483A5081233J288289J75609N5617k06598m10450n49197M76377K33778o43662
3474A5500996J411890K211437J118408J195767O76114O5445m2122K57075k84454
3465B2110556q24476J571335o02893q33485J292204n92639R0830J391360q43482
$$ plain form
3456 22759310 22322034 22246345 21407451 22145085 21913570 22250204 22765580 22935158 23063198 22525387
3446 22525387 24727086 26593851 27637539 30467140 33401447 32604475 32949127 34762915
3438 34762915 32631883 30276468 29467577 28576797 27314002 27742076 27871395 27524820 27983252
3429 27983252 29055844 29980670 31029969 31635362 31792208 31878624 33441416 35138292 35399705
3420 35399705 38187240 40278338 42028243 45733077 49494110 52481731 54776755 57670378
3412 57670378 60917928 62447226 65244320 68459928 71176037 74679370 76761803 78177289
3404 78177289 78497875 78017292 76568548 75472245 73034879 70837477 68369450 64730005
3396 64730005 61521557 60057231 59126770 58287322 57872471 57469375 58020483 59336866 60622679
$$ packed form
3456B2759310m37276p5689q38894P37634k31515L36634N15376J69578J28040n37811
3446B2525387K201699J866765J043688K829601K934307p96972L44652J813788
3438C4762915k131032k355415q08891q90780j262795M28074J29319l46575M58432
3429B7983252J072592R24826J049299O05393J56846Q6416J562792J696876K61413
3420C5399705K787535K091098J749905L704834L761033K987621K295024K893623
3412E7670378L247550J529298K797094L215608K716109L503333K082433J415486
3404G8177289L20586m80583j448744j096303k437366k197402k468027l639445
3396F4730005l208448j464326r30461q39448m14851m03096N51108J316383J285813
$$ plain form
3387 60622679 63662420 67030950 70855401 76467967 82205870 87650013 91605741 94032318
3379 94032318 95938321 94881536 93393512 90869055 86738921 82486001 79654269 76298620
3371 76298620 73303113 69694782 67322684 65983912 64278696 62699799 63089174 63654798
3363 63654798 62626659 63987541 65921206 66792931 68154009 68675039 67863535 68311262 66823294
3354 66823294 65912353 63629005 60890544 58711903 57831363 56002329 53903310 52849449
3346 52849449 50734766 49274120 48784469 49269319 48446340 47607357 46713245 46306614 45498027
3337 45498027 44824012 45007188 44539765 43924194 45407265 45873078 45135545 44934646 43961561
3328 43961561 43150908 40615978 39432501 39248070 37510254 36415757 35443251 34933702 35141028
$$ packed form
3387F0622679L039741L368530L824451N612566N737903N444143L955728K426577
3379I4032318J906003j056785j488024k524457m130134m252920k831732l355649
3371G6298620k995507l608331k372098j338772j705216j578897L89375N65624
3363F3654798j028139J360882J933665Q71725J361078N21030q11504M47727j487968
3354F6823294r10941k283348k738461k178641q80540j829034k099019j053861
3346E2849449k114683j460646m89651M84850q22979q38983q94112m06631q08587
3337D5498027o74015J83176m67423o15571J483071M65813p37533k00899r73085
3328D3961561q10653k534930j183477j84431j737816j094497r72506n09549K07326
$$ plain form
3319 35141028 34810412 34319379 33363959 32627008 32665924 33592789 32990323 31809861 33243437
3310 33243437 33594248 32549317 33461672 34607362 34761848 35193280 35955708 36944783 36311371
3301 36311371 36365564 37045193 36800147 36974627 37712863 39519602 38647629 37960193 37733983
3292 37733983 38486670 37372028 37686777 39136552 38779965 38724189 40817249 43302128 44608950
3283 44608950 46410682 49617717 52401787 55570210 58959105 63330460 68850035 72365531
3275 72365531 77909023 81391329 81907177 82794886 81110367 77498320 72800546 68456929
3267 68456929 63996217 60461844 57401456 55861453 55128511 52093285 50167198 48574764
3259 48574764 46729179 45427377 44827456 45923266 46949200 47986030 51490484 54171734
$$ packed form
3319C5141028l30616m91033r55420p36951L8916R26865o02466j180462J433576
3310C3243437L50811j044931R12355J145690J54486M31432P62428R89075o33412
3301C6311371N4193O79629k45046J74480P38236J806739q71973o87436k26210
3292C7733983P52687j114642L14749J449775l56587n5776K093060K484879J306822
3283D4608950J801732L207035K784070L168423L388895M371355N519575L515496
3275G2365531N543492L482306N15848Q87709j684519l612047m697774m343617
3267F8456929m460712l534373l060388j540003p32942l035226j926087j592434
3259D8574764j845585j301802n99921J095810J025934J036830L504454K681250
$$ plain form
3251 54171734 57760295 61634405 66409243 71379530 75299920 80216678 83129794 84522140
3243 84522140 84168200 81328602 77848034 74389014 70548529 67768617 64919635 62252365
3235 62252365 59267114 57648014 56075640 55352019 55455426 54503138 54437841 55720016 57798098
3226 57798098 58479384 60114519 62159519 65558703 69261359 74094396 80334256 85975946
3218 85975946 90969936 96312457 100712339 106324629 112020008 116654254 119291342 121017102
3210 121017102 123165569 122240514 119225041 116178478 112020386 106464865 100230127 93510476
3202 93510476 87052378 80790263 75212851 69595974 64904116 61203888 58389405 57319506
3194 57319506 55560832 55037542 54049655 52310416 50603715 49884246 47823632 46613477 45384571
$$ packed form
3251E4171734L588561L874110M774838M970287L920390M916758K913116J392346
3243H4522140l53940k839598l480568l459020l840485k779912k848982k667270
3235F2252365k985251j619100j572374p23621J03407r52288o5297J282175K078082
3226E7798098O81286J635135K045000L399184L702656M833037O239860N641690
3218H5975946M993990N342521M399882N612290N695379M634246K637088J725760
3210A21017102K148467r25055l015473l046563m158092n555521o234738o719651
3202I3510476o458098o262115n577412n616877m691858l700228k814483j069899
3194E7319506j758674n23290r87887j739239j706701p19469k060614j210155j228906
$$ plain form
3185 45384571 43436437 43337995 42979643 41968755 41851333 40928521 39045422 39583758 39136221
3176 39136221 39659560 39786657 41123892 42922223 44060135 47109621 51292860 54272994
3168 54272994 57343366 59366820 60223445 61326502 60137309 58064055 57281982 54850226
3160 54850226 52737712 51863966 48797101 46380767 44645076 40825329 38613105 37555821
3152 37555821 35815743 35718891 34893363 34331326 33383132 33153300 31642284 30695790 31474479
3143 31474479 31415598 31215423 31833656 33117529 32996457 32756623 33572862 34109869 34796594
3134 34796594 35858138 35999340 37407119 38527205 39381655 38687653 39387671 40249050 40246392
3125 40246392 40799527 41781439 42741703 42730311 43203010 44595495 45204130 46454553 48282081
$$ packed form
3185D5384571j948134r8442l58352j010888j17422r22812j883099N38336m47537
3176C9136221N23339J27097J337235J798331J137912L049486M183239K980134
3168E4272994L070372K023454Q56625J103057j189193k073254p82073k431756
3160E4850226k112514q73746l066865k416334j735691l819747k212224j057284
3152C7555821j740078r6852q25528n62037r48194k29832j511016r46494P78689
3143C1474479n8881k00175O18233J283873j21072k39834Q16239N37007O86725
3134C4796594J061544J41202J407779J120086Q54450o94002P00018Q61379k658
3125D0246392N53135R81912R60264j1392M72699J392485O08635J250423J827528
$$ plain form
3116 48282081 48402619 50035458 52724594 56776763 59906201 63207341 66526246 70897445
3108 70897445 77339938 83224385 92557295 102188580 111686054 121852291 131973669 139794226
3100 139794226 145814309 148544748 145811960 142023684 137441101 130386393 122731109 118281100
3092 118281100 111950231 107407286 106627527 103187335 101049987 100931595 97928251 94584678
3084 94584678 93138254 90735866 86971955 84397217 82995250 78663122 76002287 75043496
3076 75043496 71871260 70773835 70723298 69682047 68563630 68722303 69283457 70456980 71483861
3067 71483861 75359128 79908084 84186698 88524244 92554705 94263633 94151232 93338362
3059 93338362 89102448 84964438 80950525 77574064 73118747 69512737 65632042 62342595
$$ packed form
3116D8282081J20538J632839K689136M052169L129438L301140L318905M371199
3108G0897445O442493N884447R332910R631285R497474J0166237J0121378P820557
3100A39794226O020083K730439k732788l788276m582583p054708p655284m450009
3092A18281100o330869m542945p79759l440192k137348j18392l003344l343573
3084I4584678j446424k402388l763911k574738j401967m332128k660835r58791
3076G5043496l172236j097425n0537j041251j118417J58673N61154J173523J026881
3067G1483861L875267M548956M278614M337546M030461J708928j12401q12870
3059I3338362m235914m138010m013913l376461m455317l606010l880695l289447
$$ plain form
3051 62342595 60689998 59469576 58181405 58845719 58535986 58572405 60152703 61013721 63005683
3042 63005683 62881253 61902922 59651033 58516732 55882578 53386054 50983110 47817246
3034 47817246 44635850 42962674 41129827 39455193 39746634 38858910 39484994 40204591 41189069
3025 41189069 43539289 46026796 46470884 48147948 49568323 48853887 48235614 47926603 45999734
3016 45999734 42087581 39648660 37998156 34100231 31496448 30739900 27879102 27088105
3008 27088105 26997240 24789664 24890478 23633607 20990959 20448879 19284559 16536172 16445863
2999 16445863 17104259 15167982 15775487 16478548 15698628 15387513 14296105 14466815 13663425
2990 13663425 12462745 12582509 12442572 12447037 13656443 13703068 12514122 12171071 10189152
$$ packed form
3051F2342595j652597j220422j288171O64314l09733L6419J580298Q61018J991962
3042F3005683j24430r78331k251889j134301k634154k496524k402944l165864
3034D7817246l181396j673176j832847j674634K91441q87724O26084P19597R84478
3025D1189069K350220K487507M44088J677064J420375p14436o18273l09011j926869
3016D5999734l912153k438921j650504l897925k603783p56548k860798p90997
3008B7088105r0865k207576J00814j256871k642648n42080j164320k748387r0309
2999A6445863O58396j936277O07505P03061p79920l11115j091408J70710q03390
2990A3663425j200680J19764j39937M465J209406M6625j188946l43051j981919
$$ plain form
2981 10189152 9710644 10511795 10074699 11153295 12117211 10837793 11152901 10688025 9168724
2972 9168724 8856131 8422003 9345669 10577606 10636144 11077537 13058149 11980660 11195571
2963 11195571 11262038 11019693 12529126 13203513 13979424 15804043 16724700 19395420 21953425
2954 21953425 23503147 27392902 30374931 32262110 35328777 38051029 37833403 38146392
2946 38146392 36940535 32756220 30188535 27396600 24474766 21982822 20801504 19235698
2938 19235698 15656057 14672521 14747802 11903231 11381423 11622569 9216504 8114514 8604061
2929 8604061 9259171 8929888 8653349 8754882 8888961 6967847 7886203 7993617 6855907
2920 6855907 6881836 6436995 6582913 6674743 7600294 8747112 7306740 6353119 6612967 6196874
$$ packed form
2981A0189152m78508Q01151m37096J078596R63916j279418L15108m64876j519301
2972I168724l12593m34128R23666J231937N8538M41393J980612j077489p85089
2963A1195571O6467k42345J509433O74387P75911J824619R20657K670720K558005
2954B1953425J549722L889755K982029J887179L066667K722252k17626L12989
2946C8146392j205857m184315k567685k791935k921834k491944j181318j565806
2938A9235698l579641r83536P5281k844571n21808K41146k406065j101990M89547
2929H604061O55110l29283k76539J01533J34079j921114R18356J07414j137710
2920F855907K5929m44841J45918R1830R25551J146818j440372r53621K59848m16093
$$ plain form
2910 6196874 7232772 8185226 9210885 9001006 7158002 6373658 5763876 6584128 5253335
2901 5253335 4166731 4014423 4759474 4356809 4683722 5528936 4828637 3296130 2709226
2892 2709226 3671680 2593616 2991590 5072470 4256150 3799243 4308118 2679842 3310090
2883 3310090 3090593 2662364 2250072 676733 1029049 2499650 2535649 2297812 1804801
2874 1804801 1834220 2252067 1848053 1497322 458570 396090 552965 344266 1102565 1733901
2864 1733901 1585959 1972760 1190400 197678 816307 928829 1337129 1586703 2251784 1922404
2854 1922404 1997182 2055238 1913703 952323 905338 748709 1094378 2012279 2148602 1514224
2844 1514224 1442644 875108 -169837 1198443 2037608 1085623 2775522 2668371 1229525
$$ packed form
2910F196874J035898R52454J025659k09879j843004p84344o09782Q20252j330793
2901E253335j086604j52308P45051m02665L26913Q45214p00299j532507n86904
2892B709226R62454j078064L97974K080880q16320m56907N08875j628276O30248
2883C310090k19497m28229m12292j573339L52316J470601L5999k37837m93011
2874A804801K9419M17847m04014l50731j038752o2480J56875k08699P58299O31336
2864A733901j47942L86801p82360r92722O18629J12522M08300K49574O65081l29380
2854A922404P4778N8056j41535r61380m6985j56629L45669R17901J36323o34378
2844A514224p1580n67536j044945J368280Q39165r51985J689899j07151j438846
$$ plain form
2835 1229525 1478121 1485577 1797354 1566964 -68446 -107006 585820 -173024 379771 1560699
2825 1560699 351343 624819 1112954 1394549 1414837 2043423 2291564 2095173 1535891 1584441
2815 1584441 2581887 2670546 2932324 3448240 1770306 780859 2009850 570578 1074360
2806 1074360 1529301 584141 1037078 2174991 1774375 1109200 1474170 1701328 812508
2797 812508 2499138 2805027 1279609 1677576 2169468 -512392 -1767706 307909 -836579
2788 -836579 -587239 380268 -705316 -862462 -169423 -453538 -862837 -1001584 -1497589 -535906
2778 -535906 354179 1022032 1235695 1068756 -32956 -308318 -390598 -403213 -1278365 1232897
2768 1232897 1241297 -763378 775203 -991302 -921290 -242652 -461982 -734484 -1212903 -758509
$$ packed form
2835A229525K48596P456L11777k30390j635410l8560O92826p58844N52795J180928
2825A560699j209356K73476M88135K81595K0288O28586K48141j96391n59282M8550
2815A584441R97446Q8659K61778N15916j677934r89447J228991j439272N03782
2806A074360M54941r45160M52937J137913m00616o65175L64970K27158q88820
2797H12508J686630L05889j525418L97967M91892k681860j255314K075615j144488
2788h36579K49340R67507j085584j57146O93039k84115m09299j38747m96005R61683
2778e35906Q90085O67853K13663j66939j101712k75362q2280j2615q75152K511262
2768A232897Q400k004675J538581j766505P0012O78638k19330k72502m78419M54394
$$ plain form
2758 -758509 -240959 -578890 749551 516786 -389411 735654 624628 1476199 1769183
2749 1769183 823975 -40203 -870200 -1187780 1001586 971053 766773 -904629 -1162400
2740 -1162400 -2234611 -1839857 -1273544 -814585 -683290 -760229 -151032 769664 298713 -236171
2730 -236171 341873 -1060427 -1446351 -1465913 -889021 -131161 333325 -437619 -1163301 -1209705
2720 -1209705 -1935883 -646489 319932 -1400272 -777687 436591 -997534 -152390 953557
2711 953557 1056139 -473993 440635 1347383 251635 731101 -121484 -726763 -780568 -666177
2701 -666177 -1022551 639265 -412036 -1075134 -563424 -1494491 -1483159 -652374 -845953 -57478
2691 -57478 553410 10527 -749824 -207027 -77251 -369305 -415593 -1149544 -1383784 -385304
$$ packed form
2758g58509N17550l37931J328441k32765r06197J125065j11026Q51571K92984
2749A769183r45208q64178q29997l17580K189366l0533k04280j671402k57771
2740a162400j072211L94754N66313M58959J31295p6939O09197R20696m70951n34884
2730b36171N78044j402300l85924j9562N76892P57860M64486p70944p25682m6404
2720a209705p26178J289394R66421j720204O22585J214278j434125Q45144J105947
2711I53557J02582j530132R14628R06748j095748M79466q52585o05279n3805J14391
2701f66177l56374J661816j051301o63098N11710r31067J1332Q30785j93579P88475
2691e7478O10888n42883p60351N42797J29776k92054m6288p33951k34240R98480
$$ plain form
2681 -385304 -791764 -987219 -1891973 -1270834 -3025959 -1520293 377689 116273 -441276
2672 -441276 -344319 -756966 -655836 -509589 -1007968 -5046 -820613 -450354 64106 428796
2662 428796 538599 523032 -1027471 -1172071 -940377 -1102273 54627 333441 988986 -277886
2652 -277886 417402 -451847 -670510 369740 814968 -392522 -344957 -738887 -1631845 -1032585
2642 -1032585 -193677 -533437 -946486 -302751 -1178040 -469122 725899 170995 -1009630
2633 -1009630 -94641 -200360 -334007 135141 -214647 -931910 -1729708 -1327087 -1988231 -1595440
2623 -1595440 -545294 -2166178 -1855629 -1988840 -1751162 -1691147 -1155132 -1448624 -171858
2614 -171858 77093 25468 -219389 -525051 -531829 -1641403 -1619159 -816343 -1047315 -495914
$$ packed form
2681c85304m06460j95455r04754O21139j755125J505666J897982k61416n57549
2672d41276R6957m12647J01130J46247m98379J002922q15567L70259N14460L64690
2662D28796J09803j5567j550503j44600K31694j61896J156900K78814O55545j266872
2652b77886O95288q69249k18663J040250M45228j207490M7565l93930q92958N99260
2642a032585Q38908l39760m13049O43735q75289P08918J195021n54904j180625
2633a009630R14989j05719j33647M69148l49788p17263p97798M02621o61144L92791
2623a595440J050146j620884L10549j33211K37678O0015N36015k93492J276766
2614a71858K48951n1625k44857l05662o778j109574K2244Q02816k30972N51401
$$ plain form
2604 -495914 248564 160865 34569 738546 1077881 176340 1561199 3273105 2990308 4250446
2594 4250446 3028533 3567388 2769678 1778708 1571749 885427 121659 330381 -421035
2585 -421035 -46351 109424 -481625 632717 -423634 480818 1377134 38056 -445879
2576 -445879 -752080 -1287538 -98431 48224 -193077 -804715 -506340 -645575 -1834436
2567 -1834436 -1162288 -1408096 -2825444 -2260871 -1791543 -1229123 -176288 401931 1061068
2558 1061068 -456088 -534543 -404150 -1028570 -35779 -508046 -3278 -595419 -718373 -424401
2548 -424401 -558998 -572647 -31639 -851514 -899532 -71792 -725292 131642 91514 -50337
2538 -50337 -146064 961859 1050133 -179371 -253212 -146846 -807907 -1396501 -558689 -858807
$$ packed form
2604d95914P44478q7699j26296P03977L39335r01541J384859J711906k82797J260138
2594D250446j221913N38855p97710r90970k06959o86322p63768K08722p51416
2585d21035L74684J55775n91049J114342j056351R04452Q96316j339078m83935
2576d45879l06201n35458J189107J46655k41301o11638K98375j39235j188861
2567a834436O72148k45808j417348N64573M69328N62420J052835N78219O59137
2558A061068j517156p8455J30393o24420R92791m72267N04768n92141j22954K93972
2548d24401j34597j3649N41008q19875m8018Q27740o53500Q56934m0128j41851
2538e0337r5727J107923Q8274j229504p3841J06366o61061n88594Q37812l00118
$$ plain form
2528 -858807 -448736 -259867 384882 -483829 -646012 1021561 459698 68112 157436 566273
2518 566273 -640798 -598001 817423 102255 -1241808 -476787 -42737 -376005 547562
2509 547562 330266 235936 848306 432791 193840 558000 1097337 298431 144582 328221
2499 328221 -304984 -698738 11171 -532510 -1035009 -135341 -487591 856277 1075837 977536
2489 977536 655105 199661 -510023 -748022 -458900 -729836 -532944 41105 -329955 37232
2479 37232 -743262 -662286 -54552 -953013 -583618 -160267 -89312 -43865 -946175 -952478 -12634
2468 -12634 -678947 -721068 122226 613697 695862 247226 -38681 -515671 -1409914 -717344
2458 -717344 -442768 -1890352 -314260 -69515 -65590 -356858 560529 875967 -670087 -686228
$$ packed form
2528h58807M10071J88869O44749q68711j62183J667573n61863l91586Q9324M08837
2518E66273j207071M2797J415424p15168j344063P65021M34050l33268R23567
2509E47562k17296r4330O12370m15515k38951L64160N39337p98906j53849J83639
2499C28221o33205l93754P09909n43681n02499Q99668l52250J343868K19560r8301
2489I77536l22431m55444p09684k37999K89122k70936J96892N74049l71060L67187
2479C7232p80494Q0976O07734q98461L69395M23351P0955M5447r02310o303R39844
2468a2634o66313m2121Q43294M91471Q2165m48636k85907m76990q94243O92570
2458g17344K74576j447584J576092K44745L925k91268R17387L15438j546054j6141
$$ plain form
2448 -686228 -842628 -9293 873068 -107152 16171 200806 -81037 36915 449710 -722452
2438 -722452 -2024178 -1629479 -118330 -1133767 -376129 1042910 -30112 -730610 182917
2429 182917 1213183 1007281 504102 60472 801644 -241169 784986 624087 659316
2420 659316 1227085 -420649 59781 391632 -119693 151399 893181 1543003 632484 -229396
2410 -229396 591081 514241 -57674 1309594 1628524 1468812 1061084 2287319 1840456 965207
2400 965207 1321233 2014721 1826985 1801964 2005704 2802588 1095546 357392 1632485 1040673
2390 1040673 1522322 2244112 1630217 1538379 2424141 2707444 3892996 3530410 2954570 2556711
2380 2556711 3603679 3444212 2831339 5570518 5714312 4056127 4167677 5704309 5179569
$$ packed form
2448f86228j56400Q33335Q82361r80220J23323J84635k81843J17952M12795j172162
2438g22452j301726L94699J511149j015437P57638J419039j073022p00498R13527
2429A82917J030266k05902n03179m43630P41172j042813J026155j60899L5229
2420F59316N67769j647734M80430L31851n11325K71092P41782O49822r10519q61880
2410b29396Q20477p6840n71915J367268L18930j59712m07728J226235m46863q75249
2400I65207L56026O93488j87736k5021K03740P96884j707042p38154J275093n91812
2390A040673M81649P21790o13895r1838Q85762K83303J185552l62586n75840l97859
2380B556711J046968j59467o12873K739179J43794j658185J11550J536632n24740
$$ plain form
2371 5179569 5151993 5785731 6646248 4389817 5168762 7209933 6759290 7099623 7410644
2362 7410644 8526322 8231967 7929729 10033886 10068110 8652547 9951992 12267230 11349029
2353 11349029 10992868 11668469 13319226 13789399 15809526 19340045 24328274 29822293 32636150
2344 32636150 35275553 38875182 40101315 42635270 46758437 52610803 59413332 70849318
2336 70849318 89283931 118590840 167452969 250147200 355729661 463962685 519238687
2329 519238687 513232128 494315177 441687525 373222857 305518497 247632157 198252378
2322 198252378 155743711 121060743 97202613 83626579 73800238 67211851 62813855
2315 62813855 58868047 53317236 48148984 43085081 38829232 36869684 33241338 30792493
$$ packed form
2371E179569k7576O33738Q60517k256431P78945K041171m50643L40333L11021
2362G410644J115678k94355l02238K104157L4224j415563J299445K315238r18201
2353A1349029l56161O75601J650757M70173K020127L530519M988229N494019K813857
2344C2636150K639403L599629J226133K533955M123167N852366O802529J1435986
2336G0849318J8434613K9306909M8862129Q2694231J05582461J08233024N5276002
2329E19238687o006559j8916951n2627652o8464668o7704360n7886340m9379779
2322A98252378m2508667l4682968k3858130j3576034r826341o588387m397996
2315F2813855l945808n550811n168252n063903m255849j959548l628346k448845
$$ plain form
2307 30792493 29143368 26483941 23617406 22379732 22397075 21610026 19634589 19652347 19578582
2298 19578582 18517747 18312547 17366335 16260300 13218739 13505429 14473998 12180956 11161454
2289 11161454 12056518 11532702 10966394 10668957 10381527 10443228 8768810 9307515 9281240 9024451
2279 9024451 9205085 8844754 9194139 10272894 7496643 7629204 8386388 6182585 5683448
2270 5683448 6275443 7437657 5605380 6412674 7321999 5999400 5281730 6459200 5499915
2261 5499915 4352629 4576045 5407375 5320107 5374279 5851664 5400316 5111103 4612275 5053066
2251 5053066 5184877 4745421 3817890 3182542 3070698 2965089 3708974 3524606 3590274 2238106
2241 2238106 3017663 2699858 2956881 2403455 2679533 3345125 3318283 2755730 3727676 2788339
$$ packed form
2307C0792493j649125k659427k866535j237674J7343p87049j975437J7758p3765
2298A9578582j060835k05200r46212j106035l041561K86690R68569k293042j019502
2289A1161454Q95064n23816n66308k97437k87430O1701j674418N38705k6275k56789
2279I024451J80634l60331L49385J078755k776251J32561P57184k203803m99137
2270E683448N91995J162214j832277Q07294R09325j322599p17670J177470r59285
2261E499915j147286K23416Q31330q7268N4172M77385m51348k89213m98828M40791
2251E053066J31811m39456r27531o35348j11844j05609P43885j84368O5668j352168
2241B238106P79557l17805K57023n53426K76078O65592k6842n62553R71946r39337
$$ plain form
2231 2788339 1033789 2542321 1350195 473023 667262 1903743 283141 122611 520155
2222 520155 1273754 869517 1217059 1815568 1047937 992445 1274489 523342 624191 2160826
2212 2160826 2014359 1910243 1547052 1348037 -122413 417016 771215 -271638 -559458
2203 -559458 406068 334571 -3293 1182280 640047 -434808 -752118 -556045 -413618 -253151
2193 -253151 336149 570638 -681245 182831 1544271 1406975 45038 -656399 -848833
2184 -848833 -2088873 -498473 -212969 -219984 552182 1348555 809413 427710 697090 945085
2174 945085 314389 558453 836339 296068 1851137 910511 -123528 -639082 -182700
2165 -182700 -523400 47175 111475 448995 76529 -126593 600937 271630 -742118 256184
$$ packed form
2231B788339j754550J508532j192126q77172J94239J236481j620602j60530L97544
2222E20155P53599m04237L47542N98509p67631n5492K82044p51147J00849J536635
2212B160826j46467j04116l63191j99015j470450N39429L54199j042853k87820
2203e59458R65526p1497l37864J185573n42233j074855l17310J96073J42427J60467
2193b53151N89300K34489j251883Q64076J361440j37296j361937p01437j92434
2184h48833j240040J590400K85504p015P72166P96373n39142l81703K69380K47995
2174I45085o30696K44064K77886n40271J555069r40626j034039n15554M56382
2165a82700l40700N70575O4300L37520l72466k03122P27530l29307j013748R98302
$$ plain form
2155 256184 811076 -556171 212101 532028 -421148 -601662 1035805 69783 327702
2146 327702 40285 -1016472 -1181638 -70600 815890 -38344 207359 -359510 -271741 -708530
2136 -708530 30543 -841384 -156351 151627 178643 187324 690649 -442680 -2193315 -951920
2126 -951920 -1333994 -819832 -1156118 410578 355580 795121 721299 973564 -135129 -1238611
2116 -1238611 -1150682 -772440 -663302 -118959 341222 146476 692333 -354148 -494799 -1551886
2106 -1551886 -1845928 -1704469 -807731 -385019 254384 748729 162350 -1130150 -1445973
2097 -1445973 -1157627 -2143949 -1684872 -1675013 -341353 -521354 -1041580 -305707 -599274 -2191799
2087 -2191799 -1591113 -877738 -636221 -385903 371580 52588 -470111 -389824 -568005 -1239209
$$ packed form
2155B56184N54892j367247P68272L19927r53176j80514J637467r66022K57919
2146C27702k87417j056757j65166J111038Q86490q54234K45703n66869Q7769m36789
2136g08530P39073q71927O85033L07978K7016Q681N03325j133329j750635J241395
2126i51920l82074N14162l36286J566696n4998M39541p3822K52265j108693j103482
2116a238611Q7929L78242J09138N44343M60181j94746N45857j046481j40651j057087
2106a551886k94042J41459Q96738M22712O39403M94345n86379j292500l15823
2097a445973K88346r86322M59077R859J333660j80001n20226P35873k93567j592525
2087b191799O00686P13375K41517K50318P57483l18992n22699Q0287j78181o71204
$$ plain form
2077 -1239209 -1156303 -1205560 -1391152 -663590 -820508 -518730 -760653 -1516389 -1412463 -1325741
2067 -1325741 -936556 -688164 -623836 -261310 250246 1676355 1657633 1594238 1239681 735974
2057 735974 133314 754135 476560 -454227 173541 159488 -436867 -498415 -398051 -1054010
2047 -1054010 -1037193 -1281160 -738147 -620554 -804442 58011 -25462 -1030727 -1893441 -1204882
2037 -1204882 -2469635 -1111966 -645117 -215064 -14635 -245823 -1090832 -318522 -945638
2028 -945638 -1845992 -993643 -838189 -369421 -216838 -334402 -539671 -371711 -1192702 -1602521
2018 -1602521 -1339898 -1056976 -850728 -243026 -269166 -1343754 -927432 -1325613 -2590180
2009 -2590180 -1422107 -683565 -962928 -776821 -815308 -4036 -1188089 -1052146 -1188536
$$ packed form
2077a239209Q2906m9257j85592P27562j56918L01778k41923p55736J03926Q6722
2067a325741L89185K48392O4328L62526N11556J426109j8722o3395l54557n03707
2057G35974o02660O20821k77575r30787O27768j4053n96355o1548J00364o55959
2047a054010J6817k43967N43013J17593j83888Q62453q3473j005265q62714O88559
2037a204882j264753J357669M66849M30053K00429k31188q45009P72310o27116
2028i45638r00354Q52349J55454M68768J52583j17564k05269J67960q20991m09819
2018a602521K62623K82922K06248O07702k6140j074588M16322l98181j264567
2009b590180J168073P38542k79363J86107l8487Q11272j184053J35943j36390
$$ plain form
2000 -1188536 -1545749 -1123342 -742996 -1292213 -170276 -678187 -231330 501969 -758673
1991 -758673 -904195 -1300625 -802198 -768941 214203 -595206 -754188 -1413985 -188830 -39823
1981 -39823 -33037 -1400451 -1891370 -688074 -736647 -839118 -529592 -716740 -1749139 -1397701
1971 -1397701 -1640324 -1454192 -2813778 -1469630 -1514310 -2751779 -1619420 -1579563 -1382099
1962 -1382099 -1511452 -1467325 -1396853 -1509686 -1605237 -337105 -1356406 -804964 -1875758 -1518036
1952 -1518036 -1668107 -1268387 -1316625 -998269 -538769 -1815598 -647605 -982661 -1768802
1943 -1768802 -2296851 5076 -188371 -988731 -501400 -412041 -800082 -1792905 -2048461 -1759351
1933 -1759351 -3035866 -3573358 -1193137 -2421175 -896983 -598531 -1310812 -2242288 -2232919
$$ packed form
2000a188536l57213M22407L80346n49217J121937n07911M46857P33299j260642
1991g58673j45522l96430M98427L3257R83144q09409j58982o59797J225155J49007
1981c9823O786j367414m90919J203296m8573j02471L09526j87148j032399L51438
1971a397701k42623J86132j359586J344148m4680j237469J132359L9857J97464
1962a382099j29353M4127P0472j12833r5551J268132j019301N51442j070794L57722
1952a518036j50071L99720m8238L18356M59500j276829J167993l35056p86141
1943a768802n28049K301927j93447q00360M87331Q9359l88041r92823k55556K89110
1933a759351j276515n37492K380221j228038J524192K98452p12281r31476R369
$$ plain form
1924 -2232919 -1282661 -1993860 -1575972 -1524348 -1121548 -218760 229399 -1361468 -1593889 -1951241
1914 -1951241 -1994653 -1995777 -898332 -1546942 -1136768 -335768 -877575 -1137438 -950123 -318291
1904 -318291 -1463823 -1436659 -1102529 -269237 -354660 -392331 539844 442388 -1069146 -761399
1894 -761399 -1263787 -1435619 -663002 -1102932 -1917778 -1785348 -1678412 -2032612 -1273478 -720949
1884 -720949 -1459837 -856821 -1421826 -2088789 -1232889 -794500 -953344 -1330983 -1573144 -1960817
1874 -1960817 -2087715 -816667 95892 -1200122 -160368 -458074 -1281203 -57436 -652576
1865 -652576 -1166013 -986845 -2370855 -2210894 -41347 -797410 -121544 -440765 -74455
1856 -74455 -644080 -1465765 -675405 -1956300 -2555493 -1883400 -1282734 -1438785 -368553 -966417
$$ packed form
1924b232919R50258p11199M17888N1624M02800R02788M48159j590867k32421l57352
1914a951241m3412j124J097445o48610M10174Q01000n41807k59863J87315O31832
1904c18291j145532K7164L34130Q33292q5423l7671R32175r7456j511534L07747
1894g61399n02388j71832P72617m39930q14846J32430J06936l54200P59134N52529
1884g20949p38888O03016n65005o66963Q55900M38389j58844l77639k42161l87673
1874a960817j26898J271048R12559j296014J039754k97706q23129J223767n95140
1865f52576n13437J79168j384010J59961K169547p56063O75866l19221L66310
1856g4455n69625q21685P90360j280895n99193O72093O00666j56051J070232n97864
$$ plain form
1846 -966417 -94420 -1075392 -1937544 -2677815 -3240009 -1933650 -1689723 -1826968 -515227
1837 -515227 -1606359 -1737773 -559705 -1009619 -868135 -1431084 -2161370 -2250318 -1491106 -1073988
1827 -1073988 -1685410 -1390127 -2038274 -2720935 -2713395 -1589903 -1855812 -1753044 -1516993 -1138090
1817 -1138090 -1178230 -298411 -476520 -784250 -1352902 -1532798 -1691428 -827088 -1474431 -671643
1807 -671643 -743778 -1754366 -1962709 -2162067 -1428574 -2665185 -2642066 -1036176 -1042648 -1772855
1797 -1772855 -1358233 -836498 -1319585 -1869234 -1108610 -1184267 -2203703 -1574177 -683102 -2408908
1787 -2408908 -2068736 -2340974 -2989855 -2992255 -1996200 -1654847 -1965148 -2136962 -1840313 -911795
1777 -911795 -1721937 -1568369 -1651305 -2411304 -2730313 -1382235 -4592 -782330 755858
$$ packed form
1846i66417Q71997r80972q62152p40271n62194J306359K43927j37245J311741
1837e15227j091132j31414J178068m49914J41484n62949p30286q8948P59212M17118
1827a073988o11422K95283o48147o82661P540J123492k65909J02768K36051L78903
1817a138090m0140Q79819j78109l07730n68652j79896j58630Q64340o47343Q02788
1807f71643p2135j010588k08343j99358P33493j236611K3119J605890o472p30207
1797a772855M14622N21735m83087n49649P60624p5657j019436O29526Q91075j725806
1787b408908L40172k72238o48881k400R96055L41353l10301j71814K96649R28518
1777i11795q10142J53568q2936p59999l19009J348078J377643p77738J538188
$$ plain form
1768 755858 -95446 -861801 -1425577 -1373000 -1486419 -420774 -457018 -1152663 -605402 429389
1758 429389 340806 -298566 552672 -334349 -1551978 -953607 -859146 -1328070 -36353 179951
1748 179951 -1719927 -1309166 -1112585 -623800 -1744482 -1231137 -925335 -735100 -1487335
1739 -1487335 -329001 -124811 -1232203 -1624227 -1553805 -1741391 -1894711 -1583262 -957564
1730 -957564 344579 -1162121 83870 -180501 395925 -986269 -1015010 -1434393 -2098092
1721 -2098092 -1231597 -935456 -923013 -1375374 -1213127 -1728376 -1421123 -1647179 -502550 -289004
1711 -289004 -1358415 -1644077 -427940 -81233 -296900 -529672 -385517 -343590 -1946600
1702 -1946600 -336682 -1135821 -1175313 -984579 -1408190 -1610497 -2351790 -2748552 -1719151
$$ packed form
1768G55858q51304p66355n63776N2577j13419J065645l6244o95645N47261J034791
1758D29389q8583o39372Q51238q87021j217629N98371R4461m68924J291717K16304
1748A79951j899878M10761J96581M88785j120682N13345L05802J90235p52235
1739a487335J158334K04190j107392l92024P0422j87586j53320L11449O25698
1730i57564J302143j506700J245991k64371N76426j382194k8741m19383o63699
1721b098092Q66495K96141J2443m52361J62247n15249L07253k26056J144629K13546
1711b89004j069411k85662J216137L46707k15667k32772J44155M1927j603010
1702a946600J609918p99139l9492J90734m23611k02307p41293l96762J029401
$$ plain form
1693 -1719151 -1407133 -2858372 -1750173 -1289813 -2302325 -1062886 558370 -824342 -913782
1684 -913782 -465810 -1484670 -1818968 -1217462 -793418 -2038376 -2170579 -2542043 -2091490
1675 -2091490 -1532732 -1014628 -2376615 -3380355 -3405554 -3162938 -1819149 -1485572 -439966
1666 -439966 -933338 -868182 -1040845 -798507 -1855864 -1679797 -95959 -891322 -1679691 -1192781
1656 -1192781 -1110797 -1957232 -1436930 -1716293 -2151168 -1605980 -799774 477879 935894 566639
1646 566639 -44675 -76570 -1415071 -977831 -793232 -1094965 -1681757 -874618 -1127354 -754325
1636 -754325 -1550929 -1452418 -1457140 -2838829 -2408366 -1985573 -1599839 -1100527 -775361 -507421
1626 -507421 804232 -273839 564129 720310 -463097 -1021531 -1468704 -1233878 -1249631
$$ packed form
1693a719151L12018j451239J108199M60360j012512J239439J621256j382712q9440
1684i13782M47972j018860l34298O01506M24044j244958j32203l71464M50553
1675b091490N58758N18104j361987j003740k5199K42616J343789L33577J045606
1666d39966m93372O5156j72663K42338j057357J76067J583838p95363p88369M86910
1656a192781Q1984q46435N20302k79363m34875N45188Q06206J277653M58015l69255
1646E66639o11314l1895j338501M37240J84599l01733n86792Q07139k52736L73029
1636g54325p96604R8511m722j381689M30463M22793L85734M99312L25166K67940
1626e07421J311653j078071Q37968J56181j183407n58434m47173K34826j5753
$$ plain form
1617 -1249631 -405529 478101 -169146 -1094801 -781794 -956000 -850075 -1080293 -837002 -1331241
1607 -1331241 -1749317 218760 467832 91468 361193 -1262911 -2674033 -2291088 -2337102
1598 -2337102 -473470 -696192 -334911 -138690 -529970 -1534616 -894423 -1172361 -1385574
1589 -1385574 -2272535 -1553184 -1521655 -1185552 -648346 -499826 -901516 -2727724 -2439199 -3410820
1579 -3410820 -2453567 -746729 -1294194 -1492842 -825991 -893233 -297989 -1060416 -1764369 -1359299
1569 -1359299 -2131074 -2352905 -1507051 -1306492 -947847 -205051 -2182144 -1814172 -1769641 -1508024
1559 -1508024 -1209711 -773318 -951624 -889478 169348 265039 -460833 -1279728 -1677689 -3077523
1549 -3077523 -2655601 -1937523 -550489 -1417166 -387680 -246193 -1472716 -1840678 -2241560
$$ packed form
1617a249631Q44102Q83630o47247r25655L13007j74206J05925k30218K43291m94239
1607a331241m18076J968077K49072l76364K69725j624104j411122L82945m6014
1598b337102J863632k22722L61281J96221l91280j004646O40193k77938k13213
1589a385574q86961P19351L1529L36103N37206J48520m01690j826208K88525r71621
1579c410820R57253J706838n47465j98648O66851o7242N95244p62427p03953M05070
1569a359299p71775k21831Q45854K00559L58645P42796j977093L67972M4531K61617
1559a508024K98313M36393j78306O2146J058826R5691p25872q18895l97961j399834
1549c077523M21922P18078J387034q66677J029486J41487j226523l67962m00882
$$ plain form
1540 -2241560 -2464544 -3210174 -3323326 -2072620 -1285831 -1439884 522708 201035 -1307385
1531 -1307385 -1716658 -1652794 -1886921 -1935033 -1001513 -709749 -1193115 -2247477 -1487199 -1848315
1521 -1848315 -741923 -422758 -1029678 -863501 -1245527 -471575 -648435 -357110 121694
1512 121694 -283059 -90701 -325047 -651759 186626 773175 -358372 -509987 -788357 -344607
1502 -344607 -1428954 -700417 -1274541 -1639456 -1359741 -682466 -386877 -708780 -214740 -724763
1492 -724763 -934460 -1161480 -470619 -207266 -1876663 -857198 -754161 -1032293 -325178
1483 -325178 -799869 -1137880 -1343329 -781727 -1181811 -1051062 -1120143 -507881 -338606 -711674
1473 -711674 -261200 -912852 -1284731 -803417 -1254624 -1161944 -823636 -152480 -27366 -313792
$$ packed form
1540b241560k22984p45630j13152J250706P86789j54053J962592l21673j508420
1531a307385m09273O3864k34127m8112R33520K91764m83366j054362P60278l61116
1521a848315J106392L19165o06920J66177l82026P73952j76860K91325M78804
1512A21694m04753J92358k34346l26712Q38385N86549j131547j51615k78370M43750
1502c44607j084347P28537n74124l64915K79715O77275K95589l21903M94040n10023
1492g24763k09697k27020O90861K63353j669397J019465J03037k78132P07115
1483c25178m74691l38011k05449N61602m00084J30749o9081O12262J69275l73068
1473g11674M50474o51652l71879M81314m51207R2680L38308O71156J25114k86426
$$ plain form
1463 -313792 -912835 -464603 -1064580 -2456151 -2338954 -1951096 -2034042 -1411415 -1210373 -1695289
1453 -1695289 -1742296 -1133117 -878656 -1657553 -2672756 -2065493 -2149357 -1773773 -924239 -46154
1443 -46154 -298818 -1771087 -1159346 -785069 -2297518 -1793133 -1149497 -2070713 -1213591 -1125755
1433 -1125755 -656163 -21816 -592741 -345387 -454017 -1603758 -538708 -729968 -127387
1424 -127387 -148861 -1700223 -391056 -916186 -1531442 -1188448 -1723100 -1153586 -1212581 -2079494
1414 -2079494 -1224637 -1219816 -1071893 -693909 -1883802 -1707198 -1978759 -1050499 -567143 -69847
1404 -69847 -379557 -34129 -1520825 -1815485 -1682127 -1803654 -1968611 -1929161 -869428 -2138969
1394 -2138969 -941789 -1817531 -1400234 -651815 -1198549 -2258011 -731380 -213836 -191970
$$ packed form
1463c13792n99043M48232n99977j391571J17197L87858q2946O22627K01042m84916
1453a695289m7007O09179K54461p78897j015203O07263q3864L75584Q49534Q78085
1443d6154k52664j472269O11741L74277j512449N04385O43636r21216Q57122Q7836
1433a125755M69592O34347n70925K47354j08630j149741J065050j91260O02581
1424a27387k1474j551362J309167n25130o15256L42994n34652N69514n8995q66913
1414b079494Q54857M821J47923L77984j189893J76604k71561R28260M83356M97296
1404f9847l09710L45428j486696k94660J33358j21527j64957L9450J059733j269541
1394b138969J197180q75742M17297P48419n46734j059462J526631N17544K1866
$$ plain form
1385 -191970 442188 -600787 -531344 -373638 -824997 -1636683 -1594760 -1858285 -998242 -487477
1375 -487477 -885665 -690548 25600 -574329 -1659299 -1811738 -1376282 -1112664 -1516375 -232471
1365 -232471 -1065142 -1434693 -1707268 -1924761 -1681101 -961826 -2777135 -2410381 -2292476 -3364527
1355 -3364527 -1303452 -933753 -1013145 -100727 -878553 -2084755 -2560619 -2072447 -1211811
1346 -1211811 -872200 -1261143 -1892988 -2525322 -1269926 -1398503 -1952782 -1649554 -1790671
1337 -1790671 -1278136 -178691 562217 906100 127124 -883176 -1004726 -717941 155652
1328 155652 557642 -410956 -1204858 -331526 -454852 -1967709 -1842233 -1565828 -2048808 -3077379
1318 -3077379 -2350865 -2316913 -2150085 -1125365 -1291499 -2178474 -1953405 -1173656 -1964833 -1361879
$$ packed form
1385a91970O34158j042975O9443J57706m51359q11686M1923k63525Q60043N10765
1375d87477l98188J95117P16148n99929j084970j52439M35456K63618m03711J283904
1365b32471q32671l69551k72575k17493K43660P19275j815309L66754J17905j072051
1355c364527K061075L69699p9392R12418p77826j206202m75864M88172Q60636
1346a211811L39611l88943o31845o32334J255396j28577n54279L03228j41117
1337a790671N12535J099445P40908L43883p78976j010300j21550K86785Q73593
1328A55652M01990r68598p93902Q73332j23326j512857J25476K76405m82980j028571
1318c077379P26514L3952J66828J024720j66134q86975K25069P79749p91177O02954
$$ plain form
1308 -1361879 -1083730 -789463 -2276230 -2144009 -2105193 -2496157 -2591727 -2500654 -2633309 -1010410
1298 -1010410 -1126286 -1428717 -1028493 -600226 -434623 -1977027 -1322779 -143441 -34215
1289 -34215 186686 617008 -567056 -1267176 -864903 -368953 396911 -299209 -839442 -1732944
1279 -1732944 -1024087 -497763 142910 -37143 -1349498 -1454605 -520960 -1185935 -513894
1270 -513894 -734628 -719609 -1716595 -1354714 -698195 263052 6155 -1681670 -1932271 -2057563
1260 -2057563 -2162838 -1656620 -904766 -716977 -290297 -1651835 -970323 -1502494 -2530015
1251 -2530015 -1318448 -392940 -670767 -867218 -1154710 -455916 -1049078 -1838673 -504493
1242 -504493 -1244525 -1312528 194086 468285 -257036 443861 -1944943 -1723517 -3157019
$$ packed form
1308a361879K78149K94267j486767J32221L8816l90964r5570R1073j32655J622899
1298a010410j15876l02431M00224M28267J65603j542404O54248J179338J09226
1289c4215K20901M30322j184064p00120M02273M95950P65864o96120n40233q93502
1279a732944P08857N26324O40673j80053j312355j05107R33645o64975O72041
1270e13894k20734J5019r96986L61881O56519R61247k56897j687825k50601j25292
1260b057563j05275N06218P51854J87789M26680j361538O81512n32171j027521
1251b530015J211567R25508k77827j96451k87492O98794n93162p89595J334180
1242e04493p40032o8003J506614K74199p25321P00897k388804K21426j433502
$$ plain form
1233 -3157019 -2007773 78569 -143082 721134 -650857 -1136056 -2079477 -1659962 -814799
1224 -814799 -435598 -1669432 -1052228 -64590 12754 586603 189721 -851967 -1332551 -1821825
1214 -1821825 -752183 -274357 -1265154 -1538651 -1360912 -1223733 -1170855 -124081 424862
1205 424862 -779595 -295055 -102611 2994 -587953 -1207661 -1091322 -1243949 -869062 459560
1195 459560 -414831 -1203903 -694317 -574171 -579712 -182611 -192468 100429 218882 -782270
1185 -782270 -976088 -518982 -1559719 547876 774954 857484 268354 325919 -711434 -1347298
1175 -1347298 -1817607 -2483947 -1443999 -1321127 -1892696 -892144 449852 195978 -1687182
1166 -1687182 -2055208 -1323316 -2290620 -651220 9639 3420 -875951 -442587 -567867 -1913465
$$ packed form
1233c157019J149246K086342k21651Q64216j371991m85199r43421M19515Q45163
1224h14799L79201j233834O17204R87638P7344N73849l96882j041688m80584m89274
1214a821825J069642M77826r90797k73497J77739J37179N2878J046774N48943
1205D24862j204457M84540J92444J05605n90947o19708J16339j52627L74887J328622
1195D59560q74391p89072N09586J20146n541L97101r857K92897J18453j001152
1185g82270j93818M57106j040737K107595K27078Q2530n89130N7565j037353o35864
1175a347298m70309o66340J039948J22872n71569J000552J341996k53874j883160
1166a687182l68026P31892r67304J639400O60859o219q79371M33364j25280j345598
$$ plain form
1156 -1913465 -921087 -1306379 -359920 -832609 -1564936 -1496824 100799 -508956 -1355755 -1713446
1146 -1713446 -1640173 -1325876 -1115154 -624429 71921 -219478 -1424777 -237777 -910800
1137 -910800 73234 -1169044 -1316460 -2411592 -1718987 -1000819 -1386356 -1913614 -823945
1128 -823945 677314 -671324 -714204 -32357 -1333347 -2060105 -1431927 -2432995 -655740
1119 -655740 -930100 -97078 1435406 49065 -269138 -435888 -255240 -719464 -272732
1110 -272732 -217681 -239894 -317836 216515 225262 -649562 -1717539 -1080544 -1290248 -1479279
1100 -1479279 -104951 -175299 -1849173 -1208229 -597164 -707007 311422 -505935 8032
1091 8032 13207 -390406 -2015769 -1879429 -787636 -492602 -1569898 -1146188 -1102147 -1361227
$$ packed form
1156a913465R92378l85292R46459m72689p32327O8112J597623o09755q46799l57691
1146a713446P3273L14297K10722M90725O96350k91399j205299J187000o73023
1137i10800R84034j242278j47416j095132O92605P18168l85537n27258J089669
1128h23945J501259j348638m2880O81847j300990p26758O28178j001068J777255
1119f55740k74360Q33022J532484j386341l18203j66750J80648m64224M46732
1110b72732N5051k2213p7942N34351Q747q74824j067977O36995k09704j89031
1100a479279J374328p0348j673874O40944O11065j09843J018429q17357N13967
1091H032N175m03613j625363J36340J091793K95034j077296M23710M4041k59080
$$ plain form
1081 -1361227 301865 -887327 -2284647 -1976918 -924233 -1161996 -968824 642621 517271
1072 517271 -712911 -942881 -867160 -989877 -1223682 -28007 -1593688 -1099779 -1195947 -1544471
1062 -1544471 -864457 -239490 -767736 -600375 -88417 175331 -389982 -346727 368579 -813664
1052 -813664 -175357 298320 -5147 -9928 199844 -195095 -918387 -1484168 -2414143 -1510722
1042 -1510722 -1354871 -1592885 -608237 697820 -828350 -109661 287209 -909203 -2133734
1033 -2133734 -1185301 -1345273 -2147214 -1240409 -151949 -1182037 -2024370 -1029682 -1546109
1024 -1546109 -1956917 -1415132 -1775718 -2050575 -1674199 -2282163 -200362 -130114 -791242 -1392922
1014 -1392922 -636939 -1170661 -1255167 -237194 -719336 -1466254 -1147857 -494973 -815656 -1351096
$$ packed form
1081a361227J663092j189192j397320L07729J052685k37763J93172J611445j25350
1072E17271j230182k29970P5721j22717k33805J195675j565681M93909r6168l48524
1062a544471O80014O24967n28246J67361N11958K63748n65313M3255P15306j182243
1052h13664O38307M73677l03467m781K09772l94939p23292n65781r29975R03421
1042a510722J55851k38014R84648J306057j526170P18689L96870j196412j224531
1033b133734R48433j59972q01941R06805J088460j030088q42333R94688n16427
1024a546109m10808N41785l60586k74857L76376o07964K081801P0248o61128o01680
1014a392922P55983n33722q4506J017973m82142p46918L18397O52884l20683n35440
$$ plain form
1004 -1351096 -977574 -2522415 -2177025 -833330 -1326662 -601161 -621710 -440578 -33343
995 -33343 -404212 -1077851 -2055704 -2269136 -2186825 -1675793 -743663 287706 -771665 349865
985 349865 98358 -1443125 -1647432 -219502 -348982 -381109 650782 600093 451383 484292
975 484292 -305592 -794087 -295145 -429605 454071 710269 547417 497647 -144612 867088
965 867088 391052 -232707 -165195 -824969 254181 1217226 -423399 -897947 -1082055 -1004492
955 -1004492 -2211819 -970635 -2090229 -1625737 -2052307 -2461441 -1365045 -1143732 -654066
946 -654066 -525322 585172 192392 -964656 -1640935 -1476139 -3039139 -1873892 -1490631
937 -1490631 -1822502 -955635 -495635 -1024532 -1179258 -1301212 -1946632 -1625252 -2149519 -1475912
$$ packed form
1004a351096L73522j544841L45390J343695m93332P25501k0549J81132M07235
995c3343l70869o73639r77853k13432Q2311N11032R32130J031369j059371J121530
985C49865k51507j541483k04307J427930j29480l2127J031891n0689j48710L2909
975D84292p89884m88495M98942j34460Q83676K56198j62852m9770o42259J011700
965H67088m76036o23759O7512o59774J079150R63045j640625m74548j84108P7563
955a004492j207327J241184j119594M64492m26570m09134J096396K21313M89666
946f54066J28744J110494l92780j157048o76279J64796j563000J165247L83261
937a490631l31871Q66867M60000n28897j54726j21954o45420L21380n24267O73607
$$ plain form
927 -1475912 -1903340 -916885 -669466 -295218 -688893 -829394 37549 -608794 -908805 -1398106
917 -1398106 -904480 -793795 -247445 -771984 15253 -2334691 -974013 -1074580 -635257
908 -635257 -593167 -322060 -680166 -1105145 -255024 -72229 -782995 -1921274 -1482694 -1611305
898 -1611305 -714590 -584316 -1190618 -1139019 186194 -136414 -571720 -83388 -856217 -524014
888 -524014 -353346 -580625 -1419694 215886 -606421 379830 -165683 -641835 -982724 -1438813
878 -1438813 -526657 -1388263 -1688988 -774527 -752635 -461946 -474090 -1345023 -974170 -850303
868 -850303 -1049867 -1355261 -110466 -982922 -1285481 -862877 -1453927 -2366637 -2333252 -1215717
858 -1215717 -1218712 -479364 955499 16629 18399 -186294 -187411 -822776 -169104 176113 -488953
$$ packed form
927a475912m27428R86455K47419L74248l93675j40501Q66943o46343l00011m89301
917a398106M93626J10685N46350n24539P87237k349944J360678j00567M39323
908f35257M2090K71107l58106m24979Q50121J82795p10766j138279M38580j28611
898a611305Q96715J30274o06302N1599J325213l22608m35306M88332p72829L32203
888e24014J70668k27279q39069J635580q22307R86251n45513m76152l40889m56089
878a438813R12156q61606l00725R14461K1892K90689j2144q70933L70853J23867
868h50303j99564l05394J244795q72456l02559M22604n91050r12710L3385J117535
858a215717k995P39348J434863r38870J770k04693j117o35365O53672L45217o65066
$$ plain form
847 -488953 -836160 -947934 -776540 -564847 -855113 -616088 -614447 -717792 -467725 -17842
837 -17842 1033922 -71383 978 -358538 -1143603 -475501 385419 875503 320160 686533
827 686533 -16078 -663997 -1012454 -1373968 -1439204 -1453263 -2114345 -564991 -315595 -19729
817 -19729 404567 237000 658750 -318553 -617647 -679156 -126816 -1197092 -1343911 -655849
807 -655849 -932425 -1171352 -1165672 -2125107 -2494904 -1720974 -1171562 -741091 -955787 328276
797 328276 -554303 -1339477 -1973493 -800187 -993649 -588691 617758 -484086 -523529 -638574
787 -638574 -25495 -2140476 -2082856 -1359340 -3481477 -2675111 -1318606 -1041374 -1210457 -1488381
777 -1488381 -742299 -448977 -1979628 -1393412 -1202760 -1586467 -1401056 -686927 -386897 -369346
$$ packed form
847d88953l47207j11774J71394K11693k90266K39025J641j03345K50067M49883
837a7842J051764j105305P2361l59516p85065O68102Q60920M90084n55343L66373
827F86533p02611o47919l48457l61514o5236j4059o61082J549354K49396K95866
817a9729M24296j67567M21750r77303k99094o1509N52340j070276j46819O88062
807f55849k76576k38927N680r59435l69797P73930N49412M30471k14696J284063
797C28276q82579p85174o34016J173306j93462M04958J206449j101844l9443j15045
787f38574O13079k114981N7620P23516k122137Q06366J356505K77232j69083k77924
777a488381P46082K93322j530651N86216J90652l83707J85411P14129L00030J7551
$$ plain form
767 -369346 -466028 -382047 27305 -1826014 -1655352 -125750 -39851 449843 1158308 -127786
757 -127786 -749376 -1003385 580550 716100 166308 653202 462782 483852 187160 895236
747 895236 -269611 -1201446 -1309236 -1464637 -947855 -923236 388759 -82034 -324031 -1270643
737 -1270643 -46489 -602106 -1534702 -1075551 -1169729 -1482773 -485206 -228474 -1625237 -897235
727 -897235 -1912608 -2431763 -2163391 -901439 -2272573 -613744 -774612 -2520182 -1232105
718 -1232105 -1157730 -1588517 -2354859 -1416601 -1226689 -1936003 -197899 54075 -1751085 -348520
708 -348520 -878256 -2392684 -572043 -578271 -811173 1268447 1138617 -534728 395613 -97131
698 -97131 -1041510 36793 534548 -455151 -435818 -301782 -1025202 396668 -699776 -2057938
$$ packed form
767c69346r6682Q3981M09352j853319J70662J529602Q5899M89694P08465j286094
757a27786o21590k54009J583935J35550n49792M86894j90420K1070k96692P08076
747H95236j164847r31835j07790j55401N16782K4619J311995m70793k41997r46612
737a270643J224154n55617r32596M59151r4178l13044R97567K56732j396763P28002
727h97235j015373n19155K68372J261952j371134J658829j60868j745570J288077
718a232105P4375m30787p66342R38258J89912p09314J738104K51974j805160J402565
708c48520n29736j514428J820641o228k32902K079620j29830j673345R30341m92744
698i7131r44379J078303M97755r89699J9333J34036p23420J421870j096444j358162
$$ plain form
688 -2057938 -1264169 -159831 -398601 -438385 394421 -407447 -1502832 -911609 -912695 -2417470
678 -2417470 38301 451669 -589244 -780524 607145 -34711 -867273 -248762 -1252069
669 -1252069 -1208597 -340686 107665 -386255 422111 283195 -76153 -381319 -634460 -1267488
659 -1267488 -205835 252547 -417283 382973 570623 -1978165 -1261875 -205029 -1373074
650 -1373074 -1768468 -1796193 -1381870 -1504936 -340360 182046 -846945 -535156 699843
641 699843 1138600 508217 354210 -1286210 -1352408 -1775554 -2217649 -202312 -1253146 -1824636
631 -1824636 -1275991 -1803697 -1269502 -1247992 -948504 -310713 -671411 -1394123 -465627 -146166
621 -146166 158262 556282 1007548 294779 -636767 443078 -702237 -1476086 -1839120 -1317200
$$ packed form
688b057938P93769J104338k38770l9784Q32806q01868j095385N91223j086j504775
678b417470K455771M13368j040913j91280J387669o41856q32562O18511j003307
669a252069M3472Q67911M48351m93920Q08366j38916l59348l05166k53141o33028
659a267488J061653M58382o69830Q00256J87650k548788P16290J056846j168045
650a373074l95394k7725M14323j23066J164576N22406j028991L11789J234999
641F99843M38757o30383j54007j640420o6198m23146m42095K015337j050834n71490
631a824636N48645n27706N34195K1510K99488O37791l60698p22712R28496L19461
621a46166L04428L98020M51266p12769r31546J079845j145315p73849l63034N21920
$$ plain form
611 -1317200 -513224 -741597 -370332 533444 -156375 -497947 -735990 -1061182 -1058354 -1229151
601 -1229151 -453789 -940097 -421111 -5710 138879 -470426 -288057 -879755 -1048253 -451492
591 -451492 -1039483 -1157200 84707 170424 -1614091 812664 453901 -236251 1313428
582 1313428 1400511 133910 68238 -423851 -478377 -1384426 -386990 56013 -107766 305034
572 305034 -762772 151329 3125 -1118055 -1082152 162845 103739 469069 1655881 1687543
562 1687543 -897019 -1581729 699116 -1560175 -2515568 -1306829 -1273791 -1385188 -71587
553 -71587 207863 21530 -498585 -1286695 -774180 -1544715 -675588 -1132028 -30078 1074345
543 1074345 -637057 -896118 -516303 -655209 -1287526 -815667 -25797 -1102906 -360086
$$ packed form
611a317200Q03976k28373L71265R03776o89819l41572k38043l25192K828j70797
601a229151P75362m86308N18986M15401J44589o09305J82369n91698j68498N96761
591d51492n87991j17717J241907Q5717j784515K426755l58763o90152J549679
582A313428Q7083j266601o5672m92089n4526r06049R97436M43003j63779M12800
572C05034j067806R14101j48204j121180L5903J244997n9106L65330J186812L1662
562A687543k584562o84710K280845k259291r55393J208739L3038j11397J313601
553g1587K79450j86333n20115p88110N12515p70535Q69127m56440J101950J104423
543A074345j711402k59061L79815j38906o32317M71859P89870j077109P42820
$$ plain form
534 -360086 217890 -912119 -295417 110536 48612 -58850 -166600 182498 7929 701222
524 701222 193601 333523 1199077 521522 -736004 -28625 -689875 -1883819 810094
515 810094 807840 161836 1039645 804394 -718543 -440677 453352 23691 -239968 398553
505 398553 29919 311032 236981 -877114 -907611 -1613576 -2443309 -1528926 -978564 148752
495 148752 -347815 265070 75361 -2036401 -1446230 -399829 -1132133 144558 631374
486 631374 -66547 -128551 -543117 -1751762 -1575038 -1995298 -2774413 -1666491 -1806421 -366112
476 -366112 -333841 186938 149187 -210755 -45468 -670992 -520003 -396905 -233119 -378158
466 -378158 29903 145397 -317739 -650113 -752731 -1576030 -1086010 -1711190 -1860927 -272937
$$ packed form
534c60086N77976j130009O16702M05953o1924j07462j07750L49098j74569O93293
524G01222n07621J39922Q65554o77555j257526P07379o61250j193944K693913
515H10094k254o46004Q77809k35251j522937K77866Q94029m29661k63659O38521
505C98553l68634K81113p4051j114095l0497p05965q29733R14383N50362J127316
495A48752m96567O12885j89709k111762N90171J046401p32304J276691M86816
486F31374o97921o2004m14566j208645J76724m20260p79115J107922j39930J440309
476c66112L2271N20779l7751l59942J65287o25524J50989J23098J63786j45039
466c78158M08061J15494m63136l32374j02618q23299M90020o25180j49737J587990
$$ plain form
456 -272937 -379706 277972 -404205 551190 210847 210942 -373631 -991051 -1074225 433772 -701879
445 -701879 -347835 533881 -850253 -2222003 -1244340 -810130 -1092322 211433 520662
436 520662 -650002 -1550645 126982 -319642 -760770 138519 -797235 -1489487 -1002433 -505700
426 -505700 -620772 -753307 -1055982 -48325 -333711 685116 -606513 -848564 -809865 -1127418
416 -1127418 338577 67294 -72650 -112560 450084 -248665 7342 -793266 -59868 648872
406 648872 -68203 -87112 -630051 88552 -496487 -466104 1095108 529330 -440015 -227357
396 -227357 -23359 -151013 -199219 -132712 -268752 -2321433 -1743871 -1057916 -516101 -1817566
386 -1817566 -1285180 -965427 -510801 309372 1148875 507529 580104 170091 -9694 584493
$$ packed form
456b72937j06769O57678o82177R55395l40343R5n84573o17420q3174J507997j135651
445g01879L54044Q81716j384134j371750R77663M34210k82192J303755L09229
436E20662j170664r00643J677627m46624m41128Q99289r35754o92252M87054M96733
426e05700j15072j32535l02675J007657k85386J018827j291629k42051L8699l17553
416a127418J465995k71283j39944l9910N62644o98749K56007q00608P33398P08740
406F48872p17075j8909n42939P18603n85039L0383J561212n65778r69345K12658
396b27357K03998j27654m8206O6507j36040k052681N77562O85955N41815j301465
386a817566N32386L19753M54626Q20173Q39503o41346P2575m10013j79785N94187
$$ plain form
376 584493 -110379 556892 424979 69338 -1201446 -1290053 -356171 -485612 540705 581537
366 581537 -84582 -966981 -122833 -163108 835751 340214 363557 1237171 994932 269470
356 269470 420797 111015 -1043422 -1436833 -286160 -660935 -3053967 -489761 -672756
347 -672756 -1936889 -277668 1113597 -206716 -317549 777277 875509 -499910 -503631
338 -503631 1397746 -312865 -386689 -938002 -1374911 -1095296 -774388 -77448 -130762 -392798
328 -392798 -900143 -804141 -1190748 174683 558862 1516929 670099 205250 636365 1490831
318 1490831 1450277 603055 605181 -300573 -213449 -26119 981159 226642 -660522 -1414248
308 -1414248 -376257 -361776 -1267484 254341 214629 -671189 -760553 993944 -105775 87915
$$ packed form
376E84493o94872O67271j31913l55641j270784q8607R33882j29441J026317M0832
366E81537o66119q82399Q44148m0275R98859m95537K3343Q73614k42239p25462
356B69470J51327l09782j154437l93411J150673l74775k393032K564206j82995
347f72756j264133J659221J391265j320313j10833J094826R8232j375419l721
338e03631J901377j710611p3824n51313m36909K79615L20908O96940n3314k62036
328c92798n07345R6002l86607J365431L84179R58067q46830m64849M31115Q54466
318A490831m0554q47222K126r05754Q7124J87330J007278p54517q87164p53726
308a414248J037991J4481r05708J521825l9712q85818q9364J754497j099719J93690
$$ plain form
298 87915 322270 568294 -1244304 -755209 497297 -607827 -1050652 -1327204 -583473 -1114095
288 -1114095 -867651 148443 192888 -1523693 -500929 -1014110 -1174322 -561185 188999
279 188999 502010 -367664 442300 52767 662999 579002 842640 -442725 677113 -413104
269 -413104 660879 610087 295403 1342209 340451 994654 647924 563984 477023 508057
259 508057 -1214643 -584096 -1008624 266510 859345 686847 2172647 243126 182056
250 182056 432711 -240973 -566789 259457 -438875 -413052 -784729 -805632 -1576091 -1909752
240 -1909752 -1998114 -1952881 -995288 -542643 -328250 -63330 1213820 566166 488017 -264942
230 -264942 -775444 -405526 285701 31289 -833683 -347268 -1359554 -910879 13448 -564665
$$ packed form
298H7915K34355K46024j812598M89095J252506j105124m42825k76552P43731n30622
288a114095K46444J016094M4445j716581J022764n13181j60212O13137P50184
279A88999L13011q69674Q09964l89533O10232q3997K63638j285365J119838j090217
269d13104J073983n0792l14684J046806j001758O54203l46730q3940q6961L1034
259E08057j722700O30547m24528J275134N92835j72498J485800j929521o1070
250A82056K50655o73684l25816Q26246o98332K5823l71677k0903p70459l33661
240a909752q8362M5233R57593M52645K14393K64920J277150o47654p8149p52959
230b64942n10502L69918O91227k54412q64972M86415j012286M48675R24327n78113
$$ plain form
220 -564665 -655898 361578 849940 -35414 21893 1740232 1311785 523581 1456910 1210073
210 1210073 1062202 469892 1330946 888650 -708753 -701780 577939 115195 -233611 -130946
200 -130946 716858 -262634 147211 608975 27436 -1299789 -101569 646791 281679 285772
190 285772 849543 788760 -361287 400968 438422 237077 275290 -715739 -551497 745936
180 745936 -846576 -372383 -198545 -1175243 -1147876 -451457 637279 -833976 548034
171 548034 846038 135877 276679 1144454 103862 -390570 -774042 -185110 -1095978 -504046
161 -504046 -902652 19353 1172890 128918 685431 578407 -166770 -96748 1310386 360148
151 360148 197914 496668 1077109 1094031 1052950 1234333 1160989 -1331882 -29047 46894
$$ packed form
220e64665r1233J017476M88362q85354N7307J718339m28447p88204R33329k46837
210A210073j47871n92310Q61054m42296j597403O973J279719m62744l48806J02665
200a30946Q47804r79492M09845M61764n81539j327225J198220P48360l65112M093
190B85772N63771o0783j150047P62255L7454k01345L8213r91029J64242J297433
180G45936j592512M74193J73838r76698K7367O96419J088736j471255J382010
171E48034K98004p10161J40802Q67775j040592m94432l83472N88932r10868N91932
161e04046l98606R22005J153537j043972N56513j07024p45177P0022J407134r50238
151C60148j62234K98754N80441J6922m1081J81383p3344k492871J302835P5941
$$ plain form
141 46894 -28264 1395072 607501 394127 526531 842660 -185310 -347120 726317 841026
131 841026 353248 867664 646013 978406 637611 574971 -157529 -1084866 -166878 -1235963
121 -1235963 73823 -420462 650122 -96066 549609 -48890 328227 289672 -515888 -302508
111 -302508 -298414 -410779 201101 654975 112527 -137434 -800198 -402285 -1217281 69625
101 69625 -660934 460012 1079198 83586 1033144 1193967 1599431 141742 465726 1029261
91 1029261 -128935 578180 2018653 1015058 303491 580605 1568133 792745 89194
82 89194 1236915 818265 642169 635226 443070 -183513 -76421 301519 745100 -137750
72 -137750 64667 966945 291177 511196 453937 -185769 -479367 -748992 -443845 854048
$$ packed form
141D6894p5158J423336p87571k13374J32404L16129j027970j61810J073437J14709
131H41026m87778N14416k21651L32393l40795o2640p32500r27337R17988j069085
121a235963J309786m94285J070584p46188O45675n98499L77117l8555q05560K13380
111c02508M094j12365O11880M53874n42448k49961o62764L97913q14996J286906
101F9625p30559J120946O19186r95612R49558J60823M05464j457689L23984N63535
91A029261j158196P07115J440473j003595p11567K77114R87528p75388p03551
82H9194J147721m18650j76096o943j92156o26583J07092L77940M43581q82850
72a37750K02417R02278o75768K20019n7259o39706k93598k69625L05147J297893
$$ plain form
62 854048 -84848 806460 347525 31610 999740 623607 1360884 64252 65577 340516
52 340516 1201764 595448 493775 627001 -275668 -538431 41964 541118 625912 606384
42 606384 832643 1644299 108628 699333 1005250 486688 178277 569531 578847 325291
32 325291 734237 1483752 1787873 810689 1065321 868455 -82408 -51531 354838 287729
22 287729 543144 587446 1554471 1729452 1049819 540139 397582 -182413 -14900 1178996
12 1178996 983804 911310 1521401 1169258 517505 360795 406480 202036 -87880 -217908
2 -217908 922769 1271587
0 1271587
$$ packed form
62H54048r38896Q91308m58935l15915R68130l76133P37277j296632J325K74939
52C40516Q61248o06316j01673J33226r02669k62763N80395M99154Q4794j9528
42F06384K26259Q11656j535671N90705L05917n18562l08411L91254R316k53556
32C25291M08946P49515L04121r77184K54632j96866r50863L0877M06369o7109
22B87729K55415M4302R67025J74981o79633n09680j42557n79995J67513J193896
12A178996j95192p2494O10091l52143o51753j56710M5685k04444k89916j30028
2b17908J140677L48818
0A271587
$$ Imaginary data points
##PAGE= N=2
##DATA TABLE= (X++(I..I)), XYDATA
$$ plain form
16383 -2072395 -1903328 -2538940 -2815464 -2523981 -1835311 -2174312 -2314238 -2015907 -2564960
16374 -2564960 -2703839 -1960155 -1781053 -2309298 -2486651 -2165074 -1629787 -1726644 -1608361 -1035967
16364 -1035967 -1570831 -2177962 -2401969 -1623835 -1476006 -1440152 -1233989 -1720185 -1651118 -1691513
16354 -1691513 -681643 -1445190 -1629387 -1177525 -1354622 -1627572 -1373274 -1082141 -454336
16345 -454336 -367007 -368635 -475130 -1426808 -1531772 -1048659 -1008355 -62426 -1303182 -800716
16335 -800716 -799085 -1389270 -1021319 -737832 -1618195 -1566531 -1611865 -892473 -1275487 -851085
16325 -851085 -397912 -860320 -614462 -410302 -603582 3250 -376762 -986753 -570550 -234670
16315 -234670 -26422 481188 589522 451925 -701937 -186006 -356038 -298087 -43813 77299
$$ packed form
16383b072395J69067o35612k76524K91483O88670l39001j39926K98331n49053
16374b564960j38879P43684J79102n28245j77353L21577N35287r6857J18283N72394
16364a035967n34864o07131k24007P78134J47829L5854K06163m86196O9067m0395
16354a691513J009870p63547j84197M51862j77097k72950K54298K91133O27805
16345d54336Q7329j628j06495r51678j04964M83113M0304R45929j240756N02466
16335h00716J631n90185L67951K83487q80363N1664m5334P19392l83014M24402
16325h51085M53173m62408K45858K04160j93280O06832l80012o09991M16203L35880
16315b34670K08248N07610J08334j37597j153862N15931j70032N7951K54274J21112
$$ plain form
16305 77299 446035 446720 791829 2236427 981852 1245174 233900 183864 539252 380450
16295 380450 889454 -23014 913636 -178877 914027 1504623 1288888 20710 1328521
16286 1328521 674196 348181 373889 353480 -167552 220009 1567909 1133333 1312918 1143100
16276 1143100 1124654 70500 96680 242623 332334 249443 343953 1682782 1289692 1200340
16266 1200340 429727 756572 610609 871660 1485863 3039226 1357568 2179027 2143310
16257 2143310 2990757 2137927 2422905 2228066 802693 1431907 1184239 2398242 1663277
16248 1663277 722118 2374324 2610625 2936795 2796501 1998305 1454341 600325 787501
16239 787501 1937654 2117013 2065328 3170001 2548682 1638473 2131375 840215 41166
$$ packed form
16305G7299L68736O85L45109J444598j254575K63322j011274n0036L55388j58802
16295C80450N09004r12468R36650j092513J092904N90596k15735j268178J307811
16286A328521o54325l26015K5708k0409n21032L87561J347900m34576J79585j69818
16276A143100j8446j054154K6180J45943Q9711q2891R4510J338829l93090q9352
16266A200340p70613L26845j45963K61051O14203J553363j681658Q21459l5717
16257B143310Q47447q52830K84978j94839j425373O29214k47668J214003p34965
16248A663277r41159J652206K36301L26170j40294p98196n43964q54016J87176
16239G87501J150153J79359n1685J104673o21319r10209M92902j291160p99049
$$ plain form
16230 41166 653288 810163 2071440 1985089 1899550 2769846 2838219 1300683 1441943 1759916
16220 1759916 1394722 2042766 2013302 1931138 1960873 2559334 2697359 1198556 1683811 2067724
16210 2067724 1971345 2722622 2103227 1776589 2304566 1996895 3101212 2296838 2927797
16201 2927797 2221277 1602454 2743507 2280413 1864913 2255771 2372170 2283125 2175906
16192 2175906 2515421 2849198 2741528 1654141 2556658 2658303 2971501 3842513 3721580
16183 3721580 2773618 3170714 2477238 2381766 2797389 2813576 3462046 3397829 3351764 3330131
16173 3330131 3974402 2236046 2810164 2565865 3168592 3644632 3927418 3875890 3474251
16164 3474251 3910388 3010214 2727551 1736032 2725280 3309146 3836672 3830492 3180823 1980552
$$ packed form
16230D1166O12122J56875J261277q6351q5539Q70296O8373j537536J41260L17973
16220A759916l65194O48044k9464q2164K9735N98461J38025j498803M85255L83913
16210B067724r6379P51277o19395l26638N27977l07671J104317q04374O30959
16201B927797p06520o18823J141053m63094m15500L90858J16399q9045j07219
16192B175906L39515L33777j07670j087387R02517J01645L13198Q71012j20933
16183C721580r47962L97096o93476r5472M15623J6187O48470o4217m6065k1633
16173C330131O44271j738356N74118k44299O02727M76040K82786n1528m01639
16164C474251M36137r00174k82663r91519R89248N83866N27526o180o49669j200271
$$ plain form
16154 1980552 2605723 2100082 1614476 2664092 3261235 3401743 3073003 4779491 4306729
16145 4306729 3156062 2739406 3198427 2244180 3211525 4058907 3132096 1875589 2491779
16136 2491779 2652767 2169143 4077965 4048853 4297244 4693884 4407795 4505313 5117810 3695699
16126 3695699 3144517 3763103 3901647 3581071 2685140 3942812 2913639 2886727 3221667
16117 3221667 2510833 2028402 1795421 2529203 2958254 3750964 3162285 3753503 3122232
16108 3122232 2974058 3314613 3591455 3427591 3075694 2162472 2657668 2405523 2424169 4226966
16098 4226966 2092645 1422243 2269042 3132772 2336692 3223239 3880743 2367486 3434693
16089 3434693 4455019 3545659 2264693 3107221 1167434 1620565 4406934 3573990 3373476
$$ packed form
16154A980552O25171n05641m85606J049616N97143J40508l28740J706488m72762
16145D306729j150667m16656M59021r54247R67345Q47382r26811j256507O16190
16136B491779J60988m83624J908822k9112K48391L96640k86089R7518O12497j422111
16126C695699n51182O18586J38544l20576q95931J257672j029173k6912L34940
16117C221667p10834m82431k32981P33782M29051P92710n88679N91218o31271
16108C122232j48174L40555K76842j63864l51897r13222M95196k52145J8646J802797
16098D226966k134321o70402Q46799Q63730p96080Q86547O57504j513257J067207
16089C434693J020326r09360j280966Q42528j939787M53131K786369q32944k00514
$$ plain form
16080 3373476 4370666 3594736 3136342 2597282 1948550 2539013 3301047 3992780 3237849
16071 3237849 6165433 5548148 2878615 4598656 2605455 1761203 2989713 2723911 2021135
16062 2021135 1944664 1769576 1741352 1320201 2747191 2620974 2521026 4499021 3601059 3199411
16052 3199411 2638175 2350984 1574562 2805552 2362743 2938728 2959703 3298696 2275091
16043 2275091 2355919 3569199 2626138 3447670 3646360 3885356 4257755 3302229 3003919
16034 3003919 3034779 2354821 3080894 2543070 3581341 4027644 3089392 4256407 3423665
16025 3423665 2976902 2960451 2966197 875752 2186983 4457584 2838313 3658852 6064376
16016 6064376 4517706 3693788 4644715 3888505 2746900 2956912 2725114 2415716 2385235
$$ packed form
16080C373476R97190p75930m58394n39060o48732N90463P62034O91733p54931
16071C237849K927584o17285k669533J720041j993201q44252J228510k65802p02776
16062B021135p6471j75088k8224m21151J426990j26217r9948J977995q97962m01648
16052C199411n61236k87191p76422J230990m42809N75985K0975L38993j023605
16043B275091Q0828J213280r43061Q21532J98690K38996L72399r55526k98310
16034C003919L0860o79958P26073n37824J038271M46303r38252J167015q32742
16025C423665m46763j6451N746k090445J311231K270601j619271Q20539K405524
16016F064376j546670q23918R50927p56210j141605K10012k31798l09398l0481
$$ plain form
16007 2385235 2048156 2301977 2967438 3235680 3377009 3782286 3946115 4369820 4653835
15998 4653835 4207877 2654418 3523117 3488772 3443987 3105137 3818161 3761519 4419243 3715785
15988 3715785 2626643 3746074 3502689 2920141 3664387 3285417 2553413 3636569 3888220
15979 3888220 4760540 4939774 4911783 4550520 4458960 4322678 1964236 2254387 1839517 1579452
15969 1579452 1659898 2055137 2435573 3134913 3574843 2584630 2945222 3631673 4132323 4805375
15959 4805375 4968987 3529650 3610615 3383006 3191357 2974318 3357754 3434258 2926039 3168997
15949 3168997 3256331 3115033 2804784 3447364 1940981 2356544 1601582 3496183 4017557
15940 4017557 3483136 4569479 4092049 2925029 3247161 3696689 3015658 3125209 1972516
$$ packed form
16007B385235l37079K53821O65461K68242J41329M05277J63829M23705K84015
15998D653835m45958j553459Q68699l4345m4785l38850P13024n6642O57724p03458
15988C715785j089142J119431k43385n82548P44246l78970p32004J083156K51651
15979C888220Q72320J79234k7991l61263r1560j36282k358442K90151m14870k60065
15969A579452Q0446L95239L80436O99340M39930r90213L60592O86451N00650O73052
15959D805375J63612j439337Q0965k27609j91649k17039L83436P6504n08219K42958
15949C168997Q7334j41298l10249O42580j506383M15563p54962J894601N21374
15940D017557n34421J086343m77430j167020L22132M49528o81031J09551j152693
$$ plain form
15931 1972516 2471371 2458960 2577346 1660298 2876092 2867894 1520546 2793147 3779486
$$ packed form
15931A972516M98855j2411J18386r17048J215794q198j347348J272601R86339
$$ [...]
##END NTUPLES=NMR SPECTRUM
##END=
