##TITLE=1H_TG-2409-X12
 200.13Hz, CDCl3.
 8 sc
 17.6.2026
##JCAMPDX= 6.0         $$ Bruker NMR JCAMP-DX V2.0
##DATA TYPE= NMR SPECTRUM
##DATA CLASS= NTUPLES
##ORIGIN= UXNMR, Bruker Analytische Messtechnik GmbH
##OWNER= pz
$$ XWIN-NMR		Version 3.5
$$ Wed Jun 17 15:36:26 2026 Russian Standard Time (UT+4h)  she@DPX200
##.OBSERVE FREQUENCY= 200.1313
##.OBSERVE NUCLEUS= ^1H
##.ACQUISITION MODE= SIMULTANEOUS
##.ACQUISITION SCHEME= undefined
##.AVERAGES= 8
##.DIGITISER RES= 18
##SPECTROMETER/DATA SYSTEM= spect
##.PULSE SEQUENCE= zg30
##.SOLVENT NAME= CDCl3
##.SHIFT REFERENCE= (INTERNAL, CDCl3, 0, 15.4858)
##AUDIT TRAIL= $$ (NUMBER, WHEN, WHO, WHERE, WHAT)
$$ ##TITLE= Audit trail, XWIN-NMR		Version 3.5
$$ ##JCAMPDX= 5.01
$$ ##ORIGIN= Bruker BioSpin GmbH
$$ ##OWNER= she
$$ F:/spectra/data/she/nmr/H-C/1/pdata/1/auditp.txt
$$ ##AUDIT TRAIL=  $$ (NUMBER, WHEN, WHO, WHERE, WHAT)
(   1,<2026-06-17 15:35:03.39 +0400>,<she>,<DPX200>,
      <created by zg, POWCHK disabled, PULCHK disabled
       configuration hash MD5:
       00 E9 B6 7A A2 85 ED C7 34 08 36 98 17 FE 4E 26
       data hash MD5: 16K
       8E 20 53 11 59 8A F1 F1 A1 03 3C D5 FC D1 B3 F5>)
(   2,<2026-06-17 15:35:05.57 +0400>,<she>,<DPX200>,
      <Start of raw data processing
       efp BC_mod = 2 LB = 0.25 FT_mod = 6 PKNL = 1 PHC0 = -4217.245 PHC1 = 10.39229 SI = 16K 
       data hash MD5: 16K
       89 67 F8 1F 7B E7 63 32 EB 79 52 0A 8E C3 52 D2>)
(   3,<2026-06-17 15:35:26.75 +0400>,<she>,<DPX200>,
      <pk PHC0 = 4.602417 PHC1 = -3.800001 
       data hash MD5: 16K
       B7 73 D5 A2 73 CD 58 F1 FE DD 7E D3 A5 86 C0 6A>)
(   4,<2026-06-17 15:35:31.32 +0400>,<she>,<DPX200>,
      <abs ABSG = 5 
       data hash MD5: 16K
       FF 30 93 2F 11 CF 59 37 C8 42 FE D4 A6 ED 2D EE>)
$$ ##END=
$$ 
$$ hash MD5
$$ D0 B6 39 9C 7D 5D 4D D1 A1 C3 1B D9 E5 B6 48 7B
##$RELAX= 
##$RELAX= 
##$RELAX= 
##$RELAX= 
##$RELAX= 
##$RELAX= 
$$ Bruker specific parameters
$$ --------------------------
##$DU= <F:/spectra>
##$EXPNO= 1
##$NAME= <H-C>
##$PROCNO= 1
##$TYPE= <nmr>
##$USER= <she>
##$AMP= (0..31)
100 100 100 100 100 100 100 100 100 100 100 100 100 100 100 100 100 100 
100 100 100 100 100 100 100 100 100 100 100 100 100 100 
##$AQSEQ= 0
##$AQ_mod= 1
##$AUNM= <au_zg>
##$AUTOPOS= <>
##$BF1= 200.13
##$BF2= 200.13
##$BF3= 200.13
##$BF4= 200.13
##$BF5= 200.13
##$BF6= 200.13
##$BF7= 200.13
##$BF8= 200.13
##$BYTORDA= 1
##$CFDGTYP= 0
##$CFRGTYP= 5
##$CHEMSTR= <none>
##$CNST= (0..31)
1 1 145 1 1 1 1 1 1 1 1 1 1 1 1 1 1 1 1 1 1 1 1 1 1 1 1 1 1 1 1 1 
##$CPDPRG= <>
##$CPDPRG1= <>
##$CPDPRG2= <>
##$CPDPRG3= <>
##$CPDPRG4= <mlev>
##$CPDPRG5= <mlev>
##$CPDPRG6= <mlev>
##$CPDPRG7= <mlev>
##$CPDPRG8= <mlev>
##$CPDPRGB= <>
##$CPDPRGT= <>
##$D= (0..31)
0 0.7 0 0 0 0 0 0 0 0 0 0.03 0 0 0 0 0 0 0 0 0 0 0 0 0 0 0 0 0 0 0 0 
##$DATE= 1781696102
##$DBL= (0..7)
120 120 120 120 120 120 120 120 
##$DBP= (0..7)
150 150 150 150 150 150 150 150 
##$DBP07= 0
##$DBPNAM0= <>
##$DBPNAM1= <>
##$DBPNAM2= <>
##$DBPNAM3= <>
##$DBPNAM4= <>
$$ [...]
##$SUBNAM3= <"">
##$SUBNAM4= <"">
##$SUBNAM5= <"">
##$SUBNAM6= <"">
##$SUBNAM7= <"">
##$SUBNAM8= <"">
##$SUBNAM9= <"">
##$SW= 18.0517328524113
##$SWIBOX= (0..15)
0 0 2 0 0 0 0 0 0 0 0 0 0 0 0 0 
##$SW_h= 3612.71676300578
##$TD= 16384
##$TD0= 1
##$TE= 0
##$TE2= 300
##$TE3= 300
##$TEG= 300
##$TL= (0..7)
0 120 120 120 120 120 120 120 
##$TP= (0..7)
150 150 150 150 150 150 150 150 
##$TP07= 0
##$TPNAME0= <>
##$TPNAME1= <>
##$TPNAME2= <>
##$TPNAME3= <>
##$TPNAME4= <>
##$TPNAME5= <>
##$TPNAME6= <>
##$TPNAME7= <>
##$TPOAL= (0..7)
0.5 0.5 0.5 0.5 0.5 0.5 0.5 0.5 
##$TPOFFS= (0..7)
0 0 0 0 0 0 0 0 
##$TUNHIN= 0
##$TUNHOUT= 0
##$TUNXOUT= 0
##$USERA1= <user>
##$USERA2= <user>
##$USERA3= <user>
##$USERA4= <user>
##$USERA5= <user>
##$V9= 5
##$VALIST= <valist>
##$VCLIST= <CCCCCCCCCCCCCCC>
##$VD= 0
##$VDLIST= <DDDDDDDDDDDDDDD>
##$VPLIST= <PPPPPPPPPPPPPPP>
##$VTLIST= <TTTTTTTTTTTTTTT>
##$WBST= 1024
##$WBSW= 4
##$XGAIN= (0..3)
0 0 0 0 
##$XL= 0
##$YL= 0
##$YMAX_a= 126645
##$YMIN_a= -127962
##$ZGOPTNS= <>
##$ZL1= 120
##$ZL2= 120
##$ZL3= 120
##$ZL4= 120
##$ABSF1= 15.47364
##$ABSF2= -2.578209
##$ABSG= 5
##$ABSL= 3
##$ALPHA= 0
##$AQORDER= 0
##$ASSFAC= 0
##$ASSFACI= 0
##$ASSFACX= 0
##$ASSWID= 0
##$AUNMP= <proc_1d>
##$AZFE= 0.1
##$AZFW= 0.1
##$BCFW= 0
##$BC_mod= 2
##$BYTORDP= 0
##$COROFFS= 0
##$CY= -3
##$DATMOD= 1
##$DC= 0
##$DFILT= <>
##$DTYPP= 0
##$F1P= 0
##$F2P= 0
##$FCOR= 1
##$FTSIZE= 16384
##$FT_mod= 6
##$GAMMA= 0
##$GB= 0
##$INTBC= 1
##$INTSCL= 3.241238e-09
##$ISEN= 128
##$LB= 0.25
##$LEV0= 0
##$LPBIN= 0
##$MAXI= 10000
##$MC2= 0
##$MEAN= 0
##$ME_mod= 0
##$MI= 1.114404
##$NCOEF= 0
##$NC_proc= -8
##$NLEV= 6
##$NOISF1= 3.799351
##$NOISF2= 2.8
##$NSP= 0
##$NTH_PI= 0
##$NZP= 0
##$OFFSET= 15.48576
##$PC= 1
##$PHC0= -4212.643
##$PHC1= 6.592289
##$PH_mod= 1
##$PKNL= yes
##$PPARMOD= 0
##$PSCAL= 0
##$PSIGN= 0
##$REVERSE= no
##$SF= 200.130007191852
##$SI= 16384
##$SIGF1= 3
##$SIGF2= 2
##$SINO= 0.751879
##$SIOLD= 32768
##$SREGLST= <19F.Aceton>
##$SSB= 0
##$STSI= 16384
##$STSR= 0
##$SW_p= 3612.71676300578
##$SYMM= 0
##$S_DEV= 0
##$TDeff= 16384
##$TDoff= 0
##$TI= <>
##$TILT= no
##$TM1= 0
##$TM2= 0
##$TOPLEV= 0
##$USERP1= <user>
##$USERP2= <user>
##$USERP3= <user>
##$USERP4= <user>
##$USERP5= <user>
##$WDW= 1
##$XDIM= 16384
##$YMAX_p= 527111936
##$YMIN_p= -3992165
$$ End of Bruker specific parameters
$$ ---------------------------------
##NTUPLES= NMR SPECTRUM
##VAR_NAME=  FREQUENCY,     SPECTRUM/REAL,   SPECTRUM/IMAG
##SYMBOL=    X,             R,               I
##VAR_TYPE=  INDEPENDENT,   DEPENDENT,       DEPENDENT
##VAR_FORM=  AFFN,          ASDF,            ASDF
##VAR_DIM=   16384,         16384,           16384
##UNITS=     HZ,            ARBITRARY UNITS, ARBITRARY UNITS
##FACTOR=    0.220516191357247, 1,           1
##FIRST=     3099.16520715834, 0,            0
##LAST=      -513.55155584744, 0,            0
##MIN=       -513.55155584744, -3992165,     0
##MAX=       3099.16520715834, 527111936,    0
$$ Real data points
##PAGE= N=1
##DATA TABLE= (X++(R..R)), XYDATA
$$ [...]
$$ plain form
5088 7976813 7828996 8140322 8771864 9488534 9454241 8785336 9517037 9238089 9367190 9702118
5078 9702118 9145710 9475032 10108211 10387682 10457922 10233445 10454442 10567049 10866257 11198412
5068 11198412 10826667 10838835 10627591 11031311 11637138 11930974 11961092 11481163 11554134 11688885
5058 11688885 12065077 11489151 11839614 12750097 12886675 12921515 12747597 12166982 12182954 12698668
5048 12698668 12727629 12853869 12464062 12763010 13022676 11755070 11480292 12402871 12444411 12247004
5038 12247004 12274170 11998167 12382912 11844093 11586443 11389484 11600485 11201823 11460109 11310947
5028 11310947 10876977 10907919 10751581 10877676 11412067 11614691 11760115 11621037 11454768 11306598
5018 11306598 10935139 10645148 10766310 10829838 10838763 11458824 11193791 11421008 11344289 11929583
$$ packed form
5088G976813j47817L11326O31542P16670l4293o68905P31701k78948J29101L34928
5078I702118n56408L29322O33179K79471P0240k24477K20997J12607K99208L32155
5068A1198412l71745J2168k11244M03720O05827K93836L0118m79929P2971J34751
5058A1688885L76192n75926L50463R10483J36578L4840j73918n80615J5972N15714
5048A2698668K8961J26240l89807K98948K59666j267606k74778R22579M1540j97407
5038A2247004K7166k76003L84745n38819k57650j96959K11001l98662K58286j49162
5028A1310947m33970L0942j56338J26095N34391K02624J45424j39078j66269j48170
5018A1306598l71459k89991J21162O3528Q925O20061k65033K27217p6719N85294
$$ plain form
5008 11929583 11961702 12162907 12224283 12374979 12057663 11799948 11511319 11146770 11791932 11836592
4998 11836592 12494921 12324179 12612011 12934478 13000928 12920783 12358433 12697124 12910382 12523990
4988 12523990 12471205 12676352 12845257 13594881 14278904 14473809 14532689 14711633 14717521 14526945
4978 14526945 14353594 14339831 13398638 13186245 13676188 14471116 14372018 14321862 14364156 13855571
4968 13855571 14610208 14296480 13826889 13875335 14045048 13895427 14115604 14050036 14303361 15058116
4958 15058116 14809665 14905286 15441397 15050850 15600318 15561728 16334620 16138998 14994076 15147138
4948 15147138 15192207 14767613 14756468 15256997 14826004 15339765 15580649 15360594 15793011 16155448
4938 16155448 16682038 15918820 15412772 16487743 16309808 15946670 16028429 16118795 15652646 15430619
$$ packed form
5008A1929583L2119K01205O1376J50696l17316k57715k88629l64549O45162M4660
4998A1836592O58329j70742K87832L22467O6450q0145n62350L38691K13258l86392
4988A2523990n2785K05147J68905P49624O84023J94905N8880J78944N888j90576
4978A4526945j73351j3763r41193k12393M89943P94928r9098n0156M2294n08585
4968A3855571P54637l13728m69591M8446J69713j49621K20177o5568K53325P54755
4958A5058116k48451R5621N36111l90547N49468l8590P72892j95622j144922J53062
4948A5147138M5069m24594j1145N00529m30993N13761K40884k20055M32417L62437
4938A6155448N26590p63218n06048J074971j77935l63138Q1759R0366m66149k22027
$$ plain form
4928 15430619 15486867 15702278 15838422 15769843 15025777 15238038 14691862 14890001 14562054 14121402
4918 14121402 13958664 12664967 12949525 13432869 13242515 13078771 13220621 13050044 13460774
4909 13460774 13828696 13179689 13167081 12254434 12662885 12825629 11491647 11462404 11655102 12074537
4899 12074537 11711039 11268180 11655710 11453392 11181106 10948052 10940870 10617103 11004855 10897231
4889 10897231 10609033 11619945 11922260 12151061 12121566 11862227 11545894 11273994 11375760
4880 11375760 11644020 12267788 12146368 12003758 11521779 11353249 11205538 11378556 12354423
4871 12354423 13109237 12902223 13453644 13399522 12548810 12655646 12346654 12308224 11972172 12178683
4861 12178683 12576808 13432418 12860212 12301926 12063969 11390827 11737247 12032084 12017395 12417929
$$ packed form
4928A5430619N6248K15411J36144o8579p44066K12261n46176J98139l27947m40652
4918A4121402j62738j293697K84558M83344j90354j63744J41850j70577M10730
4909A3460774L67922o49007j2608r12647M08451J62744j333982k9243J92698M19435
4899A2074537l63498m42859L87530k02318k72286k33054p182l23767L87752j07624
4889A0897231k88198J010912L02315K28801k9495k59339l16333k71900J01766
4880A1375760K68260O23768j21420j42610m81979j68530j47711J73018R75867
4871A2354423P54814k07014N51421n4122q50712J06836l08992l8430l36052K06511
4861A2178683L98125Q55610n72206n58286k37957o73142L46420K94837j4689M00534
$$ plain form
4851 12417929 12712290 12717259 12785755 12619034 12462839 12717577 12942985 12950177 13092180 13496327
4841 13496327 13954891 13754245 13983475 13388651 12870991 12888801 12994254 12303707 11609457 11954699
4831 11954699 11736742 12092555 11202644 11366320 12530186 12648488 12330146 12573229 12142113
4822 12142113 12348818 12700233 12549917 12371352 12131985 12389231 12725716 12843410 13417074
4813 13417074 14186873 14242073 14853907 14965283 14317603 14556773 14899422 15123002 15072494 14855219
4803 14855219 14900607 14949656 15121306 15787000 15939274 15913677 16635443 16368042 16334638 16395692
4793 16395692 16168521 16363466 16470642 16709850 16378971 16241907 15978447 16725477 17250638
4784 17250638 17328879 16963220 17802102 18699211 18889584 18839494 18712841 18747229 19312453 19566086
$$ packed form
4851A2417929K94361M969O8496j66721j56195K54738K25408P192J42003M04147
4841A3496327M58564k00646K29230n94824n17660J7810J05453o90547o94250L45242
4831A1954699k17957L55813q89911J63676J163866J18302l18342K43083m31116
4822A2142113K06705L51415j50316j78565k39367K57246L36485J17694N73664
4813A3417074P69799N5200O11834J11376o47680K39170L42649K23580n0508k17275
4803A4855219M5388M9049J71650O65694J52274k5597P21766k67401l3404O1054
4793A6395692k27171J94945J07176K39208l30879j37064k63460P47030N25161
4784A7250638P8241l65659Q38882Q97109J90373n0090j26653L4388N65224K53633
$$ plain form
4774 19566086 19459393 19921328 20304810 21363443 22211110 23080569 23004915 23031756 23408375 24145829
4764 24145829 25101227 25442650 25724389 25943183 25967177 25685055 25915849 26787738 27113702 27370581
4754 27370581 28305712 29920598 29935680 29937576 30678198 30966801 30458870 30465858 30712044 30742365
4744 30742365 31416677 31399313 32150487 33292027 33901367 34584596 34901393 35383681 35437044 35292629
4734 35292629 34398306 34297719 35076900 34673988 34796839 34962582 34404415 34514183 35239321
4725 35239321 35555711 34531629 34808288 34847797 35045493 34321215 33862519 34075307 34137091 34343006
4715 34343006 35534236 36221875 36242507 36909518 36944959 37220349 37134675 37278238 37502000 36740056
4705 36740056 36142168 35866145 35148501 34779888 34758299 34664252 34625397 34065305 33703909 33047722
$$ packed form
4774A9566086j06693M61935L83482J058633Q47667Q69459p5654K6841L76619P37454
4764B4145829R55398L41423K81739K18794K3994k82122K30794Q71889L25964K56879
4754B7370581R35131J614886J5082J896P40622K88603n07931O988K46186L0321
4744C0742365O74312j7364P51174J141540O09340O83229L16797M82288N3363j44415
4734C5292629q94323j00587P79181m02912J22851J65743n58167J09768P25138
4725C5239321L16390j024082K76659L9509J97696p24278m58696K12788O1784K05915
4715C4343006J191230O87639K0632O67011L5441K75390q5674J43563K23762p61944
4705C6740056n97888k76023p17644l68613k1589r4047l8855n60092l61396o56187
$$ plain form
4695 33047722 32878120 33061120 33521497 33591507 32926842 32645541 32599629 32551978 32914893 33447781
4685 33447781 33172506 33880866 33253078 33718361 33974306 34233909 33821841 33188529 33078856
4676 33078856 33028878 32312067 31392988 31130754 31203952 30984768 31123518 31139564 30570138 30608418
4666 30608418 30354480 30230651 29859008 29593228 29280912 29469094 28448575 28058641 28097753
4657 28097753 27918084 27750932 27494250 26715586 27004950 26720953 25406835 24744012 23232387
4648 23232387 22816987 22382417 21825359 21688688 21019893 21379180 21965728 20350945 20760492
4639 20760492 20910536 20319554 20074385 18497746 18237610 18541176 18147032 18228202 18206944 18290805
4629 18290805 17560611 17078685 16587367 16609945 16691451 16495669 16229686 15549362 15168712 14715129
$$ packed form
4695C3047722j69602J83000M60377P0010o64665k81301m5912m7651L62915N32888
4685C3447781k75275P08360o27788M65283K55945K59603m12068o33312j09673
4676C3078856m9978p16811r19079k62234P3198k19184J38750J6046n69426L8280
4666C0608418k53938j23829l71643k65780l12316J88182j020519l89934L9112
4657B8097753j79669j67152k56682p78664K89364k83997j314118o62823j511625
4648B3232387m15400m34570n57058j36671o68795L59287N86548j614783M09547
4639B0760492J50044n90982k45169j576639k60136L03566l94144Q1170k1258Q3861
4629A8290805p30194m81926m91318K2578Q1506j95782k65983o80324l80650m53583
$$ plain form
4619 14715129 14126971 13642293 14036921 13913026 14311939 14550458 14465111 14679541 14971205 16108653
4609 16108653 16706963 16752891 18229422 18819657 19718710 20668035 20918678 21281321 22019325
4600 22019325 22670196 23215307 22744428 22248850 22184992 22550263 22744720 22756843 22200668 21597476
4590 21597476 20620187 18858222 18621627 18047218 17672499 17307096 16686986 16369750 16277525
4581 16277525 16168139 16072045 16097753 15738439 15354724 15264827 14674237 14645648 15738612 16488389
4571 16488389 16954064 17115534 17359214 17846850 18040778 17839598 17008224 17839839 18062401
4562 18062401 17335958 17578037 17934914 18854963 19559270 20775992 21511547 21181962 21264277
4553 21264277 21889524 20857359 20485507 20291690 20309904 20759455 20257311 20774853 21204475
$$ packed form
4619A4715129n88158m84678L94628j23895L98913K38519q5347K14430K91664J137448
4609A6108653N98310M5928J476531N90235Q99053R49325K50643L62643P38004
4600B2019325O50871N45111m70879m95578o3858L65271J94457J2123n56175o03192
4590B1597476r77289j761965k36595n74409l74719l65403o20110l17236r2225
4581A6277525j09386r6094K5708l59314l83715q9897n90590k8589J092964P49777
4571A6488389M65675J61470K43680M87636J93928k01180q31374Q31615K22562
4562A8062401p26443K42079L56877R20049P04307J216722P35555l29585Q2315
4553B1264277O25247j032165l71852j93817J8214M49551n02144N17542M29622
$$ plain form
4544 21204475 21713612 21969927 22192187 22016945 22466316 22782227 21993312 21704961 22228646
4535 22228646 22827896 23160547 23250538 24417318 25728814 27907209 29617527 30319736 31579816
4526 31579816 33662749 35992748 38039618 39857008 42960123 47273460 53140851 60668608
4518 60668608 69009926 78406475 88879656 100410773 110165454 118089604 123874633 126366626
4510 126366626 125572497 122718440 117776659 111385672 102253212 91966961 82407307 73391285
4502 73391285 65476878 59047599 52222799 46401213 42542328 38379726 34874259 32248018
4494 32248018 29745883 28319810 26677742 24914320 23200379 22073404 22050524 21048726
4486 21048726 21066540 20671734 20116893 19237060 18194461 17017729 16155588 15859899 15986685
$$ packed form
4544B1204475N09137K56315K22260j75242M49371L15911p88915k88351N23685
4535B2228646N99250L32651Q9991J166780J311496K178395J710318P02209J260080
4526C1579816K082933K329999K046870J817390L103115M313337N867391P527757
4518F0668608Q341318R396549J0473181J1531117R754681P924150N785029K491993
4510A26366626p94129k854057m941781o390987r132460j0286251r559654r016022
4502G3391285p914407o429279o824800n821586l858885m162602l505467k626241
4494C2248018k502135j426073j642068j763422j713941j126975k2880j001798
4486B1048726J7814l94806n54841q79833j042599j176732q62141k95689J26786
$$ plain form
4477 15986685 16007616 15691767 16070425 16062389 15786173 16244700 16246530 15772578 15575494 14984550
4467 14984550 14091405 13342347 13070757 13396908 12660118 12441836 12985658 13499030 13277801
4458 13277801 12900447 13239331 13259933 12786694 12743492 12671673 11854561 11494228 12171104 12641721
4448 12641721 12300402 12014283 12662508 13085492 13594126 14540419 14386487 14139917 13598500
4439 13598500 13980698 13030096 12776302 12800995 13326307 13601675 13802362 13903241 14881092 15037787
4429 15037787 15336688 15174136 15497276 15773288 16120814 16412245 16366582 16289637 16144643 16576665
4419 16576665 16344935 16691219 17010831 16348348 15283816 14132270 13380265 13304826 13343132
4410 13343132 12794293 11809589 11338426 10754623 10831561 10897656 10839945 10885771 11589533 11529911
$$ packed form
4477A5986685K0931l15849L78658q036k76216M58527J830m73952j97084n90944
4467A4984550q93145p49058k71590L26151p36790k18282N43822N13372k21229
4458A3277801l77354L38884K0602m73239m3202p1819q17112l60333O76876M70617
4448A2641721l41319k86119O48225M22984N08634R46293j53932k46570n41417
4439A3598500L82198r50602k53794K4693N25312K75368K00687J00879R77851J56695
4429A5037787K98901j62552L23140K76012L47526K91431m5663p6945j44994M32022
4419A6576665k31730L46284L19612o62483j064532j151546p52005p5439L8306
4410A3343132n48839r84704m71163n83803P6938O6095n7711M5826P03762n9622
$$ plain form
4400 11529911 11049976 10901523 11716078 11457874 11578508 11464969 11720297 11765115 11443555 10838941
4390 10838941 11490052 12257475 12580120 12668539 12151808 12142775 12116560 11257009 11237042 12082902
4380 12082902 11860574 11688652 11347198 10973238 10775086 11355384 11364328 11075227 11370568 11124530
4370 11124530 11840514 11035973 11245721 11381543 11083503 12275803 12417751 12354170 12649611
4361 12649611 12651295 12766179 13334800 12412261 12361232 12691541 12340888 12824984 13007790 12692404
4351 12692404 12761120 13023740 13726938 14115539 14075951 14320545 14605259 14350156 14407048 14426344
4341 14426344 13947585 14496614 14717487 14443528 14512615 14804702 15217884 15953741 16433560 16763912
4331 16763912 17091740 16503558 16975212 17049003 17218282 17475902 16972672 17640526 18247409 17867041
$$ packed form
4400A1529911m79935j48453Q14555k58204J20634j13539K55328M4818l21560o04614
4390A0838941O51111P67423L22645Q8419n16731r033k6215q59551j9967Q45860
4380A2082902k22328j71922l41454l73960j98152N80298Q944k89101K95341k46038
4370A1124530P15984q04541K09748J35822k98040J192300J41948o3581K95441
4361A2649611J684J14884N68621r22539n1029L30309l50653M84096J82806l15386
4351A2692404O8716K62620P03198L88601l9588K44594K84714k55103N6892J9296
4341A4426344m78759N49029K20873k73959O9087K92087M13182P35857M79819L30352
4331A6763912L27828n88182M71654P3791J69279K57620n03230O67854O06883l80368
$$ plain form
4321 17867041 17842611 18567028 18605520 18791409 18927495 18546917 19055774 19294600 20234527 20978667
4311 20978667 20825208 21253273 21945038 21394905 21842007 21713750 21384229 21595838 20773233
4302 20773233 20498039 20504413 19737744 19832430 19799546 20280254 20873211 20800011 20145197 20011334
4292 20011334 19675722 19724353 20233340 19405448 19090250 18743305 18584376 18866670 18574192 18009237
4282 18009237 18837343 18745803 18563526 18473174 17953359 18051825 17704439 17078274 17584942 17859248
4272 17859248 18431346 19100469 18663818 18571431 18953652 18661437 18393579 18449280 19013320 19076638
4262 19076638 18673775 18074286 18287776 18249145 17647961 17924603 17961893 17851732 18465718 17844157
4252 17844157 18004105 17830638 18057831 17921284 17000232 16285788 16522021 16371768 16367522 16269219
$$ packed form
4321A7867041k4430P24417L8492J85889J36086l80578N08857K38826R39927P44140
4311B0978667j53459M28065O91765n50133M47102j28257l29521K11609q22605
4302B0773233k75194O374p66669R4686l2884M80708N92957p3200o54814j33863
4292B0011334l35612M8631N08987q27892l15198l46945j58929K82294k92478n64955
4282A8009237Q28106r1540j82277r0352n19815R8466l47386o26165N06668K74306
4272A7859248N72098O69123m36651r2387L82221k92215k67858N5701N64040O3318
4262A9076638m02863n99489K13490l8631o01184K76642L7290j10161O13986o21561
4252A7844157J59948j73467K27193j36547r21052p14444K36233j50253m246r8303
$$ plain form
4242 16269219 15885533 16126488 15792857 15942011 15800036 16100460 15859078 16363937 16419081 16401486
4232 16401486 16210360 15868542 16101117 15481381 15446386 16316271 16258357 16670710 16267492 16579643
4222 16579643 16270152 15663162 15531834 15169857 14889317 14662900 14798541 14488798 14220626
4213 14220626 14731450 14126668 12706320 12357132 13149869 14062062 13938912 13135197 13152071
4204 13152071 13219159 13881835 14313704 14353645 14208330 14566400 14764347 15067468 15298725 15801575
4194 15801575 16247208 16064311 15755747 15521759 15086055 15231458 15144083 13856058 14554683
4185 14554683 14626672 13991859 13816943 14089144 13931299 14238710 14105319 14180862 13467986 13348871
4175 13348871 14199948 14322003 13854749 13920683 14158196 13624059 13900018 13416339 13315445 14947535
$$ packed form
4242A6269219l83686K40955l33631J49154j41975L00424k41382N04859N5144j7595
4232A6401486j91126l41818K32575o19736l4995Q69885n7914M12353m03218L12151
4222A6579643l09491o06990j31328l61977k80540k26417J35641l09743k68172
4213A4220626N10824o04782j420348l49188P92737R12193j23150q03715J6874
4204A3152071O7088O62676M31869L9941j45315L58070J97947L03121K31257N02850
4194A5801575M45633j82897l08564k33988m35704J45403q7375j288025O98625
4185A4554683P1989o34813j74916K72201j57845L07411j33391P5543p12876j19115
4175A3348871Q51077J22055m67254O5934K37513n34137K75959m83679j00894J632090
$$ plain form
4165 14947535 14982328 14744984 14556605 15408328 16330483 16381027 16941725 17668223 18382683 19287889
4155 19287889 18713957 18550302 18751138 18679124 18679903 17727861 17700494 17400234 17373131 16522881
4145 16522881 15996344 16064977 15796524 16083899 15831418 15284234 15638137 15817049 15965448 15155825
4135 15155825 14939771 15401016 15445187 15413792 15509261 15371274 14973296 15380412 15898092 15470394
4125 15470394 15323849 15956428 15949346 15599543 14914793 15203221 15662099 15743342 15789092 15880791
4115 15880791 16372911 16837884 16852394 17318014 17954735 19093284 20374384 19564003 18978748
4106 18978748 20173804 21268500 22053081 21992749 22759381 23284880 24018438 25077029 25706364
4097 25706364 25790796 26061396 27061419 27722478 28020761 28608265 29730373 29995728 30720736
$$ packed form
4165A4947535L4793k37344j88379Q51723R22155N0544N60698P26498P14460R05206
4155A9287889n73932j63655K00836p2014P79r52042k7367l00260k7103q50250
4145A6522881n26537O8633k68453K87375k52481n47184L53903J78912J48399q09623
4135A5155825k16054M61245M4171l1395R5469j37987l97978M07116N17680m27698
4125A5470394j46545O32579p082l49803o84750K88428M58878Q1243M5750R1699
4115A5880791M92120M64973J4510M65620O36721J138549J281100q10381n85255
4106A8978748J195056J094696P84581o0332P66632N25499P33558J058591O29335
4097B5706364Q4432K70600J000023O61059K98283N87504J122108K65355P25008
$$ plain form
4088 30720736 31260202 31206600 31868606 32740773 32331200 32805786 33528364 34105006 34300939 34204899
4078 34204899 34386273 34815832 35373395 35614368 35986482 36031804 36706680 36654598 36068096 36329336
4068 36329336 35848266 36356250 36250463 36080975 36277247 37192806 37672123 38042650 38042167 37512387
4058 37512387 38303044 38545789 39291772 38973053 38826158 39816730 40306758 40270976 40813832 41226594
4048 41226594 41520557 41794107 42081555 42276822 42831196 42884913 42720235 43009936 43874929 44616221
4038 44616221 44023948 43941771 44589255 45611203 46095155 46215868 46631794 46727672 47236736 47757237
4028 47757237 48891757 49422759 49243242 50512779 51288645 50922908 52186816 53410158 54363586
4019 54363586 54944257 55806314 56108850 56477048 57661819 57884691 58249836 59012487 60253755
$$ packed form
4088C0720736N39466n3602O62006Q72167m09573M74586P22578N76642J95933r6040
4078C4204899J81374M29559N57563K40973L72114M5322O74876n2082n86502K61240
4068C6329336m81070N07984j05787j69488J96272R15559M79317L70527m83n29780
4058C7512387P90657K42745P45983l18719j46895R90572M90028l5782N42856M12762
4048D1226594K93963K73550K87448J95267N54374N3717j64678K89701Q64993P41292
4038D4616221n92273q2177O47484J021948M83952J20713M15926R5878N09064N20501
4028D7757237J134520N31002j79517J269537P75866l65737J263908J223342R53428
4019E4363586N80671Q62057L02536L68198J184771K22872L65145P62651J241268
$$ plain form
4010 60253755 60426726 60572105 61265284 61687951 62460210 63052318 63334315 64291287 64451724
4001 64451724 64443156 65096857 65365102 65991510 66878645 67266463 68593290 68384600 68453211 68877462
3991 68877462 69170762 69276270 69720432 70173144 70237456 71237770 71101383 70900010 71814938
3982 71814938 72563163 73490472 73386745 74026871 74612168 74572407 75175015 75628675 75581616 75639224
3972 75639224 75934971 76193281 76706213 76553260 75249253 74607754 74287612 73651236 72974542
3963 72974542 72194862 72666049 72586449 72491479 72351771 72902213 72713188 72953158 73380556 73557270
3953 73557270 73998811 74219305 74003916 73293817 72843527 73023407 73165533 72226884 71252881
3944 71252881 69843012 68233384 66428341 65561001 65175681 65005525 64217478 63347124 62816385
$$ packed form
4010F0253755J72971J45379O93179M22667P72259N92108K81997R56972J60437
4001F4451724q568O53701K68245O26408Q87135L87818J326827k08690O8611M24251
3991F8877462K93300J05508M44162M52712O4312J000314j36387k01373R14928
3982G1814938P48225R27309j03727O40126N85297l9761O02608M53660m7059N7608
3972G5639224K95747K58310N12932j52953j304007o41499l20142o36376o76694
3963G2974542p79680M71187p9600r4970j39708N50442j89025K39970M27398J76714
3953G3557270M41541K20494k15389p10099m50290J79880J42126r38649r74003
3944G1252881j409869j609628j805043q67340l85320j70156p88047q70354n30739
$$ plain form
3935 62816385 62266213 62148862 61612897 61669774 61551326 60971712 60022914 59193512 58735247 58887687
3925 58887687 58090266 57186493 56716667 55638564 55120381 55013564 53911232 53617879 53879719
3916 53879719 53240886 53575885 53454609 52396927 52148615 52253280 51433164 50451329 49804669
3907 49804669 49181567 49125475 48144652 46945268 46693166 46904272 47027413 47049932 46997969 47019510
3897 47019510 46498153 46123626 45745220 45532670 45541845 45246362 44995937 45065152 44635523 44520441
3887 44520441 44204078 43987507 44184444 44795888 45381092 45914802 46225894 46601748 47277013
3878 47277013 47974412 48573689 49030786 49535178 50419897 52366518 53027228 54395780 56200086
3869 56200086 58819540 61756977 65784325 69261732 72039967 75777349 76994449 76529203
$$ packed form
3935F2816385n50172j17351n35965N6877j18448n79614r48798q29402m58265J52440
3925E8887687p97421r03773m69826j078103n18183j06817j102332k93353K61840
3916E3879719o38833L34999j21276j057682k48312J04665q20116r81835o46660
3907D9804669o23102n6092r80823j199384k52102K11106J23141K2519n1963K1541
3897D7019510n21357l74527l78406k12550R175k95483k50425O9215m29629j15082
3887D4520441l16363k16571J96937O11444N85204N33710L11092L75854O75265
3878D7277013O97399N99277M57097N04392Q84719J946621O60710J368552J804306
3869E6200086K619454K937437M027348L477407K778235L737382J217100m65246
$$ plain form
3861 76529203 74385956 72414587 71544184 69651170 66888228 64985640 63908387 61532806
3853 61532806 59041095 57289643 55905925 54706722 53890825 52047902 50651206 49919866
3845 49919866 48866464 47575273 46580271 46214684 46605781 45706703 43910206 42893436 42907414
3836 42907414 42882577 42333770 41397095 40395099 40617486 40221594 39410238 38624207 38053422
3827 38053422 37903689 36854967 34992222 34190989 34162417 34214764 34675088 34587497 34670129 34602795
3817 34602795 34887173 35235821 34789032 34523749 35104379 35037720 34320191 34602295 34616371 33874482
3807 33874482 33148320 32308102 32423194 33182182 33423858 32999760 33030770 33334094 33585973 33801683
3797 33801683 34255762 34485300 34541298 34901973 34701617 35550242 35309215 34663792 34857880 34595459
$$ packed form
3861G6529203k143247j971369q70403j893014k762942j902588j077253k375581
3853F1532806k491711j751452j383718j199203q15897j842923j396696p31340
3845D9919866j053402j291191r95002l65587L91097q99078j796497j016770J3978
3836D2907414k4837n48807r36675j001996K22387l95892q11356p86031n70785
3827C8053422j49733j048722j862745q01233k8572N2347M60324q7591Q2632o7334
3817C4602795K84378L48648m46789k65283N80630o6659p17529K82104J4076p41889
3807C3874482p26162q40218J15092P58988K41676m24098L1010L03324K51879K15710
3797C3801683M54079K29538N5998L60675k00356Q48625k41027o45423J94088k62421
$$ plain form
3787 34595459 34811699 34310429 33609060 33518176 32691001 32768346 32874283 32047965 31021988 31261200
3777 31261200 31086338 30769263 30550294 30591596 30926748 30856647 31044183 30403537 29981312 29623071
3767 29623071 29747681 29557254 29115982 28810003 28886895 28736162 28602559 28571681 28817124 29296251
3757 29296251 29307360 29380356 29670338 29740874 29786202 30840876 30757925 30297639 30124379 30002418
3747 30002418 30270542 30457066 29604784 29734943 29288772 29012038 29014101 29143521 29213341 28835535
3737 28835535 29809354 30362119 29579586 29123652 29385422 29655087 29832874 29280682 28977598
3728 28977598 28904195 29181412 28871451 27504212 26631238 27048199 27228714 26788386 25933991
3719 25933991 25643765 25368063 24292059 23440483 22445703 21836687 21257220 21275513 20985942
$$ packed form
3787C4595459K16240n01270p01369r0884q27175P7345J05937q26318j025977K39212
3777C1261200j74862l17075k18969M1302L35152p0101J87536o40646m22225l58241
3767B9623071J24610j90427m41272l05979P6892j50733j33603l0878K45443M79127
3757B9296251J1109P2996K89982P0536M5328J054674q2951m60286j73260j21961
3747C0002418K68124J86524q52282J30159m46171k76734K063J29420O9820l77806
3737B8835535R73819N52765p82533m55934K61770K69665J77787n52192l03084
3728B8977598p3403K77217l09961j367239q72974M16961J80515m40328q54395
3719B5933991k90226k75702j076004q51576r94780o09016n79467J8293k89571
$$ plain form
3710 20985942 20771051 20405835 19708589 19384672 18980027 19115666 20291379 21118932 20248435
3701 20248435 19856085 20348929 20685879 20223635 20166506 20249571 20452696 19839809 20025343 19580717
3691 19580717 18974027 19077336 19611448 19698047 19568785 20525862 20811541 20281288 20227821 21054017
3681 21054017 21897058 22722809 22867007 22923690 22536879 23068255 22598960 21572115 21356152
3672 21356152 21313391 21449526 20503087 19531917 19466320 19818912 19981320 19300728 19229942 19490882
3662 19490882 18865932 18355835 17937557 17878993 17665401 17580772 17288659 16662297 15893144 15708081
3652 15708081 15650361 15012000 15415530 15545044 16291440 17149816 16864357 16147940 16067414 17181544
3642 17181544 17198987 16907855 16982001 17497083 17718773 17946509 16998890 16211693 16109253 16026533
$$ packed form
3710B0985942k14891l65216o97246l23917m04645J35639J175713Q27553q70497
3701B0248435l92350M92844L36950m62244n7129Q3065K03125o12887J85534m44626
3691A9580717o06690J03309N34112Q6599j29262R57077K85679n30253n3467Q26196
3681B1054017Q43041Q25751J44198N6683l86811N31376m69295j026845k15963
3672B1356152m2761J36135r46439r71170o5597L52592J62408o80592p0786K60940
3662A9490882o24950n10097m18278n8564k13592q4629k92113o26362p69153j85063
3652A5708081n7720o38361M03530J29514P46396Q58376k85459p16417q0526J114130
3642A7181544J7443k91132P4146N15082K21690K27736r47619p87197j02440q2720
$$ plain form
3632 16026533 16197405 15168853 14486768 13771939 14032807 13643114 13362173 12987461 12830354
3623 12830354 12435711 12653589 13315058 13705565 13024712 12154052 11516040 12281621 12419647
3614 12419647 11405138 11093581 11032427 11599565 12273489 12620806 12750527 13160984 12696118
3605 12696118 12554796 12653245 12741329 12329153 13053349 12424921 12442122 12699125 12228818 12200474
3595 12200474 12432218 12126525 12553257 12371034 11478159 11588600 11968277 12252437 12469558
3586 12469558 11346982 10538513 10980013 10942188 10558238 9817166 9792596 10454343 10933424 10726317
3576 10726317 10368428 10238499 10255350 10498886 10615644 10369184 10431562 10521159 10801087 10517447
3566 10517447 10953616 11411066 11444787 11440600 11550155 11647631 11805177 11915802 11715904 11412020
$$ packed form
3632A6026533J70872j028552o82085p14829K60868l89693k80941l74712j57107
3623A2830354l94643K17878O61469L90507o80853q70660o38012P65581J38026
3614A2419647j014509l11557o1154N67138O73924L47317J29721M10457m64866
3605A2696118j41322R8449Q8084m12176P24196o28428J7201K57003m70307k8344
3595A2200474K31744l05693M26732j82223q92875J10441L79677K84160K17121
3586A2469558j122576q08469M41500l7825l83950p41072k4570O61747M79081k07107
3576A0726317l57889j29929J6851K43536J16758k46460O2378Q9597K79928k83640
3566A0517447M36169M57450L3721m187J09555R7476J57546J10625j99898l03884
$$ plain form
3556 11412020 11371883 11189643 10938728 11562299 12224786 13024575 13408493 13793100 13367650 13744364
3546 13744364 13292051 13191608 13448695 13776686 13147865 13767169 13580762 12739154 13745187
3537 13745187 13635793 13747642 13933745 14238012 13983125 13641810 13404489 14155131 14852542
3528 14852542 15133580 15218698 15028330 15605406 15793215 16150542 15782347 15281732 15176212 14576877
3518 14576877 14266375 14047392 13872764 13451248 13857841 13226874 13178036 13441374 12861751 12829198
3508 12829198 12401578 12620131 12862368 12902336 13651029 12652253 13275459 14121420 15150724
3499 15150724 15513512 16040084 17503750 18025314 18357945 19097557 20152267 21717552 23734940
3490 23734940 25605661 27800727 31355414 34213210 37968068 41563104 45242481 48194701
$$ packed form
3556A1412020m0137j82240k50915O23571O62487P99789L83918L84607m25450L76714
3546A3744364m52313j00443K57087L27991o28821O19304j86407q41608J006033
3537A3745187j09394J11849J86103L04267k54887l41315k37321P50642O97411
3528A4852542K81038Q5118j90368N77076J87809L57327l68195n00615j05520n99335
3518A4576877l10502k18983j74628m21516M06593o30967m8838K63338n79623l2553
3508A2829198m27620K18553K42237L9968P48693r98776O23206Q45961J029304
3499A5150724L62788N26572J463666N21564L32631P39612J054710J565285K017388
3490B3734940J870721K195066L554687K857796L754858L595036L679377K952220
$$ plain form
3482 48194701 50542876 51819479 51272590 49458124 47679122 45873816 43925042 40322979
3474 40322979 36890659 35112725 32401361 29669794 28129333 27270776 25733089 24916267
3466 24916267 23981646 22895719 21696374 20889667 20986454 20272184 19495714 20080012 20283456
3457 20283456 21711662 22500794 21879013 21734089 22119471 21370026 20339923 20282339 20195574
3448 20195574 19482141 19042708 19400109 19460776 19349645 19920180 19984608 21326807 21761702 22234033
3438 22234033 22159655 22298875 22755823 22682684 22318486 21253088 21776650 22466417 22417175 22227381
3428 22227381 22544902 23113101 23692025 24794343 24703894 24365915 24220766 24431351 24145530
3419 24145530 23704134 23268544 23175473 23230555 24291953 23663069 24080034 25075026 25828675 25991519
$$ packed form
3482D8194701K348175J276603n46889j814466j779002j805306j948774l602063
3474D0322979l432320j777934k711364k731567j540461q58557j537687q16822
3466B4916267r34621j085927j199345q06707R6787p14270p76470N84298K03444
3457B0283456J428206P89132o21781j44924L85382p49445j030103n7584q6765
3448B0195574p13433m39433L57401O0667j11131N70535O4428J342199M34895M72331
3438B2234033p4378J39220M56948p3139l64198j065398N23562O89767m9242j89794
3428B2227381L17521N68199N78924J102318r0449l37979j45149K10585k85821
3419B4145530m41396m35590r3071N5082J061398o28884M16965R94992P53649J62844
$$ plain form
3409 25991519 26369532 27275036 27828405 28096554 28087867 27681537 27785670 28719973 28782580 28199120
3399 28199120 27387647 27750772 27367500 27664553 27697314 26705887 26794329 27180631 26606068 26506769
3389 26506769 27441264 27539428 27670647 27603801 27856921 29360564 29580964 29956737 30623991 31612087
3379 31612087 33054665 34395509 35578763 37202504 39256402 42350780 45468680 48906848
3371 48906848 53059247 58869980 63415232 67505743 70681738 71546824 71725730 70616026
3363 70616026 66919672 63184880 59867068 56544614 53152591 50320450 47663738 45573274
3355 45573274 44170774 42086463 41312192 41293958 41496448 41343344 40902826 40269603 39326513
3346 39326513 38724600 37807457 36669934 36037085 35344148 34832746 34020764 33254005 32918403
$$ packed form
3409B5991519L78013R05504N53369K68149q687m06330J04133R34303O2607n83460
3399B8199120q11473L63125l83272K97053L2761r91427Q8442L86302n74563r9299
3389B6506769R34495R8164J31219o6846K53120J503643K20400L75773O67254R88096
3379C1612087J442578J340844J183254J623741K053898L094378L117900L438168
3371D8906848M152399N810733M545252M090511L175995Q65086J78906j109704
3363G0616026l696354l734792l317812l322454l392023k832141k656712k090464
3355D5573274j402500k084311p74271j8234K02490j53104m40518o33223r43090
3346C9326513o01913r17143j137523o32849o92937n11402q11982p66759l35602
$$ plain form
3337 32918403 32132193 32303907 32045126 31526834 31210176 31344033 31199193 30408107 31055689
3328 31055689 31181966 30409127 29875661 29069336 29552936 29786408 29744095 28976703 28477264 28237589
3318 28237589 28116723 28069702 28426574 28587727 29084619 29545936 29658693 29738950 30316521 31552707
3308 31552707 31764720 31537818 32134111 33260475 33599102 33079287 32515160 33070386 33541017
3299 33541017 33552832 32463029 31042898 31153445 30958305 30935645 30624732 30149145 30807452
3290 30807452 30680564 30788211 30880612 31151840 31602525 32195230 32223512 32815732 32652088 32912556
3280 32912556 33065806 32965572 32854654 33303641 33381759 33277782 32887908 32309527 32087570 32425332
3270 32425332 32128088 32037602 32136521 31715190 32147029 32072646 32134908 32544013 32374370 32095828
$$ packed form
3337C2918403p86210J71714k58781n18292l16658J33857j44840p91086O47582
3328C1055689J26277p72839n33466q06325M83600K33472m2313p67392m99439k39675
3318B8237589j20866m7021L56872J61153M96892M61317J12757Q0257N77571J236186
3308C1552707K12013k26902N96293J126364L38627n19815n64127N55226M70631
3299C3541017J1815j089803j420131J10547j95140k2660l10913m75587O58307
3290C0807452j26888J07647R2401K71228M50685N92705K8282N92220j63644K60468
3280C2912556J53250j00234j10918M48987P8118j03977l89874n78381k21957L37762
3270C2425332k97244r0486R8919m21331M31839p4383O2262M09105j69643k78542
$$ plain form
3260 32095828 31874400 31841941 32007940 32710050 32446697 32194500 32731811 33712537 34128974 34497635
3250 34497635 34767637 36336100 37955018 39073092 39897468 41283401 43605141 45744922
3242 45744922 46836584 49107860 53223553 58047095 64124656 70535390 78254898 86479979
3234 86479979 93786552 99305436 103292535 104942306 105722493 104688264 101345111 96444360
3226 96444360 91102251 86060218 81878994 77638812 74983526 72722774 72206609 73299374
3218 73299374 75094374 77581896 81652287 85052269 87528589 88608738 88193689 86830560
3210 86830560 84000657 80392292 75192930 71341765 67744149 63301746 59493530 57106418
3202 57106418 55301956 54083313 53313734 51100419 49704785 49113445 48887936 48785471 48866455
$$ packed form
3260C2095828k21428l2459J65999P02110k63353k52197N37311R80726M16437L68661
3250C4497635K70002J568463J618918J118074Q24376J385933K321740K139781
3242D5744922J091662K271276M115693M823542O077561O410734P719508Q225081
3234H6479979P306573N518884L987099J649771P80187j034229l343153m900751
3226I6444360n342109n042033m181224m240182k655286k260752n16165J092765
3218G3299374J795000K487522M070391L399982K476320J080149m15049j363129
3210H6830560k829903l608365n199362l851165l597616m442403l808216k387112
3202E7106418j804462j218643p69579k213315j395634n91340k25509j02465Q0984
$$ plain form
3193 48866455 49101977 49725799 50969354 51162118 51667151 53887852 57445722 60985709 64851506
3184 64851506 70694957 78243025 86621824 95054095 103587499 109986521 114810156 118246749
3176 118246749 119027993 118877228 118549522 119039597 119387897 120406164 121204776 121931677 122612133
3167 122612133 122066656 119483364 115314277 110200651 103836361 95935969 88893866 82578879
3159 82578879 77245101 72602741 68532994 65227327 62884380 62094159 61046175 60904437
3151 60904437 61991389 62925372 63866695 65623295 68480377 71763546 75275461 79536331
3143 79536331 84563073 90544823 97779606 105792552 112911855 120447914 126839919 132862387
3135 132862387 137586289 139982219 140002144 137221831 132653235 125766907 119014147 111389747
$$ packed form
3193D8866455K35522O23822J243555J92764N05033K220701L557870L539987L865797
3184F4851506N843451P548068Q378799Q432271Q533404O399022M823635L436593
3176A18246749P81244j50765l27706M90075L48300J018267P98612P26901O80456
3167A22612133n45477k583292m169087n113626o364290p900392p042103o314987
3159H2578879n333778m642360m069747l305667k342947p90221j047984j41738
3151F0904437J086952R33983R41323J756600K857082L283169L511915M260870
3143G9536331N026742N981750P234783Q012946P119303P536059O392005O022468
3135A32862387M723902K395930J9925k780313m568596o886328o752760p624400
$$ plain form
3127 111389747 103731994 97681031 91472147 87230506 83124052 80404280 79448714 78684875
3119 78684875 79344897 82393460 87428931 93134473 100143892 109075678 118578703 127390378
3111 127390378 133542094 137057741 136626749 132223342 126890338 119273388 110242637 101728864
3103 101728864 95024620 89496118 85989648 83697190 82615508 83693970 86653684 89931075
3095 89931075 93209461 95855399 97069898 96733832 96203955 93695300 91161375 88713881
3087 88713881 87242022 86950123 87416676 88983820 90980987 93322985 94508508 94785094 94457398
3078 94457398 92608347 89742286 86721814 83069741 80315711 78056500 75970671 74781967
3070 74781967 74111617 74534225 76049583 78095044 81280245 85459041 89328936 92491029
$$ packed form
3127A11389747p657753o050963o208884m241641m106454k719772r55566p63839
3119G8684875O60022L048563N035471N705542P009419Q931786R503025Q811675
3111A27390378O151716L515647m30992m403407n333004p616950r030751q513773
3103A01728864o704244n528502l506470k292458j081682J078462K959714L277391
3095H9931075L278386K645938J214499l36066n29877k508655k533925k447494
3087H8713881j471859k91899M66553J567144J997167K341998J185523K76586l27696
3078I4457398j849051k866061l020472l652073k754030k259211k085829j188704
3070G4781967o70350M22608J515358K045461L185201M178796L869895L162093
$$ plain form
3062 92491029 94013930 93862795 92259540 88584310 83615082 78305421 73387649 68662355
3054 68662355 64234795 59873317 56243786 53587614 52112270 50205750 48960523 47563018
3046 47563018 47133006 47136848 46141641 45101184 43798557 43141741 42127924 41283843 40075787
3037 40075787 38553541 37273368 36138885 35058391 34671752 35089041 33989495 33863216 33369714
3028 33369714 32700594 32466086 32354183 31697365 31948493 31793645 31698522 31890045 32079238 32604264
3018 32604264 32260712 33729505 35285827 37050529 39500608 42175379 45838603 51088527
3010 51088527 56462909 63390743 71292258 77720307 82873625 84920424 84982729 82824268
3002 82824268 78408169 72831580 66502278 59526385 53479606 48239032 44112788 40480410
$$ packed form
3062I2491029J522901j51135j603255l675230m969228n309661m917772m725294
3054F8662355m427560m361478l629531k656172j475344j906520j245227j397505
3046D7563018m30012L842r95207j040457j302627o56816j013817q44081j208056
3037D0075787j522246j280173j134483j080494l86639M17289j099546j26279m93502
3028C3369714o69120k34508j11903o56818K51128j54848r5123J91523J89193N25026
3018C2604264l43552J468793J556322J764702K450079K674771L663224N249924
3010E1088527N374382O927834P901515O428049N153318K046799O2305k158461
3002H2824268m416099n576589o329302o975893o046779n240574m126244l632378
$$ plain form
2994 40480410 37790984 35584885 33993092 33045488 32669096 31381795 30158695 29602471 29060025
2985 29060025 28559620 27478946 26128725 23569613 22714239 21912961 20842350 19487895 18598055
2976 18598055 17593495 17731739 16597740 15713322 15656995 15368527 15455236 14964564 13839759
2967 13839759 13021911 12461847 12616402 12653049 12335534 12378948 12273543 11539818 11227885 11412838
2957 11412838 11209794 10840378 10443222 9727331 10144502 9481609 9157474 9290782 8827724
2948 8827724 8605593 9005850 9077200 9345587 9187697 8467088 8507464 8410440 8108596 8590504
2938 8590504 8644952 8668463 8435593 8923893 8256573 7919232 8496044 7981799 7898924 7837474
2928 7837474 8230123 7249193 6992965 7182028 7308972 7823643 8546302 7964199 7810152 7673982
$$ packed form
2994D0480410k689426k206099j591793r47604l76392j287301j223100n56224n42446
2985B9060025n00405j080674j350221k559112q55374q01278j070611j354455q89840
2976A8598055j004560J38244j133999q84418n6327k88468Q6709m90672j124805
2967A3839759q17848n60064J54555L6647l17515M3414j05405p33725l11933J84953
2957A1412838k03044l69416l97156p15891M17171o62893l24135J33308m63058
2948H827724k22131M00257P1350K68387j57890p20609M0376r7024l01844M81908
2938H590504N4448K3511k32870M88300o67320l37341N76812n14245q2875o1450
2928G837474L92649r80930k56228J89063J26944N14671P22659n82103j54047j36170
$$ plain form
2918 7673982 7535042 7773848 7961622 8049935 8000485 7018845 6881543 6634173 6213325 6170771
2908 6170771 6516192 6140734 5912640 5827290 5767951 5202712 5181331 4854706 5235858 5132643
2898 5132643 4956022 5094605 5596943 5484830 4889174 5067393 5271893 5443841 5657901 5701021
2888 5701021 5410456 4935678 4927035 4465501 4594075 4997294 5183627 5180007 5026035 4831091
2878 4831091 5877868 5885569 5148807 4483006 3955694 3700637 3589491 3701315 3373592 2841715
2868 2841715 2622006 3365240 3355520 3338398 3262402 3226964 3579318 4059215 3007712 3154952
2858 3154952 3519628 3238870 3229749 2773963 2475519 3269089 3316714 3858684 3885557 3746768
2848 3746768 3660470 3077807 2890991 3365273 2726486 2348262 1960883 1816741 2304395 2674255
$$ packed form
2918G673982j38940K38806J87774Q8313m9450r81640j37302k47370m20848m2554
2908F170771L45421l75458k28094q5350n9339n65239k1381l26625L81152j03215
2898E132643j76621J38583N02338j12113n95656J78219K04500J71948K14060M3120
2888E701021k90565m74778q643m61534J28574M03219J86333l620j53972j94944
2878D831091J046777P701p36762o65801n27312k55057j11146J11824l27723n31877
2868B841715k19709P43234r720j7122p5996l5438L52354M79897j051503J47240
2858C154952L64676k80758r121m55786k98444P93570M7625N41970K6873j38789
2848C746768q6298n82663j86816M74282o38787l78224l87379j44142M87654L69860
$$ plain form
2838 2674255 2470688 2843974 2941267 3807653 4002156 3133615 2609995 3080493 2333649 1733758
2828 1733758 1784714 2340869 2163324 2842576 3258123 3315449 3312386 3235372 2626803 2226454
2818 2226454 1554664 1899356 2680223 2441883 2248638 2081374 1734332 2026631 2685549 2423105
2808 2423105 2372327 2557503 2554685 2459605 2622207 1982427 1746851 1641441 2980190 2328368
2798 2328368 2229221 2288257 1762148 2337953 2314390 1480251 2024596 2274564 2175247 1454239
2788 1454239 1616240 1838798 1217346 932383 1707947 2118610 2215999 1871828 2032731 2341238
2778 2341238 2791313 2255651 1812017 1376383 900340 950571 800155 825270 875544 1776538
2768 1776538 1924907 1661494 1658730 1501169 2507891 990000 490262 929447 620718 1221359
$$ packed form
2838B674255k03567L73286R7293Q66386J94503q68541n23620M70498p46844n99891
2828A733758N0956N56155j77545O79252M15547N7326l063p7014o08569m00349
2818B226454o71790L44692P80867k38340j93245j67264l47042K92299O58918k62444
2808B423105n0778J85176k818r5080J62602o39780k35576j05410J338749o51822
2798B328368r9147N9036n26109N75805k3563q34139N44345K49968r9317p21008
2788A454239J62001K22558o21452k84963P75564M10663R7389l44171J60903L08507
2778B341238M50075n35662m43634m35634m76043N0231j50416K5115N0274R00994
2768A776538J48369k63413k764j57561J006722j517891m99738M39185l08729O00641
$$ plain form
2758 1221359 1247698 921459 621353 354214 446569 1011267 1125600 1501297 1282162 878418
2748 878418 1296313 1311585 945415 1542651 992667 335978 317090 256210 1064430 1205571
2738 1205571 399514 287417 818607 1163187 629247 408101 412543 734455 1029129 1037039
2728 1037039 996301 1014562 1481953 1470925 942605 525721 233152 404792 436084 -110756
2718 -110756 300311 1111271 1251264 932629 382152 1126534 1677279 1047679 501961 1087690
2708 1087690 1310088 1694401 1117549 704900 678410 50854 -57001 211208 770180 523667
2698 523667 808181 598848 178576 470919 1095829 1326503 883290 451191 -248124 -363348
2688 -363348 -164259 558274 780138 1298957 1143938 191537 297645 245518 533137 975474
$$ packed form
2758A221359K6339l26239l00106k67139R2355N64698J14333L75697k19135m03744
2748H78418M17895J5272l66170N97236n49984o56689j8888o0880Q08220J41141
2738A205571q06057j12097N31190L44580n33940k21146M442L21912K94674P910
2728A037039m0738J8261M67391j1028n28320m16884k92569J71640L1292n46840
2718a10756M11067Q10960J39993l18635n50477P44382N50745o29600n45718N85729
2708A087690K22398L84313n76852m12649k6490o27556j07855K68209N58972k46513
2698E23667K84514k09333m20272K92343O24910K30674m43213m32099o99315j15224
2688c63348J99089P22533K21864N18819j55019r52401J06108n2127K87619M42337
$$ plain form
2678 975474 877060 879648 481159 -397320 -470546 -203195 -6603 986397 1514802 1702256
2668 1702256 933746 -21331 18503 -3478 535328 311214 912705 729922 688036 1047868
2658 1047868 221165 1127385 1058031 1095864 1419450 1018772 1511551 1643953 391086 659407
2648 659407 715635 902608 368183 259257 621860 672636 794593 359843 12119 512562
2638 512562 630156 326930 1110413 1355276 940310 749742 1269856 676345 671402 491919
2628 491919 -142913 458840 1051825 1407303 1167749 708569 459329 624267 899003 1104145
2618 1104145 991290 946180 1068522 1280173 711741 975903 1109291 526630 717044 33337
2608 33337 258850 87401 550037 554338 178131 183143 1162282 1869623 1885477 1919237 2266368
$$ packed form
2678I75474r8414K588l98489q78479p3226K67351J96592R93000N28405J87454
2668A702256p68510r55077L9834k1981N38806k24114O01491j82783m1886L59832
2658A047868q26703R06220o9354L7833L23586m00678M92779J32402j252867K68321
2648F59407N6228J86973n34425j08926L62603N0776J21957m34750l47724N00443
2638E12562J17594l03226P83483K44863m14966j90568N20114n93511m943j79483
2628D91919o34832O01753N92985L55478k39554m59180k49240J64938K74736K05142
2618A104145j12855m5110J22342K11651n68432K64162J33388n82661J90414o83707
2608C3337K25513j71449M62636M301l76207N012R79139P07341J5854L3760L47131
$$ plain form
2597 2266368 2968014 2569908 1721120 2377356 2759709 2340983 1704622 2480255 2309929 2029869
2587 2029869 1389233 1004038 1069243 568825 1235051 435407 -147122 248156 577442 603703
2577 603703 451993 -246752 582398 1145068 430783 181530 369161 662908 1051105 508832
2567 508832 -273571 -494362 -107504 62162 324628 417642 377700 1451585 1052712 33993
2557 33993 -175607 -135618 1495 -1019016 -1014858 -694521 -802985 -110511 246226 159071
2547 159071 278231 32429 219581 893425 -504196 -751800 116683 379070 -219076 -403116
2537 -403116 -499397 -652533 -117480 396197 1025045 1223528 853146 555463 -398662 -409448
2527 -409448 -534852 -957119 -97087 141176 150945 492327 268612 -175818 93530 278528
$$ packed form
2597B266368P01646l98106q48788O56236L82353m18726o36361P75633j70326k80060
2587B029869o40636l85195O5205n00418O66226p99644n82529L95278L29286K6261
2577F03703j51710o98745Q29150N62670p14285k49253J87631K93747L88197n42273
2567E08832p82403k20791L86858J69666K62466R3014l9942J073885l98873j018719
2557C3993k09600L9989J37113j020511M158L20337j08464O92474L56737q7155
2547A59071J19160k45802J87152O73844j397621k47604Q68483K62387n98146j84040
2537d03116r6281j53136N35053N13677O28848J98483l70382k97683r54125j0786
2527d09448j25404m22267Q60032K38263R769L41382k23715m44430K69348J84998
$$ plain form
2517 278528 271606 201364 -191122 43895 236609 455716 74241 -293366 -10121 231306
2507 231306 339378 263581 -149734 167035 358044 551892 369686 142138 194341 337385
2497 337385 -275860 -876688 -582207 -288190 506035 546021 951813 756676 1014282 1282574
2487 1282574 990523 158481 759787 600007 656568 257986 -35167 49742 736192 1426358
2477 1426358 546803 518140 1553215 1748638 875584 -152010 -480237 -168922 -229898 -326104
2467 -326104 -204977 242590 856065 872752 1575057 1474359 1188088 577196 -1011962 -1027575
2457 -1027575 -690840 51745 -519877 -298536 124400 910947 1551806 419292 238458
2448 238458 1059819 926743 816546 797402 -291107 -573920 331034 115796 -447771 47956
$$ packed form
2517B78528o922p0242l92486K35017J92714K19107l81475l67607K83245K41427
2507B31306J08072p5797m13315L16769J91009J93848j82206k27548N2203J43044
2497C37385o13245o00828K94481K94017P94225L9986M05792j95137K57606K68292
2487A282574k92051q32042O01306j59780N6561l98582k93153Q4909O86450O90166
2477A426358q79555k8663J035075J95423q73054j027594l28227L11315o0976r6206
2467c26104J21127M47567O13475J6687P02305j00698k86271o10892j589158j5613
2457a027575L36735P42585n71622K21341M22936P86547O40859j132514j80834
2448B38458Q21361j33076j10197j9144j088509k82813R04954k15238n63567M95727
$$ plain form
2438 47956 793520 1909371 1347919 1310647 1141364 1325948 1321944 288155 485285 783849
2428 783849 535299 842239 1065655 886169 1628964 2636951 2345650 1931071 1925421 2073950
2418 2073950 2168820 860996 764527 1269079 806240 1163374 1153813 1613870 2196705 2900046
2408 2900046 2583591 2058861 2198893 2808588 2888606 2603776 2759411 2936804 3087356 2033529
2398 2033529 1387875 1713783 2243337 1967758 2378725 2357465 2758058 3511748 3506333 2578840
2388 2578840 2191638 2722945 2913993 2369778 2365118 3826187 4998808 4475588 3925239 4588497
2378 4588497 4614939 4504000 4381040 4619804 5666774 6115996 5500878 5288306 5940246 6676050
2368 6676050 6676987 5321905 6608533 7194448 8104329 8642555 8027637 7293631 7330372 8370670
$$ packed form
2438D7956P45564J115851n61452l7272j69283J84584m004j033789J97130K98564
2428G83849k48550L06940K23416j79486P42795J007987k91301m14579n650J48529
2418B073950R4870j307824r6469N04552m62839L57134r561M60057N82835P03341
2408B900046l16455n24730J40032O09695Q0018k84830J55635J77393J50552j053827
2398B033529o45654L25908N29554k75579M10967k1260M00593P53690n415r27493
2388B578840l87202N31307J91048n44215m660J461069J172621n23220n50349O63258
2378D588497K6442j10939j22960K38764J046970M49222o15118k12572O51940P35804
2368F676050R37j355082J286628N85915R09881N38226o14918p34006L6741J040298
$$ plain form
2358 8370670 9226494 9172688 9688191 10519638 10878602 11350687 12107262 13476570 15466243
2349 15466243 17300402 19491872 24059597 29117800 33646984 35562920 37334586 40424520
2341 40424520 42728560 45544679 50438952 57059028 66735440 80997282 100124096 134717883
2333 134717883 199259744 301966872 425462913 519781622 527111936 503357699 467702527
2326 467702527 393899845 320667797 257336974 206166500 162210190 126587829 99224114
2319 99224114 83009239 72677412 65948474 61936440 59185416 55128462 51457317 48051132
2311 48051132 44061572 40335258 36840725 33501044 30791976 28795522 27500782 25398365
2303 25398365 24184969 22940273 22522800 21841553 20315675 19484416 19161952 18408470 17495137
$$ packed form
2358H370670Q55824n3806N15503Q31447L58964M72085P56575J369308J989673
2349A5466243J834159K191470M567725N058203M529184J915936J771666L089934
2341D0424520K304040K816119M894273O620076R676412J4261842J9126814L4593787
2333A34717883O4541861J02707128J23496041R4318709P330314k3754237l5655172
2326D67702527p3802682p3232048o3330823n1170474m3956310l5622361k7363715
2319I9224114j6214875j0331827o728938m012034k751024m056954l671145l406185
2311D8051132l989560l726314l494533l339681k709068j996454j294740k102417
2303B5398365j213396j244696m17473o81247j525878q31259l22464p53482r13333
$$ plain form
2294 17495137 16870196 15987673 16520755 15195249 14108774 14075880 13433475 13215177 13379470
2285 13379470 12489564 12981650 12688500 11903104 11767386 11908035 11632302 11140798 10070227
2276 10070227 9389476 9479787 9417040 9552255 10356711 9478350 9164338 9487985 8100004 7791599
2266 7791599 7800419 7744092 7708378 6991164 6472109 7109320 6788657 5793390 5817175 5558777
2256 5558777 5379317 6060514 5721449 5527655 4953108 5243240 4404084 4721830 5211494 4734687
2246 4734687 4626428 4430544 4632850 4677581 4748616 4153399 4322690 4854619 4142296 4335392
2236 4335392 4113086 3512403 3610453 3923674 3815087 4076354 3754373 3204288 3675918 3778101
2226 3778101 3108628 3081544 3106162 3375778 3910619 2944611 3531409 4462105 4695159 3426566
$$ packed form
2294A7495137o24941q82523N33082j325506j086475l2894o42405k18298J64293
2285A3379470q89906M92086k93150p85396j35718J40649k75733m91504j070571
2276A0070227o80751R0311o2747J35215Q04456q78361l14012L23647j387981l08405
2266G791599Q820n6327l5714p17214n19055O37211l20663r95267K3785k58398
2256E558777j79460O81197l39065j93794n74547K90132q39156L17746M89664m76807
2246D734687j08259j95884K02306M4731P1035n95217J69291N31929p12323J93096
2236D335392k22306o00683R8050L13221j08587K61267l21981n50085M71630J02183
2226C778101o69473k7084K4618K69616N34841r66008N86798R30696K33054j268593
$$ plain form
2216 3426566 1965782 2972044 3378506 2493449 2872602 2798939 2901487 3687800 3459474
2207 3459474 2827694 2511558 2531380 2966310 3076684 2745285 2523560 2938919 1533969 780224
2197 780224 1104551 1731982 2106180 1872726 2195482 2528395 2334470 2549164 1730811 2264471
2187 2264471 2684021 2208466 2098506 1466868 1309795 1662275 2117974 1632890 1112630 1805124
2177 1805124 1587137 1782854 1275546 945321 1321682 1335242 1147467 993115 1339362 1154013
2167 1154013 1027299 1026594 903165 850644 1119285 1062367 995514 1871910 2102782 1971335 1286643
2156 1286643 802566 864643 1397748 1167873 602387 963939 1059437 1064943 638884 780594
2146 780594 330094 717732 1161677 1077898 255948 -10308 165244 145923 276149 699537
$$ packed form
2216C426566j460784J006262M06462q85057L79153p3663J02548P86313k28326
2207C459474o31780l16136J9822M34930J10374l31399k21725M15359j404950p53745
2197G80224L24327O27431L74198k33454L22756L32913j93925K14694q18353N33660
2187B264471M19550m75555j09960o31638j57073L52480M55699m85084n20260O92494
2177A805124k17987J95717n07308l30225L76361J3560j87775j54352L46247j85349
2167A154013j26714p05j23429n2521K68641n6918o6853Q76396K30872j31447o84692
2156A286643m84077O2077N33105k29875n65486L61552R5498N506m26059J41710
2146G80594m50500L87638M43945q3779q21950k66256J75552j9321J30226M23388
$$ plain form
2136 699537 1104184 1605548 1074974 445377 1250473 1123915 1123847 1060131 1185815 1103346 1050945
2125 1050945 594535 1078826 805195 431096 688305 320417 461754 235570 449417 568761
2115 568761 1065397 873057 1287812 905450 55957 -176389 -458563 280410 455354 379592
2105 379592 732853 854357 721970 332932 561299 1073334 1232700 235965 -135664 54380
2095 54380 792351 474676 318417 314882 204481 665264 816765 317985 439549 612193
2085 612193 555640 110454 -439111 -273490 359304 372672 257703 317514 -56202 -124756
2075 -124756 -328094 890636 1112196 1700388 1136185 446065 612724 402787 668868 -204737
2065 -204737 311703 817932 1235908 1998673 2261371 2442575 2209131 1685946 1941187 1892421
$$ packed form
2136F99537M04647N01364n30574o29597Q05096j26558o8o3716J25684q2469n2401
2125A050945m56410M84291k73631l74099K57209l67888J41337k26184K13847J19344
2115E68761M96636j92340M14755l82362q49493k32346k82174P38973J74944p5762
2105C79592L53261J21504j32387l89038K28367N12035J59366r96735l71629J90044
2095E4380P37971l17675j56259l535j10401M60783J51501m98780J21564J72644
2085F12193n6553m45186n49565J65621O32794J3368j14969N9811l73716o8554
2075a24756k03338J218730K21560N88192n64203o90120J66659k09937K66081q73605
2065b04737N16440N06229M17976P62765K62698J81204k33444n23185K55241m8766
$$ plain form
2055 1892421 1954010 1944631 2034616 968946 -947608 -187285 909922 780787 557476 662231
2045 662231 811616 1281327 929941 123259 292961 685570 397676 316651 -103747 -404926
2035 -404926 16911 854967 1025871 366616 710569 703681 -98415 -251865 -270811 -369965
2025 -369965 -141766 -302645 -385266 -770151 -275470 360643 -493216 -626854 141867 565880
2015 565880 409838 386996 253240 255402 464433 602399 595418 589194 86776 239983 137769
2004 137769 -451654 84355 589423 921479 104810 30344 -12767 -237912 -256052 -119389
1994 -119389 900311 791033 578225 304057 420680 425626 817818 -200055 -436950 -416516
1984 -416516 -109458 144315 100042 -488120 -955937 -768111 -405179 -134745 -383774 -518885
$$ packed form
2055A892421O1589r379Q9985j065670j916554P60323J097207j29135k23311J04755
2045F62231J49385M69711l51386q06682J69702L92609k87894q1025m20398l01179
2035d04926M21837Q38056J70904o59255L43953o888q02096j53450j8946r9154
2025c69965K28199j60879q2621l84885M94681O36113q53859j33638P68721M24013
2015E65880j56042k2842j33756K162K09031J37966o981o224n02418J53207j02214
2004A37769n89423N36009N05068L32056q16669p4466m3111k25145j8140J36663
1994a19389J019700j09278k12808k74168J16623M946L92192j017873k36895K0434
1984d16516L07058K53773m4273n88162m67817J87826L62932K70434k49029j35111
$$ plain form
1974 -518885 -457595 -146634 101038 -421525 -936210 -832566 -614192 -330935 43437 613426
1964 613426 750574 759166 571515 237178 -409359 -240614 -218142 58282 441091 257421
1954 257421 -495768 -1034763 -940509 -888201 -666645 -75134 38808 -446317 -493441 -414251
1944 -414251 -601344 -739225 -1098996 -844298 -499539 -265968 -583941 -655540 -273345 -45688
1934 -45688 26708 -226628 -14178 145025 -561815 -475907 -330826 -406733 -132674 6691
1924 6691 -103956 -119704 -425275 -173216 -170752 -485176 -90391 270894 -61995 -470429 -931552
1913 -931552 -371846 342753 22602 93265 -88461 208249 744522 933991 317822 -229176
1903 -229176 -199538 -122363 25701 -223811 -693882 -355588 -1126522 -1435496 -1925512 -1305901
$$ packed form
1974e18885O1290L10961K47672n22563n14685J03644K18374K83257L74372N69989
1964F13426J37148Q592j87651l34337o46537J68745K2472K76424L82809j83670
1954B57421p53189n38995R4254N2308K21556N91511J13942m85125m7124P9190
1944d14251j87093j37881l59771K54698L44759K33571l17973p1599L82195K27657
1934d5688P2396k53336K12450J59203p06840Q5908J45081p5907K74059J39365
1924F691j10647j5748l05571K52059K464l14424L94785L61285l32889m08434m61123
1913i31552N59706P14599l20151P0663j81726K96710N36273J89469o16169n46998
1903b29176K9638P7175J48064k49512m70071L38294p70934l08974m90016O19611
$$ plain form
1893 -1305901 -311853 -553654 -446388 -488739 -740874 -237588 -268375 -246116 -28810 -235199
1883 -235199 -126389 -883288 -566149 -273164 -100892 -133125 -626779 -569716 -509859 135524
1873 135524 311471 -265613 53448 -275452 109194 144317 137847 -96704 460196 49306
1863 49306 -667944 -853913 -978420 -586762 -981228 -774927 442890 21320 -187257 11423
1853 11423 -421325 -226208 -293548 315105 569120 359063 456062 429756 405632 -228693 -441303
1842 -441303 -469528 -474599 -241851 -165166 -415299 -324933 433144 194675 7030 -221663 -152256
1831 -152256 -434377 5837 357774 348890 -124475 -218875 -493948 -244315 -267801 -189010 254945
1820 254945 463445 -99196 -2756 -134191 -498556 -249068 132033 621657 582589 226415
$$ packed form
1893a305901R94048k41801J07266m2351k52135N03286l0787K2259K17306k06389
1883b35199J08810p56899L17139K92985J72272l2233m93654N7063N9857O45383
1873A35524J75947n77084L19061l28900L84646L5123o470k34551N56900m10890
1863D9306p17250j85969j24507L91658l94466K06301J217817m21570k08577J98680
1853A1423m32748J95117o7340O08653K54015k10057R6999k6306k4124o34325k12610
1842d41303k8225n071K32748P6685k50133R0366P58077k38469j87645k28693O9407
1831a52256k82121M40214L51937q884m73365r4400k75073K49633k3486P8791M43955
1820B54945K08500n62641R6440j31435l64365K49488L81101M89624l9068l56174
$$ plain form
1810 226415 -57882 -302053 248594 372309 -40959 -269669 63283 -185851 -148138 127828
1800 127828 3132 -203292 -105891 -454764 -62453 40908 340243 419455 -36333 440136
1790 440136 50754 -571409 -427135 -44395 -234781 -137139 -960630 -574452 -577926 -79423
1780 -79423 -283200 -881170 -814783 69523 -186110 -640491 -831804 -444411 -213736 -423916
1770 -423916 -1286949 -408523 -251798 -447206 -397430 -1048308 -1198417 -389565 -423715 -679966
1760 -679966 -868281 -1475377 -674441 -660119 -562352 445514 657161 -381144 -572980 598684
1750 598684 -385298 -795366 -754715 -962397 -240380 425680 -126905 -590238 -688661 -156703
1740 -156703 538113 -360242 -803664 -555106 -13064 -652204 -882437 -913517 98491 484524
$$ packed form
1810B26415k84297k44171N50647J23715m13268k28710L32952k49134L7713K75966
1800A27828j24696k06424R7401l48873L92311J03361K99335P9212m55788M76469
1790D40136l89382o22163J44274L82740j90386R7642q23491L86178l474M98503
1780g9423k03777n97970O6387Q84306k55633m54381j91313L87393K30675k10180
1770d23916q63033Q78426J56725j95408M9776o50878j50109Q08852l4150k56251
1760f79966j88315o07096Q00936J4322R7767J007866K11647j038305j91836J171664
1750E98684r83982m10068M0651k07682P22017O66060n52585m63333r8423N31958
1740a56703O94816q98355m43422K48558N42042o39140k30233l1080J012008L86033
$$ plain form
1730 484524 376346 483266 587861 653200 1157447 1057586 -139477 -793783 -102482 -32031
1720 -32031 -443495 -578656 -139376 454156 -327996 -1187701 -1181284 -1287162 -681653 -223929
1710 -223929 -580684 -852004 -27845 -404216 -739712 -811369 -702429 -492262 -176564 -894632
1700 -894632 -782276 -453685 20537 180712 -355888 -90329 592676 541222 -45065 -560702
1690 -560702 -221165 188882 -197974 -345637 -341902 -443240 -694707 -620879 -774740 -167817
1680 -167817 364137 329182 -156818 249850 -58625 358621 624017 -785473 -395314 77720
1670 77720 53773 -137332 -506401 -741987 -895867 -611953 -741355 -1023466 -390757 27465
1660 27465 29660 -480231 -826303 -491829 -448247 -394974 -557982 -203878 -346242 -468420 -1044626
$$ packed form
1730D84524j08178J06920J04595O5339N04247r9861j197063o54306O91301P0451
1720c2031m11464j35161M39280N93532p82152q59705O417j05878O05509M57724
1710b23929l56755k71320Q24159l76371l35496p1657J08940K10167L15698p18068
1700h94632J12356L28591M74222J60175n36600K65559O83005n1454n86287n15637
1690e60702L39537M10047l86856j47663L735j01338k51467P3828j53861O06923
1680a67817N31954l4955m86000M06668l08475M17246K65396j409490L90159M73034
1670G7720k3947j91105l69069k35586j53880K83914j29402k82111O32709M18222
1660B7465K195n09891l46072L34474M3582N3273j63008L54104j42364j22178n76206
$$ plain form
1649 -1044626 -1029967 -473150 52801 -492989 -777806 -1008085 -1003025 -1575920 -1169506 -1234318
1639 -1234318 -847322 -32916 -443519 -935277 -598673 54942 156527 -879207 -642009
1630 -642009 47256 -86557 -711802 -1430466 -1133796 -303946 -401097 -199213 56611 -260031
1620 -260031 244731 -272212 -969553 -1221724 -569442 -149157 -128604 -807844 -303759 95110
1610 95110 -177465 -725055 -496548 -619888 -340811 440232 846424 112865 549808 983047
1600 983047 1093964 445634 -389099 -264498 -713324 -1027924 -1099253 -873861 -36685 17682
1590 17682 -382492 -262736 -32160 -72674 -257568 -1052407 -786910 -11333 -182864 -287949
1580 -287949 372850 459948 38846 225979 379995 -163488 -334392 -21258 -347023 -383112
$$ packed form
1649a044626J4659N56817N25951n45790k84817k30279N060n72895M06414o4812
1639a234318L86996Q14406m10603m91758L36604O53615J01585j035734K37198
1630f42009O89265j33813o25245p18664K96670Q29850r7151K01884K55824l16642
1620b60031N04762n16943o97341k52171O52282M20285K0553o79240N04085L98869
1610I5110k72575n47590K28507j23340K79077P81043M06192p33559M36943M33239
1600I83047J10917o48330q34733J24601m48826l14600p1329K25392Q37176N4367
1590A7682m00174J19756K30576m0514j84894p94839K65497P75577j71531j05085
1580b87949O60799Q7098m21102J87133J54016n43483j70904L13134l25765l6089
$$ plain form
1570 -383112 -590025 -470850 -175179 -436945 -1180242 -711248 -426175 30561 83229 -275889
1560 -275889 -885885 -1034632 -771020 -622852 -577163 -730719 -668955 -135961 -248848 -243547
1550 -243547 -512242 -42322 248870 242638 -297366 -635783 -787208 -883447 -819782 -688656
1540 -688656 -225505 -606535 -482274 -575956 -1100123 -877403 -401355 -176834 -133634 7024
1530 7024 315455 153145 -167397 -869391 -484569 -437334 -653234 -931226 -818750 185889
1520 185889 -145335 -381384 -364078 -842544 -759444 -164513 -553424 -412097 -321997 -273584
1510 -273584 40505 -318796 -973902 -825618 -90794 721219 291167 -13337 489259 -432607
1500 -432607 -697273 -695062 -1183493 -420946 231785 -185405 199943 548627 -151002 60211
$$ packed form
1570c83112k06913J19175K95671k61766p43297M68994K85073M56736N2668l59118
1560b75889o09996j48747K63612J48168M5689j53556O1764N32994j12887N301
1550b43547k68695M69920K91192o232n40004l38417j51425r6239O3665J31126
1540f88656M63151l81030J24261r3682n24167K22720M76048K24521M3200J40658
1530G024L08431j62310l20542p01994L84822M7235k15900k77992J12476J004639
1520A85889l31224k36049J7306m78466Q3100N94931l88911J41327R0100M8413
1510b73584L14089l59301o55106J48284P34824Q12013m30052l04504N02596r21866
1500d32607k64666K211m88431P62547O52731m17190L85348L48684o99629K11213
$$ plain form
1490 60211 584743 -141818 56671 299055 -523346 -985987 -1089791 -620519 -390301 -813477
1480 -813477 -289930 -1789 47406 -176000 -161659 -68089 114629 -267359 -289772 -387834 -224388
1469 -224388 -110633 -245739 676370 713443 388381 253504 -23932 -814244 -197055 261965
1459 261965 21398 -889844 -884604 254122 521298 249893 -215090 -163067 19694 -58805
1449 -58805 -459655 -2656 -203384 -553046 -1219035 -169440 -180821 -417235 -695273 -795682
1439 -795682 -853818 -357566 -440171 -281239 -492766 -477617 -499425 -363106 -242188 -248337 -392648
1428 -392648 -623235 -854131 -1179983 -673854 -893387 -427484 -451777 -461276 -267224 17869
1418 17869 -12456 -701757 -1194039 -829033 -1076607 -670042 -295482 9185 770969 352384
$$ packed form
1490F0211N24532p26561J98489K42384q22401m62641j03804M69272K30218m23176
1480h13477N23547K88141M9195k23406J4341R3570J82718l81988k2413r8062J63446
1469b24388J13755j35106R22109L7073l25062j34877k77436p90312O17189M59020
1459B61965k40567r11242N240J138726K67176k71405m64983N2023J82761p8499
1449e8805m00850M56999k00728l49662o65989J049595j1381k36414k78038j00409
1439g95682n8136M96252q2605J58932k11527J5149k1808J36319J20918o149j44311
1428c92648k30587k30896l25852N06129k19533M65903k4293r499J94052K85093
1418A7869l0325o89301m92282L65006k47574M06565L74560L04667P61784m18585
$$ plain form
1408 352384 -22839 -312713 -524307 -318431 -507155 -764489 -1388201 -684138 -630591 -836907
1398 -836907 -1090716 -470080 37677 92088 -405986 -914146 34423 592672 185454 -654318
1388 -654318 -352692 458088 227468 -370218 -877791 10674 254669 154129 -41877 -508635
1378 -508635 32869 -398845 -878769 -400583 -566131 -515130 -836284 -1256436 -1310912 -587816
1368 -587816 -133554 102930 -52386 72533 -73834 -244579 -1018919 -859730 -256446 -14426
1358 -14426 -488999 -694707 -23803 -233262 -172609 -266251 -664191 -150943 253004 364641
1348 364641 -239673 -402269 -82207 -128967 -365641 -985218 -865906 -90346 157898 -12779
1338 -12779 -67613 218320 174565 341454 -27159 134 144789 -45844 -12586 -1058046
$$ packed form
1408C52384l75223k89874k11594K05876j88724k57334o23712P04063N3547k06316
1398h36907k53809O20636N07757N4411m98074n08160R48569N58249m07218q39772
1388f54318L01626Q10780k30620n97686n07573Q88465K43995j00540j96006m66758
1378e08635N41504m31714m79924M78186j65548N1001l21154m20152n4476P23096
1368e87816M54262K36484j55316J24919j46367j70745p74340J59189O03284K42020
1358a4426m74573k05708O70904k09459O0653r3642l97940N13248M03947J11637
1348C64641o04314j62596L20062m6760k36674o19577J19312P75560K48244j70677
1338a2779n4834K85933m3755J66889l68613K7293J44655j90633L3258j045460
$$ plain form
1328 -1058046 -719860 -648733 -884349 -1183236 -1176486 -473883 -148544 -171281 -402997 -263931
1318 -263931 64652 -212912 -284757 -690840 -434789 -404341 -718592 -586676 -518215 -488840
1308 -488840 -145641 -171096 -528849 -748122 -124880 282992 438959 3351 149358 266691
1298 266691 -81298 -957727 -635365 -275740 -193642 -488342 -666736 -344598 -394723 -409362
1288 -409362 -1189979 -876546 362187 290779 44613 -781797 -926594 -376415 -746953 -888363
1278 -888363 -48350 -245877 -412910 -450745 -26520 -231656 -619322 -517531 -789660 -1069674
1268 -1069674 -884981 -101269 -441217 -602616 -147551 224234 417905 329466 -309533 -640462
1258 -640462 -464292 -207305 -169041 -501475 -728078 -625276 -353511 184710 527477 447996
$$ packed form
1328a058046L38186P1127k35616k98887O750P02603L25339k2737k31716J39066
1318b63931L28583k77564p1845m06083K56051L0448l14251J31916O8461K9375
1308d88840L43199k5455l57753k19273O23242M07872J55967m35608J46007J17333
1298B66691l47989q76429L22362L59625Q2098k94700j78394L22138n0125j4639
1288d09362p80617L13433J238733p1408k46166q26410j44797N50179l70538j41410
1278h88363Q40013j97527j67033l7835M24225k05136l87666J01791k72129k80014
1268a069674J84693P83712l39948j61399M55065L71785J93671q8439o38999l30929
1258f40462J76170K56987L8264l32434k26603J02802K71765N38221L42767p9481
$$ plain form
1248 447996 -290783 -83685 -695631 -800337 -513203 -1191531 -931523 -1031856 -862923 -95795
1238 -95795 -184371 -447155 136395 90249 273043 -262001 -507017 -304734 -224322 -239899 381907
1227 381907 465936 120179 143971 -356150 -625293 -654789 -507744 -767897 95086 -39970
1217 -39970 -106913 -260534 163305 -209060 -508244 61953 -608034 -341846 165098 124276
1207 124276 -61138 -207641 -436281 -254697 88228 -776655 -399118 -82566 -444338 -486234
1197 -486234 -1325234 -1462224 -687070 -475793 60724 -180639 -194170 549777 300166 -112298
1187 -112298 4268 269390 265085 -278756 -768240 -582499 409047 187391 361115 451944
1177 451944 835570 196273 -313816 -629401 -750141 -574252 -13836 -147706 -507416 555472
$$ packed form
1248D47996p38779K07098o11946j04706K87134o78328K60008j00333J68933P67128
1238i5795q8576k62784N83550m6146J82794n35044k45016K02283Q0412j5577O21806
1227C81907Q4029l45757K3792n00121k69143k9496J47045k60153Q62983j35056
1217c9970o6943j53621M23839l72365k99184N70197o69987K66188N06944m0822
1207A24276j85414j46503k28640J81584L42925q64883L77537L16552l61772m1896
1197d86234q39000j36990P75154K11277N36517k41363j3531P43947k49611m12464
1187a12298J16566K65122m305n43841m89484J85741R91546k21656J73724R0829
1177D51944L83626o39297n10089l15585j20740J75889N60416j33870l59710J062888
$$ plain form
1167 555472 1046524 665115 -279234 -697876 -161161 366304 -156498 -177911 -308351 -107835
1157 -107835 -471992 237712 -475920 -143399 184850 -295159 -28212 -248310 -31441 -211208
1147 -211208 -227827 17420 195163 -392718 -157644 -224686 -96897 370185 -306356 -484405
1137 -484405 17339 434906 856584 671770 366367 206380 -609906 -736806 -393929 -486957
1127 -486957 22470 918415 454052 -285192 175591 -638854 -1211720 -573071 -719652 -417930
1117 -417930 -458152 -829557 -405804 -884598 -300675 732650 -73712 855302 601627 145111
1107 145111 196184 -365125 -530405 -688473 -545245 -619900 -168622 -161111 45762 238308
1097 238308 287461 377061 805254 373476 -144411 -1063254 -448685 271082 -33366 -83373
$$ packed form
1167E55472M91052l81409r44349m18642N36715N27465n22802k1413j30440K00516
1157a07835l64157P09704p13632L32521L28249m80009K66947k20098K16869j79767
1147b11208j6619K45247J77743n87881K35074o7042J27789M67082o76541j78049
1137d84405N01744M17567M21678j84814l05403j59987q16286j26900L42877r3028
1127d86957N09427Q95945m64363p39244M60783q14445n72866O38649j46581L01722
1117d17930m0222l71405M23753m78794N83923J033325q06362R29014k53675m56516
1107A45111N1073n61309j65280j58068J43228p4655M51278P511K06873J92546
1097B38308M9153Q9600M28193m31778n17887r18843O14569P19767l04448n0007
$$ plain form
1087 -83373 -459304 -366661 -451278 -475189 -257563 533745 246115 -141712 -387496 -231241
1077 -231241 205517 -244574 -1243290 -1368294 -574695 202854 141189 -70598 -799733 -588397
1067 -588397 -606366 -351048 58159 -133095 70296 -311238 -183902 -77570 -193086 208527
1057 208527 308742 316846 -266491 -79113 -552558 -517330 -603430 -644187 -372691 -449207 -134539
1046 -134539 -531191 -733967 -162265 -284929 -215005 101748 205386 -503641 -657940 -808166
1036 -808166 -1288588 -1052584 -1005852 -169157 -384896 -275106 -470913 -493317 -464548 -18593
1026 -18593 -315348 -1222582 -1284716 -1252413 -152767 583708 -448628 -861531 -186901 -231289
1016 -231289 -98022 -309309 -318400 -289438 -426828 -272688 52934 -584428 -195308 272714
$$ packed form
1087h3373l75931R2643q4617k3911K17626P91308k87630l87827k45784J56255
1077b31241M36758m50091r98716j25004P93599P77549o1665k11787p29135K11336
1067e88397j7969K55318M09207j91254K03391l81534J27336J06332j15516M01613
1057B08527J00215Q104n83337J87378m73445L5228q6100m0757K71496p6516L14668
1046a34539l96652k02776N71702j22664O9924L16753J03638p09027j54299j50226
1036h08166m80422K36004M6732Q36695k15739J09790j95807k2404K8769M45955
1026a8593k96755r07234o2134L2303J099646P36475j032336m12903O74630m4388
1016b31289J33267k11287r091K8962j37390J54140L25622o37362L89120M68022
$$ plain form
1006 272714 -212762 309939 757048 488504 -56336 -315849 -258220 -299644 -363637 469888
996 469888 747901 709243 572382 41777 -178233 487940 314693 228456 45869 -319551
986 -319551 -43680 -1106295 -864535 -228219 -452755 159270 577415 660137 188067 188627
976 188627 -420389 -662744 -332002 -9964 -765108 5100 -436714 -358028 -44649 -74843
966 -74843 179304 718119 883058 419393 508977 -135933 -405183 -21830 -93969 810816
956 810816 335757 -218172 -30037 -311025 -801251 -233125 117140 -263372 -245338 -390661
946 -390661 666889 -260863 226621 161777 180169 173677 298905 36447 -357749 -605852
936 -605852 -253475 320934 371010 -43253 -404475 -637019 2699 371117 -732 -73533
$$ packed form
1006B72714m85476N22701M47109k68544n44840k59513N7629m1424o3993Q33525
996D69888K78013l8658j36861n30605k20010O66173j73247q6237j82587l65420
986c19551K75871j062615K41760O36316k24536O12025M18145Q2722m72070N60
976A88627o09016k42355L30742L22038p55144P70208m41814P8686L13379l0194
966g4843K54147N38815J64939m63665Q9584o44910k69250L83353p2139R04785
956H10816m75059n53929J88135k80988m90226N68126L50265l80512J8034j45323
946c90661J057550r27752M87484o4844J8392o492J25228k62458l94196k48103
936f05852L52377N74409N0076m14263l61222k32544O39718L68418l71849p2801
$$ plain form
926 -73533 -517704 -222714 -54310 -122924 -165540 653751 814542 678836 -22554 161992
916 161992 -96528 -348530 -203468 290164 -196151 386825 379366 -794242 -935647 -122060
906 -122060 272190 28521 472827 592177 1023796 933922 1326229 690793 472787 681819
896 681819 -78649 -494983 -5793 89472 572704 56608 -155511 -4905 752991 956769
886 956769 -139443 -955822 -464447 268844 625093 199225 119945 357797 531005 528993
876 528993 1230 -143827 158156 -143448 -458756 -596549 -83860 -120818 -183378 166056
866 166056 170131 378209 551567 520216 -152305 -84846 -71759 638296 425900 44040 271726
855 271726 368072 -67422 -67455 253353 -179585 875865 1143438 549129 392333 415492 -213253
$$ packed form
926g3533m44171K94990J68404o8614m2616Q19291J60791j35706p01390J84546
916A61992k58520k52002J45062M93632m86315N82976p459j173608j41405Q13587
906a22060L94250k43669M44306J19350M31619q9874L92307o35436k18006K09032
896F81819p60468m16334M89190R5265M83232n16096k12119J50606P57896K03778
886I56769j096212q16379M91375P33291L56249m25868p9280K37852J73208k012
876E28993n27763j45057L01983l01604l15308j37793N12689l6958o2560L49434
866A66056M075K08078J73358l1351o72521O7459J3087P10055k12396l81860K27686
855B71726R6346m35494l3L20808m32938J055450K67573n94309j56796K3159o28745
$$ plain form
844 -213253 -163444 -41519 -76579 429474 341368 -475285 -176820 5781 487417 620048
834 620048 -272651 573657 604691 593749 334985 -239565 69857 -16476 -66633 -845458 -1109382
823 -1109382 -517121 -102960 -27150 28456 1076275 769264 -3679 224420 25847 -390954
813 -390954 73477 -382559 -613397 202707 719464 977025 685508 -29003 121685 -448787
803 -448787 20252 -302528 -482975 130676 31773 190678 -274403 -519821 137334 -21106
793 -21106 -220618 -238154 -254132 -190557 -148108 -320718 354239 514999 -29889 -735221 -740536
782 -740536 -458405 370006 626972 137821 230040 -217395 -234846 -387747 -239928 -295449
772 -295449 133871 651552 913082 -110159 -1125698 -84579 196394 336621 896674
$$ packed form
844b13253M9809J21925l5060N06053q8106q16653K98465J82601M81636J32631
834F20048q92699Q46308L1034j0942k58764n74550L09422q6333n0157p78825k63924
823a109382N92261M14161P5810N5606J047819l07011p72943K28099j98573m16801
813c90954M64431m56036k30838Q16104N16757K57561k91517p14511J50688n70472
803d48787M69039l22780j80447O13651r8903J58905m65081k45418O57155j58440
793b1106j99512j7536j5978O3575M2449j72610O74957J60760n44888p05332n315
782g40536K82131Q28411K56966m89151R2219m47435j7451j52901J47819n5521
772b95449M29320N17681K61530j023241j015539J041119K80973J40227N60053
$$ plain form
763 896674 829878 875032 -90526 109448 108511 190812 222379 502977 462138 213834 455482
752 455482 519227 85133 124212 327792 1114094 841387 -98376 -659792 -739878 -66973
742 -66973 -147251 478152 387795 807398 327574 461349 550058 970178 964196 378718 34210
731 34210 225816 497672 711746 363171 -336051 -354695 -479369 157314 238851 -289817
721 -289817 -428632 193821 417623 32365 -664288 -500736 -199621 76059 202791 303654
711 303654 -68054 518503 969409 -98280 -164093 -190689 365876 492574 6589 -167491
701 -167491 57545 -438227 -776907 -215480 381453 896393 782265 473994 219047 14616
691 14616 611063 565845 -222569 -266245 305857 -205021 -490077 73691 186474 906360
$$ packed form
763H96674o6796M5154r65558J99974r37Q2301L1567K80598m0839k48304K41648
752D55482O3745m34094L9079K03580P86302k72707r39763n61416q0086O72905
742f6973q0278O25403r0357M19603m79824J33775Q8709M20120n982n85478l44508
731C4210J91606K71856K14074l48575o99222j8644j24674O36683Q1537n28668
721b89817j38815O22453K23802l85258o96653J63552L01115K75680J26732J00863
711C03654l71708N86557M50906j067689o5813k6596N56565J26698m85985j74080
701a67491K25036m95772l38680N61427N96933N14940j14128l08271k54947k04431
691A4616N96447m5218p88414m3676N72102n10878k85056N63768J12783P19886
$$ plain form
681 906360 621936 153177 306608 -232744 -513321 -657110 -663818 -404435 -116672 705005
671 705005 508851 443296 603524 836706 645661 1133606 1296185 404584 -36065 588797
661 588797 73624 -40292 442001 -63250 176696 -224334 -171361 -119335 -621324 -234207
651 -234207 -768583 -34598 717605 358215 -77579 -64229 -193672 236823 363071 85527
641 85527 275268 919902 699208 170960 -28426 12658 387493 134844 -138402 220467
631 220467 -20810 -293568 79451 255865 72782 350957 12103 -341902 -317430 -138112
621 -138112 790987 273009 -573645 -597072 -37367 314402 763926 10403 584412 1397564
611 1397564 674953 889245 435445 241754 442547 -297514 159076 299440 560233 164926
$$ packed form
681I06360k84424m68759J53431n39352k80577j43789o708K59383K87763Q21677
671G05005j96154o5555J60228K33182j91045M87945J62579q91601m40649O24862
661E88797n15173j13916M82293n05251K39946m01030N2973N2026n01989L87117
651b34207n34376P33985P52203l59390m35794J3350j29443M30495J26248k77544
641H5527J89741O44634k20694n28248j99386M1084L74835k52649k73246L58869
631B20467k41277k72758L73019J76414j83083K78175l38854l54005K4472J79318
621a38112R29099n17978q46654k3427N59705L51769M49524p53523N74009Q13152
611A397564p22611K14292m53800j93691K00793p40061M56590J40364K60793l95307
$$ plain form
601 164926 41798 26186 -53846 -1528 604609 595909 307909 -488251 -671575 -458594 586147
590 586147 977149 731542 675225 574252 241389 -773349 -1179859 9295 831568 43132
580 43132 -148535 447703 661921 516434 842504 510888 -79014 381471 321673 -554637
570 -554637 -890383 -290020 -166495 -62328 462003 262715 148424 528625 690299 973208
560 973208 407851 404785 494037 415390 238981 286663 378970 -322742 384172 99039 -150162
549 -150162 101838 526789 240099 522729 1242257 975307 1025183 767894 293833 80629
539 80629 809247 350397 193998 154185 714277 1283028 663428 -74814 -396517 346697
529 346697 214604 544478 140383 -170847 -809354 -392973 140039 -140357 -219943 380471
$$ packed form
601A64926j23128j5612q0032N2318O06137q700k88000p96160j83324K12981J044741
590E86147L91002k45607n6317j00973l32863j014738m06510J189154Q22273p88436
580D3132j91667N96238K14218j45487L26070l31616n89902M60485n9798q76310
570e54637l35746O00363J23525J04167N24331j99288j14291L80201J61674K82909
560I73208n65357l066Q9252p8647j76409M7682R2307p01712P06914k85133k49201
549a50162K52000M24951k86690K82630P19528k66950M9876k57289m74061k13204
539H0629P28618m58850j56399l9813N60092N68751o19600p38242l21703P43214
529C46697j32093L29874m04095l11230o38507M16381N33012k80396p9586O00414
$$ plain form
519 380471 384354 551753 440930 986797 578047 683645 594702 -308657 -508022 -274459
509 -274459 -798442 -151145 497003 464264 505535 595177 859685 1007389 1021564 993599 349954
498 349954 124951 -13750 -60482 -390053 -15737 -64673 -606429 409872 112562 668766
488 668766 983767 1249571 577718 212521 -361259 -279895 -588933 -425041 -857629 -545660
478 -545660 63426 225632 65518 390912 1049342 1076739 718741 415194 509080 323653
468 323653 824565 32087 -145366 379722 1087401 1191269 602992 609842 217111 731876
458 731876 461561 -613797 -263863 148123 -156846 209440 -73417 -18624 711813 764270
448 764270 1127065 370403 -199290 294262 688454 687985 540133 868802 272928 -470174
$$ packed form
519C80471L883J67399j10823N45867m08750J05598q8943r03359j99365K33563
509b74459n23983O47297O48148l2739M1271Q9642K64508J47704J4175k7965o43645
498C49954k25003j38701m6732l29571L74316m8936n41756J016301k97310N56204
488F68766L15001K65804o71853l65197n73780Q1364l09038J63892m32588L11969
478e45660O09086J62206j60114L25394O58430K7397l57998l03547R3886j85427
468C23653N00912p92478j77453N25088P07679J03868n88277O850l92731N14765
458G31876k70315j075358L49934M11986l04969L66286k82857N4793P30437N2457
448G64270L62795p56662n69693M93552L94192m69j47852L28669n95874p43102
$$ plain form
438 -470174 726100 1187999 486410 1021315 1340603 607488 431394 574567 351131 -454068
428 -454068 -87156 149049 759811 78719 -382093 129120 176603 1326060 1621959 1305917
418 1305917 1086122 1206773 782101 334812 341995 1134610 1172794 464412 -526934 -104906
408 -104906 597655 345274 10422 -128250 298398 911056 910548 124529 -623646 -237070
398 -237070 414246 -28568 205071 175973 626943 1735351 1002093 1102002 1338274 549941
388 549941 420953 -255037 -705946 -150684 234706 -119716 19952 560076 483187 588483
378 588483 712265 519315 771326 854345 743177 567524 -566168 -856372 -286270 212663
368 212663 308427 364704 329707 738779 71173 -24616 857794 1124388 1280799 156902
$$ packed form
438d70174J196274M61899p01589N34905L19288p33115j76094J43173k23436q05199
428d54068L66912K36205O10762o81092m60812N11213M7483J149457K95899l16042
418A305917k19795J20651m24672m47289P183P92615L8184p08382r91346M22028
408a04906P02561k52381l34852j38672M26648O12658n08p86019p48175L86576
398b37070O51316m42814K33639k9098M50970J108408p33258R9909K36272p88333
388E49941j28988o75990m50909N55262L85390l54422J39668N40124p6889J05296
378E88483J23782j92950K52011Q3019j11168j75653j133692k90204N70102M98933
368B12663R5764N6277l4997M09072o67606r5789Q82410K66594J56411j123897
$$ plain form
358 156902 -27300 -246480 -643344 -974624 -471356 417605 124589 451905 1437209 1734473
348 1734473 1670790 1773777 1473534 395835 538008 1208099 -129415 -1353771 -1221401
339 -1221401 -384137 109208 279494 1000006 981109 1125132 1515016 1324512 1104795 1412186
329 1412186 937293 -97833 -273297 -133228 119036 408775 387279 663877 734460 688515
319 688515 1096565 952330 390731 154633 185493 603241 537488 -38545 150746 541017
309 541017 257865 465910 1283642 1100419 1233464 997097 -118504 -367114 -835721 -464678
299 -464678 -576140 -526586 -180700 770365 293920 78374 340330 882645 950388 449374
289 449374 509231 687206 336138 -137666 101487 489729 293704 223344 320311 165389
$$ packed form
358A56902j84202k19180l96864l31280N03268Q88961k93016L27316R85304K97264
348A734473o3683J02987l00243j077699J42173O70091j337514j224356J32370
339a221401Q37264M93345J70286P20512j8897J44023L89884j90504k19717L07391
329A412186m74893j035126j75464J40069K52264K89739k1496K76598P0583m5945
319F88515M08050j44235n61599k36098L0860M17748o5753n76033J89291L90271
309E41017k83152K08045Q17732j83223J33045k36367j115601k48610m68607L71043
299d64678j11462M9554L45886R51065m76445k15546K61956N42315O7743n01014
289D49374N9857J77975l51068m73804K39153L88242j96025p0360R6967j54922
$$ plain form
279 165389 599308 598025 831450 385758 -167280 -414822 -490755 -272434 -21367 -371790
269 -371790 -32665 20152 469104 897012 1281889 1125014 930236 1293540 915141 665283
259 665283 558529 -805120 -583111 -238383 727800 593490 296558 320182 980582 697583
249 697583 412882 541574 889424 883295 396116 -19667 -538270 135457 -453474 -358051
239 -358051 -426874 126765 295206 -4724 514679 553300 317193 90595 529616 687764
229 687764 1016665 899497 490386 301030 420808 1579446 980288 570269 618802 324132
219 324132 962271 1110279 433183 207331 216974 573812 499790 281760 268096 833751 949972
208 949972 1388168 1170521 786355 612399 124612 215732 230089 28673 183756 896855
$$ packed form
279A65389M33919j283K33425m45692n53038k47542p5933K18321K51067l50423
269c71790L39125N2817M48952M27908L84877j56875j94778L63304l78399k49858
259F65283j06754j363649K22009L44728R66183j34310k96932K3624O60400k82999
249F97583k84701J28692L47850o129m87179m15783n18603O73727n88931R5423
239c58051o8823N53639J68441k99930N19403L8621k36107k26598M39021J58148
229F87764L28901j17168m09111j89356J19778J158638n99158m10019M8533k94670
219C24132O38139J48008o77096k25852R643L56838p4022k18030j3664N65655J16221
208I49972M38196k17647l84166j73956m87787R1120J4357k01416J55083P13099
$$ plain form
198 896855 792350 975362 1137316 886701 850444 478105 430878 932753 891251 988462 834603
187 834603 9472 -16219 450357 859522 1272695 810573 381266 641779 416177 210371
177 210371 101297 84878 606108 960355 379392 968036 816149 661351 478512 825894
167 825894 1066230 716382 525138 349489 775310 507709 351081 188713 371808 340806
157 340806 236478 -18534 11632 241261 924703 1145295 483459 356484 463087 747532
147 747532 291815 486165 48709 247263 1066445 534618 566187 522001 518414 752869 607996
136 607996 946600 886548 3969 -177535 185742 357942 427312 599575 366294 134645
126 134645 769614 1021534 419726 555591 350188 291620 249235 197504 -182135 658204
$$ packed form
198H96855j04505J83012J61954k50615l6257l72339m7227N01875m1502R7211j53859
187H34603q25131k5691M66576M09165M13173m62122m29307K60513k25602k05806
177B10371j09074j6419N21230L54247n80963N88644j51887j54798j82839L47382
167H25894K40336l49848j91244j75649M25821k67601j56628j62368J83095l1002
157C40806j04328k55012L0166K29629O83442K20592o61836j26975J06603K84445
147G47532m55717J94350m37456J98554Q19182n31827L1569m4186l587K34455j44873
136F07996L38604o0052q82579j81504L63277J72200O9370J72263k33281k31649
126A34645O34969K51920o01808J35865k05403n8568m2385n1731l79639Q40339
$$ plain form
116 658204 1687350 877166 367104 221784 -158093 224928 63312 265813 243096 398160
106 398160 511000 654454 693174 433939 319290 426909 194715 7550 490339 653430
96 653430 696322 589579 695764 542655 773112 946095 665435 417152 330859 375155 572623
85 572623 377639 700815 579371 770544 747122 504973 997707 1511018 1284952 911033
75 911033 904756 977883 1023212 720748 399009 901155 967406 721783 1093208 731794 896354
64 896354 841899 634388 806311 529395 695560 541733 383996 647574 782698 1132276
54 1132276 971963 619949 502081 714462 339977 687366 471420 284034 599766 535158
44 535158 413223 62936 185553 404061 304031 39798 30128 359966 116452 98938 540399
$$ packed form
116F58204J029146q10184n10062j45320l79877L83021j61616K02501k2717J55064
106C98160J12840J43454L8720k59235j14649J07619k32194j87165M82789J63091
96F53430M2892j06743J06185j53109K30457J72983k80660k48283q6293M4296J97468
85E72623j94984L23176j21444J91173k3422k42149M92734N13311k26066l73919
75I11033o277P3127M5329l02464l21739N02146O6251k45623L71425l61414J64560
64H96354n4455k07511J71923k76916J66165j53827j57737K63578J35124L49578
54A132276j60313l52014j17868K12381l74485L47389k15946j87386L15732o4608
44E35158j21935l50287J22617K18508j00030k64233r670L29838k43514j7514M41461
$$ plain form
33 540399 748866 1234116 886044 794158 678383 421935 237837 308172 -54767 205730
23 205730 513808 595775 991689 765176 609767 570366 633124 672151 403734 415479 477017
12 477017 669250 249122 722975 836377 779916 932017 871013 948846 996143 963342 670891
1 670891 801691
0 801691
$$ packed form
33E40399K08467M85250l48072r1886j15775k56448j84098P0335l62939K60497
23B05730L08078Q1967L95914k26513j55409l9401O2758L9027k68417J1745O1538
12D77017J92233m20128M73853J13402n6461J52101o1004P7833M7297l2801k92451
1F70891J30800
0H01691
$$ Imaginary data points
##PAGE= N=2
##DATA TABLE= (X++(I..I)), XYDATA
$$ plain form
16383 -2653583 -2782300 -3054581 -2964692 -2397061 -1961265 -2053018 -2128592 -1918626 -1976951 -1983800
16373 -1983800 -2064394 -2479345 -2217317 -1709983 -1890378 -2026468 -2203058 -1649676 -1433275 -1642980
16363 -1642980 -1237150 -1428105 -1131659 -1568534 -2064145 -1847054 -1153382 -1302510 -1786963
16354 -1786963 -1649432 -1396347 -1477022 -1431660 -1073218 -1401345 -1281219 -593922 -842336 -1487368
16344 -1487368 -1239901 -1183786 -1190460 -1368296 -924154 -804837 -711218 -751543 -1014218 -562207
16334 -562207 -292610 -585670 -626203 -1064084 -655210 -440765 -382037 -338731 -821513 -391267
16324 -391267 -278631 -541381 -293945 226673 -12712 -186595 72782 -72296 -180343 -395398
16314 -395398 -262039 -537828 -806811 -555569 -323248 -261702 -95829 19561 6467 276409
$$ packed form
16383b653583j28717k72281Q9889N67631M35796r1753p5574K09966n8325o849
16373a983800q0594m14951K62028N07334j80395j36090j76590N53382K16401k09705
16363a642980M05830j90955K96446m36875m95611K17091O93672j49128m84453
16354a786963J37531K53085q0675M5362L58442l28127J20126O87297k48414o45032
16344a487368K47467N6115o674j77836M44142J19317R3619m0325k62675M52011
16334e62207K69597k93060m0533m37881M08874K14445N8728M3306m82782M30246
16324c91267J12636k62750K47436N20618k39385j73883K59377j45078j08047k15055
16314c95398J33359k75789k68983K51242K32321O1546J65873J15390j3094K69942
$$ plain form
16304 276409 148201 19097 295685 134483 283660 126152 5737 549164 514469 575716
16294 575716 672861 744052 520357 1005086 1076334 758103 413827 605999 1582627 1638712
16284 1638712 1206030 1053487 1135779 1457010 1367871 1574615 1078743 796241 740161 620369
16274 620369 869195 659892 768550 1389660 1810985 1652649 1023833 1371345 1538810 1546660
16264 1546660 1206101 1527218 1646744 1708362 1193824 1442385 1958365 2029541 1981214 1687441
16254 1687441 1705595 1972063 1876422 2033767 1763136 1587169 1401041 1506212 1221551 1150858
16244 1150858 1458327 2154473 2778945 2109404 1317958 1408904 2053792 1551747 1179393 1244049
16234 1244049 2015475 2286329 1889430 1829285 2029236 1814841 2337019 2270722 2289906 2155919
$$ packed form
16304B76409j28208j29104K76588j61202J49177j57508j20415N43427l4695O1247
16294E75716R7145P1191k23695M84729P1248l18231l44276J92172R76628N6085
16284A638712m32682j52543Q2292L21231q9139K06744m95872k82502n6080j19792
16274F20369K48826k09303J08658O21110M21325j58336o28816L47512J67465P850
16264A546660l40559L21117J19526O1618n14538K48561N15980P1176m8327k93773
16254A687441J8154K66468r5641J57345k70631j75967j86128J05171k84661p0693
16244A150858L07469O96146O24472o69541p91446R0946O44888n02045l72354O4656
16234A244049P71426K70854l96899o0145J99951k14395N22178o6297J9184j33987
$$ plain form
16224 2155919 2954943 1943862 1694623 1825939 2419668 2618100 2560463 3058793 2890684
16215 2890684 2526172 2372109 2566039 2928166 3219804 2886335 2452111 2401081 2382243 2822199
16205 2822199 2432600 2177008 2649775 2705255 3103810 3450560 2830788 2505130 2587579 2205163
16195 2205163 2214505 1799176 1912004 2334219 1970647 2069326 2624207 2373834 2738887 2855714
16185 2855714 2507110 3183036 3501441 2942378 3112728 3499191 3008028 2540439 2536229 2946163
16175 2946163 3204650 2187025 2423266 2372089 2346028 3470203 3869345 3498617 3184593
16166 3184593 2587100 2782807 3255554 3405379 3428323 3270188 3034634 3100173 2815779 2834626
16156 2834626 3239436 3505068 3436088 2811537 1970235 2095513 2365648 1919734 2913136 3562988
$$ packed form
16224B155919P99024j011081k49239J31316N93729J98432n7637M98330j68109
16215B890684l64512j54063J93930L62127K91638l33469m34224n1030j8838M39956
16205B822199l89599k55592M72767N5480L98555L46750o19772l25658Q2449l82416
16195B205163R342m15329J12828M22215l63572R8679N54881k50373L65053J16827
16185B855714l48604O75926L18405n59063J70350L86463m91163m67589m210M09934
16175B946163K58487j017625K36241n1177k6061J124175L99142l70728l14024
16166C184593n97493J95707M72747J49825K2944j58135k35554O5539k84394J8847
16156B834626M04810K65632o8980o24551q41302J25278K70135m45914R93402O49852
$$ plain form
16146 3562988 3355114 3825576 3492614 3755864 3740288 2882282 2791978 2853568 2811778 3050420
16136 3050420 3384561 3137741 3646613 3738071 3144180 3360285 3115744 2884510 2832534 2854175
16126 2854175 2891301 2934411 3154224 3310869 3725374 3687830 3660895 3717937 3822130 3970477
16116 3970477 4399539 4707730 4401858 3491950 3314326 3579970 3705030 3420332 3260153
16107 3260153 3179075 3644048 3690946 3380939 2800194 3345815 3701101 3627193 3131666 2684290
16097 2684290 2836410 3246763 3163865 3611114 4174585 4181171 4036884 3916530 4080194 3964660
16087 3964660 4539310 3752471 3072031 3480251 3554677 3851363 3751196 3636080 3613395 3247053
16077 3247053 2808981 3430516 3774518 4232676 3881086 3417200 3911976 3303287 3605469
$$ packed form
16146C562988k07874M70462l32962K63250j5576q58006r0304O1590m1790K38642
16136C050420L34141k46820N08872R1458n93891K16105k44541k31234n1976K1641
16126B854175L7126M3110K19813J56645M14505l7544k6935N7042J04193J48347
16116C970477M29062L08191l05872r09908j77624K65644J25060k84698j60179
16107C260153q1078M64973M6898l10007n80745N45621L55286p3908m95527m47376
16097B684290J52120M10353q2898M47249N63471O586j44287j20354J63664j15534
16087C964660N74650p86839o80440M08220P4426K96686j00167j15116k2685l66342
16077C247053m38072O21535L44002M58158l51590m63886M94776o08689L02182
$$ plain form
16068 3605469 3280231 3615786 3767194 3956806 3795163 3630994 3970966 3938753 3708008 3974759
16058 3974759 3794876 3517435 3452415 3478594 2917624 2312948 2375197 2992746 3391786 3423343
16048 3423343 3103348 3381788 3236699 3748733 3976656 3431517 3627600 3871488 3394055
16039 3394055 3664706 3892378 3783434 4072306 3561770 3367128 3934813 4007808 3541779 3666972
16029 3666972 3568505 3225154 3217249 3249671 3269127 3740215 3674593 3093836 3009458 4026627
16019 4026627 4476380 4579830 4007747 3842270 3929700 4354989 3837603 3482938 3144179 3250792
16009 3250792 3213059 2704044 3042739 3524617 3895717 3869366 3744809 3439109 4357292 3518710
15999 3518710 3301817 3066529 3114431 3678747 3690446 3325973 3483866 4297678 3810115 3763221
$$ packed form
16068C605469l25238L35555J51408J89612j61643j64169L39972l2213k30745K66751
16058C974759j79883k77441o5020K6179n60970o04676O2249O17549L99040L1557
16048C423343l19995K78440j45089N12034K27923n45139J96083K43888m77433
16039C394055K70651K27672j08944K88872n10536j94642N67685P2995m66029J25193
16029C666972r8467l43351p905L2422J9456M71088o5622n80757q4378J017169
16019D026627M49753J03450n72083j65477Q7430M25289n17386l54665l38759J06613
16009C250792l7733n09015L38695M81878L71100k6351j24557l05700R18183q38582
15999C518710k16893k35288M7902N64316J1699l64473J57893Q13812m87563m6894
$$ plain form
15989 3763221 3876964 3950281 3822782 3642739 2935956 2623004 2623471 2239487 2983065 3491871
15979 3491871 3953264 4062604 3672386 3835924 3685790 3818277 3729767 4248519 4214710 3633311
15969 3633311 3264317 2803102 2484089 2568407 3212498 4040217 4198378 3918919 3498882 3829379
15959 3829379 4115049 4326503 3848813 3650125 3784190 4316255 3567781 2344280 3082523
15950 3082523 3521712 3357638 3935482 3821018 3974747 3364730 3635169 3111115 3214656
15941 3214656 3218002 2376325 2481588 2980513 3152793 2783448 2893271 2978794 3136583 3480987
15931 3480987 4572174 4154131 3250784 2850316 3662386 4276792 3523682 3044375 3461956
15922 3461956 3384927 3391713 3719726 4497056 5521916 5275536 4732280 3140191 2333432 2790432
$$ packed form
15989C763221J13743P3317j27499j80043p06783l12952M67l83984P43578N08806
15979C491871M61393J09340l90218J63538j50134J32487q8510N18752l3809n81399
15969C633311l68994m61215l19013Q4318O44091Q27719J58161k79459m20037L30497
15959C829379K85670K11454m77690j98688J34065N32065p48474j223501P38243
15950C082523M39189j64074N77844j14464J53729o10017K70439n24054J03541
15941C214656L346q41677J05263M98925J72280l69345J09823Q5523J57789L44404
15931C480987J091187m18043r03347m00468Q12070O14406p53110m79307M17581
15922C461956p7029O786L28013P77330J024860k46380n43256j592089q06759M57000
$$ plain form
15912 2790432 3067062 3216958 3046540 3903794 3991723 4865994 3926633 3845988 4297144 3924174
15902 3924174 3505249 3160030 3217202 3885844 3355850 3066022 3394504 2999664 3628704 4000123
15892 4000123 4396748 4420692 4294966 3805684 3268138 3722784 3548373 3470742 2661853 2222961
15882 2222961 2421864 3052772 3674129 3306971 3308855 3409950 3572556 3807666 3787008 4013569
15872 4013569 3570758 3685366 3601550 3038505 3015922 2980870 3215237 2894373 3283889 4368347
15862 4368347 4285467 3912503 3495176 3285876 3663111 3439517 3297336 3401426 2988437 3626347
15852 3626347 4040573 3308185 2937790 3722684 3941744 3955852 3424419 3029299 3841380 3788973
15842 3788973 3421558 3615486 3665552 3467766 4209912 3470164 3533001 3360390 3658800 3585689
$$ packed form
15912B790432K76630J49896j70418Q57254Q7929Q74271r39361q0645M51156l72970
15902C924174m18925l45219N7172O68642n29994k89828L28482l94840O29040L71419
15892D000123L96625K3944j25726m89282n37546M54646j74411p7631q08889m38892
15882B222961J98903O30908O21357l67158J884J01095J62606K35110k0658K26561
15872D013569m42811J14608q3816n63045k2583l5052K34367l20864L89516J084458
15862D368347q2880l72964m17327k09300L77235k23594j42181J04090m12989O37910
15852C626347M14226p32388l70395P84894K19060J4108n31433l95120Q12081n2407
15842C788973l67415J93928N0066j97786P42146p39748O2837j72611K98410p3111
$$ plain form
15832 3585689 3680182 3832570 3724250 3219353 3464844 3683013 3753281 3903438 3674799 3770775
$$ packed form
15832C585689R4493J52388j08320n04897K45491K18169P0268J50157k28639R5976
$$ [...]
##END NTUPLES=NMR SPECTRUM
##END=
