##TITLE=1H_TG-2409-X1
 200.13Hz, CDCl3.
 8 sc
 17.6.2026
##JCAMPDX= 6.0         $$ Bruker NMR JCAMP-DX V2.0
##DATA TYPE= NMR SPECTRUM
##DATA CLASS= NTUPLES
##ORIGIN= UXNMR, Bruker Analytische Messtechnik GmbH
##OWNER= pz
$$ XWIN-NMR		Version 3.5
$$ Wed Jun 17 14:55:08 2026 Russian Standard Time (UT+4h)  she@DPX200
##.OBSERVE FREQUENCY= 200.1313
##.OBSERVE NUCLEUS= ^1H
##.ACQUISITION MODE= SIMULTANEOUS
##.ACQUISITION SCHEME= undefined
##.AVERAGES= 8
##.DIGITISER RES= 18
##SPECTROMETER/DATA SYSTEM= spect
##.PULSE SEQUENCE= zg30
##.SOLVENT NAME= CDCl3
##.SHIFT REFERENCE= (INTERNAL, CDCl3, 0, 15.4736)
##AUDIT TRAIL= $$ (NUMBER, WHEN, WHO, WHERE, WHAT)
$$ ##TITLE= Audit trail, XWIN-NMR		Version 3.5
$$ ##JCAMPDX= 5.01
$$ ##ORIGIN= Bruker BioSpin GmbH
$$ ##OWNER= she
$$ F:/spectra/data/she/nmr/H-C/1/pdata/1/auditp.txt
$$ ##AUDIT TRAIL=  $$ (NUMBER, WHEN, WHO, WHERE, WHAT)
(   1,<2026-06-17 14:53:48.82 +0400>,<she>,<DPX200>,
      <created by zg, POWCHK disabled, PULCHK disabled
       configuration hash MD5:
       00 E9 B6 7A A2 85 ED C7 34 08 36 98 17 FE 4E 26
       data hash MD5: 16K
       B3 42 C6 AD 54 48 2D E0 BB 53 38 28 CD 1A E0 22>)
(   2,<2026-06-17 14:53:51.56 +0400>,<she>,<DPX200>,
      <Start of raw data processing
       efp BC_mod = 2 LB = 0.25 FT_mod = 6 PKNL = 1 PHC0 = -4207.374 PHC1 = 0.1922894 SI = 16K 
       data hash MD5: 16K
       4F 68 EE D8 C7 C0 83 34 35 0B 75 39 80 B5 87 F0>)
(   3,<2026-06-17 14:54:13.12 +0400>,<she>,<DPX200>,
      <pk PHC0 = -9.871264 PHC1 = 10.2 
       data hash MD5: 16K
       59 DC 54 1D CD 8B 00 26 0F 0C EC DB 4C 66 31 2F>)
(   4,<2026-06-17 14:54:17.17 +0400>,<she>,<DPX200>,
      <abs ABSG = 5 
       data hash MD5: 16K
       15 3E 02 A8 1E 8B 4A 19 FA 8C 96 63 97 DF 40 34>)
$$ ##END=
$$ 
$$ hash MD5
$$ BD E5 15 4D 25 22 D0 18 4A 3F 30 73 6E FD F8 93
##$RELAX= 
##$RELAX= 
##$RELAX= 
##$RELAX= 
##$RELAX= 
##$RELAX= 
$$ Bruker specific parameters
$$ --------------------------
##$DU= <F:/spectra>
##$EXPNO= 1
##$NAME= <H-C>
##$PROCNO= 1
##$TYPE= <nmr>
##$USER= <she>
##$AMP= (0..31)
100 100 100 100 100 100 100 100 100 100 100 100 100 100 100 100 100 100 
100 100 100 100 100 100 100 100 100 100 100 100 100 100 
##$AQSEQ= 0
##$AQ_mod= 1
##$AUNM= <au_zg>
##$AUTOPOS= <>
##$BF1= 200.13
##$BF2= 200.13
##$BF3= 200.13
##$BF4= 200.13
##$BF5= 200.13
##$BF6= 200.13
##$BF7= 200.13
##$BF8= 200.13
##$BYTORDA= 1
##$CFDGTYP= 0
##$CFRGTYP= 5
##$CHEMSTR= <none>
##$CNST= (0..31)
1 1 145 1 1 1 1 1 1 1 1 1 1 1 1 1 1 1 1 1 1 1 1 1 1 1 1 1 1 1 1 1 
##$CPDPRG= <>
##$CPDPRG1= <>
##$CPDPRG2= <>
##$CPDPRG3= <>
##$CPDPRG4= <mlev>
##$CPDPRG5= <mlev>
##$CPDPRG6= <mlev>
##$CPDPRG7= <mlev>
##$CPDPRG8= <mlev>
##$CPDPRGB= <>
##$CPDPRGT= <>
##$D= (0..31)
0 0.7 0 0 0 0 0 0 0 0 0 0.03 0 0 0 0 0 0 0 0 0 0 0 0 0 0 0 0 0 0 0 0 
##$DATE= 1781693628
##$DBL= (0..7)
120 120 120 120 120 120 120 120 
##$DBP= (0..7)
150 150 150 150 150 150 150 150 
##$DBP07= 0
##$DBPNAM0= <>
##$DBPNAM1= <>
##$DBPNAM2= <>
##$DBPNAM3= <>
##$DBPNAM4= <>
$$ [...]
##$SUBNAM3= <"">
##$SUBNAM4= <"">
##$SUBNAM5= <"">
##$SUBNAM6= <"">
##$SUBNAM7= <"">
##$SUBNAM8= <"">
##$SUBNAM9= <"">
##$SW= 18.0517328524113
##$SWIBOX= (0..15)
0 0 2 0 0 0 0 0 0 0 0 0 0 0 0 0 
##$SW_h= 3612.71676300578
##$TD= 16384
##$TD0= 1
##$TE= 0
##$TE2= 300
##$TE3= 300
##$TEG= 300
##$TL= (0..7)
0 120 120 120 120 120 120 120 
##$TP= (0..7)
150 150 150 150 150 150 150 150 
##$TP07= 0
##$TPNAME0= <>
##$TPNAME1= <>
##$TPNAME2= <>
##$TPNAME3= <>
##$TPNAME4= <>
##$TPNAME5= <>
##$TPNAME6= <>
##$TPNAME7= <>
##$TPOAL= (0..7)
0.5 0.5 0.5 0.5 0.5 0.5 0.5 0.5 
##$TPOFFS= (0..7)
0 0 0 0 0 0 0 0 
##$TUNHIN= 0
##$TUNHOUT= 0
##$TUNXOUT= 0
##$USERA1= <user>
##$USERA2= <user>
##$USERA3= <user>
##$USERA4= <user>
##$USERA5= <user>
##$V9= 5
##$VALIST= <valist>
##$VCLIST= <CCCCCCCCCCCCCCC>
##$VD= 0
##$VDLIST= <DDDDDDDDDDDDDDD>
##$VPLIST= <PPPPPPPPPPPPPPP>
##$VTLIST= <TTTTTTTTTTTTTTT>
##$WBST= 1024
##$WBSW= 4
##$XGAIN= (0..3)
0 0 0 0 
##$XL= 0
##$YL= 0
##$YMAX_a= 298141
##$YMIN_a= -289016
##$ZGOPTNS= <>
##$ZL1= 120
##$ZL2= 120
##$ZL3= 120
##$ZL4= 120
##$ABSF1= 15.48576
##$ABSF2= -2.56609
##$ABSG= 5
##$ABSL= 3
##$ALPHA= 0
##$AQORDER= 0
##$ASSFAC= 0
##$ASSFACI= 0
##$ASSFACX= 0
##$ASSWID= 0
##$AUNMP= <proc_1d>
##$AZFE= 0.1
##$AZFW= 0.1
##$BCFW= 0
##$BC_mod= 2
##$BYTORDP= 0
##$COROFFS= 0
##$CY= -3
##$DATMOD= 1
##$DC= 0
##$DFILT= <>
##$DTYPP= 0
##$F1P= 0
##$F2P= 0
##$FCOR= 1
##$FTSIZE= 16384
##$FT_mod= 6
##$GAMMA= 0
##$GB= 0
##$INTBC= 1
##$INTSCL= 3.241238e-09
##$ISEN= 128
##$LB= 0.25
##$LEV0= 0
##$LPBIN= 0
##$MAXI= 10000
##$MC2= 0
##$MEAN= 0
##$ME_mod= 0
##$MI= 1.114404
##$NCOEF= 0
##$NC_proc= -7
##$NLEV= 6
##$NOISF1= 3.799351
##$NOISF2= 2.8
##$NSP= 0
##$NTH_PI= 0
##$NZP= 0
##$OFFSET= 15.47364
##$PC= 1
##$PHC0= -4217.245
##$PHC1= 10.39229
##$PH_mod= 1
##$PKNL= yes
##$PPARMOD= 0
##$PSCAL= 0
##$PSIGN= 0
##$REVERSE= no
##$SF= 200.130009617941
##$SI= 16384
##$SIGF1= 3
##$SIGF2= 2
##$SINO= 0.751879
##$SIOLD= 32768
##$SREGLST= <19F.Aceton>
##$SSB= 0
##$STSI= 16384
##$STSR= 0
##$SW_p= 3612.71676300578
##$SYMM= 0
##$S_DEV= 0
##$TDeff= 16384
##$TDoff= 0
##$TI= <>
##$TILT= no
##$TM1= 0
##$TM2= 0
##$TOPLEV= 0
##$USERP1= <user>
##$USERP2= <user>
##$USERP3= <user>
##$USERP4= <user>
##$USERP5= <user>
##$WDW= 1
##$XDIM= 16384
##$YMAX_p= 278892364
##$YMIN_p= -16962276
$$ End of Bruker specific parameters
$$ ---------------------------------
##NTUPLES= NMR SPECTRUM
##VAR_NAME=  FREQUENCY,     SPECTRUM/REAL,   SPECTRUM/IMAG
##SYMBOL=    X,             R,               I
##VAR_TYPE=  INDEPENDENT,   DEPENDENT,       DEPENDENT
##VAR_FORM=  AFFN,          ASDF,            ASDF
##VAR_DIM=   16384,         16384,           16384
##UNITS=     HZ,            ARBITRARY UNITS, ARBITRARY UNITS
##FACTOR=    0.220516191357247, 1,           1
##FIRST=     3096.73981046091, 0,            0
##LAST=      -515.976952544867, 0,           0
##MIN=       -515.976952544867, -16962276,   0
##MAX=       3096.73981046091, 278892364,    0
$$ Real data points
##PAGE= N=1
##DATA TABLE= (X++(R..R)), XYDATA
$$ [...]
$$ plain form
7374 1259527 1232140 1325466 1194472 1009393 1192273 677448 1017788 1265322 1081159 1092301
7364 1092301 1471032 1161861 1296980 1511474 1764128 1666724 1291509 1252469 1069793 1068550
7354 1068550 994361 760648 714722 972061 782340 734019 924028 1147221 1054515 771077
7344 771077 526682 748976 791571 1364985 1748554 1515737 1799840 1869216 1564845 1823452
7334 1823452 1781976 955502 807928 1493484 973647 1057743 1326975 729855 944600 1074830
7324 1074830 809554 1507194 1384790 1526980 1957913 2517107 2113636 1839476 1729813 1049379
7314 1049379 1499924 1513926 1382000 846449 548345 814590 1096395 1215675 1091395 487147
7304 487147 360687 1008542 1319854 2186150 1800943 1416304 1514118 1658374 2079369 1907665
$$ packed form
7374A259527k7387R3326j30994j85079J82880n14825L40340K47534j84163J1142
7364A092301L78731l09171J35119K14494K52654r7404l75215l9040j82676j243
7354A068550p4189k33713m5926K57339j89721m8321J90009K23193r2706k83438
7344G71077k44395K22294M2595N73414L83569k32817K84103O9376l04371K58607
7334A823452m1476q26474j47574O85556n19837Q4096K69232n97120K14745J30230
7324A074830k65276O97640j22404J42190M30933N59194m03471k74160j09663o80434
7314A049379M50545J4002j31926n35551k98104K66245K81805J19280j24280o04248
7304D87147j26460O47855L11312Q66296l85207l84639R7814J44256M20995j71704
$$ plain form
7294 1907665 1468265 1324793 768790 293189 856184 862313 1018587 974619 298505 379657
7284 379657 888232 965150 1145147 1396592 1399569 1236495 1380992 1979855 1518564 1443505
7274 1443505 960453 400639 764012 1052990 889859 1321570 969017 670594 944692 997952
7264 997952 1358102 1398927 910661 1196979 1339115 1360554 812024 340214 602652 718761
7254 718761 700391 1024696 806435 912559 811798 851632 1026124 817833 745030 1002155
7244 1002155 529894 903656 716159 679336 1079436 932028 950398 1138448 1813085 1675806
7234 1675806 1232652 2038634 1714267 1264120 1033510 742965 1121952 1281472 1085185 717702
7224 717702 427069 467853 736493 956572 1582764 1305584 1450800 1485635 1137184 872199
$$ packed form
7294A907665m39400j43472n56003m75601N62995O129J56274m3968o76114Q1152
7284C79657N08575P6918J79997K51445K977j63074J44497N98863m61291p5059
7274A443505m83052n59814L63373K88978j63131M31711l52553k98423K74098N3260
7264I97952L60150M0825m88266K86318J42136K1439n48530m71810K62438J16109
7254G18761j8370L24305k18261J06124j00761L9834J74492k08291p2803K57125
7244A002155m72261L73762j87497l6823M00100j47408J8370J88050O74637j37279
7234A675806m43154Q05982l24367m50147k30610k90545L78987J59520j96287l67483
7224G17702k90633M0784K68640K20079O26192k77180J45216L4835l48451k64985
$$ plain form
7214 872199 898432 1281366 1098346 980898 835671 504824 1103371 1031750 834211 822219
7204 822219 455005 462542 515685 947048 1687794 1500808 1353744 1149647 1203626 1687946
7194 1687946 1706063 1333216 699594 934184 1233310 980270 1845397 1718756 983704 1080681
7184 1080681 1161882 1341345 1911745 1326013 1132319 1068578 946130 834544 1272525 1172623
7174 1172623 1075718 1108275 1171289 559130 1142836 1486703 1301922 1814470 1380079 1113357
7164 1113357 934674 811039 1182319 646249 16423 577271 829616 261878 1166791 1559895
7154 1559895 1201011 1038892 990831 830948 1129259 687743 845538 947013 511331 244700
7144 244700 28944 494741 456292 276434 245235 383144 307155 338647 303125 879174 565500
$$ packed form
7214H72199K6233L82934j83020j17448j45227l30847N98547p1621j97539j1992
7204H22219l67214P537N3143M31363P40746j86986j47064k04097N3979M84320
7194A687946J8117l72847o33622K34590K99126k53040Q65127j26641p35052R6977
7184A080681Q1201J79463N70400n85732j93694o3741j22448j11586M37981r9902
7174A172623r6905L2557O3014o12159N83706L43867j84781N12548m34391k66722
7164A113357j78683j23635L71280n36070o29826N60848K52345n67738R04913L93104
7154A559895l58884j62119m8061j59883K98311m41516J57795J01475m35682k66631
7144B44700k15756M65797l8449j79858l1199J37909p5989L1492l5522N76049l13674
$$ plain form
7133 565500 -151186 203002 447931 607797 263219 387840 413712 656571 904996 404365
7123 404365 616094 647645 208174 545022 465311 378722 415205 339444 689233 719278 381349
7112 381349 633329 800988 729153 665285 1142270 623536 136138 762802 695064 475225
7102 475225 475939 715848 364082 527540 775678 1027852 725580 1038768 721998 742538
7092 742538 1002771 794448 460499 542725 583629 301145 681198 1034624 678859 206535
7082 206535 -30323 722346 846695 244901 88463 681950 395708 341824 319217 493645
7072 493645 462017 208773 436347 886698 801195 845747 836710 826756 511220 370937 370688
7061 370688 369069 540672 483840 569372 928578 484247 629215 897650 680504 287062
$$ packed form
7133E65500p16686L54188K44929J59866l44578J24621K5872K42859K48425n00631
7123D04365K11729L1551m39471L36848p9711q6589L6483p5761L49789L0045l37929
7112C81349K51980J67659p1835o3868M76985n18734m87398O26664o7738k19839
7102D75225P14K39909l51766J63458K48138K52174l02272L13188l16770K0540
7092G42538K60233k08323l33949Q2226M0904k82484L80053L53426l55765m72324
7082B06535k36858P52669J24349o01794j56438N93487k86242n3884k2607J74428
7072D93645l1628k53244K27574M50351q5503M4552r037r954l15536j40283k49
7061C70688j619J71603n6832Q5532L59206m44331J44968K68435k17146l93442
$$ plain form
7051 287062 348255 329057 493360 377868 287750 390725 465877 451826 190722 173966 472379
7040 472379 1002042 414013 506853 1061827 811872 1261474 1075714 801584 1325136 411752
7030 411752 112327 447114 197209 870653 511885 365063 366333 56921 609343 574841
7020 574841 806046 1082788 778289 711366 592544 451029 818737 302587 609207 421065
7010 421065 325242 333679 42083 209242 317148 -137096 339598 751572 353827 434537
7000 434537 393488 666835 379487 39491 290676 30134 142224 275070 197700 236874
6990 236874 637140 128867 370664 1087050 808307 136083 346352 -157802 -82962 286771
6980 286771 138349 699876 39650 -57469 441708 325748 1217773 953648 462295 992063
$$ packed form
7051B87062O1193j9198J64303j15492r0118J02975P5152j4051k61104j6756K98413
7040D72379N29663n88029R2840N54974k49955M49602j85760k74130N23552r13384
7030D11752k99425L34787k49905O73444l58768j46822J270l09412N52422l4502
7020E74841K31205K76742l04499o6923j18822j41515L67708n16150L06620j88142
7010D21065r5823Q437k91596J67159J07906m54244M76694M11974l97745Q0710
7000D34537m1049K73347k87348l39996K51185k60542J12090J32846p7370L9174
6990B36874M00266n08273K41797P16386k78743o72224K10269n04154P4840L69733
6980B86771j48422N61527o60226r7119M99177j15960Q92025k64125m91353N29768
$$ plain form
6970 992063 963687 632466 1071399 1090010 827190 226099 260349 352094 152211 231834 -97578
6959 -97578 -152461 139094 -141956 269796 575437 475824 484140 381122 673717 564539 452730
6948 452730 448601 464477 599236 46295 -37284 469043 138542 -376304 190977 524222
6938 524222 -272729 -263006 136362 -15943 235282 351998 244247 329421 433359 605823
6928 605823 563971 289510 265659 86936 -602453 -358478 -714613 -694583 -167284 -668399
6918 -668399 -558925 -103408 -361811 -276958 -172876 277406 -462675 -216022 26971 -122238
6908 -122238 170268 208808 112718 -42221 -136857 -154265 -7349 317461 166012 -180818
6898 -180818 24256 -100832 -619151 -619742 -602072 -396287 -385296 -402274 106348 -40514 51345
$$ packed form
6970I92063k8376l31221M38933J8611k62820o01091L4250R1745j99883P9623l29412
6959i7578n4883K91555k81050M11752L05641r9613Q316j03018K92595j09178j11809
6948D52730m129J5876J34759n52941q3579N06327l30501n14846N67281L33245
6938E24222p96951R723L99368j52305K51225J16716j07751Q5174J03938J72464
6928F05823m1852k74461k3851j78723o89389K43975l56135K0030N27299n01115
6918f68399J09474M55517k58403Q4853J04082M50282p40081K46653K42993j49209
6908a22238K92506L8540r6090j54939r4636j7408J46916L24810j51449l46830
6898a80818K05074j25088n18319n91J7670K05785J0991j6978N08622j46862R1859
$$ plain form
6887 51345 104107 -118553 -81119 294068 287201 -86997 -27103 -374870 -695044 -207388 -195139
6876 -195139 -311394 -490670 -215916 -102342 -114053 -62490 -148374 -183166 238144 144853 208991
6865 208991 367628 -272538 -926940 -976307 -818741 -215257 -126717 -34529 138794 65182
6855 65182 524333 693184 298393 -236703 -31559 256783 -121723 164035 8093 -265242
6845 -265242 -462745 -920379 -57813 33916 -540909 -278995 -404801 -153499 253971 23262
6835 23262 -5848 -363827 -476807 -374424 -622354 -128671 41590 -324779 -17619 -299696
6825 -299696 -392590 -365850 -471088 -405297 -182109 -89082 112541 24785 29168 -651817 -461441
6814 -461441 -457069 -516801 -836144 -1224009 -1087899 -420408 -605686 -371611 -601009 -709946
$$ packed form
6887E1345N2762k22660L7434L75187o867l74198N9894l47767l20174M87656J2249
6876a95139j16255j79276K74754J13574j1711N1563q5884l4792M21310r3291O4138
6865B08991J58637o40166o54402m9367J57566O03484Q8540R2188J73323p3612
6855F5182M59151J68851l94791n35096K05144K88342l78506K85758j55942k73335
6845b65242j97503m57634Q62566R1729n74825K61914j25806K51302M07470k30709
6835B3262k9110l57979j12980J02383k47930M93683J70261l66369L07160k82077
6825b99696r2894K6740j05238O5791K23188R3027K01623q7756M383o80985J90376
6814d61441M372n9732l19343l87865J36110O67491j85278K34075k29398j08937
$$ plain form
6804 -709946 -495052 -488025 -352547 30131 -321227 -879705 -252094 -137757 -156838 336885
6794 336885 -247746 -603838 -502961 -343013 -214048 -23543 -394816 -474420 -743721 -437874
6784 -437874 -521479 -875088 -211472 -144191 431749 245736 -283262 -303593 -397756 -785371
6774 -785371 -552337 -770188 -787609 -89403 -847774 -584479 180751 -207572 -119539 18096
6764 18096 -44425 -205082 -229683 -680515 -592153 -689712 -263351 -428550 -400971 -320968 -179495
6753 -179495 -523511 -165892 -305434 18646 2925 -170643 -222458 -411447 -602407 -230616
6743 -230616 -565207 -128846 61869 -613659 -502659 -91588 230129 668983 -35491 -410776
6733 -410776 -176008 -645591 -261955 -328601 -1039365 -424088 -380576 -276464 -474790 -384684
$$ packed form
6804g09946K14894P027J35478L82678l51358n58478O27611J14337j9081M93723
6794C36885n84631l56092J00877J59948J28965J90505l71273p9604k69301L05847
6784d37874q3605l53609O63616O7281N75940j86013n28998k0331r4163l87615
6774g85371K33034k17851j7421O98206p58371K63295P65230l88323Q8033J37635
6764A8096o2521j60657k4601m50832Q8362r7559M26361j65199K7579Q0003J41473
6753a79495l44016L57619j39542L24080j5721j73568n1815j88989j90960L71791
6743b30616l34591M36361J90715o75528J11000M11071L21717M38854p04474l75285
6733d10776K34768m69583L83636o6646p10764O15277M3512J04112j98326R0106
$$ plain form
6723 -384684 -490506 -510012 -40611 -60352 -414083 -267374 -177004 -457200 -58455 -572329
6713 -572329 -961119 -720051 -767775 -597477 -399189 -311073 -482061 -1055913 -845961 -671839
6703 -671839 -711277 -851366 -825607 -535023 -261557 -548789 -438459 -418612 32769 -381671
6693 -381671 -660298 -686378 -753258 -875377 -815756 -777608 -981932 -1130161 -809876 -373493
6683 -373493 -242451 -47023 -474014 -612632 -729150 -507039 380164 -362085 -121818 -367644
6673 -367644 -984369 -727548 -612891 -732354 -373486 -792466 -964846 -769007 -1097156 -492881
6663 -492881 -365674 -598095 -165424 36917 -221761 -273817 -560074 -421711 -566551 -797299
6653 -797299 -635029 -778980 -414887 -809265 -970582 -788815 -833933 -774153 -371737 -500821
$$ packed form
6723c84684j05822j9506M69401j9741l53731J46709R0370k80196L98745n13874
6713e72329l88790K41068m7724J70298J98288Q8116j70988n73852K09952J74122
6703f71839l9438j40089K5759K90584K73466k87232J10330J9847M51381m14440
6693c81671k78627k6080o6880j22119N9621L8148k04324j48229L20285M36383
6683c73493J31042J95428m26991j38618j16518K22111Q87203p42249K40267k45826
6673c67644o16725K56821J14657j19463L58868m18980j72380J95839l28149O04275
6663d92881J27207k32421M32671K02341k58678n2056k86257J38363j44840k30748
6653g97299J62270j43951L64093l94378j61317J81767m5118N9780M02416j29084
$$ plain form
6643 -500821 -974263 -657875 -825918 -909988 -599931 -801976 -644416 -446592 -564007 -100266
6633 -100266 -233174 -674809 -452459 -307435 -783089 -579828 -631699 -492290 -788489 -863069
6623 -863069 -793602 -610406 -183576 -611399 79758 -100131 -1332388 -1016871 -444159 -670549
6613 -670549 -437224 -677616 -1160396 -819220 -892358 -862695 -131620 -471084 -126912 -196326
6603 -196326 -127349 -6436 393758 18473 -675513 -683255 -499612 -324531 -612275 -980303
6593 -980303 -1560524 -1226701 -782451 -234896 -97943 172459 216458 568676 463976 178204
6583 178204 208794 -257992 -147135 -465986 -92690 -234360 -777370 -587613 -606081 -709052
6573 -709052 -715667 -732620 -464968 -231487 -573999 -220697 -355993 -122636 255682 -19076
$$ packed form
6643e00821m73442L16388j68043q4070L10057k02045J57560J97824j17415M63741
6633a00266j32908m41635K22350J45024m75654K03261n1871J39409k96199p4580
6623h63069O9467J83196M26830m27823O91157j79889j232257L15517N72712k26390
6613f70549K33325k40392m82780L41176p3138K9663P31075l39464L44172o9414
6603a96326O8977J20913M00194l75285o93986p742J83643J75081k87744l68028
6593i80303n80221L33823M44250N47555J36953K70402M3999L52218j04700k85772
6583A78204L0590m66786J10857l18851L73296j41670n43010J89757j8468j02971
6573g09052o615j6953K67652K33481l42512L53302j35296K33357L78318k74758
$$ plain form
6563 -19076 39 -285307 -480926 -252919 -612253 -809532 -594054 -458933 -342616 -694157
6553 -694157 -683660 -259126 -178451 -218255 401114 686368 344882 189990 206574 227647 730330
6542 730330 719303 319331 354349 273637 712763 844901 225741 12729 426131 269843
6532 269843 313453 527114 661630 506480 803910 441753 1170422 1384793 692622 706701
6522 706701 958269 1308691 1694695 912366 912565 1301925 1240290 1516991 1799637 1633315
6512 1633315 1315640 1319356 1243882 1077511 1471893 1647955 1284574 1694131 1980547 2077023
6502 2077023 2286803 2415531 2072212 1680718 2125237 1912224 1946626 1711999 1343979 1763408
6492 1763408 1515122 688933 1081898 1220748 1270598 1519408 1169757 1359282 1497271 1625290
$$ packed form
6563a9076J9115k85346j95619K28007l59334j97279K15478J35121J16317l51541
6553f94157J0497M24534Q0675l9804O19369K85254l41486j54892J6584K1073N02683
6542G30330j1027l99972L5018q0712M39126J32138o19160k13012M13402j56288
6532B69843M3610K13661J34516j55150K97430l62157P28669K14371o92171J4079
6522G06701K51568L50422L86004p82329J99L89360o1635K76701K82646j66322
6512A633315l17675L716p5474j66371L94382J76062l63381M09557K86416R6476
6502B077023K09780J28728l43319l91494M44519k13013L4402k34627l68020M19429
6492A763408k48286q26189L92965J38850M9850K48810l49651J89525J37989J28019
$$ plain form
6482 1625290 1194047 1472369 1311460 1328546 1692000 993653 979618 1283537 945985 1370173
6472 1370173 1771279 1282178 1837246 2186678 2114032 1934999 1908168 1834316 1781890 1773040 1742705
6461 1742705 1881953 1879380 1169582 982292 1693395 1396358 2120119 2062392 1609295 2299745
6451 2299745 2715390 1359002 1567051 1842173 1827613 2094408 1906184 1468328 2420273 2625586
6441 2625586 2286423 2352128 2478367 2186430 2158667 2595904 2466532 2930098 3129885 2430499
6431 2430499 2785703 3223281 3008461 3806728 3706595 3482640 4294350 4137308 4522070 5060061
6421 5060061 4075645 4881962 5133775 4586599 5256200 5242402 5564055 5757105 5710185 5235395
6411 5235395 5739148 6911815 6617453 6769342 7383422 7493554 7912030 8428171 8398354 8581620
$$ packed form
6482A625290m31243K78322j60909J7086L63454o98347j4035L03919l37552M24188
6472A370173M01106m89101N55068L49432p2646j79033k6831p3852n2426q850l0335
6461A742705J39248k573p09798j87290P11103k97037P23761n7727m53097O90450
6451B299745M15645j356388K08049K75122j4560K66795j88224m37856R51945K05313
6441B625586l39163O5705J26239k91937k7763M37237j29372M63566J99787o99386
6431B430499L55204M37578k14820P98267j00133k23955Q11710j57042L84762N37991
6421E060061r84416Q06317K51813n47176O69601j3798L21653J93050m6920m74790
6411E235395N03753J172667k94362J51889O14080J10132M18476N16141k9817J83266
$$ plain form
6401 8581620 8852861 9002711 9407969 10268012 10369610 10870870 11346522 11480534 11781946 12746753
6391 12746753 13185112 13370789 13622488 13453158 13912208 14029201 14169161 14759454 14975043
6382 14975043 15145578 15162029 14843556 15038706 15298709 15611292 15626860 15597021 15699474 15753768
6372 15753768 16567442 16293392 16488014 17724354 17841235 17928873 18625485 18864294 18932972 19200620
6362 19200620 18900117 18403338 19028292 19428636 19502302 20213700 20342393 20169266 20626722 20293483
6352 20293483 20063162 20034884 19346379 19266002 18766557 18375831 18328855 18125236 17763696 17910080
6342 17910080 17541217 17058438 17214056 17429661 17020977 16882330 16882093 16906561 17173407 16661739
6332 16661739 15961043 16313910 15964172 15628762 16473326 15988241 15952923 16019580 15555082 16150266
$$ packed form
6401H581620K71241J49850M05258Q60043J01598N01260M75652J34012L01412R64807
6391A2746753M38359J85677K51699j69330M59050J16993J39960N90293K15589
6382A4975043J70535J6451l18473J95150K60003L12583J5568k9839J02453N4294
6372A5753768Q13674k74050J94622J236340J16881Q7638O96612K38809O8678K67648
6362A9200620l00503m96779O24954M00344P3666P11398J28693j73127M57456l33239
6352B0293483k30321k8278o88505q0377m99445l90726m6976k03619l61540J46384
6342A7910080l68863m82779J55618K15605m08684j38647k37K4468K66846n11668
6332A6661739p00696L52867l49738l35410Q44564m85085l5318O6657m64498N95184
$$ plain form
6322 16150266 15966914 14754917 14545290 14157626 14365535 14384122 13476517 13474977 12697367 12139408
6312 12139408 12083827 11172215 10769165 10643797 10099506 10052801 9893383 9709247 9335487 8773892
6302 8773892 8835781 8536880 8263210 8575450 7861001 6619649 7148515 7567556 7331105 7311360
6292 7311360 6536235 5478404 5638818 5691379 5555932 5116604 5160016 4756697 4630026 4700914
6282 4700914 4295420 4390565 4497474 3288239 3227083 3283753 3143354 3047520 2649220 2357116
6272 2357116 2366261 2537278 2569909 2626367 2200965 2111143 1607852 1222376 1845167 2142568
6262 2142568 2251771 1796873 1480199 1617834 1647295 1683231 1372904 1147520 1406325 1547643
6252 1547643 1196741 1455765 1200492 1329668 1760484 1540512 1845578 1610234 1469572 1522031
$$ packed form
6322A6150266j83352j211997k09627l87664K07909J8587r07605j540p77610n57959
6312A2139408n5581r11612m03050j25368n44291m6705j59418j84136l73760n61595
6302H773892O1889k98901k73670L12240p14449j241352N28866M19041k36451j9745
6292G311360p75125j057831J60414N2561j35447m39328M3412m03319j26671P0888
6282D700914m05494R5145J06909j209235o1156N6670j40399r5834l98300k92104
6272B357116R145J71017L2631N6458m25402q9822n03291l85476O22791K97401
6262B142568J09203m54898l16674J37635K9461L5936l10327k25384K58805J41318
6252A547643l50902K59024k55273J29176M30816k19972L05066k35344j40662N2459
$$ plain form
6242 1522031 1244165 1004988 1091818 1317391 1161371 1328462 1359165 1709253 1384019 1095037
6232 1095037 1069503 1013244 865954 809520 789914 416873 264484 250220 284550 602140 614607
6221 614607 325290 813515 753305 536998 462684 418229 851097 348681 365458 590300
6211 590300 639723 273916 277367 424060 797485 899260 295366 485890 837471 749040
6201 749040 552705 427656 218539 260957 133940 367973 1119393 793738 694929 311895
6191 311895 406165 539238 682387 524837 520505 758227 1528779 1687094 1886837 1842388
6181 1842388 1604609 1662638 1657885 1918889 1827937 1048157 1208346 1290945 691657 753648 869930
6170 869930 651455 1025662 607769 607711 1095095 907421 1019026 1425180 1411812 926630 605730
$$ packed form
6242A522031k77866k39177Q6830K25573j56020J67091L0703L50088l25234k88982
6232A095037k5534n6259j47290n6434j9606l73041j52389j4264L4330L17590J2467
6221F14607k89317M88225o0210k16307p4314m4455M32868n02416J6777K24842
6211E90300M9423l65807L451J46693L73425J01775o03894J90524L51581q8431
6201G49040j96335j25049k09117M2418j27017K34033P51420l25655r8809l83034
6191C11895R4270J33073J43149j57550m332K37722P70552J58315J99743m4449
6181A842388k37779N8029m753K61004r0952p79780J60189Q2599n99288O1991J16282
6170H69930k18475L74207m17893n8M87384j87674J11605M06154j3368m85182l20900
$$ plain form
6159 605730 869978 1281589 1145672 543048 635499 769427 522508 875718 1393644 1864623
6149 1864623 1786063 1475729 1311149 1466101 1520619 1389367 1564873 1763749 1490342 1611630
6139 1611630 1210488 1149994 1169927 542509 268505 1012520 727503 1248918 807099 932641
6129 932641 1158393 1277014 1467102 1651155 1484347 1485221 1160999 1193271 1116707 661755 766438
6118 766438 1263767 1392473 1317167 1409994 1356737 1680914 1696113 1203371 1634729 1722428 1075939
6107 1075939 1376077 1164249 1038267 1533748 1245281 1313917 1713623 1524270 1908813 2004747
6097 2004747 1651674 1798816 1808778 1716306 1864152 1703552 1342110 1563618 866598 793965
6087 793965 1387991 583247 847157 1594817 673176 910961 1575579 1454185 1660768 1281205
$$ packed form
6159F05730K64248M11611j35917o02624R2451J33928k46919L53210N17926M70979
6149A864623p8560l10334j64580J54952N4518j31252J75506J98876k73407J21288
6139A611630m01142o0494J9933o27418k74004P44015k85017N21415m41819J25542
6129I32641K25752J18621J90088J84053j66808Q74l24222L2272p6564m54952J04683
6118G66438M97329J28706p5306R2827n3257L24177J5199m92742M31358Q7699o46489
6107A075939L00138k11828j25982M95481k88467O8636L99706j89353L84543R5934
6097B004747l53073J47142R962r2472J47846j60600l61442K21508o97020p2633
6087G93965N94026q04744K63910P47660r21641K37785O64618j21394K06583l79563
$$ plain form
6077 1281205 1175192 1658441 1844315 1480735 1643852 1474270 1271078 1071492 1528164 1516217
6067 1516217 1745327 1874111 1602325 1890905 1576663 1824417 1627457 907834 1187756 1152717
6057 1152717 1078466 1385726 663087 571195 1038867 806580 694073 222003 220508 46016
6047 46016 -136051 233442 528575 869940 715981 438155 411875 435993 172830 316631
6037 316631 368272 530513 326777 95376 -41074 255055 561738 253242 147048 -231259
6027 -231259 -230937 198412 252885 429826 93159 -449620 221292 -111684 81952 716263
6017 716263 528932 274629 433488 378403 570244 548474 229687 -33812 -152027 158121
6007 158121 310160 288763 569606 238990 452825 236464 -127171 -89991 663806 509738
$$ packed form
6077A281205j06013M83249J85874l63580J63117j69582k03192j99586M56672j1947
6067A516217K29110J28784k71786K88580l14242K47754j96960p19623K79922l5039
6057A152717p4251L07260p22639r1892M67672k32287j12507m72070j495j74492
6047D6016j82067L69493K95133L41365j53959k77826k6280K4118k63163J43801
6037C16631N1641J62241k03736k31401j36450K96129L06683l08496j06194l78307
6027b31259L22M29349N4473J76941l36667n42779O70912l32976J93636O34311
6017G16263j87331k54303J58859n5085J91841k1770l18787k63499j18215L10148
6007A58121J52039k1397K80843l30616K13835k16361l63635L7180P53797j54068
$$ plain form
5997 509738 546698 610614 888462 1032460 768639 211191 245587 395794 44029 41302 222907
5986 222907 -276588 -316836 -118731 248886 1191476 1016180 828984 1482798 790422 837837
5976 837837 1491205 655021 1197981 1086887 225218 851423 827924 35197 676843 542145
5966 542145 941645 1528314 1351867 1369132 1858258 1398004 1187026 1247903 1653431 1937615
5956 1937615 2057553 2047744 2360820 2272834 1927282 2523746 3029434 2722739 3014697 2725824
5946 2725824 2735140 3002959 3272234 3538318 3898012 2833560 2969819 3582465 3847833 4331833
5936 4331833 3428165 3288585 4016290 3924495 4300534 4535975 3654184 3882540 3905948 3679049
5926 3679049 4064631 4236800 4224468 4306556 3881395 4270114 5119836 5129261 4774408 5365786
$$ packed form
5997E09738L6960O3916K77848J43998k63821n57448L4396J50207l51765k727J81605
5986B22907m99495m0248J98105L67617R42590j75296j87196O53814o92376M7415
5976H37837O53368q36184N42960j11094q61669O26205k3499p92727O41646j34698
5966E42145L99500N86669j76447J7265M89126m60254k10978O0877M05528K84184
5956A937615J19938r809L13076q7986l45552N96464N05688l06695K91958k88873
5946B725824R316K67819K69275K66084L59694j064452J36259O12646K65368M84000
5936D331833r03668j39580P27705r1795L76039K35441q81791K28356K3408k26899
5926C679049L85582J72169j2332Q2088m25161L88719Q49722R425l54853N91378
$$ plain form
5916 5365786 6141205 5837521 6083780 6547501 6852328 7360449 7390976 7704963 8029135 8228113
5906 8228113 8306341 8241357 7959962 8583741 9089200 9741557 10884356 11357466 11259782 12193248
5896 12193248 13130422 14466070 15347460 16630785 18301058 19694440 21767980 24358017
5888 24358017 26622127 30003190 33215068 37029339 41577290 44447679 46989143 48959879
5880 48959879 49863728 50836732 50835316 50149895 50461156 50153671 50132666 50360051 50145374 50733013
5870 50733013 51329613 52043661 52526713 53073884 53945904 55019424 55572489 56595720 58093471
5861 58093471 58953584 60083071 60963325 62402619 63322842 63398541 63257256 62399281 60687689
5852 60687689 59310588 56844068 54445133 52059484 49486451 47645874 46469095 45561191
$$ packed form
5916E365786P75419l03684K46259M63721L04827N08121L0527L13987L24172J98978
5906H228113P8228o4984k81395O23779N05459O52357J142799M73110r7684R33466
5896A2193248R37174J335648Q81390J283325J670273J393382K073540K590037
5888B4358017K264110L381063L211878L814271M547951K870389K541464J970736
5880D8959879R03849R73004j416o85421L11261l07485k1005K27385k14677N87639
5870E0733013N96600P14048M83052N47171Q72020J073520N53065J023231J497751
5861E8093471Q60113J129487Q80254J439294R20223P5699j41285q57975j711592
5852F0687689j377101k466520k398935k385649k573033j840577j176779r07904
$$ plain form
5844 45561191 44921894 43325596 43410453 42928772 42092897 41650712 40918400 40331277 39535683
5835 39535683 37706179 36774124 35005088 32968648 31007978 28187028 26498896 24968427
5827 24968427 22477209 20693533 19073606 17387622 16013650 14588239 14084658 13393895
5819 13393895 11943647 11655215 11488089 10742160 9961791 9971406 9701195 8925183 9184348 8052268
5809 8052268 7843968 7547562 6845179 7338643 7045548 6826766 7350903 6787049 6861155 7198807
5799 7198807 6528335 6788059 7341726 6821157 7078847 7333382 6848583 6654149 6760495 6078045
5789 6078045 5890841 5787903 6080047 6129140 5680407 5304852 5552844 5152607 5493342 5622335
5779 5622335 5604678 5381230 5166908 4714790 4976830 4674224 4353188 4526845 4941680 4590922
$$ packed form
5844D5561191o39297j596298Q4857m81681q35875m42185p32312n87123p95594
5835C9535683j829504r32055j769036k036440j960670k820950j688132j530469
5827B4968427k491218j783676j619927j685984j373972j425411n03581o90763
5819A3393895j450248k88432j67126p45929p80369R615k70211p76012K59165j132080
5809H052268k08300k96406p02383M93464k93095k18782N24137n63854P4106L37652
5799G198807o70472K59724N53667n20569K57690K54535m84799j94434J06346o82450
5789F078045j87204j02938K92144M9093m48733l75555K47992m00237L40735J28993
5779E622335j7657k23448k14322m52118K62040l02606l21036J73657M14835l50758
$$ plain form
5769 4590922 4430254 4657195 5229956 5452889 4826733 5016821 5183414 4381268 4227948 3721253
5759 3721253 3912585 4470825 3256760 3179016 3489677 2732474 2793162 3069639 2525260 2011956
5749 2011956 2159302 2770375 3390930 3105243 2185258 1903571 2198099 1797405 1801308 1888092
5739 1888092 1539717 1498280 810262 1084022 1603576 1277647 1468737 1953643 1345254 1280477
5729 1280477 1062785 983956 469184 506502 413588 227260 151475 33351 195006 209472
5719 209472 -280391 468122 406602 818816 1191129 192610 358958 745597 436054 739286
5709 739286 407486 214631 678639 104926 -30460 162614 -458742 -220318 -81700 -476435
5699 -476435 -235293 314498 36743 251383 381128 420687 778182 290622 -50620 -329863
$$ packed form
5769D590922j60668K26941N72761K22933o26156J90088J66593q02146j53320n06695
5759C721253J91332N58240j214065p7744L10661p57203O0688K76477n44379n13304
5749B011956J47346O11073O20555k85687r19985k81687K94528m00694L903Q6784
5739A888092l48375m1437o88018K73760N19554l25929J91090M84906o08389o4777
5729A280477k17692p8829n14772L7318r2914j86328p5785j18124J61655J4466
5719B09472m89863P48513o1520M12214L72313r98519J66348L86639l09543L03232
5709G39286l31800j92855M64008n73713j35386J93074o21356K38424J38618l94735
5699d76435K41142N49791k77755K14640J29745L9559L57495m87560l41242k79243
$$ plain form
5689 -329863 -173662 241736 138256 2918 1454 578656 271052 452901 686001 26517
5679 26517 221770 391821 543646 584854 422732 336241 308346 -237646 -538351 43515
5669 43515 -228108 -410366 -289915 -702358 -265498 -19073 -272754 -120881 -199531 -105925
5659 -105925 -106771 12441 46671 -740265 -805069 -27833 -148565 -273963 197763 409838 198777
5648 198777 56878 90731 422858 154197 -77833 -160012 -368793 -392013 -614604 -945577
5638 -945577 -42258 -132497 -82166 651976 36379 34489 -8310 -681066 -302372 -381335 -746237
5627 -746237 -283423 -369764 76775 53144 -142662 -130113 -42452 257700 269889 -278710 -487007
5616 -487007 -1283900 -1354722 -1065818 -774184 -946421 -1453116 -1359485 -1155633 -1754634 -980158
$$ packed form
5689c29863J56201M15398j03480j35338j464N77202l07604J81849K33100o59484
5679B6517J95253J70051J51825M1208j62122q6491k7895n45992l00705N81866
5669D3515k71623j82258J20451m12443M36860K46425k53681J51873p8650R3606
5659a05925q46J19212L4230p86936o4804P77236j20732j25398M71726K12075k11061
5648A98777j41899L3853L32127k68661k32030q2179k08781k3220k22591l30973
5638i45577R03319r0239N0331P34142o15597j890m2799o72756L78694p8963l64902
5627g46237M62814q6341M46539k3631j95806J2549Q7661L00152J2189n48599k08297
5616d87007p96893p0822K88904K91634j72237n06695R3631K03852n99001P74476
$$ plain form
5606 -980158 -616989 -672815 -940403 -1056912 -644530 -458095 -581705 -642839 -1511224 -1365928
5596 -1365928 -755594 -948276 -1137016 -1409531 -1414671 -731777 -948046 -674370 -665361 -1068294
5586 -1068294 -759143 -1043930 -1270936 -724167 -944020 -848456 -951390 -615006 -571833 -1252354
5576 -1252354 -582136 -570021 -678854 -843517 -1155662 -1374444 -1677339 -1367159 -809471 -1089264
5566 -1089264 -954638 -387392 -218788 -277697 -358008 -693298 -1100967 -1100185 -631834 -818862
5556 -818862 -946405 -989593 -1046769 -1510479 -1212063 -1173940 -754371 -738951 -872549 -1136090
5546 -1136090 -873772 -853577 -413521 -773933 -1010748 -958224 -905340 -713137 -877959 -1132907
5536 -1132907 -1140479 -1604837 -1764902 -1174802 -634295 -608971 -863898 -1411254 -1124050 -486866
$$ packed form
5606i80158L63169n5826k67588j16509M12382J86435j23610o1134q68385J45296
5596a365928O10334j92682j88740k72515n140O82894k16269K73676R009m02933
5586a068294L09151k84787k27006N46769k19853R5564j02934L36384M3173o80521
5576a252354O70218J2115j08833j64663l12145k18782l02895L10180N57688k79793
5566a089264J34626N67246J68604n8909q0311l35290m07669P82M68351j87028
5556h18862j27543m3188n7176m63710K98416L8123M19569J5420j33598k63541
5546a136090K62318K0195M40056l60412k36815N2524N2884J92203j64822k54948
5536a132907p572m64358j60065N90100N40507K5324k54927n47356K87204O37184
$$ plain form
5526 -486866 -226181 150975 -210068 -1311991 -1102834 -933465 -904207 -918003 -1477401 -1381989
5516 -1381989 -1758125 -1454755 -911386 -580579 -814366 -1247434 -1311778 -648752 -374878 -429529
5506 -429529 -856282 -1118385 -764269 -857180 -1442330 -1120205 -1370220 -1050407 -1079576 -1384061
5496 -1384061 -1236055 -1676486 -1972773 -1279767 -1284510 -1224475 -1390757 -1120657 -662397 -846677
5486 -846677 -1345213 -1175484 -1337284 -1564562 -2116350 -2079216 -1074099 -1272048 -1700385 -2027190
5476 -2027190 -1532349 -1370367 -1807210 -1526691 -1351953 -968819 -1113836 -1621275 -1150744 -1157111
5466 -1157111 -1039503 -754245 -1566648 -1878936 -1742053 -2309349 -1910313 -1357573 -1749867 -1176624
5456 -1176624 -722989 -1142484 -1001839 -1022978 -486906 -67506 -906530 -1352369 -925077 -1291360
$$ packed form
5526d86866K60685L77156l61043j101923K09157J69369K9258j3796n59398R5412
5516a381989l76136L03370N43369L30807k33787m33068o4344O63026K73874n4651
5506d29529m26753k62103L54116r2911n85150L22125k50015L19813k9169l04485
5496a384061J48006m40431k96287O93006m743O0035j66282K70100M58260j84280
5486h46677m98536J69729j61800k27278n51788L7134J005117j97949m28337l26805
5476b027190M94841J61982m36843K80519J74738L83134j45017n07439M70531o367
5466a157111J17608K85258q12403l12288J36883n67296L99036N52740l92294N73243
5456a176624M53635m19495J40645k1139N36072M19400q39024m45839M27292l66283
$$ plain form
5446 -1291360 -1226833 -1098552 -1813670 -1190083 -988727 -1605281 -888857 -692032 -592099 -891869
5436 -891869 -1441912 -1198649 -858509 -1407306 -922248 -1104449 -1169420 -999221 -868762 -781380
5426 -781380 -1238134 -1537513 -1980153 -2377017 -1645006 -1421684 -1776292 -1424162 -1486832 -1165902
5416 -1165902 -969860 -1051994 -869541 -1443377 -1448479 -1060851 -940678 -801607 -1096387 -1514688
5406 -1514688 -1627414 -1549088 -1626724 -1609042 -1656647 -1483913 -1793570 -1806499 -1155190 -1351930
5396 -1351930 -2140148 -1948171 -1762502 -1666839 -1690013 -1803110 -1435831 -1279857 -1188433 -1315506
5386 -1315506 -1544664 -1139413 -1278354 -2049949 -1779237 -1397913 -1494094 -1022900 -1070504 -1781836
5376 -1781836 -1902613 -1868435 -1768712 -1314295 -1648421 -1974182 -1604755 -1474595 -1205790 -1237060
$$ packed form
5446a291360O4527J28281p15118O23587K01356o16554P16424J96825R9933k99770
5436h91869n50043K43263L40140n48797M85058j82201o4971J70199J30459Q7382
5426g81380m56754k99379m42640l96864P32011K23322l54608L52130o2670L20930
5416a165902J96042q2134J82453n73836n102L87628J20173J39071k94780m18301
5406a514688j12726P8326p7636J7682m7605J72734l09657j2929O51309j96740
5396a351930p88218J91977J85669R5663k3174j13097L67279J55974R1424j27073
5386a315506k29158M05251j38941p71595K70712L81324r6181M71194m7604p11332
5376a781836j20777L4178R9723M54417l34126l25761L69427J30160K68805l1270
$$ plain form
5366 -1237060 -1693137 -2097204 -2246818 -2076133 -1818420 -1365335 -1430512 -1355849 -1106145 -1307024
5356 -1307024 -1633828 -1553055 -1319770 -1827584 -1942831 -1937211 -1726880 -1588737 -2219144 -1764661
5346 -1764661 -1668333 -1848827 -1364376 -1450777 -1459054 -1013166 -1463243 -1557314 -1288546 -1650825
5336 -1650825 -1713876 -1539110 -1623165 -1492432 -1453463 -800629 -658413 -834010 -751492 -891502
5326 -891502 -808735 -1010341 -1727765 -1307011 -1285351 -1593747 -1163087 -802223 -909945 -952099
5316 -952099 -1586329 -1418831 -1002982 -940740 -883094 -939389 -794347 -740155 -736673 -1027589 -964934
5305 -964934 -828860 -1038033 -1050666 -1406861 -1415444 -620794 -724132 -763510 -970218 -1166826
5295 -1166826 -875270 -978036 -999295 -1030058 -1550178 -864756 -575011 -473840 -552488 -1199934
$$ packed form
5366a237060m56077m04067j49614J70685K57713M53085o5177P4663K49704k00879
5356a307024l26804Q0773K33285n07814j15247N620K10331J38143o30407M54483
5346a764661R6328j80494M84451q6401q277M45888m50077r4071K68768l62279
5336a650825o3051J74766q4055J30733L8969O52834J42216j75597Q2518j40010
5326h91502Q2767k01606p17424M20754K1660l08396M30660L60864j07722m2154
5316i52099o34230J67498M15849O2242N7646n6295J45042N4192L482k90916O2655
5305i64934J36074k09173j2633l56195q583P94650j03338l9378k06708j96608
5295a166826K91556j02766k1259l0763n20120O85422K89745J01171p8648o47446
$$ plain form
5285 -1199934 -651059 -1176392 -2223880 -1679955 -1544768 -1104755 -1160612 -1947066 -1498955 -937362
5275 -937362 -1193447 -1359821 -1136008 -517733 -998135 -1461923 -1521915 -1427525 -1446984 -1897842
5265 -1897842 -1786124 -1823392 -1968968 -1693281 -1285050 -1533175 -1631453 -1569427 -1554633 -1429453
5255 -1429453 -1292438 -1120483 -942379 -362937 -769098 -1445175 -733573 -763125 -1526532 -1494073
5245 -1494073 -1341796 -1138855 -1349229 -1324729 -1601632 -1625997 -1399229 -1419927 -1293408 -1439822
5235 -1439822 -1670369 -1375654 -1621292 -1305100 -1076820 -1626429 -1223767 -1156217 -1700927 -1336704
5225 -1336704 -1197221 -1806587 -1824126 -1883354 -1809660 -1681342 -1625002 -1372277 -1337706 -1128789
5215 -1128789 -1199284 -1512161 -1734704 -1674396 -1318956 -603713 -616063 -1071018 -1071473 -766627 -766436
$$ packed form
5285a199934N48875n25333j047488N43925J35187M40013n5857p86454M48111N61593
5275i37362k56085j66374K23813O18275m80402m63788n9992R4390j9459m50858
5265a897842J11718l7268j45576K75687M08231k48125r8278O2026J4794J25180
5255a429453J37015J71955J78104N79442m06161o76077P11602k9552p63407L2459
5245a494073J52277K02941k10374K4500k76903k4365K26768k0698J26519j46414
5235a439822k30547K94715k45638L16192K28280n49609M02662O7550n44710L64223
5225a336704J39483o09366j7539n9228P3694J28318N6340K52725L4571K08917
5215a128789p0495l12877k22543O0308L55440P15243j2350m54955m55L04846J91
$$ plain form
5204 -766436 -1229411 -1320330 -1072320 -918932 -1242288 -499234 -289043 -520082 -740770 -803642
5194 -803642 -647586 -395910 -192213 -376618 -188401 -573121 -1201310 -447175 266576 24213
5184 24213 19954 -775834 -1092716 -705471 -708413 103307 395683 -291977 -436259 -345681 -363965
5173 -363965 -317438 11670 -83207 -559257 -246469 -556353 -262749 738559 165326 -547394
5163 -547394 -283534 -921854 -391708 244549 436467 609363 -255894 16428 147866 170703
5153 170703 194366 193086 -75655 -484414 -161760 -223548 -367704 139551 -485248 -446893 39022
5142 39022 562126 656155 801844 1171474 1080872 637261 892704 568126 5927 351398
5132 351398 -467379 -54333 293321 121395 680747 710716 606976 1057993 1129942 997306
$$ packed form
5204g66436m62975r0919K48010J53388l23356P43054K10191k31039k20688o2872
5194h03642J56056K51676K03697j84405J88217l84720o28189P54135P13751k42363
5184B4213m259p95788l16882L87245k942Q11720K92376o87660j44282R0578j8284
5173c63965M6527L29108r4877m76050L12788l09884K93604J001308n73233p12720
5163e47394K63860o38320N30146O36257J91918J72896q65257K72322J31438K2837
5153A70703K3663j280k68741m08759L22654o1788j44156N07255o24799L8355M85915
5142C9022N23104R4029J45689L69630r0602m43611K55443l24578n62199L45471
5132C51398q18777M13046L47654j71926N59352K9969j03740M51017P1949j32636
$$ plain form
5122 997306 1268960 1563669 1269673 1009031 1228959 887017 697952 663213 -40604 377468
5112 377468 805699 459535 550859 463237 286771 864633 382666 831884 1231725 708084
5102 708084 1040077 1336818 1544353 1916455 1444014 1605865 2022895 1570619 1156524 1153273
5092 1153273 1037902 793010 935578 1769599 1890998 2221691 2326202 2809827 3195555 2803706
5082 2803706 2816791 3454530 3728960 3894381 3456036 3757784 4007408 3536517 3766107 4062923
5072 4062923 4093425 4003623 3976739 4094165 4480638 4637583 4793604 4708846 4803209 5069367
5062 5069367 4861043 5186865 5447049 5084312 5547864 6033704 6247132 5927672 6011085 6004797
5052 6004797 6283687 7266080 8026125 7779129 8648652 8992950 10073789 11332258 11953116
$$ packed form
5122I97306K71654K94709k93996k60642K19928l41942j89065l4739p03817M18072
5112C77468M28231l46164R1324q7622j76466N77862m81967M49218L99841n23641
5102G08084L31993K96741K07535L72102m72441J61851M17030m52276m14095l251
5092A153273j15371k44892J42568Q34021J21399L30693J04511M83625L85728l91849
5082B803706J3085O37739K74430J65421m38345L01748K49624m70891K29590K96816
5072D062923L0502q9802k6884J17426L86473J56945J56021q4758R4363K66158
5062E069367k08324L25822K60184l62737M63552M85840K13428l19460Q3413o288
5052F004797K78890R82393P60045k46996Q69523L44298J080839J258469O20858
$$ plain form
5043 11953116 12580365 13346915 14302376 15670006 16520635 17473700 18650005 18868297 19363181
5034 19363181 20003995 20657318 20646821 20702428 20990367 20994990 21083970 20539665 20414148 20236995
5024 20236995 19670361 19529964 18942285 18143445 18117503 17780447 17236583 16217587 15353920
5015 15353920 14102787 13267697 13219294 12519636 12696305 12397045 11636459 11874143 11493798
5006 11493798 11259972 11268232 11429061 11633443 11792821 11705423 12465641 13111330 13046719 13483605
4996 13483605 14126447 14619309 15315478 16454615 17762125 19143387 20083306 21487443 23220745
4987 23220745 24880604 26403347 27005277 27999621 29584326 30201085 31742072 33663277 34967366
4978 34967366 36014831 36872931 37316431 37013998 36872189 36540420 35786575 34980188 33910440
$$ packed form
5043A1953116O27249P66550R55461J367630Q50629R53065J176305K18292M94884
5034A9363181O40814O53323j0497N5607K87939M623Q8980n44305j25517j77153
5024B0236995n66634j40397n87679p98840k5942l37056n43864j018996q63667
5015A5353920j251133q35090m8403o99658J76669k99260p60586K37684l80345
5006A1493798k33826Q260J60829K04382J59378q7398P60218O45689o4611M36886
4996A3483605O42842M92862O96169J139137J307510J381262R39919J404137J733302
4987B3220745J659859J522743O01930R94344J584705O16759J540987J921205J304089
4978C4967366J047465Q58100M43500l02433j41809l31769p53845q06387j069748
$$ plain form
4969 33910440 32779911 32282653 31669390 30733149 30188331 28912097 27800869 26868510 25112984
4960 25112984 23977754 23040355 21661839 20339116 18516038 17547570 17472854 16695157 16057444
4951 16057444 16057680 15610596 15174266 15011438 14911203 14926876 14570496 14054760 14641902 15111169
4941 15111169 15719245 15855707 16216347 16888382 16522398 16902570 18080044 17814001 17781968
4932 17781968 17711143 18427719 19436772 19490572 19898514 20064611 19923856 20194812 20550138 21390640
4922 21390640 21791560 22158990 22131840 22663916 23373118 24296456 24565867 24783235 24822753 25231780
4912 25231780 26068465 26789519 27793874 28376593 28863349 29538896 30799804 31124934 31725862
4903 31725862 32730928 33370806 33668946 34711035 35910818 36284556 36281548 35747781 35615931
$$ packed form
4969C3910440j130529m97258o13263r36241n44818j276234j111228r32359j755526
4960B5112984j135230r37399j378516j322723j823078r68468p4716p77697o37713
4951A6057444K36m47084m36330j62828j00235J5673l56380n15736N87142M69267
4941A5111169O08076J36462L60640O72035l65984L80172J177474k66043l2033
4932A7781968p0825P16576J009053N3800M07942J66097j40755K70956L55326Q40502
4922B1390640M00920L67430k7150N32076P09202R23338K69411K17368L9518M09027
4912B5231780Q36685P21054J004355N82719M86756O75547J260908L25130O00928
4903C1725862J005066O39878K98140J042089J199783L73738l008n33767j31850
$$ plain form
4894 35615931 35911388 35503834 34496925 33672796 33110718 31549274 30867147 30294713 29843891
4885 29843891 29479004 28831442 28841161 28853653 28645080 29076512 29633860 29849941 30777710 31639437
4875 31639437 32054443 33227719 34545704 35770358 36410684 37279988 38051726 38943165 39891043
4866 39891043 39920792 39177429 38063834 37300500 37315551 36885972 36439851 36479024 36146645 35565685
4856 35565685 35405167 35152817 34642108 34329425 34016535 33236502 33487285 33836630 33233307
4847 33233307 32901041 32682640 32340399 32024776 31912879 31637145 31088686 30531684 30184159
4838 30184159 30038942 30269522 30628335 30769695 30707953 31961665 33224158 33637414 34729893
4829 34729893 35936227 36365495 36865670 37109435 37746056 37866565 37334479 37214159 37328299
$$ packed form
4894C5615931K95457m07554j006909q24129n62078j561444o82127n72434m50822
4885B9843891l64887o47562R719J2492k08573M31432N57348K16081R27769Q61727
4875C1639437M15006J173276J317985J224654O40326Q69304P71738Q91439R47878
4866C9891043K9749p43363j113595p63334J5051m29579m46121L9173l32379n80960
4856C5565685j60518k52350n10709l12683l12890p80033K50783L49345o03323
4847C3233307l32266k18401l42241l15623j11897k75734n48459n57002l47525
4838C0184159j45217K30580L58813J41360o1742J253712J262493M13256J092479
4829C4729893J206334M29268N00175K43765O36621J20509n32086j20320J14140
$$ plain form
4820 37328299 37438694 37642856 38219155 39115852 39534119 39878993 40541016 41468602 43245109
4811 43245109 43894993 44923926 46463401 47296582 47971530 49027148 49909245 50333340 51045310
4802 51045310 51396278 51767164 52931826 52905035 52977748 53580394 53512158 53690993 53928957 54226765
4792 54226765 55099206 55247217 55331722 56477839 56775199 57032979 58088223 58178482 58426257
4783 58426257 58411403 58459319 59271363 59645013 61025978 62096023 62557231 63392724 64923741
4774 64923741 67277437 69317294 71231792 73684611 76244100 78591128 80608165 82012323
4766 82012323 83175870 83976090 85102230 86352049 86720089 86384674 85763854 85163300 83884560
4757 83884560 82497890 80932252 79001505 77058524 75549798 74209863 74115746 73703256 72926558
$$ packed form
4820C7328299J10395K04162N76299Q96697M18267L44874O62023R27586J776507
4811D3245109O49884J028933J539475Q33181O74948J055618Q82097M24095P11970
4802E1045310L50968L70886J164662k6791P2713O02646o8236J78835K37964K97808
4792E4226765Q72441J48011Q4505J146117K97360K57780J055244R0259K47775
4783E8426257j4854M7916Q12044L73650J380965J070045M61208Q35493J531017
4774F4923741K353696K039857J914498K452819K559489K347028K017037J404158
4766H2012323J163547Q00220J126140J249819L68040l35415o20820o00554j278740
4757H3884560j386670j565638j930747j942981j508726j339935r4117m12490p76698
$$ plain form
4748 72926558 72700518 73634471 74735125 75281945 75972637 77276235 78867803 80523373 82078493
4739 82078493 84179037 86198647 87836620 89160132 89901116 90594607 90665849 89971490 89180548
4730 89180548 88103814 85962944 84231018 82598017 80916850 79395269 78098343 77105579
4722 77105579 76026524 74369905 73509519 72824399 71881537 70983570 70146596 69604168 69857333
4713 69857333 69261854 69023304 69241668 68825893 68828930 68409942 68076154 67589005 67053686 67545376
4703 67545376 67289832 66449306 66362109 66577598 66441208 66186901 65226294 64620523 63591983
4694 63591983 62441434 62070226 61202159 60029846 58488033 56705664 55863724 54929154 53919263
4685 53919263 53187895 51418174 49927265 49434280 48780190 48378416 47366843 45902441 45802041
$$ packed form
4748G2926558k26040R33953J100654N46820O90692J303598J591568J655570J555120
4739H2078493K100544K019610J637973J323512P40984O93491P1242o94359p90942
4730H9180548j076734k140870j731926j633001j681167j521581j296926r92764
4722G7105579j079055j656619q60386o85120r42862q97967q36974n42428K53165
4713F9857333n95479k38550K18364m15775L037m18988l33788m87149n35319M91690
4703F7545376k55544q40526q7197K15489j36390k54307r60607o05771j028540
4694F3591983j150549l71208q68067j172313j541813j782369q41940r34570j009891
4685E3919263p31368j769721j490909m92985o54090m01774j011573j464402j00400
$$ plain form
4676 45802041 45250676 44783657 44806383 44664409 45139080 45820395 45695365 46163736 46685311 46892937
4666 46892937 47122730 46850900 46332346 46015426 44423054 43591724 42514262 41000798 39712271
4657 39712271 37916408 36846720 36215730 34671665 34090355 34082363 33098337 32961043 33444999
4648 33444999 33787879 33654952 33548920 34805727 35187155 35343077 35632359 36009683 36420071
4639 36420071 36462401 36474818 37702206 39192555 41461524 44959362 48409436 52062109 54998719
4630 54998719 57205977 59291875 60104462 59563350 58100320 55839974 53782021 51245158
4622 51245158 49450154 47889756 45510558 43001099 41646312 40304146 39095889 37690231
4614 37690231 37036898 36570822 35576407 35144367 35308979 34584049 34281506 34208340 33534169 33815095
$$ packed form
4676D5802041n51365m67019K2726j41974M74671O81315j25030M68371N21575K07626
4666D6892937K29793k71830n18554l16920j592372q31330j077462j513464j288527
4657C9712271j795863j069688o30990j544065n81310p992r84026j37294M83956
4648C3444999L42880j32927j06032J256807L81428J55922K89282L77324M10388
4639C6420071M2330J2417J227388J490349K268969L497838L450074L652673K936610
4630E4998719K207258K085898Q12587n41112j463030k260346k057953k536863
4622E1245158j795004j560398k379198k509459j354787j342166j208257j405658
4614C7690231o53333m66076r94415m32040J64612p24930l02543p3166o74171K80926
$$ plain form
4604 33815095 33817380 33105082 32631298 32342982 31642166 30689991 29803884 29153904 28688490 27868043
4594 27868043 26964767 26492763 26359185 26064701 25657204 26282025 26425797 26158318 26768831
4585 26768831 27047265 27883693 28694226 29279777 29978643 31225759 31845967 33304807 34220421
4576 34220421 35376516 36442453 36887452 38148348 39608353 40410292 42032158 42939611 42843376
4567 42843376 43297350 43771641 43951943 43712683 43710807 43379693 42129393 41692519 42002670 42002795
4557 42002795 41759758 42480916 43820257 45048120 47111392 50386251 54772851 60037621
4549 60037621 65590000 71108725 78385735 84648005 89023692 92096365 94697502 96117850
4541 96117850 97773027 99796379 103709589 110163818 120011696 134135166 152817236 173286853
$$ packed form
4604C3815095K285p12298m73784k88316p00816r52175q86107o49980m65414q20447
4594B7868043r03276m72004j33578k94484m07497O24821J43772k67479O10513
4585B6768831K78434Q36428Q10533N85551O98866J247116O20208J458840R15614
4576C4220421J156095J065937M44999J260896J460005Q01939J621866R07453r6235
4567D2843376M53974M74291J80302k39260j876l31114j250300m36874L10151J25
4557D2002795k43037P21158J339341J227863K063272L274859M386600N264770
4549F0037621N552379N518725P277010O262270M375687L072673K601137J420348
4541I6117850J655177K023352L913210O454229R847878J4123470J8682070K0469617
$$ plain form
4533 173286853 194757640 217693512 239273626 257529688 271196892 278043698 278892364
4526 278892364 273314131 261015994 244303694 223600058 201187189 179103545 157721716
4519 157721716 138622161 122065091 107493802 95098797 84758718 76206008 69296454
4512 69296454 62967010 57272414 52903649 49043636 45404064 42475666 40738936 38550963
4504 38550963 35884661 34194708 33074895 31840982 30386308 29162980 27989419 27009039
4496 27009039 26241502 25097948 24126479 23735008 23120994 22400667 21635592 20838389 20185172
4487 20185172 19526846 18176080 17686483 17873481 17073872 16344403 17102945 17467014 16925490
4478 16925490 16648105 16377323 16766068 16093170 15472233 15703331 15404763 14895888 14755467
$$ packed form
4533A73286853K1470787K2935872K1580114J8256062J3667204O846806Q48666
4526B78892364n578233j2298137j6712300k0703636k2412869k2083644k1381829
4519A57721716j9099555j6557070j4571289j2395005j0340079q552710o909554
4512F9296454o329444n694596m368765l860013l639572k928398j736730k187973
4504C8550963k666302j689953j119813j233913j454674j223328j173561r80380
4496B7009039p67537j143554r71469l91471o14014p20327p65075p97203o53217
4487B0185172o58326j350766m89597J86998p99609p29469P58542L64069n41524
4478A6925490k77385k70782L88745o72898o20937K31098k98568n08875j40421
$$ plain form
4469 14755467 14687090 14904505 14561979 13890413 14382656 14613442 13928343 13391317 13338086 13506936
4459 13506936 13360873 13347266 13338313 13412094 13512844 13887986 14217129 14193359 14075623 14072532 13902812
4448 13902812 13786652 14157469 13549360 13082250 13017357 12648792 12663389 12959609 12667910 12504148
4438 12504148 12546983 12599993 13071955 12754166 12863102 12745420 12280648 12479635 12802845 12636993
4428 12636993 12713775 13132777 13897209 14864339 16601692 18511853 20603425 22773288 24207201
4419 24207201 24955095 26303393 26061117 25038716 23304725 21247113 20036854 17974667
4411 17974667 15799151 14914257 13279678 12069846 11441509 10837432 10399352 10048809 10161203
4402 10161203 10292590 10206185 10051492 10306574 10252592 10224815 9948692 9668461 9682699 9824354
$$ packed form
4469A4755467o8377K17415l42526o71566M92243K30786o85099n37026n3231J68850
4459A3506936j46063j3607q953P3781J00750L75142L29143k3770j17736l091j69720
4448A3902812j16160L70817o08109m67110o4893l68565J4597K96220k91699j63762
4438A2504148M2835N3010M71962l17789J08936j17682m64772J98987L23210j65852
4428A2636993P6782M19002P64432R67130J737353J910161K091572K169863J433913
4419B4207201P47894J348298k42276j022401j733991k057612j210259k062187
4411A7974667k175516q84894j634579j209832o28337o04077m38080l50543J12394
4402A0161203J31387q6405j54693K55082n3982k7777k76123k80231J4238J41655
$$ plain form
4392 9824354 9530432 8913862 9122575 8873124 8300651 8715340 8800102 8656835 8368283 8227902
4382 8227902 8044817 8120066 8390339 8129782 7477704 7728705 8323917 8425661 8374592 8868653
4372 8868653 8715840 8941159 8629804 8711800 9577807 9410137 9132208 9505061 9080887 9318831
4362 9318831 9246818 8511182 8803757 9518844 9251217 9296913 9334367 9412301 9267807 8637544
4352 8637544 8578841 8862887 8235240 8460317 8453808 8056487 8120099 8289171 8468654 9027034
4342 9027034 9466560 9451412 9547053 9863573 10014468 9182513 9382289 9538429 9136413 8906833
4332 8906833 8670606 9088648 9025130 8795151 9417102 9314351 9637733 10148459 10574999 11299157
4322 11299157 11819088 12415486 12981994 13698897 15187579 16166393 17999267 20357020 25083909
$$ packed form
4392I824354k93922o16570K08713k49451n72473M14689Q4762j43267k88552j40381
4382H227902j83085P5249K70273k60557o52078K51001N95212J01744n1069M94061
4372H868653j52813K25319l11355Q1996Q66007j67670k77929L72853m24174K37944
4362I318831p2013p35636K92575P15087k67627M5696L7454P7934j44494o30263
4352H637544n8703K84046o27647K25077o509l97321O3612J69072J79483N58380
4342I027034M39526j5148R5641L16520J50895q31955J99776J56140m02016k29580
4332H906833k36227M18042o3518k29979O21951j02751L23382N10726M26540P24158
4322A1299157N19931N96398N66508P16903J488682R78814J832874K357753M726889
$$ plain form
4313 25083909 33406680 46471697 64491096 82022468 87343358 82853498 79996033 74103056
4305 74103056 64179382 53897364 44335099 36677619 30995729 26162817 22436078 20381985
4297 20381985 17919750 15995983 14633361 13612753 13578921 13063111 12000525 11797607 12059474
4288 12059474 11717400 11409997 11210144 11259134 11022850 11221708 11612809 11391322 10941814 9985371
4278 9985371 9553346 9719511 10197298 10006242 8917924 9028906 9695706 8965992 9222634
4269 9222634 9490800 8859162 8181690 8035084 8321359 8701138 8849032 8171811 7831618 8232288
4259 8232288 8359709 8144909 8712353 9016956 9050451 8969595 8678806 9524711 9575073 9339679
4249 9339679 9438454 9358810 9319331 9587278 9408493 9512363 10274285 10507599 10250173 10422425
$$ packed form
4313B5083909Q322771J3065017J8019399J7531372N320890m489860k857465n892977
4305G4103056r923674j0282018r562265p657480n681890m832912l726739k054093
4297B0381985k462235j923767j362622j020608l3832n15810j062586k02918K61867
4288A2059474l42074l07403j99853M8990k36284J98858L91101k21487m49508r56443
4278I985371m32025J66165M77787j91056j088318J10982O66800p29714K56642
4269I222634K68166o31638o77472j46606K86275L79779J47894o77221l40193M00670
4259H232288J27421k14800N67444L04603L3495q0856k90789Q45905N0362k35394
4249I339679R8775p9644l9479K67947j78785J03870P61922K33314k57426J72252
$$ plain form
4239 10422425 10771855 10607498 10135605 10554470 10583399 10478333 10053134 9881344 9915090 9935637
4229 9935637 9660542 9390705 9205361 9407205 9448479 9721971 9792463 9787890 9241060 9126570
4219 9126570 9724897 10168061 10479712 10003871 9906841 10302001 10859705 11050061 11279036 10644562
4209 10644562 10448363 9850290 9991698 9959123 9781488 9695132 9287174 9268636 9510395 9364345
4199 9364345 9698401 10121211 10260428 10014691 10396834 10569079 10581358 10664049 11030213 11364252
4189 11364252 11636736 11553421 11403555 11516722 11866393 11837120 12173289 12557861 12868438 13103586
4179 13103586 13336161 13324257 13783370 14165002 14475547 14958967 15233834 15741080 15867910 15850472
4169 15850472 16312834 16478938 16992147 17076509 17038221 17421528 17188299 17300603 17607104 17308368
$$ packed form
4239A0422425L49430j64357m71893M18865K8929j05066m25199j71790L3746K0547
4229I935637k75095k69837j85344K01844M1274K73492P0492m573n46830j14490
4219I126570N98327M43164L11651m75841r7030L95160N57704J90356K28975o34474
4209A0644562j96199n98073J41408l2575j77635q6356m07958j8538K41759j46050
4199I364345L34056M22810J39217k45737L82143J72245J2279Q2691L66164L34039
4189A1364252K72484q3315j49866J13167L49671k9273L36169L84572L10577K35148
4179A3103586K32575j1904M59113L81632L10545M83420K74867N07246J26830j7438
4169A5850472M62362J66104N13209Q4362l8288L83307k33229J12304L06501k98736
$$ plain form
4159 17308368 17560244 17811567 18094371 17865262 17506194 17815557 17973275 17884072 17882602 18089594
4149 18089594 17860349 17754343 18129004 17818749 17296154 17072715 16664950 16975140 16948132 16453419
4139 16453419 16506059 16570887 16798459 18061375 18046866 18041286 18561091 18250934 19056002 19835246
4129 19835246 19271715 19592285 19409981 19685429 20387148 20773667 21636916 21955842 21787215
4120 21787215 22653537 22811342 22949919 23608826 24131478 24094512 24618502 25241554 25590941 26266295
4110 26266295 26388110 26547087 27807623 28544666 28908491 29730199 30175040 30794298 31141438
4101 31141438 31055093 31474137 31643282 31828307 32481050 33135737 33674118 34646135 35874443
4092 35874443 36560077 36993868 37971990 38289669 39148554 39403595 39796685 39970867 40117977
$$ packed form
4159A7308368K51876K51323K82804k29109l59068L09363J57718q9203j470K06992
4149A8089594k29245j06006L74661l10255n22595k23439m07765L10190k7008m94713
4139A6453419N2640O4828K27572J262916j4509n580N19805l10157Q05068P79244
4129A9835246n63531L20570j82304K75448P01719L86519Q63249L18926j68627
4120B1787215Q66322J57805J38577O58907N22652l6966N23990O23052L49387O75354
4110B6266295J21815J58977J260536P37043L63825Q21708M44841O19258L47140
4101C1141438q6345M19044J69145J85025O52743O54687N38381R72017J228308
4092C5874443O85634M33791R78122L17679Q58885K55041L93090J74182J47110
$$ plain form
4083 40117977 41043070 41216808 41476066 42218093 42571085 43152009 44502441 45304913 46710805
4074 46710805 47809577 48268060 48981987 49324593 50111508 51200778 51366717 52692122 53628980
4065 53628980 54473363 56346908 57039176 57841400 58804758 59192041 59447617 59920243 61247709
4056 61247709 62930932 64499254 66526464 68671827 70418592 72372689 73173806 73881398
4048 73881398 74429626 74643083 75273973 75781868 75999418 76477391 76605495 77240295 77956218
4039 77956218 78688186 80001024 81499570 82831446 84096035 85733130 87334165 88457082
4031 88457082 89787347 90470801 91215393 92605309 94118465 95240790 96328439 96905281 97987887
4022 97987887 98644149 99086646 99740778 99906743 100479977 100940485 101088892 101124021 101347540 101647599
$$ packed form
4083D0117977R25093J73738K59258P42027L52992N80924J350432Q02472J405892
4074D6710805J098772M58483P13927L42606P86915J089270J65939J325405R36858
4065E3628980Q44383J873545O92268Q02224R63358L87283K55576M72626J327466
4056F1247709J683223J568322K027210K145363J746765J954097Q01117P07592
4048G3881398N48228K13457O30890N07895K17550M77973J28104O34800P15923
4039G7956218P31968J312838J498546J331876J264589J637095J601035J122917
4031H8457082J330265O83454P44592J389916J513156J122325J087649N76842J082606
4022I7987887O56262M42497O54132J65965N73234M60508J48407L5129K23519L00059
$$ plain form
4012 101647599 102215330 102452761 102654885 102443356 102265902 101882085 102393086 102509719 102569399
4003 102569399 102695121 102569878 102429445 102389285 101758915 101340782 100583519 100397322 99818932
3994 99818932 98618643 97646770 95999021 94970148 94580115 92842004 91219076 89911060
3986 89911060 88875083 87735248 86358568 85639064 84796388 84139867 83484197 83033351 83081999
3977 83081999 82497554 81930279 81762245 81209475 80761095 80276330 79452140 78815549 77614484
3968 77614484 76374919 76112720 74680751 74283957 73866702 72648369 72102044 71681906 70946883
3959 70946883 71198895 71464415 71625138 71934010 72326422 72759231 73762385 74367918 74120994
3950 74120994 74099280 74758982 75143069 75628038 75981730 76064859 76383311 76795056 77125796 77842575
$$ packed form
4012A01647599N67731K37431K02124k11529j77454l83817N11001J16633N9680
4003A02569399J25722j25243j40433m0160o30370m18133p57263j86197n78390
3994I9818932j200289r71873j647749j028873l90033j738111j622928j308016
3986H9911060j035977j139835j376680p19504q42676o56521o55670m50846M8648
3977H3081999n84445n67275j68034n52770m48380m84765q24190o36591j201065
3968G7614484j239565k62199j431969l96794m17255j218333n46325m20138p35023
3959G0946883K52012K65520J60723L08872L92412M32809J003154O05533k46924
3950G4120994k1714O59702L84087M84969L53692Q3129L18452M11745L30740P16779
$$ plain form
3940 77842575 78328415 78491677 78439585 79232698 79684616 80154924 80553021 80051976 78667988
3931 78667988 77860582 76819781 75622394 73561803 70907080 68610450 66449528 64193196
3923 64193196 62236026 60171284 58042831 56555418 55125028 53388244 52527720 51876926
3915 51876926 50380883 50012652 49451991 48215010 47555887 46019037 44323718 44051110 42966823
3906 42966823 41483706 40867701 40754532 39479365 39139217 38480110 38241493 38457588 38814794
3897 38814794 38878164 39197090 38857576 39033819 38889166 37938651 38332893 37779699 36940089 37252134
3887 37252134 36468918 35942081 36831574 36983727 36220698 36517831 36930539 36559530 36155180
3878 36155180 36542783 36801890 36509796 37189963 37584480 37949041 39179623 39922261 40047952
$$ packed form
3940G7842575M85840J63262n2092P93113M51918M70308L98097n01045j383988
3931G8667988q07406j040801j197387k060591k654723k296630k160922k256332
3923F4193196j957170k064742k128453j487413j430390j736784q60524o50794
3915E1876926j496043l68231n60661j236981o59123j536850j695319k72608j084287
3906D2966823j483117o16005j13169j275167l40148o59107k38617K16095L57206
3897C8814794O3370L18926l39514J76243j44653r50515L94242n53194q39610L12045
3887C7252134p83216n26837Q89493J52153p63029K97133M12708l71009m04350
3878C6155180L87603K59107k92094O80167L94517L64561J230582P42638J25691
$$ plain form
3869 40047952 40632591 41088025 41833262 42452064 42691890 42450427 42092976 42470138 42960736
3860 42960736 43516681 43275517 44106899 45064709 45577711 46845497 48660129 49744963 50607020
3851 50607020 51609389 52450714 53582133 54371305 54341201 54344041 54258805 55034974 55698668 55532604
3841 55532604 55791074 56775694 56984460 57649800 59076487 59604281 60773107 61455458 61203951
3832 61203951 61375576 60158351 58753823 57678480 55301501 53289730 51450139 49504803
3824 49504803 47854786 45441781 43234262 41971078 40107963 38804142 37481910 36155865
3816 36155865 35093935 34334878 33166925 32098556 31490847 30974851 30141824 29362867 28861374
3807 28861374 28565588 29087214 29159783 29582377 30463909 30676945 31143833 31884317 33188693
$$ packed form
3869D0047952N84639M55434P45237O18802K39826k41463l57451L77162M90598
3860D2960736N55945k41164Q31382R57810N13002J267786J814632J084834Q62057
3851E0607020J002369Q41325J131419P89172l0104K840q5236P76169O63694j66064
3841E5532604K58470R84620K08766O65340J426687N27794J168826O82351k51507
3832F1203951J71625j217225j404528j075343k376979k011771j839591j945336
3824D9504803j650017k413005k207519j263184j863115j303821j322232j326045
3816C6155865j061930p59057j167953j068369o07709n15996q33027p78957n01493
3807B8861374k95786N21626P2569M22594Q81532K13036M66888P40484J304376
$$ plain form
3798 33188693 34164654 35314382 35962510 37309970 37793759 38255429 38690262 38292282 37731995
3789 37731995 37416273 36967159 36473191 36448927 36170225 36640556 36610022 37093270 37773567 37434223
3779 37434223 37803111 37895719 37679736 38385957 38980988 38602162 38743473 37987577 36773716
3770 36773716 36200669 35186971 34083112 33202645 31814669 30602040 29313487 28661222 27985537
3761 27985537 27356099 26063817 25082061 24810816 24192443 24139709 24377646 24262698 23925835
3752 23925835 23914233 23823571 23952004 23950959 24209274 24454601 25021155 25471251 26925212 27794131
3742 27794131 28436217 29537221 31771869 33220195 34920840 37130617 39387090 41362778
3734 41362778 43346904 44528430 45915449 46253587 45758799 45291624 44794120 43515740 42366850
$$ packed form
3798C3188693R75961J149728O48128J347460M83789M61670M34833l97980n60287
3789C7731995l15722m49114m93968k4264k78702M70331l0534M83248O80297l39344
3779C7434223L68888R2608k15983P06221N95031l78826J41311p55896j213861
3770C6773716n73047j013698j103859q80467j387976j212629j288553o52265o75685
3761B7985537o29438j292282r81756k71245o18373n2734K37937j14948l36863
3752B3925835j1602r0662J28433j045K58315K45327N66554M50096J453961Q68919
3742B7794131O42086J101004K234648J448326J700645K209777K256473J975688
3734D1362778J984126J181526J387019L38138m94788m67175m97504j278380j148890
$$ plain form
3725 42366850 41805931 41045123 40436833 39426752 37838489 36436304 35459465 34078862 33087401
3716 33087401 32585118 31487084 30377562 29402899 28425902 27745608 26968933 26137014 25565014
3707 25565014 24942340 25320987 25528040 24829386 25514289 25981356 26124728 25761827 26542741
3698 26542741 27132355 27231535 27615778 28316710 28291679 28703256 28767715 28715876 29135824 29065822
3688 29065822 29674847 30149391 31049592 31980759 32193238 33022775 33393747 33801006 34145241
3679 34145241 34713668 35082962 35844105 35713167 35469653 34534273 33787529 32800250 31263373
3670 31263373 29806999 28190119 26401200 24917399 24163941 23447917 22850224 21873390 21222729
3661 21222729 20704442 20364976 20350234 19798226 19671986 19274242 18233655 18702557 18662449 18237790
$$ packed form
3725D2366850n60919p60808o08290j010081j588263j402185r76839j380603r91461
3716C3087401n02283j098034j109522r74663r76997o80294p76675q31919n72000
3707B5565014o22674L78647K07053o98654O84903M67067J43372l62901P80914
3698B6542741N89614R9180L84243P00932k5031M11577O4459n1839M19948p0002
3688B9065822O09025M74544R00201R31167K12479Q29537L70972M07259L44235
3679C4145241N68427L69294P61143j30938k43514r35380p46744r87279j536877
3670C1263373j456374j616880j788919j483801p53458p16024n97693r76834o50661
3661B1222729n18287l39466j4742n52008j26240l97744j040587M68902m0108m24659
$$ plain form
3651 18237790 17800181 16836235 17183304 17868849 17674973 17946640 18337317 17877974 18035554
3642 18035554 18125000 18395150 18712982 18752721 18413423 18604831 19638263 20066547 20552846 20384102
3632 20384102 20546628 20521447 19620700 19378713 19571193 19152002 18935887 18162375 18290382 17825421
3622 17825421 16508363 16155294 15781298 15357834 14959131 14305974 14416829 14583093 14135332
3613 14135332 14703870 14633292 14108659 14122018 13935119 13949228 13310083 12796799 13163054 12688323
3603 12688323 12499860 11880280 11202106 10854476 9787077 9684967 9718169 9823079 10031576
3594 10031576 10222989 9838572 9540066 9634861 10702809 10327461 10019712 10575811 10587639 10653139
3584 10653139 11234245 11170293 11180095 10701878 10479448 10545868 11018559 11736341 11738916 11046063
$$ packed form
3651A8237790m37609r63946L47069O85545j93876K71667L90677m59343J57580
3642A8035554Q9446K70150L17832L9739l39298J91408J033432M28284M86299j68744
3632B0384102J62526k5181r00747k41987J92480m19191k16115p73512J28007m64961
3622A7825421j317058l53069l73996m23464l98703o53157J10855J66264m47761
3613A4135332N68538p0578n24633J3359j86899J4109o39145n13284L66255m74731
3603A2688323j88463o19580o78174l47630j067399j02110L3202J04910K08497
3594A0031576J91413l84417k98506R4795J067948l75348l07749N56099J1828O5500
3584A0653139N81106o3952R802m78217k22430O6420M72691P17782K575o92853
$$ plain form
3574 11046063 10801947 10545530 10386630 10227556 10077229 9707957 10030307 9629504 9523371
3565 9523371 10141153 10028968 9545416 9522892 9480100 9448141 9368670 9315614 8967914 9000928 9404287
3554 9404287 9676113 10327723 10821707 10491285 10914624 11530940 11645046 12027271 11757531 12071957
3544 12071957 11911921 12075758 11952849 12535218 12952918 13017171 13128408 13202552 13580643 13802005
3534 13802005 13252764 12867838 12904408 12593191 12285165 12041318 11736403 12439100 12217516 12002948
3524 12002948 12291750 12743474 12595987 12407583 12171649 12487975 12080470 12127049 12328226 12725737
3514 12725737 12397739 12562916 12883484 12916099 12658262 12794690 13151181 14092528 13973800 14178588
3504 14178588 14655954 14280614 14725001 14414693 13829934 14034893 13774490 13879783 14489465
$$ packed form
3574A1046063k44116k56417j58900j59074j50327l69272L22350m00803j06133
3565I523371O17782j12185m83552k2524m2792l1959p9471n3056l47700L3014M03359
3554I404287K71826O51610M93984l30422M23339O16316J14106L82225k69740L14426
3544A2071957j60036J63837j22909N82369M17700O4253J11237P4144L78091K21362
3534A3802005n49241l84926L6570l11217l08026k43847l04915P02697k21584k14568
3524A2002948K88802M51724j47487j88404k35934L16326m07505M6579K01177L97511
3514A2725737l27998J65177L20568L2615k57837J36428L56491R41347j18728K04788
3504A4178588M77366l75340M44387l10308n84759K04959k60403J05293O09682
$$ plain form
3495 14489465 15014360 15180895 15443412 16036417 17048152 18000128 18704119 19141044 20605076
3486 20605076 21851826 22916007 24250683 25217480 26658351 27860463 28935781 30659467
3478 30659467 32473589 33372526 34095266 34233136 33716481 31633908 29684672 27463043 25038891
3469 25038891 22961206 21355729 20164965 18893208 17722868 16772727 15876844 15250315 14705341
3460 14705341 14056420 13566932 13756890 13429655 13593486 13301531 13043471 13548480 13606710 13584716
3450 13584716 13267458 12567747 12685892 12462919 12482976 12653364 12692480 12335581 11920156 11777195
3440 11777195 12398005 12159355 11623039 11702521 11672927 11202146 11268588 11600970 11543119 11406200
3430 11406200 11490092 11468174 11798289 12052854 11982017 11665266 11499534 11571049 11609796 11654289
$$ packed form
3495A4489465N24895J66535K62517N93005J011735R51976P03991M36925J464032
3486B0605076J246750J064181J334676R66797J440871J202112J075318J723686
3478C0659467J814122Q98937P22740J37870n16655k082573j949236k221629k424152
3469B5038891k077685j605477j190764j271757j170340r50141q95883o26529n44974
3460A4705341o48921m89488J89958l27235J63831k91955k58060N05009N8230k1994
3450A3584716l17258o99711J18145k22973K0057J70388L9116l56899m15425j42961
3440A1777195O20810k38650n36316P9482k9594m70781O6442L32382n7851j36919
3430A1406200Q3892k1918L30115K54565p0837l16751j65732P1515L8747M4493
$$ plain form
3420 11654289 11716340 11828430 11638300 11840404 11963880 12320081 12448955 12145711 11768488 11604802
3410 11604802 11487643 12117757 12132638 12066449 11866509 11870064 11934947 12005835 12114422 11865501
3400 11865501 12197276 12248101 12751274 13243609 13028606 13532501 13860407 13826112 13840042 13575175
3390 13575175 13611819 13364367 13014270 12637782 13056528 13132070 12739107 12337369 12446028 12044793
3380 12044793 11908509 12042110 12239603 12917976 12977145 13054914 13742159 13005450 13189419 13899994
3370 13899994 13837365 14663934 14731956 14357496 15229372 15641345 15542057 15658483 16210493 16387308
3360 16387308 17003103 17596807 18083449 18555675 18420268 18319311 18802980 19286512 19433083
3351 19433083 19228898 19095733 18772401 18695541 19114988 19622325 19926120 20026616 19927898 19866142
$$ packed form
3420A1654289O2051J12090j90130K02104J23476L56201J28874l03244l77223j63686
3410A1604802j17159O30114J4881o6189j99940L555O4883P0888J08587k48921
3400A1865501L31775N0825N03173M92335k15003N03895L27906l4295J3930k64867
3390A3575175L6644k47452l50097l76488M18746P5542l92963m01738J08659m01235
3380A2044793j36284J33601J97493O78373N9169P7769O87245p36709J83969P10575
3370A3899994o2629Q26569O8022l74460Q71876M11973r9288J16426N52010J76815
3360A6387308O15795N93704M86642M72226j35407j00957M83669M83532J46571
3351A9433083k04185j33165l23332p6860M19447N07337L03795J00496r8718o1756
$$ plain form
3341 19866142 20316201 20654104 20907185 20987664 21322492 21664785 21830465 22345550 22463230 22525773
3331 22525773 23205523 23536836 24462796 25421828 26735295 27775182 29238279 30671576 32439396
3322 32439396 33741494 35949947 37980968 40368435 42904838 45463812 48938100 52913216
3314 52913216 56727239 61637594 67357342 73115088 81109175 90557327 100992997 113696597
3306 113696597 126992191 139815306 150986250 157791048 160214940 159055870 153598206 145938945
3298 145938945 135772278 124600227 114638797 105444206 96629434 89202304 82440548 76597611
3290 76597611 72243967 69029308 65843577 63446528 61535102 59397096 58194525 57837361
3282 57837361 57474311 57269855 56846201 56817537 56637506 56472715 56175954 55699369 54961427 54373525
$$ packed form
3341A9866142M50059L37903K53081Q0479L34828L42293J65680N15085J17680O2543
3331B2525773O79750L31313R25960R59032J313467J039887J463097J433297J767820
3322C2439396J302098K208453K031021K387467K536403K558974L474288L975116
3314E2913216L814023M910355N719748N757746P994087R448152J0435670J2703600
3306A13696597J3295594J2823115J1170944O804798K423892j159070n457664p659261
3298A45938945j0166667j1172051r961430r194591q814772p427130o761756n842937
3290G6597611m353644l214659l185731k397049j911426k138006j202571l57164
3282E7837361l63050k04456m23654k8664j80031j64791k96761m76585p37942n87902
$$ plain form
3272 54373525 53698053 53050903 52214605 51850801 51521993 51284605 51477946 50584375 49800586
3263 49800586 49734862 49316674 48589263 47835028 47228677 46222514 45284783 45574997 45024281
3254 45024281 44373691 43915364 43059673 43618563 43497977 42534108 42926762 41544074 40704400
3245 40704400 40415062 39227209 39087056 39590365 38992007 38924824 38613440 38713347 38918472 39361952
3235 39361952 39346992 39443241 39564167 40255840 40904749 41148381 41466120 42081356 42752261 43699669
3225 43699669 44149235 45676990 46174103 47105883 48506351 49862320 51751995 54666626 57090523
3216 57090523 59855355 62706125 66813060 72130873 78087904 85004401 93363225 104300932
3208 104300932 116741972 130636630 145213473 158492222 169572511 177352950 179119717
$$ packed form
3272E4373525o75472o47150q36298l63804l28808k37388J93341q93571p83789
3263D9800586o5724m18188p27411p54235o06351j006163r37731K90214n50716
3254D5024281o50590m58327q55691N58890j20586r63869L92654j382688q39674
3245D0704400k89338j187853j40153N03309n98358o7183l11384R9907K05125M43480
3235C9361952j4960R6249J20926O91673O48909K43632L17739O15236O70905R47408
3225D3699669M49566J527755M97113R31780J400468J355969J889675K914631K423897
3216E7090523K764832K850770M106935N317813N957031O916497Q358824J0937707
3208A04300932J2441040J3894658J4576843J3278749J1080289P780439J766767
$$ plain form
3201 179119717 177306127 171433795 160883514 148924419 136217578 122620706 111598890
3194 111598890 101312152 92139243 85148420 79087966 73704075 70410970 66980794 64865342
3186 64865342 63876451 62890037 62863224 63810844 64171551 65958916 67919122 69034011 70423405
3177 70423405 72160967 73756584 75570982 76987735 77640514 78077174 78810314 79965696 80281946
3168 80281946 79624072 77405744 74326048 71522517 67955105 65453404 63393424 61160770
3160 61160770 59818574 58496118 58632780 59650975 60174871 61082222 63255242 65522191 67802845
3151 67802845 70369687 73971255 77302457 81937486 87625803 95026807 105522041 118329382
3143 118329382 133896809 152083365 169528605 184247313 193344879 196662748 195116985
$$ packed form
3201A79119717j813590n872332j0550281j1959095j2706841j3596872j1021816
3194A11598890j0286738r172909o990823o060454n383891l293105l430176k115452
3186F4865342r88891r86414k6813R47620L60707J787365J960206J114889J389394
3177G0423405J737562J595617J814398J416753O52779M36660P33140J155382L16250
3168H0281946o57874k218328l079696k803531l567412k501701k059980k232654
3160F1160770j342196j322456J36662J018195N23896R07351K173020K266949K280654
3151F7802845K566842L601568L331202M635029N688317P401004J0495234J2807341
3143A18329382J5567427J8186556J7445240J4718708R097566L317869j545763
$$ plain form
3136 195116985 189680449 181773578 172782062 165224086 159628406 156880246 158763074 163569360
3128 163569360 171382871 181398388 190437609 197093935 201036536 198708764 192351072 183704778
3120 183704778 171668247 159108839 145677542 133138331 122016627 111287446 102804305
3113 102804305 95649791 89551960 84030541 79067662 75041263 71376843 68721224 65603936
3105 65603936 63086531 61638879 60222342 58637730 58583198 58770538 59082003 60185802 60632520
3096 60632520 60763120 61264518 60905236 60234561 59251169 58043721 56855027 56433470 55999578
3087 55999578 55828545 55049335 54226322 54973792 55091183 55305810 55525953 55753958 56496070
3078 56496070 56464233 57122994 57937989 58879511 60259833 61450404 63433470 66911686 70253567
$$ packed form
3136A95116985n436536p906871q991516p557976n595680k748160J882828M806286
3128A63569360P813511J0015517R039221O656326L942601k327772o357692q646294
3120A83704778j2036531j2559408j3431297j2539211j1121704j0729181q483141
3113A02804305p154514o097831n521419m962879m026399l664420k655619l117288
3105F5603936k517405j447652j416537j584612n4532J87340L11465J103799M46718
3096F0632520J30600N01398l59282o70675r83392j207448j188694m21557m33892
3087E5999578j71033p79210q23013P47470J17391K14627K20143K28005P42112
3078E6496070l1837O58761Q14995R41522J380322J190571J983066L478216L341881
$$ plain form
3069 70253567 74763785 81178354 88906999 99061531 111478131 125078232 139144086 151701665
3061 151701665 161589110 166846971 166863783 162412274 154186342 143647542 132125594 119972518
3053 119972518 108683070 98732856 90192437 82614427 76863239 72826480 68982809 65299375
3045 65299375 62040405 59807706 57660307 55824413 53932346 51545475 49520113 48148016
3037 48148016 46536285 45171095 44225698 43511367 43112549 42398913 42886237 43458454 43747937
3028 43747937 44662047 45989122 47763740 50476609 53172058 56528129 60580453 66072231
3020 66072231 73686646 82930517 95296550 109345580 124659934 139879408 151638211
3013 151638211 158946246 161177501 157803960 149937114 139091865 126191684 113137000 99900842
$$ packed form
3069G0253567M510218O414569P728645J0154532J2416600J3600101J4065854J2557579
3061A51701665R887445N257861J6812m451509q225932j0538800j1521948j2153076
3053A19972518j1289448r950214q540419p578010n751188m036759l843671l683434
3045F5299375l258970k232699k147399j835894j892067k386871k025362j372097
3037D8148016j611731j365190r45397p14331l98818p13636M87324N72217K89483
3028D3747937R14110J327075J774618K712869K695449L356071M052324N491778
3020F6072231P614415R243871J2366033J4049030J5314354J5219474J1758803
3013A51638211P308035K231255l373541p866846j0845249j2900181j3054684j3236158
$$ plain form
3005 99900842 87873292 78023307 69240018 62766796 57311779 52773810 48931997 45776949
2997 45776949 42477155 40002717 37662458 35551652 33556479 31396260 29655961 27756124
2989 27756124 26369661 25834179 24257367 23030893 22403458 21639249 21311906 20635717 20079136
2980 20079136 19341036 18189894 17667348 16617994 16262060 15958853 15778470 15208911 14889069
2971 14889069 14218282 14200424 14467581 14338948 13764446 13565611 12879166 12316174 12421839 12218582
2961 12218582 12312160 12070220 11613286 11476961 10922925 10830035 11206888 10168774 10492546 10338118
2951 10338118 9700237 9885183 9888355 9795269 9164022 8852928 8696995 8614562 8996685 9122815
2941 9122815 9047468 9057372 9107748 9409298 9906932 10332001 10594680 9996097 10109088 9867545
$$ packed form
3005I9900842j2027550r849985q783289o473222n455017m537969l841813l155048
2997D5776949l299794k474438k340259k110806j995173k160219j740299j899837
2989B7756124j386463n35482j576812j226474o27435p64209l27343o76189n56581
2980B0079136p38100j151142n22546j049354l55934l03207j80383n69559l19842
2971A4889069o70787j7858K67157j28633n74502j98835o86445n62992J05665k03257
2961A2218582R3578k41940m56934j36325n54036r2890L76853j038114L23772j54428
2951A0338118o37881J84946L172r3086o31247l11094j55933q2433L82123J26130
2941I122815p5347R904N0376L01550M97634M25069K62679n98583J12991k41543
$$ plain form
2931 9867545 9404888 9382387 8632781 7989295 7315850 7126124 7681931 6754748 6746309 6914996
2921 6914996 6754822 6872282 6719564 6671334 6534872 6648164 6486565 5690559 5819896 6220367
2911 6220367 5574490 5352025 4597181 4271996 4666209 4356053 4730169 4387856 4273984 4663307
2901 4663307 4325546 3860412 4432066 4162063 3797912 3686186 3179547 3557133 3953725 4176984
2891 4176984 3617701 3310232 3620093 3533888 3309896 3522161 3903560 3396926 2832784 3193463
2881 3193463 3232127 3110134 3481961 3164467 2492582 2798999 2337988 2513355 2955190 2871214
2871 2871214 2816973 2925615 2956185 3136479 3466913 3432636 3058444 2934087 2707693 3155726
2861 3155726 3038657 2453559 2698181 2346706 2247516 2594249 2536545 2966474 2766896 2689589
$$ packed form
2931I867545m62657k2501p49606o43486o73445j89726N55807r27183q439J68687
2921F914996j60174J17460j52718m8230j36462J13292j61599p96006J29337M00471
2911F220367o45877k22465p54844l25185L94213l10156L74116l42313j13872L89323
2901D663307l37761m65134N71654k70003l64151j11726n06639L77586L96592K23259
2891D176984n59283l07469L09861q6205k23992K12265L81399n06634n64142L60679
2881C193463L8664j21993L71827l17494o71885L06417m61011J75367M41835q3976
2871B871214n4241J08642L0570J80294L30434l4277l74192j24357k26394M48033
2861C155726j17069n85098K44622l51475r9190L46733n7704M29929j99578p7307
$$ plain form
2851 2689589 3047182 2491831 3103807 3590054 3068151 2647021 2494404 2114693 2484403 2466266
2841 2466266 2225846 2457758 2488370 2246043 2575518 1950764 2074407 2555052 2189803 2302340
2831 2302340 2301109 1473602 1461552 1648717 1348685 1391153 1278955 1143088 1943322 2256200
2821 2256200 1959195 2009372 1682745 1545277 2048227 1747018 1570709 1198905 1244957 1229674
2811 1229674 838556 785119 899983 979033 1194999 967513 886310 974308 1192896 1329374
2801 1329374 1429136 1774157 1406611 1338860 1516010 1032370 1165376 1215496 1090212 1218264
2791 1218264 908047 807972 726224 709199 1289707 1270351 991264 1268057 1061399 1104583
2781 1104583 1398298 1814939 1363934 1071866 1015232 1311815 946457 1492640 1475324 1119090
$$ packed form
2851B689589L57593n55351O11976M86247n21903m21130j52617l79711L69710j8137
2841B466266k40420K31912L0612k42327L29475o24754J23643M80645l65249J12537
2831B302340j231q27507j2050J87165l00032M2468j12198j35867Q00234L12878
2821B256200k97005N0177l26627j37468N02950l01209j76309l71804M6052j5283
2811A229674l91118n3437J14864P9050K15966k27486q1203Q7998K18588J36478
2801A329374R9762L45021l67546o7751J77150m83640J33006N0120j25284J28052
2791A218264l10217j00075q1748j7025N80508j9356k79087K76793k06658M3184
2781A104583K93715M16641m51005k92068n6634K96583l65358N46183j7316l56234
$$ plain form
2771 1119090 1091004 835154 1135769 1206237 1472292 1371269 446789 632269 696049 793505
2761 793505 707964 957933 809259 193387 389631 697244 512868 1340903 1343843 1085475
2751 1085475 1375624 1522952 1371683 1330094 1046478 799498 388495 79805 561984 500345
2741 500345 845121 809706 334922 591131 785359 1126569 1569797 1827158 1124842 945535
2731 945535 1456139 2013988 1770790 1334585 1432657 1307962 1179570 1233323 1419594 1630744
2721 1630744 1249969 825370 930630 623490 802416 516145 544850 821729 736934 352982
2711 352982 964150 996045 1075660 642044 517954 1232451 673772 159731 343463 180282
2701 180282 -66491 -218566 -186608 424675 11297 -248725 278737 334863 546149 290152
$$ packed form
2771A119090k8086k55850L00615P0468K66055j01023r24480J85480O3780R7456
2761G93505q5541K49969j48674o15872J96244L07613j84376Q28035K940k58368
2751A085475K90149J47328j51269m1589k83616k46980m11003l08690M82179o1639
2741E00345L44776l5415m74784K56209J94228L41210M43228K57361p02316j79307
2731I45535N10604N57849k43198m36205R8072j24695j28392N3753J86271K11150
2721A630744l80775m24599J05260l07140J78926k86271K8705K76879q4795l83952
2711C52982O11168L1895P9615m33616j24090P14497n58679n14041J83732j63181
2701A80282k46773j52075L1958O11283m13378k60022N27462N6126K11286k55997
$$ plain form
2691 290152 470878 632532 517162 330614 319720 448782 -100367 -368863 -129392 -377628
2681 -377628 -920793 -556679 -420605 142994 421826 -182761 -407582 -159138 238670 685907
2671 685907 436463 125732 206850 -184997 -119772 -124738 -615553 -278269 -491284 -1094472
2661 -1094472 -527067 -266512 -341405 39613 22841 -455996 27273 -221674 38249 -112402
2651 -112402 -616201 -77661 264915 -89349 -246249 -719010 -837490 -651646 -771371 -385895
2641 -385895 -450038 -305902 -534112 -1030151 -238087 553369 -166967 -775906 -408809 -63264
2631 -63264 -239485 40386 250464 -81788 -283690 -769137 -278443 196629 178906 204350
2621 204350 -259579 -162823 412209 313 -74670 299468 -46709 299114 695758 832537
$$ packed form
2691B90152J80726J61654j15370j86548j0894J29062n49149k68496K39471k48236
2681c77628n43165L64114J36074N63599K78832o04587k24821K48444L97808M47237
2671F85907k49444l10731Q1118l91847O5225m966m90815L37284k13015o03188
2661a094472N67405K60555p4893L81018j6772m78837M83269k48947K59923j50651
2651a12402n03799N38540L42576l54264j56900m72761j18480J85844j19725L85476
2641c85895o4143J44136k28210m96039P92064P91456p20336o08939L67097L45545
2631f3264j76221K79871K10078l32252k01902m85447M90694M75072j7723K5444
2621B04350m63929R6756N75032m11896p4983L74138l46177L45823L96644J36779
$$ plain form
2611 832537 331909 269977 326320 624025 1343379 1220066 1472478 1858001 827406 385969
2601 385969 925831 366495 631067 292523 -90197 124677 -194864 -537330 -249902 -115118
2591 -115118 312941 469390 -146042 288854 370654 309826 373445 -159500 46331 -124599
2581 -124599 -332698 -217146 371772 -439538 -1045391 -324617 139097 304713 403485 355354
2571 355354 190865 5772 101722 217452 293799 351129 -290813 -521732 -166619 -268974
2561 -268974 -223086 -119687 -144907 94769 -233991 -595361 -59588 175011 66973 -202029
2551 -202029 114119 483514 -73350 106105 -10550 193649 170662 109311 194487 674773
2541 674773 371248 156331 -159819 -304676 -482306 -939861 -804299 -302834 -760408 -669248
$$ packed form
2611H32537n00628o1932N6343K97705P19354j23313K52412L85523j030595m41437
2601C85969N39862n59336K64572l38544l82720K14874l19541l42466K87428J34784
2591a15118M28059J56449o15432M34896Q1800o0828O3619n32945K05831j70930
2581a24599k08099J15552N88918q11310o05853P20774M63714J65616R8772m8131
2571C55354j64489j85093R5950J15730P6347N7330o41942k30919L55113j02355
2561b68974M5888J03399k5220K39676l28760l61370N35773K34599j08038k69002
2551b02029L16148L69395n56864J79455j16655K04199k2987o1351Q5176M80286
2541F74773l03525k14917l16150j44857j77630m57555J35562N01465m57574R1160
$$ plain form
2531 -669248 -203448 518906 953309 669049 606356 833203 285730 338873 -133006 76723
2521 76723 422616 -327852 -469098 -226602 -83266 161245 -84390 388229 314685 280108
2511 280108 276646 590727 765009 -50439 -92092 291095 253134 153098 -91156 -489235
2501 -489235 -406149 122924 98609 426976 792922 216544 135041 558632 461718 59310
2491 59310 -256757 -206151 -87132 -637603 -20936 151306 -138157 163411 347904 -175610
2481 -175610 550632 501457 8575 -49880 269222 164818 -273681 75830 73452 -200950
2471 -200950 -276867 107618 422992 192371 -205201 -518882 -216161 -195223 189262 -222078
2461 -222078 -123799 -136882 496813 486465 1003306 896849 294532 321324 791448 568951
$$ packed form
2531f69248M65800P22354M34403k84260o2693K26847n47473N3143m71879K09729
2521G6723L45893p50468j41246K42496J43336K44511k45635M72619p3544l4577
2511B80108l462L14081J74282q15448m1653L83187l7961j00036k44254l98079
2501d89235Q3086N29073k4315L28367L65946n76378q1503M23591r6914m02408
2491E9310l16067N0606J19019n50471O16667J72242k89463L01568J84493n23514
2481a75610P26242m9175m92882n8455L19102j04404m38499L49511k378k74402
2471b00950p5917L84485L15374k30621l97572l13681L02721K0938L84485m11340
2461b22078R8279j3083O33695j0348N16841j06457o02317K6792M70124k22497
$$ plain form
2451 568951 570176 625066 374222 -167716 -487510 31666 560158 489371 -100796 392942
2441 392942 1205859 1471920 1729125 909426 955472 1597654 922246 1192418 1301102 931546
2431 931546 964104 735709 223106 948904 796162 283169 378786 1215719 1640369 1393451
2421 1393451 1353680 1615958 1937378 1520528 1267279 1705754 1296534 1286745 1539299 1517473
2411 1517473 1712946 2010325 1927673 2445082 2251803 1907641 1615488 1608523 1298432 1133876
2401 1133876 1642382 1918858 1946928 2242564 2435166 2702638 2950556 2923805 3007845 3352667
2391 3352667 2645503 2245654 2660337 2810387 3120531 2756456 2508805 2993273 3335126 3370158
2381 3370158 3521417 3368480 3342588 3556066 3380332 3855567 3703241 3512904 3808644 3875463
$$ packed form
2451E68951J225N4890k50844n41938l19794N19176N28492p0787n90167M93738
2441C92942Q12917K66061K57205q19699M6046O42182o75408K70172J08684l69556
2431I31546L2558k28395n12603P25798j52742n12993R5617Q36933M24650k46918
2421A393451l9771K62278L21420m16850k53249M38475m09220r789K52554k1826
2411A517473J95473K97379q2652N17409j93279l44162k92153o965l10091j64556
2401A133876N08506K76476K8070K95636J92602K67472K47918k6751Q4040L44822
2391C352667p07164l99849M14683J50050L10144l64075k47651M84468L41853L5032
2381C370158J51259j52937k5892K13478j75734M75235j52326j90337K95740O6819
$$ plain form
2371 3875463 4346117 4554493 4453177 4863093 5241036 5234585 5414035 5495405 6193735 5539063
2361 5539063 5771362 6993597 7413323 8817429 11063423 12868063 15421847 17169607 18934222
2352 18934222 20654698 22369804 24116810 26005539 28833889 33918410 40706959 52133126
2344 52133126 71839339 106621754 158930346 216919161 248977263 241949952 231323311
2337 231323311 219481587 190465139 154975214 124952726 99694721 78304342 61988074
2330 61988074 49369215 41136479 36430232 32902113 30518691 28806861 26015766 24215295
2322 24215295 22894978 20529619 18752890 17134788 15699510 14538247 13991295 13160608
2314 13160608 12215675 12157512 11373758 10958556 10813190 9735034 9050473 8998676 8381687 8074604
$$ packed form
2371C875463M70654K08376j01316M09916L77943o451J79450Q1370O98330o54672
2361E539063K32299J222235M19726J404106K245994J804640K553784J747760J764615
2352A8934222J720476J715106J747006J888729K828350N084521O788549J1426167
2344E2133126J9706213L4782415N2308592N7988815L2058102p027311j0626641
2337B31323311j1841724k9016448l5489925l0022488k5258005k1390379j6316268
2330F1988074j2618859q232736m706247l528119k383422j711830k791095j800471
2322B4215295j320317k365359j776729j618102j435278j161263n46952q30687
2314A3160608r44933n8163p83754m15202j45366j078156o84561n1797o16989l07083
$$ plain form
2304 8074604 7413110 6880424 7076851 6340558 5870942 5909074 5637027 5571863 5204954 4997163
2294 4997163 5602560 5759332 5167231 4865990 4980305 4983485 4559323 4366262 4309615 4348277
2284 4348277 4158847 3497165 3748220 3855074 3545047 3622465 4200303 3675253 3436915 3952493
2274 3952493 3883788 3503422 3058469 2852041 3113259 2966684 2801697 2637475 2768900 3065854
2264 3065854 3025450 3254933 2962201 2774260 2827790 1761782 1980670 2387745 2168346 2075004
2254 2075004 1287876 1677983 2042818 1485085 1321342 1631174 1895108 1719580 1367530 1816685
2244 1816685 1909027 1615237 1372748 929507 1288320 1308597 997526 1563968 1178754 893343
2234 893343 1487664 1234112 1066330 1338008 453845 653969 601319 596530 441196 303040
$$ packed form
2304H074604o61494n32686J96427p36293m69616L8132k72047o5164l66909k07791
2294D997163O05397J56772n92101l01241J14315L180m24162j93061n6647L8662
2284D348277j89430o61682K51055J06854l10027P7418N77838n25050k38338N15578
2274C952493o8705l80366m44953k06428K61218j46575j64987j64222J31425K96954
2264C065854m0404K29483k92732j87941N3530j066008K18888M07075k19399r3342
2254B075004p87128L90107L64835n57733j63743L09832K63934j75528l52050M49155
2244A816685R2342k93790k42489m43241L58813K0277l11071N66442l85214k85411
2234H93343N94321k53552j67782K71678q84163K00124n2650m789j55334j38156
$$ plain form
2224 303040 374324 184386 233366 230400 343770 411552 320295 1729 387200 908389 1232423
2213 1232423 964084 407199 440669 -53443 -25800 339999 -410851 -393474 -290946 204896
2203 204896 559570 496523 493463 299165 557762 597890 798703 904800 310773 302275 156166
2192 156166 466009 683102 -142045 210346 463910 -232793 -119717 180079 443525 767109
2182 767109 54166 -193588 -22433 -116164 521289 499945 204619 491016 474704 746789
2172 746789 1039417 804656 596352 711847 562417 252848 731032 743376 253983 -37285
2162 -37285 -64156 -202317 349699 119382 23376 464269 474681 495236 156197 248895 587572
2151 587572 577267 704522 683410 483858 39138 174766 694532 561292 283176 192495
$$ packed form
2224C03040P1284j89938M8980k966J13370O7782r1257l18566L85471N21189L24034
2213A232423k68339n56885L3470m94112K7643L65799p50850J7377J02528M95842
2203B04896L54674o3047l060j94298K58597M0128K00813J06097n94027q498j46109
2192A56166L09843K17093q25147L52391K53564o96703J13076K99796K63446L23584
2182G67109p12943k47754J71155r3731O37453k1344k95326K86397j6312K72085
2172G46789K92628k34761k08304J15495j49430l09569M78184J2344m89393k91268
2162c7285k6871j38161N52016k30317r6006M40893J0412K0555l39039R2698L38677
2151E87572j0305J27255k1112j99552m44720J35628N19766j33240k78116r0681
$$ plain form
2141 192495 -332423 -171905 106294 152062 161352 -551171 -253636 -30699 748690 798173
2131 798173 210725 387673 649061 580602 489082 729163 287690 -449120 144595 144107 -21705
2120 -21705 110775 -161531 -108041 -266171 -154285 281929 293563 297933 -183442 -506656 105034
2109 105034 446509 216941 127642 -201764 -398590 -324537 561310 574880 -100509 -178012
2099 -178012 -101563 219443 266967 -220364 -240715 -436058 -573007 103090 195277 156593 -225311
2088 -225311 -846049 -289474 544982 565236 595321 408080 -216355 -404793 46151 295136
2078 295136 -224659 -393964 -475283 124862 760009 645525 1311356 1047000 943554 823325
2068 823325 485418 978001 575644 177599 106656 -460159 186765 515357 355308 566813
$$ packed form
2141A92495n24918J60518K78199M5768R290p12523K97535K22937P79389M9483
2131G98173n87448J76948K61388o8459r1520K40081m41473p36810N93715m88j65812
2120b1705J32480k72306N3490j58130J11886M36214J1634M370m81375l23214O11690
2109A05034L41475k29568q9299l29406j96826P4053Q85847J3570o75389p7503
2099a78012P6449L21006M7524m87331k0351j95343j36949O76097R2187l8684l81904
2088b25311o20738N56575Q34456K0254L0085j87241o24435j88438M50944K48985
2078B95136n19795j69305q1319O00145O35147j14484O65831k64356j03446j20229
2068H23325l37907M92583m02357l98045p0943n66815O46924L28592j60049K11505
$$ plain form
2058 566813 186818 172747 397668 -1250 -274519 -123176 -488826 -334196 -298514 -347712
2048 -347712 -181800 -29020 -206497 -202922 -76517 -32522 197633 -234401 -549621 -92904
2038 -92904 -231881 -123170 423580 -88895 -163541 -162840 114984 -411613 -688806 -770731 -296295
2027 -296295 -271271 -469183 -77110 -370063 -96682 -280731 27968 57963 -510000 -397310
2017 -397310 -60665 239665 -106528 23745 -117885 186920 -129622 110347 185592 -475279
2007 -475279 -620815 -277592 -81837 467892 143344 -144616 50574 -87318 -95884 -126659
1997 -126659 -475879 -402970 -612799 -380517 65392 -132568 94613 -276211 -310601 -77476
1987 -77476 -173242 164480 190379 -208085 -273635 -715847 -692405 -504340 -528130 -341336 -538477
$$ packed form
2058E66813l79995j4071K24921l98918k73269J51343l65650J54630L5682m9198
2048c47712J65912J52780j77477L575J26405M3995K30155m32034l15220M56717
2038i2904j38977J08711N46750n12475p4646P01K77824n26597k77193q1925M74436
2027b96295K5024j97912L92073k92953K73381j84049L08699K9995n67963J12690
2017c97310L36645L00330l46193J30273j41630L04805l16542K39969P5245o60871
2007d75279j45536L43223J95755N49729l24548k87960J95190j37892q566l0775
1997a26659l49220P2909k09829K32282M45909j97960K27181l70824l4390K33125
1987g7476r5766L37722K5899l98464o5550m42212K3442J88065k3790J86794j97141
$$ plain form
1976 -538477 -570336 -298045 -287833 -150805 304659 46667 -476832 -315065 -707041 -408871
1966 -408871 226724 -5253 -147905 -72254 -152918 48182 -362897 278086 -308579 -342955
1956 -342955 -451052 -607463 59552 459405 50582 -93307 -451784 114596 196869 -333288
1946 -333288 150184 -35802 -386279 352391 5549 -219613 148737 -108774 554036 81070
1936 81070 -311866 96612 109206 -382131 -517775 -325425 -171636 -227662 -541880 -233158
1926 -233158 256792 -86993 369406 414378 -62385 -50284 -163451 -20688 60995 -430398
1916 -430398 -558225 -171837 -222811 -129432 125323 -286944 -715416 -661573 -514456 -447955
1906 -447955 -473371 -551797 -474100 -166902 -230171 -433109 -324285 -206996 -155501 -928218 -919735
$$ packed form
1976e38477l1859K72291J0212J37028M55464k57992n23499J61767l91976K98170
1966d08871O35595k31977j42652P5651q0664K01100m11079O40983n86665l4376
1956c42955j08097j56411O67015L99853m08823j43889l58477N66380Q2273n30157
1946c33288M83472j85986l50477P38670l46842k25162L68350k57511O62810m72966
1936H1070l92936M08478J2594m91337j35644J92350J53789n6026l14218L08722
1926b33158M89950l43785M56399M4972m76763J2101j13167J42763Q1683m91393
1916d30398j27827L86388n0974R3379K54755m12267m28472N3843J47117O6501
1906d47955k5416p8426P7697L07198o3269k02938J08824J17289N1495p72717Q483
$$ plain form
1895 -919735 -431162 -340422 -223612 -379562 -616141 -64742 -112847 -680226 -511694 -890653
1885 -890653 -668725 -75538 -118717 -373508 -364300 -285030 90937 455772 -2085 520468
1875 520468 419476 -360826 202506 517671 366125 396631 -411004 -206063 119142 -267361
1865 -267361 -160546 -492195 -767998 -602196 -643743 -301452 148977 87312 165220 -12336
1855 -12336 4263 473453 1036295 989543 482339 58049 -47506 -134114 -369806 -960686
1845 -960686 -952879 -790635 -1088747 -429720 -60800 -166624 110066 115177 63876 5155 -9754
1834 -9754 -58356 -30649 -336314 -225080 -140522 22599 -6940 -721333 -674655 -48604 -471917
1823 -471917 -907800 -52260 -137981 -173900 -25276 -365566 -787820 -567439 -463987 100250
$$ packed form
1895i19735M88573R0740J16810j55950k36579N51399m8105n67379J68532l78959
1885h90653K21928N93187m3179k54791R208P9270L75967L64835m57857N22553
1875E20468j00992p80302N63332L15165j51546L0506q07635K04941L25205l86503
1865b67361J06815l31649k75803J65802m1547L42291M50429o1665P7908j77556
1855a2336J6599M69190N62842m6752n07204m24290j05555q6608k35692n90880
1845i60686P807J62244k98112O59027L68920j05824K76690N111n1301n8721j4909
1834i754m8602K7707l05665J11234Q4558J63121k9539p14393M6678O26051m23313
1823d71917m35883Q55540q5721l5919J48624l40290m22254K20381J03452N64237
$$ plain form
1813 100250 293931 299718 519424 116303 95037 484376 -418686 -553889 -175162 -647879
1803 -647879 -422392 -433788 -665335 -551413 -123022 -28598 -204960 -176278 -51932 -81840
1793 -81840 511399 253974 -324088 -365835 -983694 -398113 -373058 -471242 34003 -601043
$$ packed form
1813A00250J93681N787K19706m03121k1266L89339r03062j35203L78727m72717
1803f47879K25487j1396k31547J13922M28391R4424j76362K8682J24346k9908
1793h1840N93239k57425n78062m1747o17859N85581K5055r8184N05245o35046
$$ [...]
##END NTUPLES=NMR SPECTRUM
##END=
