##TITLE=1H_TG-2409-3
 200.13Hz,CDCl3.
 8 sc
 15.6.2026
##JCAMPDX= 6.0         $$ Bruker NMR JCAMP-DX V2.0
##DATA TYPE= NMR SPECTRUM
##DATA CLASS= NTUPLES
##ORIGIN= UXNMR, Bruker Analytische Messtechnik GmbH
##OWNER= pz
$$ XWIN-NMR		Version 3.5
$$ Mon Jun 15 13:50:24 2026 Russian Standard Time (UT+4h)  she@DPX200
##.OBSERVE FREQUENCY= 200.131
##.OBSERVE NUCLEUS= ^1H
##.ACQUISITION MODE= SIMULTANEOUS
##.ACQUISITION SCHEME= undefined
##.AVERAGES= 8
##.DIGITISER RES= 18
##SPECTROMETER/DATA SYSTEM= spect
##.PULSE SEQUENCE= zg30
##.SOLVENT NAME= CDCl3
##.SHIFT REFERENCE= (INTERNAL, CDCl3, 0, 13.9994)
##AUDIT TRAIL= $$ (NUMBER, WHEN, WHO, WHERE, WHAT)
$$ ##TITLE= Audit trail, XWIN-NMR		Version 3.5
$$ ##JCAMPDX= 5.01
$$ ##ORIGIN= Bruker BioSpin GmbH
$$ ##OWNER= she
$$ F:/spectra/data/she/nmr/H-C/1/pdata/1/auditp.txt
$$ ##AUDIT TRAIL=  $$ (NUMBER, WHEN, WHO, WHERE, WHAT)
(   1,<2026-06-15 13:48:51.75 +0400>,<she>,<DPX200>,
      <created by zg, POWCHK disabled, PULCHK disabled
       configuration hash MD5:
       00 E9 B6 7A A2 85 ED C7 34 08 36 98 17 FE 4E 26
       data hash MD5: 16K
       34 50 E1 89 32 93 6F FF E5 42 84 D1 DE 85 14 F6>)
(   2,<2026-06-15 13:48:54.26 +0400>,<she>,<DPX200>,
      <Start of raw data processing
       efp BC_mod = 2 LB = 0.25 FT_mod = 6 PKNL = 1 PHC0 = -4296.451 PHC1 = 6.992293 SI = 16K 
       data hash MD5: 16K
       25 65 8E 09 0E FA 8D 8B 50 DD 62 06 B7 5F 60 FB>)
(   3,<2026-06-15 13:49:27.35 +0400>,<she>,<DPX200>,
      <pk PHC0 = 83.15589 PHC1 = -3.4 
       data hash MD5: 16K
       7B 03 65 E1 8C E3 8E 5C F9 48 85 96 CA 08 15 63>)
(   4,<2026-06-15 13:49:31.54 +0400>,<she>,<DPX200>,
      <abs ABSG = 5 
       data hash MD5: 16K
       6A DE AC B7 8B 8B 1D 4F 8E 3C E7 F1 BF A2 FC C5>)
$$ ##END=
$$ 
$$ hash MD5
$$ 27 5F C9 4A 52 A9 27 59 04 94 CD 84 0B CD 43 67
##$RELAX= 
##$RELAX= 
##$RELAX= 
##$RELAX= 
##$RELAX= 
##$RELAX= 
$$ Bruker specific parameters
$$ --------------------------
##$DU= <F:/spectra>
##$EXPNO= 1
##$NAME= <H-C>
##$PROCNO= 1
##$TYPE= <nmr>
##$USER= <she>
##$AMP= (0..31)
100 100 100 100 100 100 100 100 100 100 100 100 100 100 100 100 100 100 
100 100 100 100 100 100 100 100 100 100 100 100 100 100 
##$AQSEQ= 0
##$AQ_mod= 1
##$AUNM= <au_zg>
##$AUTOPOS= <>
##$BF1= 200.13
##$BF2= 200.13
##$BF3= 200.13
##$BF4= 200.13
##$BF5= 200.13
##$BF6= 200.13
##$BF7= 200.13
##$BF8= 200.13
##$BYTORDA= 1
##$CFDGTYP= 0
##$CFRGTYP= 5
##$CHEMSTR= <none>
##$CNST= (0..31)
1 1 145 1 1 1 1 1 1 1 1 1 1 1 1 1 1 1 1 1 1 1 1 1 1 1 1 1 1 1 1 1 
##$CPDPRG= <>
##$CPDPRG1= <>
##$CPDPRG2= <>
##$CPDPRG3= <>
##$CPDPRG4= <mlev>
##$CPDPRG5= <mlev>
##$CPDPRG6= <mlev>
##$CPDPRG7= <mlev>
##$CPDPRG8= <mlev>
##$CPDPRGB= <>
##$CPDPRGT= <>
##$D= (0..31)
0 0.7 0 0 0 0 0 0 0 0 0 0.03 0 0 0 0 0 0 0 0 0 0 0 0 0 0 0 0 0 0 0 0 
##$DATE= 1781516931
##$DBL= (0..7)
120 120 120 120 120 120 120 120 
##$DBP= (0..7)
150 150 150 150 150 150 150 150 
##$DBP07= 0
##$DBPNAM0= <>
##$DBPNAM1= <>
##$DBPNAM2= <>
##$DBPNAM3= <>
##$DBPNAM4= <>
##$DBPNAM5= <>
$$ [...]
##$SUBNAM3= <"">
##$SUBNAM4= <"">
##$SUBNAM5= <"">
##$SUBNAM6= <"">
##$SUBNAM7= <"">
##$SUBNAM8= <"">
##$SUBNAM9= <"">
##$SW= 18.0517599122864
##$SWIBOX= (0..15)
0 0 2 0 0 0 0 0 0 0 0 0 0 0 0 0 
##$SW_h= 3612.71676300578
##$TD= 16384
##$TD0= 1
##$TE= 0
##$TE2= 300
##$TE3= 300
##$TEG= 300
##$TL= (0..7)
0 120 120 120 120 120 120 120 
##$TP= (0..7)
150 150 150 150 150 150 150 150 
##$TP07= 0
##$TPNAME0= <>
##$TPNAME1= <>
##$TPNAME2= <>
##$TPNAME3= <>
##$TPNAME4= <>
##$TPNAME5= <>
##$TPNAME6= <>
##$TPNAME7= <>
##$TPOAL= (0..7)
0.5 0.5 0.5 0.5 0.5 0.5 0.5 0.5 
##$TPOFFS= (0..7)
0 0 0 0 0 0 0 0 
##$TUNHIN= 0
##$TUNHOUT= 0
##$TUNXOUT= 0
##$USERA1= <user>
##$USERA2= <user>
##$USERA3= <user>
##$USERA4= <user>
##$USERA5= <user>
##$V9= 5
##$VALIST= <valist>
##$VCLIST= <CCCCCCCCCCCCCCC>
##$VD= 0
##$VDLIST= <DDDDDDDDDDDDDDD>
##$VPLIST= <PPPPPPPPPPPPPPP>
##$VTLIST= <TTTTTTTTTTTTTTT>
##$WBST= 1024
##$WBSW= 4
##$XGAIN= (0..3)
0 0 0 0 
##$XL= 0
##$YL= 0
##$YMAX_a= 557010
##$YMIN_a= -398215
##$ZGOPTNS= <>
##$ZL1= 120
##$ZL2= 120
##$ZL3= 120
##$ZL4= 120
##$ABSF1= 14.14048
##$ABSF2= -3.911373
##$ABSG= 5
##$ABSL= 3
##$ALPHA= 0
##$AQORDER= 0
##$ASSFAC= 0
##$ASSFACI= 0
##$ASSFACX= 0
##$ASSWID= 0
##$AUNMP= <proc_1d>
##$AZFE= 0.1
##$AZFW= 0.1
##$BCFW= 0
##$BC_mod= 2
##$BYTORDP= 0
##$COROFFS= 0
##$CY= -3
##$DATMOD= 1
##$DC= 0
##$DFILT= <>
##$DTYPP= 0
##$F1P= 0
##$F2P= 0
##$FCOR= 1
##$FTSIZE= 16384
##$FT_mod= 6
##$GAMMA= 0
##$GB= 0
##$INTBC= 1
##$INTSCL= 3.241238e-09
##$ISEN= 128
##$LB= 0.25
##$LEV0= 0
##$LPBIN= 0
##$MAXI= 10000
##$MC2= 0
##$MEAN= 0
##$ME_mod= 0
##$MI= 1.114404
##$NCOEF= 0
##$NC_proc= -6
##$NLEV= 6
##$NOISF1= 3.799351
##$NOISF2= 2.8
##$NSP= 0
##$NTH_PI= 0
##$NZP= 0
##$OFFSET= 13.99944
##$PC= 1
##$PHC0= -4213.295
##$PHC1= 3.592293
##$PH_mod= 1
##$PKNL= yes
##$PPARMOD= 0
##$PSCAL= 0
##$PSIGN= 0
##$REVERSE= no
##$SF= 200.130004651697
##$SI= 16384
##$SIGF1= 3
##$SIGF2= 2
##$SINO= 0.751879
##$SIOLD= 32768
##$SREGLST= <19F.Aceton>
##$SSB= 0
##$STSI= 16384
##$STSR= 0
##$SW_p= 3612.71676300579
##$SYMM= 0
##$S_DEV= 0
##$TDeff= 16384
##$TDoff= 0
##$TI= <>
##$TILT= no
##$TM1= 0
##$TM2= 0
##$TOPLEV= 0
##$USERP1= <user>
##$USERP2= <user>
##$USERP3= <user>
##$USERP4= <user>
##$USERP5= <user>
##$WDW= 1
##$XDIM= 16384
##$YMAX_p= 479406276
##$YMIN_p= -565449
$$ End of Bruker specific parameters
$$ ---------------------------------
##NTUPLES= NMR SPECTRUM
##VAR_NAME=  FREQUENCY,     SPECTRUM/REAL,   SPECTRUM/IMAG
##SYMBOL=    X,             R,               I
##VAR_TYPE=  INDEPENDENT,   DEPENDENT,       DEPENDENT
##VAR_FORM=  AFFN,          ASDF,            ASDF
##VAR_DIM=   16384,         16384,           16384
##UNITS=     HZ,            ARBITRARY UNITS, ARBITRARY UNITS
##FACTOR=    0.220516191357248, 1,           1
##FIRST=     2801.70803098152, 0,            0
##LAST=      -811.00873202427, 0,            0
##MIN=       -811.00873202427, -565449,      0
##MAX=       2801.70803098152, 479406276,    0
$$ Real data points
##PAGE= N=1
##DATA TABLE= (X++(R..R)), XYDATA
$$ [...]
7430E960780l16165k38765j12249J34916R6541J09629k0451q9628k24159J4370
7420E314819L10924M4466N1023L7475l03803j37016L6685j8695L2049l39462k10967
7409D817498p4440k7874M4268j42081k06618k4936J1332K44100J53029j31812
7399D662466L9633L8177O3800P9184R4977P0987q5394j43232j00980K2490K14043
7388D956151M1980j80613m6162N7417l7304p5925n1603q3152j05278k0453Q1601
7377D536659o4556N7945j0539K8599J8843J33593R4069o4880l4967q0661J01289
7366D715394J80036J53099n0315O2726n5099N6009J66849J9940L6089l6141L368
7355E251955J10221J66143n9914p4032n6101N5738J25066J91704j5178j75387
$$ plain form
7430 5960780 5644615 5405850 5293601 5428517 5525058 5634687 5614236 5524608 5300449 5314819
7420 5314819 5625743 5670209 5721232 5758707 5454904 5317888 5354573 5335878 5367927 5028465 4817498
7409 4817498 4743058 4715184 4759452 4617371 4410753 4385817 4397149 4641249 4794278 4662466
7399 4662466 4702099 4740276 4804076 4883260 4978237 5049224 4963830 4820598 4719618 4742108 4956151
7388 4956151 4998131 4817518 4771356 4828773 4791469 4715544 4663941 4580789 4475511 4455058 4536659
7377 4536659 4472103 4530048 4519509 4548108 4566951 4700544 4794613 4729733 4694766 4614105 4715394
7366 4715394 4895430 5048529 4998214 5060940 5005841 5061850 5228699 5248639 5284728 5248587 5251955
7355 5251955 5362176 5528319 5468405 5394373 5338272 5394010 5519076 5710780 5695602 5520215
7345E520215J44824J08570J13826K28817n6920J88005J12370K57270R5612J9415
7335F732004K19130R9234L05907L36610J88648M90285K19397K92773M25478L93587
7325I703053J67446K02263j9535K24873N3945j06808J11304J83897K7340K01100
7315A0748878M42063M36288M41403L78426P43891N53670P14661N72994L89565
7306A5421839K21972K32377J33705K00994L5867J13543L82040L39030M25003N41107
7296A8047477P63001O39526N21049N00719L03684L48558J45883m6948j42266K3028
7286B1103711J35306p288J52104L86797N19529N98269N65652P61282P16001O51791
7276B5583154L47734M35371K94231j79579n1504j63321l55785m55719j96527R0798
$$ plain form
7345 5520215 5665039 5773609 5887435 6116252 6059332 6247337 6359707 6616977 6712589 6732004
7335 6732004 6951134 7050368 7356275 7692885 7881533 8371818 8591215 8883988 9309466 9703053
7325 9703053 9870499 10072762 10053227 10278100 10332045 10225237 10336541 10520438 10547778 10748878
7315 10748878 11190941 11627229 12068632 12447058 13190949 13744619 14459280 15032274 15421839
7306 15421839 15643811 15876188 16009893 16210887 16246754 16360297 16742337 17081367 17506370 18047477
7296 18047477 18810478 19450004 19971053 20471772 20775456 21124014 21269897 21222949 21080683 21103711
7286 21103711 21239017 21231729 21383833 21770630 22290159 22888428 23454080 24215362 24931363 25583154
7276 25583154 25930888 26366259 26660490 26480911 26429407 26266086 25910301 25454582 25258055 25348853
7266B5348853K26508L30153M19593M59404L95693N23933L70485K23953J00644
7257B8399219r836k71309l2663J05756k17365p1432O6965J48425K86048L26466
7247B8730274N54359N23250M96539M02259K16864J06468R883j10189k0184p396
7237C0902127K30822K59540J09631L86896M21037M91407P50482P59581R11847
7228C5223370P90002Q74496Q38865R46632P91198P29323O02405O71809P35926
7219D2204026P91584O85894Q56929J029526J095434J007055R44235J153256J271691
7210E1039630J387461J273178J123954J169068J284101J231182J272736J097842
7202F0879152J163706J039434J178604Q96285J011379R62029O49862P95339Q01076
$$ plain form
7266 25348853 25575361 25905514 26325107 26784511 27180204 27704137 28074622 28298575 28399219
7257 28399219 28389383 28118074 28085411 28191167 27973802 27902370 27969335 28117760 28403808 28730274
7247 28730274 29284633 29807883 30304422 30706681 30923545 31030013 31039896 30929707 30909523 30902127
7237 30902127 31132949 31392489 31502120 31889016 32310053 32801460 33551942 34311523 35223370
7228 35223370 36013372 36887868 37726733 38673365 39464563 40193886 40796291 41468100 42204026
7219 42204026 42995610 43681504 44538433 45567959 46663393 47670448 48614683 49767939 51039630
7210 51039630 52427091 53700269 54824223 55993291 57277392 58508574 59781310 60879152
7202 60879152 62042858 63082292 64260896 65157181 66168560 67130589 67780451 68575790 69376866
7193F9376866J90370L56335J92215J0528Q9599j9098O014m47320l89001o28465
7183F8738043o42402n38231p79636p08148p45023r02212j259467j042905j043854
7174F1076165j197809j130879j243131j062078j179188j290728j008605j277700
7166E1686047j108035j083305j227748j207277j098986j183014j056309j089985
7158D2631388j051104j080791r61235r79663r61263q45742r01605q68939r95607
7149C3985439q75320q02000p23812o33451p17259q06889p47335p01599o46288
7140B7331486o03385p18195m53533o16515o17874m61605n83098m54838n88171
7131B2234272n18320k46335n51959n12527m22590m93140l68770l28542l38813
$$ plain form
7193 69376866 69567236 69923571 70115786 70126314 70215913 70196815 70202829 69755509 69366508 68738043
7183 68738043 68095641 67557410 66777774 66069626 65324603 64422391 63162924 62120019 61076165
7174 61076165 59878356 58747477 57504346 56442268 55263080 53972352 52963747 51686047
7166 51686047 50578012 49494707 48266959 47059682 45960696 44777682 43721373 42631388
7158 42631388 41580284 40499493 39538258 38558595 37597332 36751590 35849985 34981046 33985439
7149 33985439 33110119 32308119 31584307 30950856 30233597 29426708 28679373 27977774 27331486
7140 27331486 26728101 26009906 25556373 24939858 24321984 23860379 23277281 22822443 22234272
7131 22234272 21715952 21469617 20917658 20405131 19982541 19489401 19120631 18792089 18453276
7122A8453276j96925m99310l49921j89167l13808k41831m49880l48206l30569
7113A5533659j21905j49258l89870l93961l77244l91043j31950j03663n9023k63754
7103A3151988l83321j04737M9489j74361j25159k28036k66662o7688k66091l3721
7093A1551701k02927m75378p8466p7380o0606j31975r9595k00728k48725j13040
7083I862881j16357l671o832j80577j69139k80360L3763J29650p3540j21599L8180
7072I112399k6525K39771K14651P6762j13176j90030j07513j10135k81264l09355
7062H505585l74167j88160k01274k08772J10544j71068k07613j31050k28951J31565
7052G036639J1067k66409k1106j62643n0249P5689j53965l8869L1435r691P4061
$$ plain form
7122 18453276 18256351 17757041 17407120 17217953 16904145 16662314 16212434 15864228 15533659
7113 15533659 15411754 15262496 14872626 14478665 14101421 13710378 13578428 13474765 13415742 13151988
7103 13151988 12768667 12663930 12713419 12539058 12413899 12185863 11919201 11851513 11585422 11551701
7093 11551701 11348774 10873396 10794930 10717550 10656944 10524969 10425374 10224646 9975921 9862881
7083 9862881 9746524 9742853 9736021 9555444 9386305 9105945 9139708 9269358 9195818 9074219 9112399
7072 9112399 9085874 9325645 9540296 9617058 9503882 9313852 9206339 9096204 8814940 8505585
7062 8505585 8131418 7943258 7741984 7533212 7643756 7472688 7265075 7134025 6905074 7036639
7052 7036639 7047706 6781297 6760191 6597548 6547299 6622988 6469023 6430154 6461589 6451898 6525959
7041F525959j42629J81852O5030P8522K01047k8931j14131j92955l55913k21393
7031E996458j21645n9680j02144k29535j61743k8756J5714j31238j68763j34145
7021D874523j5838k2911m5228J1933K1445p3097K8867n3597l3563m38j03784o0343
7009D527969K3316J09256j6043Q1542q2473j08322R0796l6770m7766j66492j77637
6998D197376k5121n8155M7885j6261o2068q2027k6042J28131r7429n2563J2598
6987C966324p1057k2654o4576l0316k3075o4815r7713N8818j66386M9724j8927
6976C515347k20782J34395l7409p5087o221j11892r6321j77865n7549J40331p1160
6965B935787p8889l8813q2310j2484Q64J41174K3529j25476p1423p4427J66137
$$ plain form
7041 6525959 6383330 6565182 6630212 6708734 6909781 6880850 6766719 6573764 6217851 5996458
7031 5996458 5874813 5815133 5712989 5483454 5321711 5292955 5308669 5177431 5008668 4874523
7021 4874523 4858685 4835774 4790546 4802479 4823924 4750827 4779694 4726097 4692534 4692096 4588312 4527969
7009 4527969 4551285 4660541 4644498 4726040 4643567 4535245 4626041 4589271 4541505 4375013 4197376
6998 4197376 4172255 4114100 4161985 4145724 4083656 4001629 3975587 4103718 4006289 3953726 3966324
6987 3966324 3895267 3872613 3808037 3777721 3754646 3689831 3592118 3650936 3484550 3534274 3515347
6976 3515347 3294565 3428960 3391551 3316464 3310243 3198351 3102030 2924165 2866616 3006947 2935787
6965 2935787 2856898 2818085 2735775 2723291 2724155 2865329 2888858 2763382 2691959 2617532 2783669
6954B783669J46497r9444k9876j35224j6930J25112K5198Q888M108q7970k8725
6943B695303j1430R9858j37955o2520J77422J7240O9498j10561j09772j03078
6933B524005j5082Q860k1797j20735m359j57846K4570K27830M4907j59464k66897
6922B083992R1010J44182r3630j59975k5052j2229O2269J03446R9619j22158l67011
6911A804463P4812K01874J1156K10621k27269o8479M8503j43627J23222o4835
6901A970441j90865k734n2996J4390R8037o2645q5517j810j76869K29040q6576
6890A651896j43192M9435k223N3061m6964l2600l6618p8508K1171K62149l7809
6879A659798Q6321k339q5434r455J55102N9512j64475P457j33641j37076J17071
$$ plain form
6954 2783669 2930166 2830722 2800846 2665622 2648692 2773804 2799002 2807890 2811998 2724028 2695303
6943 2695303 2683873 2783731 2645776 2583256 2760678 2777918 2847416 2736855 2627083 2524005
6933 2524005 2508923 2517783 2495986 2375251 2370892 2213046 2237616 2465446 2510353 2350889 2083992
6922 2083992 2175002 2319184 2225554 2065579 2040527 2028298 2090567 2194013 2293632 2171474 1804463
6911 1804463 1879275 2081149 2092305 2302926 2075657 2007178 2055681 1912054 2035276 1970441
6901 1970441 1779576 1776842 1723846 1738236 1836273 1773628 1688111 1686301 1509432 1738472 1651896
6890 1651896 1508704 1558139 1555916 1608977 1562013 1529413 1492795 1414287 1435458 1697607 1659798
6879 1659798 1746119 1743780 1658346 1648891 1803993 1863505 1699030 1706487 1572846 1435770 1552841
6868A552841J05139O6755o7096K9453j06355n4480l9089m2747Q279k0292L8556
6857A470964K08118L5075j10328o0647n1006M4625K21454p1347k02770l7845o0291
6846A386002q603K9892O8682N5985j13124q9129j04636j32319J38632J61654J97
6835A393233j60911j83457J05643K95245L6340j55167q3880J35040o292M3381
6825A419175L7882k10804N9713L8562n9328J92j46639m7239O720k5836J04526
6814A176924J43577M0426p9475J04474k60304q9337K05601k3942L7911J1545m625
6803A262775O038o7421J51556o1973k16984J13022J84557O1937K9822j08543o2105
6792A292681m6108j2230J41395N6361j49236j11365P6210K9447M7304J9539p7296
$$ plain form
6868 1552841 1657980 1724735 1657639 1687092 1580737 1526257 1487168 1444421 1452700 1432408 1470964
6857 1470964 1679082 1714157 1603829 1543182 1492176 1536801 1758255 1686908 1484138 1446293 1386002
6846 1386002 1377399 1407291 1475973 1531958 1418834 1329705 1225069 1092750 1231382 1393036 1393233
6835 1393233 1232322 1048865 1154508 1449753 1486093 1330926 1247046 1382086 1375794 1419175
6825 1419175 1457057 1246253 1305966 1344528 1285200 1285392 1138753 1091514 1098234 1072398 1176924
6814 1176924 1320501 1360927 1281452 1385926 1125622 1036285 1241886 1217944 1255855 1267400 1262775
6803 1262775 1268813 1201392 1352948 1290975 1073991 1187013 1371570 1433507 1463329 1354786 1292681
6792 1292681 1246573 1234343 1375738 1432099 1282863 1171498 1247708 1277155 1324459 1343998 1266702
6781A266702n5944K7888k8752J85826J48627J80033j90059r918o8271o9199P0832
6770A457765P2255J47446J11553j30514m9474k06115q0414R9764q8337j04237
6760A229692J10887K12618k4372j95917n3371m4596k3576J54988q1994J23155
6750A407514j3003j42967m9760Q8026O8456J23475O2376j60173o1222J85483O0682
6739A568887J64702J39881l8454J6881k0535j28100r3115O9093j18880O9766m6121
6728A584005J8498Q4958k09924q7323J59833k3891J01672J02468j03011j6603
6718A610682j6787N5781m6739Q973r031J15834J13128o0562J2808N2453K3428
6707A859968n5697j15970O4386k5950P5684o3122L8064M4721l1729Q0434L6279
$$ plain form
6781 1266702 1210758 1238646 1209894 1395720 1544347 1724380 1534321 1524403 1456132 1386933 1457765
6770 1457765 1530020 1677466 1789019 1658505 1609031 1402916 1322502 1422266 1333929 1229692
6760 1229692 1340579 1553197 1528825 1332908 1279537 1234941 1211365 1366353 1284359 1407514
6750 1407514 1394511 1251544 1201784 1289810 1358266 1481741 1544117 1383944 1322722 1508205 1568887
6739 1568887 1733589 1873470 1835016 1851897 1831362 1703262 1610147 1679240 1560360 1630126 1584005
6728 1584005 1602503 1687461 1477537 1390214 1550047 1526156 1627828 1730296 1627285 1610682
6718 1610682 1593895 1649676 1602937 1611910 1602879 1718713 1831841 1771279 1784087 1836540 1859968
6707 1859968 1804271 1688301 1752687 1726737 1802421 1739299 1777363 1822084 1790355 1870789 1907068
6696A907068J12255J15856k23106j65201p8811R826J24307p7507J19643J27756
6686A972086j26185K972P5614o6578q7536j67591L7719J26473O176r8132R322
6675A684340k0216j38909M5247R803R0036m0323L6877N2198j61021J82519j6881
6664A723670m1972k7776K7290J23864j19690j60882J30534q1387p3592J33525
6654A633584n1161j60992J5745K0852M0227L6856P0298K21513r4222J03055j04269
6643A731486j65267Q2653k0569j444L2356j33539Q9512K7263r3393R4099J20879
6632A764036P2772N7878K4377J13233L8911j47197P1528N1599o4164J43391N204
6621B131568j57526k0921j33428O5922K45512J43542O003m7181K3445P5036Q6525
$$ plain form
6696 1907068 2019323 2135179 1912073 1746872 1668061 1677887 1802194 1724687 1844330 1972086
6686 1972086 1845901 1848873 1924487 1857909 1770373 1602782 1640501 1766974 1773150 1675018 1684340
6675 1684340 1664124 1525215 1570462 1580265 1670301 1629978 1666855 1719053 1558032 1740551 1723670
6664 1723670 1681698 1653922 1681212 1805076 1685386 1524504 1655038 1573651 1500059 1633584
6654 1633584 1582423 1421431 1437176 1458028 1498255 1535111 1605409 1826922 1732700 1835755 1731486
6643 1731486 1566219 1648872 1628303 1626859 1659215 1525676 1615188 1642451 1549058 1643157 1764036
6632 1764036 1836808 1894686 1919063 2032296 2071207 1924010 1995538 2047137 1982973 2126364 2131568
6621 2131568 1974042 1953121 1819693 1885615 2131127 2274669 2280672 2233491 2256936 2331972 2418497
6610B418497O7731j0146N7721j9946Q7460J53561J55250N0140J64041J91137J75590
6599C491036K32686K04319J54071J12624l8683k3179j11778j00633P2275o8618
6589C924120k62649J8180r3142J1442O8610n4240R0173O5924L26989K65120J5422
6578D375949m5923J53118j00033J4029j9224k29745r8066n9438k4317J05199J6740
6567D088289J62076p911O5129K67335K22160K18080J49188J75985K72537K73844
6557E886712L01478K69686J14654J25805K62957K92743K37149q2874J94138L15149
6547G917597K74760M56402M35688L02710L52564K77706K35176J42260j37435j45177
6537A0112251q6934q4658k87999k25076j61873K1767j10891r6880m3770J45343
$$ plain form
6610 2418497 2486228 2476082 2533803 2513857 2601317 2754878 2910128 2960268 3124309 3315446 3491036
6599 3491036 3723722 3928041 4082112 4194736 4156053 4132874 4021096 3920463 3992738 3924120
6589 3924120 3661471 3679651 3586509 3597951 3666561 3612321 3702494 3768418 4095407 4360527 4375949
6578 4375949 4330026 4483144 4383111 4397140 4377916 4148171 4050105 3990667 3966350 4071549 4088289
6567 4088289 4250365 4242454 4307583 4574918 4797078 5015158 5164346 5340331 5612868 5886712
6557 5886712 6188190 6457876 6572530 6698335 6961292 7254035 7491184 7408310 7602448 7917597
6547 7917597 8192357 8648759 9084447 9387157 9739721 10017427 10252603 10394863 10257428 10112251
6537 10112251 10025317 9940659 9652660 9427584 9265711 9287478 9176587 9079707 9035937 9181280
6527I181280L3069J13220K77353J76023K38682P0532J33674j1191j03221M8622
6517A0158043j89609k28595j42251k43807j37639j32114j4065L8143K1380o3782
6507I065704j24066J20488k7043J11912J7302K9258n6213L8818J18529J0361J60942
6496I465992k7437m6557j34621k0367j75537M7526o9707L7099k5879p535n6373
6485H986604q9354K5346K6354q6469M879j89562k83140N6046j3656K04673j13091
6474H528630p0515j89485Q1493J95467J61214K63483M12548L29602L91057M97642
6464A0601136P29119M91307N30953L91395J98533R6678j45117j91512j9945j13086
6454A2569461q3086J74774N4384J34714J32440K51272K52634K75016K95519K70876
$$ plain form
6527 9181280 9214349 9327569 9604922 9780945 10019627 10090159 10223833 10212642 10109421 10158043
6517 10158043 9968434 9739839 9597588 9353781 9216142 9084028 9069963 9108106 9129486 9065704
6507 9065704 8941638 9062126 9035083 9146995 9164297 9193555 9137342 9176160 9294689 9305050 9465992
6496 9465992 9438555 9391998 9257377 9237010 9061473 9108999 9039292 9076391 9050512 9042977 8986604
6485 8986604 8897250 8922596 8948950 8862481 8867360 8677798 8394658 8450704 8437048 8641721 8528630
6474 8528630 8458115 8268630 8350123 8545590 8706804 8970287 9382835 9712437 10103494 10601136
6464 10601136 11330255 11821562 12352515 12743910 12942443 13039121 12894004 12702492 12682547 12569461
6454 12569461 12486375 12661149 12715533 12850247 12982687 13233959 13486593 13761609 14057128 14328004
6444A4328004J189k42121l85441n00405n66011n97553n08203o74336o11979o07687
6434I635457n31639k76647k91108k8329m5643R5196J05100k1877J9179R0602K30373
6423H980664m0926Q0878M8759k62342k91898m92183k17252J3543j76608k30951
6413G411684p9069j153j56761m7915K01906J28264K22684M17000J86374k11060
6403H071954r8928k98852k6252j83372k08490p507k5454O7180l7169j74703K56864
6392G335271K94160Q9652J80753K90043P3552J3072q0515j65827p4436l96122
6382G559603j44615k51148l39528k44680j20697k4768J7417q8266N220p0772n3908
6371F243858J65019J45090J67179J66894K19068J01972J72009K81769M79084M42863
$$ plain form
6444 14328004 14329193 14087072 13701631 13201226 12635215 12037662 11529459 10855123 10243144 9635457
6434 9635457 9103818 8827171 8536063 8507734 8462091 8557287 8662387 8640510 8659689 8750291 8980664
6423 8980664 8939738 9020616 9069375 8807033 8515135 8022952 7805700 7819243 7642635 7411684
6413 7411684 7332615 7331462 7174701 7126786 7328692 7456956 7679640 8096640 8283014 8071954
6403 8071954 7973026 7674174 7647922 7464550 7256060 7248553 7223099 7290279 7253110 7078407 7335271
6392 7335271 7629431 7719083 7899836 8189879 8263431 8276503 8195988 8030161 7955725 7559603
6382 7559603 7414988 7163840 6824312 6579632 6458935 6434167 6451584 6363318 6368538 6297766 6243858
6371 6243858 6408877 6553967 6721146 6888040 7107108 7209080 7381089 7662858 8141942 8584805
6361H584805Q91315J048628J056787J339646J487922J289268J142857O48414K57333
6352A7746975o2169n41084m53609p02681o62940l18168j14708Q1298K96777K72290
6342A5541981P50592J035454J212441R08257K61054j279l89630q33160p86833
6333A7698877j030429j082512q56399q61414n99367m75858l14323k4165K05223
6324A2659633L24369M46103K45133M662K61647j54583Q4408K59453n2085M8345
6314A4127085J96779K9329K87099N20177O94664J048355R25955J275438J402715
6305B0507596J769637K365804K447928K632076K756930K423731J845199J096043
6297C7844944K97335j73551q52424j129346j089718j054814q07607n98903l56755
$$ plain form
6361 8584805 9476120 10524748 11581535 12921181 14409103 15698371 16841228 17489642 17746975
6352 17746975 17684806 17143722 16690113 15987432 15324492 15006324 14891616 14972914 15269691 15541981
6342 15541981 16292573 17328027 18540468 19448725 19709779 19708500 19318870 18485710 17698877
6333 17698877 16668448 15585936 14729537 13868123 13268756 12792898 12478575 12454410 12659633
6324 12659633 12984002 13430105 13675238 13679900 13941547 13786964 13871372 14130825 14078740 14127085
6314 14127085 14323864 14353193 14640292 15160469 15855133 16903488 17829443 19104881 20507596
6305 20507596 22277233 24643037 27090965 29723041 32479971 34903702 36748901 37844944
6297 37844944 38142279 37968728 37116304 35986958 34897240 33842426 33034819 32435916 32079161
6288C2079161K56229N77211P81021R82854M50339K40878k86345n99088m65419
6279C4016841o94558q42320q43105j337413j417117j524317j754288j414461j277983
6270B2911279j107356r40034q98767n44662o16007o61573n86613p70417m87270
6261A6298580p10280p72468m63016m26485m59876l09313j60577M5318J07676K39337
6251A3388896M06891P32438P92921J287413J829186K068542K319977K111474K048979
6242B6986717J278659O05462j89014r31937j134046j349316j485740j185077j128509
6233B1467199j063723p95887n58327j98705L63705P51809R80672J390945J623960
6224B3961648J735554J115039N62671m1768q20434j137387j492531j573528j701772
$$ plain form
6288 32079161 32335390 32912601 33693622 34676476 35126815 35367693 35081348 34482260 34016841
6279 34016841 33322283 32479963 31636858 30299445 28882328 27358011 25603723 24189262 22911279
6270 22911279 21803923 20863889 19965122 19420460 18804453 18142880 17556267 16785850 16298580
6261 16298580 15588300 14815832 14352816 13926331 13466455 13157142 12996565 13041883 13149559 13388896
6251 13388896 13795787 14528225 15321146 16608559 18437745 20506287 22826264 24937738 26986717
6242 26986717 28265376 28870838 28681824 27749887 26615841 25266525 23780785 22595708 21467199
6233 21467199 20403476 19607589 19049262 18850557 19214262 19966071 20946743 22337688 23961648
6224 23961648 25697202 26812241 27374912 27333144 26512710 25375323 23882792 22309264 20607492
6215B0607492j677118j573157r61162q43430o21116l23773k89021j22685J51776
6206A4347806L10617O36969N00249O56198M60407K60832J92561N7299r4004j49685
6196A7179249P1193J33549M21484L25919Q30155R07914Q81503J207572R70314
6187B2928852Q94857N21715L22517K75939j95342m1984k06670k75237j50797q2798
6177B3991052r2291n4486j60188p8612j69529J27620o5094J20257J84741M24707
6167B4228177O59148O54737Q93953Q72725R80039J049887P93131P00459M84928
6158C1317184M22714L29655K87772M43475O30514R29214R91565J212286J479614
6149C8043993J813140J974811K101513J922071J569253P03432L8632q92398j752043
$$ plain form
6215 20607492 18930374 17357217 16396055 15552625 14931509 14607736 14318715 14196030 14347806
6206 14347806 14658423 15295392 15795641 16451839 16912246 17173078 17365639 17422938 17328934 17179249
6196 17179249 17250442 17383991 17805475 18131394 18961549 19869463 20750966 21958538 22928852
6187 22928852 23823709 24345424 24667941 24943880 24748538 24706554 24499884 24224647 24073850 23991052
6177 23991052 23898761 23844275 23684087 23605475 23435946 23563566 23498472 23618729 23803470 24228177
6167 24228177 24887325 25542062 26436015 27308740 28288779 29338666 30131797 30832256 31317184
6158 31317184 31739898 32069553 32357325 32800800 33431314 34360528 35352093 36564379 38043993
6149 38043993 39857133 41831944 43933457 45855528 47424781 48128213 48166845 47274447 45522404
6140D5522404k003665k056837k192546k137232j696299j302903j028356r12723
6132C2191843o39928j69091K62696L27172R25164Q66408R66215J320457J362885
6123C7413821J963107K252092K409021K794276K711425K443556J846557J204206
6115E5038061L58611o25926j358342j999339k507491k717123k537111k341737
6107D1309603j744184j423678j227076q96762r18532p59547n88678q69491p76844
6098C2104811n99837l22592N0824L47289O54555J104771J486551J930157K069013
6089C8825542K052310J870844J860730J398016P82241K83116l08261r51297j104248
6080D4708993j491361j519501j587311j407977j038227o71388l16765J07322K44778
$$ plain form
6140 45522404 43518739 41461902 39269356 37132124 35435825 34132922 33104566 32191843
6132 32191843 31551915 31382824 31645520 31972692 32897856 33764264 34730479 36050936 37413821
6123 37413821 39376928 41629020 44038041 46832317 49543742 51987298 53833855 55038061
6115 55038061 55396672 54770746 53412404 51413065 48905574 46188451 43651340 41309603
6107 41309603 39565419 38141741 36914665 36017903 35099371 34339824 33751146 32881655 32104811
6098 32104811 31504974 31182382 31233206 31580495 32235050 33339821 34826372 36756529 38825542
6089 38825542 40877852 42748696 44609426 46007442 46789683 47072799 46764538 45813241 44708993
6080 44708993 43217632 41698131 40110820 38702843 37664616 36993228 36676463 36783785 37028563
6071C7028563L94883O34236Q01782R96426O73706O46351N02757M43883J64478
6062D2287065q6789m83727j093296j689665j867195j885567k080085j955872j942814
6053B9202055j514279r35025p84728n00084l92423l30363o6097j83196l50948
6044B4144912m45233n91566r22049r09546p64646n47015p01931o19762k02785
6035A8440379r4421L68462O21166Q95655P37407K17768j99499l58054p05347j246461
6025A8677055j403054j451405j243438r90027j029116q67447o43785o12238m67589
6016I968956l37347l78187k56934l23208j29315k88258j11798j10056l20054j50109
6006G563690l688m53716j01353j43524k66770p413j12251j43847M0010p6039n7575
$$ plain form
6071 37028563 37423446 38057682 38859464 39855890 40529596 41175947 41678704 42122587 42287065
6062 42287065 42200276 41716549 40623253 38933588 37066393 35180826 33100741 31144869 29202055
6053 29202055 27687776 26752751 25968023 25467939 25075516 24745153 24679056 24495860 24144912
6044 24144912 23699679 23108113 22186064 21276518 20511872 19964857 19262926 18643164 18440379
6035 18440379 18345958 18714420 19335586 20231241 20968648 21186416 20986917 20628863 19923516 18677055
6025 18677055 17274001 15822596 14579158 13589131 12560015 11692568 11048783 10436545 9968956
6016 9968956 9631609 9253422 8996488 8673280 8543965 8255707 8143909 8033853 7713799 7563690
6006 7563690 7560002 7106286 7004933 6861409 6594639 6587226 6474975 6331128 6371138 6295099 6237524
5995F237524r5009j3171p4397M0705K52613J32918P3781M0993J97855m8987j60075
5984F584750j59057o7667m8724k42895j77209q5955j71084m3682m9296M2810o9770
5973E512221k06075j04501j17901J24321J61810j44718q2112k03045j18662J820
5963D823158j26317J9285j53249k21340k6983n659l0987Q6686J15066q2009N7172
5952D454823Q3746J0132p5579M440J00978L6679P8485M2456k03943r1851m9842
5941D390524n220J88767k3176j59156q21j84445K9016J22132J77771l2114j43992
5930D359286j08540j23793J57549O8830L4021o1237o179J48360o3903J26317P1051
5919D601762N8741J56345o0294J90495k3806j22502K59605K54318Q5511m6224
$$ plain form
5995 6237524 6142515 6129344 6054947 6095652 6348265 6481183 6554964 6595957 6793812 6744825 6584750
5984 6584750 6425693 6358026 6309302 6066407 5889198 5803243 5632159 5588477 5539181 5581991 5512221
5973 5512221 5306146 5201645 5083744 5208065 5369875 5225157 5143045 4940000 4821338 4823158
5963 4823158 4696841 4716126 4562877 4341537 4314554 4308895 4277908 4364594 4479660 4397651 4454823
5952 4454823 4538569 4548701 4473122 4477562 4578540 4615219 4693704 4736160 4532217 4440366 4390524
5941 4390524 4385304 4574071 4550895 4391739 4390918 4206473 4235489 4357621 4535392 4503278 4359286
5930 4359286 4250746 4126953 4284502 4353332 4387353 4326116 4319937 4468297 4404394 4530711 4601762
5919 4601762 4660503 4816848 4756554 4947049 4923243 4800741 5060346 5314664 5400175 5353951
5909E353951m5699J03252Q847J5193K29763J33842L6374r7664K936J75773j7681
5898E898887r336K82556K95260J80030M7994k96N8568J95159L15283N38174J96144
5887G998423K15415K38371N980J89261J37891J59924K14245j07529N9136K53636
5877I364753R8449K00731k1880k52563k78951k83109j03367l07500l84322j68886
5867G863355m22476l98489j25015j90305o5022k40009k52826k38299j58545q8886
5857E683483J8250j91242k35763l9277j28757J70481j46762l70509n0843J5079
5847D724140P6856J30444k33723r8730k35082M7397L28977L300J74375j12363
5837D805591k25099P4591M2398R270q4012j79130q2285J28990o5990O872j0556
$$ plain form
5909 5353951 5308252 5411504 5420351 5435544 5665307 5799149 5835523 5737859 5740795 5916568 5898887
5898 5898887 5889551 6172107 6467367 6647397 6695391 6695095 6753663 6948822 7264105 7802279 7998423
5887 7998423 8213838 8452209 8458189 8647450 8785341 8945265 9159510 9051981 9111117 9364753
5877 9364753 9463202 9663933 9642053 9389490 9110539 8827430 8724063 8416563 8032241 7863355
5867 7863355 7440879 7042390 6917375 6727070 6662048 6422039 6169213 5930914 5772369 5683483
5857 5683483 5701733 5510491 5274728 5235451 5106694 5277175 5130413 4759904 4709061 4724140
5847 4724140 4800996 4931440 4697717 4598987 4363905 4411302 4740279 4743579 4917954 4805591
5837 4805591 4580492 4655083 4697481 4706751 4622739 4443609 4361324 4490314 4424324 4431196 4420640
5826D420640j32293j09828j13670n3875J73619K3736J15699m097J9035l73o9176
5815D269417R9462P531q0468J29024r9607p3054N0936k5235K16016J72158q4085
5804D582095K16658J8487k48056J35821l7627r0675K75094J4081J0943k18464
5794D658357j85575j3265K9249J70425J33986R6317j30980j5401m9507n415M9270
5783D737461Q7522J59206o8305j58778L0187j2637K82237p5479j3648K59077k9862
5772E196981J99369J19037j38367J86809l881M52354K48171p4983O8188n2707
5762F200971L366J37577J1272R4218o2725j78074K67735R2105m334J63444j5296
5751F710259k30284J32743J08506K03810o7400k70896p9165j23014J55950K05440
$$ plain form
5826 4420640 4288347 4178519 4064849 4010974 4184593 4208329 4324028 4319931 4338966 4338593 4269417
5815 4269417 4368879 4376410 4295942 4424966 4325359 4252305 4303241 4278006 4494022 4666180 4582095
5804 4582095 4798753 4817240 4569184 4705005 4667378 4576703 4851797 4865878 4876821 4658357
5794 4658357 4472782 4459517 4488766 4659191 4793177 4889494 4758514 4743113 4693606 4688191 4737461
5783 4737461 4824983 4984189 4915884 4757106 4787293 4774656 5056893 4981414 4967766 5226843 5196981
5772 5196981 5396350 5515387 5377020 5563829 5559948 6012302 6260473 6185490 6253678 6200971
5762 6200971 6204337 6341914 6353186 6447404 6384679 6206605 6474340 6566445 6562111 6725555 6710259
5751 6710259 6479975 6612718 6721224 6925034 6857634 6586738 6507573 6384559 6540509 6745949
5741F745949n1597O4295J468J2395M34793J12535M05846J99566m7516L4784r5216
5730G817302k23400j90272k71605j48959l5720n3287j7270k7822p2689j5805N0259
5719F810732J62419K95913j32044N3960j56901N1631K59536J95302J21076J31909
5709G793533q6764L34854L38001O3920N8438j06880L5562M6117n6395J20898j48148
5698H393136m248J06500n8396K8498M4534K7683R3966R3038j29288J3002j43696
5687H464729J6013J0207k41754L1322m2435j48740j96860l41067j08043K45340
5677G688712k1229q7382k3590k47986J02128k59910k22720j33066k57087N8573
5667F596443o8625q4305j51985k64720P7908k7591L2862M1890m5291k24878N0299
$$ plain form
5741 6745949 6694352 6758647 6760115 6772510 7207303 7319838 7725684 7925250 7877734 7912518 7817302
5730 7817302 7593902 7403630 7132025 6983066 6947346 6894059 6876789 6848967 6776278 6760473 6810732
5719 6810732 6973151 7269064 7137020 7190980 7034079 7085710 7345246 7540548 7661624 7793533
5709 7793533 7706769 8041623 8379624 8443544 8501982 8395102 8430664 8476781 8420386 8541284 8393136
5698 8393136 8388888 8495388 8436992 8465490 8510024 8537707 8631673 8724711 8595423 8608425 8464729
5687 8464729 8480742 8490949 8249195 8280517 8238082 8089342 7892482 7551415 7443372 7688712
5677 7688712 7667483 7580101 7556511 7308525 7410653 7150743 6928023 6794957 6537870 6596443
5667 6596443 6527818 6443513 6291528 6026808 6104716 6077125 6109987 6151877 6106586 5881708 5932007
5656E932007j12589J38088J60582l16494j71487R712K8631K98281j95309J1325
5646E782747J65649j48826K70062J77029p3591N1664k59587O6558J01792k46723
5636E886774K6922k20187j05976J6991k54326q6969k1135j97941j3014M61M6030
5625E077630p7347j21698j14274p9110r8612j25347m4502P5361k55429k50456
5615C986216q0459j23641m8280m1517p0218j13851j31861n5393j26128K6662l7382
5604C184148N3753q1514O9581l3548p528n4852m1396J89343M6994p6180m4811
5593C203990k2786j25342O0702P4002L0676L7464j365O525j13839J6778p0276
5582C096529j03555O422j2707J08845Q4795P0959J1626j39590o2062o0103J72062
$$ plain form
5656 5932007 5819418 5957506 6118088 5801594 5630107 5639819 5668450 5966731 5771422 5782747
5646 5782747 5948396 5799570 6069632 6246661 6173070 6224734 5965147 6031705 6133497 5886774
5636 5886774 5913696 5693509 5587533 5604524 5350198 5263229 5242094 5044153 5031139 5031600 5077630
5625 5077630 5000283 4878585 4764311 4685201 4586589 4461242 4416740 4492101 4236672 3986216
5615 3986216 3905757 3782116 3733836 3692319 3622101 3508250 3376389 3320996 3194868 3221530 3184148
5604 3184148 3237901 3156387 3225968 3192420 3184892 3130040 3088644 3277987 3324981 3248801 3203990
5593 3203990 3181204 3055862 3116564 3190566 3221242 3258706 3257341 3263866 3150027 3166805 3096529
5582 3096529 2992974 2999396 2986689 3095534 3180329 3251288 3262914 3123324 3061262 3001159 3173221
5571C173221N1080Q1821p739r65l2425p393N8198J5477o4696R2397j21849j25738
5559C111389j0556n4836K49442M3667k5119p7501q6583P9053O0725L8771m688
5548C323764j25654J43681L4261J272l0015k7896o3197l5211K30536O3729j3409
5537C501861l2278j45131J02204R9401L5387m4037o5780J6901N2798J47478P7885
5526C746689k22429l8345k7974O8160J53923O2084K950r6752j27589J9655N6251
5515C596623J03724N6400L3966j2073J64029q2244K5244n156j13913J74561L2424
5504C973585J54394O2804j58665P0918Q4799Q7844O7179j14551O7653L3899k6887
5493D302972k1708K06012N8645m17J06611p1204L1632j24268q0658J14330J2953
$$ plain form
5571 3173221 3224301 3306122 3298383 3297418 3264993 3257600 3315798 3331275 3266579 3358976 3237127 3111389
5559 3111389 3100833 3045997 3295439 3339106 3313987 3236486 3149903 3228956 3289681 3328452 3323764
5548 3323764 3198110 3341791 3376052 3377324 3347309 3319413 3256216 3221005 3451541 3515270 3501861
5537 3501861 3469583 3324452 3426656 3526057 3561444 3517407 3451627 3468528 3521326 3668804 3746689
5526 3746689 3524260 3485915 3457941 3526101 3680024 3742108 3745058 3648306 3520717 3540372 3596623
5515 3596623 3700347 3756747 3790713 3778640 3942669 3860425 3885669 3880513 3766600 3941161 3973585
5504 3973585 4127979 4190783 4032118 4103036 4187835 4275679 4342858 4228307 4295960 4329859 4302972
5493 4302972 4281264 4487276 4545921 4545504 4652115 4580911 4612543 4488275 4407617 4521947 4534900
5482D534900N6219j3157J18572J931l2384J18625l5966J39642Q1485k2514M7886
5471D995239j19636l7980Q8074J72954N0733j39740o7241L5353Q5194k1037L8193
5460E080106J60749q4280j12789m012J06339K85719j66548q0738r1491p3256K51722
5449E271521N2394n9146j7244o8923K10523J30814L7775J6557P2770J19287J57781
5438E924109m3306Q9658o6131n9669J49703O6008R781j53238r7916j9085k1311
5427E778603K5011K37342l9213o7078q8392j37783N151N2055J34516P6189m1584
5416E934817O21J48435m2435J07143k5283j18724J01139P4206J88260J35631j38162
5405F365648Q4159n1890r060M30895L5021O6427L2125N5540O43K03154l1730O0354
$$ plain form
5482 4534900 4591119 4577962 4696534 4698465 4666081 4784706 4748740 4888382 4969867 4947353 4995239
5471 4995239 4875603 4837623 4925697 5098651 5149384 5009644 4942403 4977756 5062950 5041913 5080106
5460 5080106 5240855 5156575 5043786 5039774 5146113 5431832 5265284 5184546 5093055 5019799 5271521
5449 5271521 5323915 5264769 5247525 5178602 5389125 5519939 5557714 5574271 5647041 5766328 5924109
5438 5924109 5880803 5970461 5904330 5844661 5994364 6060372 6070153 5916915 5818999 5799914 5778603
5427 5778603 5803614 6040956 6001743 5934665 5846273 5708490 5713641 5765696 5900212 5976401 5934817
5416 5934817 5935438 6083873 6041438 6148581 6123298 6004574 6105713 6179919 6368179 6503810 6365648
5405 6365648 6449807 6397917 6388857 6819752 6854773 6921200 6953325 7008865 7009508 7212662 7180932 7241286
5393G241286n4746l3220K40656L54431j07855k20566j87462J27550L73810J21181
5383G855065J67712o6115j20726J74401J15707K27139J5066p2117j4578K46368
5373H527922K66427P3131Q5856l2629j63599J37148J70413J75837l6205L3975
5363I238276N9909J72269K84007l8682R7315J4798J45985J61644J87907K5940
5353A0349368J38400J19812K16799L4689K98581K85578k5803J32798L9167M11147
5343A2000536K13979J19712K42634P7842K76168K49949J06001J53013J85837J72050
5333A3797721q698K59849J10120J39065K09235K19664L97774J11442J32967J19366
5323A5488505L01768M42332L18510M45916K70077N4504K58178J25970K28222K67639
$$ plain form
5393 7241286 7186540 7153320 7393976 7748407 7640552 7419986 7232524 7360074 7733884 7855065
5383 7855065 8022777 7956662 7835936 8010337 8126044 8353183 8368249 8296132 8281554 8527922
5373 8527922 8794349 8867480 8953336 8920707 8757108 8894256 9064669 9240506 9204301 9238276
5363 9238276 9298185 9470454 9754461 9715779 9813094 9827892 9973877 10135521 10323428 10349368
5353 10349368 10487768 10607580 10824379 10859068 11157649 11443227 11417424 11550222 11589389 12000536
5343 12000536 12214515 12334227 12576861 12654703 12930871 13180820 13286821 13439834 13625671 13797721
5333 13797721 13789023 14048872 14158992 14298057 14507292 14726956 15124730 15236172 15369139 15488505
5323 15488505 15790273 16232605 16551115 16997031 17267108 17321612 17579790 17705760 17933982 18201621
5313A8201621J93030Q4768K54942M17621L62110L84386J7909P4887L19818K17661
5303B0528753M64087J63365M9735J10005K43623K02441M44500K60009M20785N18852
5293B3406155M77601O97496P71859N93820P08534N27975Q53655J010866J116893
5284C0164854J063304J094355J380145J436606J528314J645872J494258J365847
5276D1173555J435033J396432J453554J538363J470076J680840J689429J601694
5268E3438976J860958K034227K037761K032417K076682K126540K240035K225619
5260G0073215J998332J925957J907703J682326J444543J344831J161037Q93413
5252H2431357R06826N65187R14021P88600Q64499R92690P50741Q07320R77570
$$ plain form
5313 18201621 18394651 18479419 18734361 19151982 19514092 19898478 19916387 19991274 20311092 20528753
5303 20528753 20992840 21156205 21205940 21315945 21559568 21762009 22206509 22466518 22887303 23406155
5293 23406155 23883756 24581252 25353111 25946931 26655465 27183440 28037095 29047961 30164854
5284 30164854 31228158 32322513 33702658 35139264 36667578 38313450 39807708 41173555
5276 41173555 42608588 44005020 45458574 46996937 48467013 50147853 51837282 53438976
5268 53438976 55299934 57334161 59371922 61404339 63481021 65607561 67847596 70073215
5260 70073215 72071547 73997504 75905207 77587533 79032076 80376907 81537944 82431357
5252 82431357 83338183 83903370 84817391 85605991 86470490 87463180 88213921 89021241 89998811
5243H9998811J123532J134742Q59996Q91672R18011J025573J017057J258601J407178
5234I9635173J493754J267056R58780P24776Q80541O82456Q71755J085408J392894
5225A08992593J589284K007576K020332K163627K201036K206455K380109K519470
5217A26080482K972453L023669K900737K737453K412801J622503J290801P86418
5209A43827317M21356k57263p14647j352319j922592k216383k533428k849136
5201A32402905l031209k745987k599228k336974j854185j282472q12826n29332
5193A17210692l29190k11208k45718l23093m89366o81448n25061o98686o53493
5184A13053429o89153r80116j242720j436438j606252j789151j894565k204530
$$ plain form
5243 89998811 91122343 92257085 93117081 94008753 94926764 95952337 96969394 98227995 99635173
5234 99635173 101128927 102395983 103354763 104079539 104960080 105642536 106514291 107599699 108992593
5225 108992593 110581877 112589453 114609785 116773412 118974448 121180903 123561012 126080482
5217 126080482 129052935 132076604 134977341 137714794 140127595 141750098 143040899 143827317
5209 143827317 144248673 143991410 143276763 141924444 140001852 137785469 135252041 132402905
5201 132402905 129371696 126625709 124026481 121689507 119835322 118552850 117740024 117210692
5193 117210692 116881502 116670294 116424576 116101483 115612117 114930669 114405608 113706922 113053429
5184 113053429 112364276 111384160 110141440 108705002 107098750 105309599 103415034 101210504
5176A01210504k438466k555380k240427j817349j798525j501577j518988j575476
5168H5764316j202164j360761j380625j562568j842826j716170j939118j991988
5160G2768096j854010k208610k419218k338315k374671k287509k364530k713751
5152E4207482k667198k497502k353810k010625j754630j804082j541058j025002
5144C8553575p66592o01180l85041k71996k63254p0240Q427J4035J60733M3770
5134C6422237q8859k83305j33621J57982r4815k1711K11259O6539J33967K7562
5124C6397235K27924N2912O1343M33824M78888L97218J99466J48243k49126l59876
5114C7788051m60210l76707n25813p19533p48855p86182p99030p36546o84536
$$ plain form
5176 101210504 98772038 96216658 93976231 92158882 90360357 88858780 87339792 85764316
5168 85764316 84562152 83201391 81820766 80258198 78415372 76699202 74760084 72768096
5160 72768096 70914086 68705476 66286258 63947943 61573272 59285763 56921233 54207482
5152 54207482 51540284 49042782 46688972 44678347 42923717 41119635 39578577 38553575
5144 38553575 37786983 37185803 36800762 36528766 36265512 36195272 36203699 36217734 36378467 36422237
5134 36422237 36333378 36050073 35916452 36074434 35979619 35957908 36169167 36235706 36369673 36397235
5124 36397235 36625159 36678071 36739414 37173238 37652126 38049344 38248810 38397053 38147927 37788051
5114 37788051 37327841 36951134 36425321 35705788 34956933 34170751 33371721 32635175 31950639
5105C1950639p10784o68707n54367n58817p41753o76510m46448k50377j07171
5096B7235705k07523m2168L3795L28474M19136L13445M58386N87090O89177O82998
5086C0498515N98113O16129N02968N58665M34920L02546M53534N32284N41797
5077C5039471N87154N36936O05786O57272L32298K06872K44440N2339M6023k1719
5067C8286872k07546k44449m39725n55912m53824p20292q80831q09499r32579
5058C3042215r70382o67434p32056o88072p50162r94212o75963p39854p40475
5049B6083605p32773o74754m98246m59522m10747l58563l04841k88574l06100
5040B2049485m9303j70871r1983p0077m754J3406p8886O59n1772n3414n274N9245
$$ plain form
5105 31950639 31239855 30571148 30016781 29457964 28716211 28039701 27593253 27342876 27235705
5096 27235705 27028182 26986014 27019809 27348283 27767419 28080864 28539250 29126340 29815517 30498515
5086 30498515 31096628 31712757 32215725 32774390 33209310 33511856 33965390 34497674 35039471
5077 35039471 35626625 36163561 36769347 37426619 37758917 37965789 38210229 38262568 38308591 38286872
5067 38286872 38079326 37834877 37395152 36839240 36385416 35665124 34784293 33974794 33042215
5058 33042215 32071833 31404399 30672343 29984271 29234109 28239897 27563934 26824080 26083605
5049 26083605 25350832 24676078 24177832 23718310 23307563 22949000 22644159 22355585 22049485
5040 22049485 22000182 21829311 21737328 21667251 21662497 21675903 21597017 21597676 21545904 21492490 21487216 21546461
5028B1546461J47405j47414J10445J52982J06321K31880J08974M4017j49341l01667
5018B1850063k44715m41676o40542l05363l43636k53293r1395k53307k37159n3129
5008A8985848p1580j39700j07686q8806k11207j78615j73132j79892j13810j25301
4998A7596119k09961j31280J2677j34354k49163p1063j15166k71643l09120j92266
4988A5924780k79507l51094k63519m8099j93082j86845N1856P1585l1419J20384
4978A4815040K07762O0529m7443L1267k07470k26497j63737k61086n4025j63867
4968A3990473j69103k95579k46217J9215J99513J14633O8739j82978K7893K12953
4958A3739542P3985R7534J18859j73055j00083O5010j20367m4025k32683j99484
$$ plain form
5028 21546461 21693866 21546452 21656897 21809879 21916200 22148080 22257054 22301071 22151730 21850063
5018 21850063 21605348 21163672 20523130 20217767 19874131 19620838 19529443 19276136 19038977 18985848
5008 18985848 18914268 18774568 18666882 18578076 18366869 18188254 18015122 17835230 17721420 17596119
4998 17596119 17386158 17254878 17267555 17133201 16884038 16812975 16697809 16426166 16117046 15924780
4988 15924780 15645273 15294179 15030660 14982561 14789479 14602634 14654490 14726075 14694656 14815040
4978 14815040 15022802 15083331 15035888 15067155 14859685 14633188 14469451 14208365 14154340 13990473
4968 13990473 13821370 13525791 13279574 13298789 13498302 13612935 13681674 13498696 13526589 13739542
4958 13739542 13813527 13911061 14029920 13856865 13756782 13821792 13701425 13657400 13424717 13225233
4948A3225233K25743J76461K12002J41460O9131J59543L4339J56462K26622j89642
4938A4437354j25941k78731m36502l97234m04395n22862m01826m30845l37469
4929A1101549m17818n45975k14566k34212q7150m5525k56790R3914o2426j36091
4919I194910r4216k12306j06090J9887J06956J68182n7643j79088j41585q4410
4909H614597K30443J46373p5708j44763m0605k29028K5740Q6638r378k7702R6623
4898H673230R185R3720l9864j12442j59867q6150J31747Q5142J42880M9354k0676
4887H766259P3069k4003l5029j7535L530L964K85595J20533k4615J9537O6466
4876I237771N4819N6807K14463K06488M3550L4414n5800j59125O0933J03319P2070
$$ plain form
4948 13225233 13450976 13627437 13839439 13980899 14050030 14209573 14243912 14400374 14626996 14437354
4938 14437354 14311413 14032682 13596180 13198946 12794551 12271689 11869863 11439018 11101549
4929 11101549 10683731 10137756 9923190 9688978 9601828 9556303 9299513 9393427 9331001 9194910
4919 9194910 9100694 8888388 8782298 8802185 8909141 9077323 9019680 8840592 8699007 8614597
4909 8614597 8845040 8991413 8915705 8770942 8730337 8501309 8527049 8613687 8604309 8576607 8673230
4898 8673230 8682415 8776135 8736271 8623829 8463962 8377812 8509559 8594701 8737581 8786935 8766259
4887 8766259 8839328 8815325 8780296 8762761 8766291 8770255 9055850 9176383 9151768 9171305 9237771
4876 9237771 9292590 9349397 9563860 9770348 9813898 9848312 9792512 9633387 9694320 9797639 9869709
4865I869709L6939p5211j8648l26506l81090j22491r0443j00375n3955j91539
4855H546390K7852j59691r0586j8193K10879K49317R6963J79031J43259K06228
4845I391449K03742K37333M10313L84320J32812L77292K85096J51816J3577P0869
4835A1658619j64319q5343K4216p7811j46744l7591M6986J95684M50675J12876
4825A1977248K21738L16981P7752J39093j0678J28366n3471P282P5686j29990
4815A2750007j15177p7055k51010l38333k32338n0938J12540J12708Q5682L26686
4805A2322772O698j49174j46085l53149l48379m12780l49004j00406p1757j58724
4795A0240012k16848M7706J38752J64564K82257R5292K19497K67823L00884L86890
$$ plain form
4865 9869709 9906648 9831437 9812789 9486283 9105193 8982702 8892259 8791884 8737929 8546390
4855 8546390 8574242 8414551 8323965 8305772 8516651 8765968 8862931 9041962 9185221 9391449
4845 9391449 9595191 9832524 10242837 10627157 10759969 11137261 11422357 11574173 11587750 11658619
4835 11658619 11494300 11408957 11433173 11355362 11208618 11171027 11218013 11413697 11864372 11977248
4825 11977248 12198986 12515967 12593719 12732812 12722134 12850500 12797029 12804311 12879997 12750007
4815 12750007 12634830 12557775 12306765 11968432 11736094 11685156 11797696 11910404 11996086 12322772
4805 12322772 12329470 12180296 12034211 11681062 11332683 10919903 10570899 10470493 10398736 10240012
4795 10240012 10023164 10070870 10209622 10374186 10656443 10751735 10971232 11239055 11539939 11926829
4785A1926829L53518K78195N6998J96013K95964K34711J98984J7725Q8231L30180
4775A3977348L50300K63691O5412J34071K95698L19061J65654J98098L04735L68159
4765A6442227K84304L72333O37252L76583J1282L81948K65402M22625M90971L00756
4755A9985683N15388K06529K82473L16101L07483N4905j96177k35026J52755l16203
4745B1073911k19673J10900J9865O7042L3480N4774K06586J45417K21212M79046
4735B2192560N07211M78277O81061N29926O93681J018737J093488J464446J301570
4726B9960957J329313J303641J259232J328688J231943J057950J159350J275486
4718C9906560J157259J407550J274394J178038J043208R01657Q59740P19901O46712
$$ plain form
4785 11926829 12280347 12558542 12615540 12811553 13107517 13342228 13541212 13558937 13647168 13977348
4775 13977348 14327648 14591339 14656751 14790822 15086520 15405581 15571235 15769333 16074068 16442227
4765 16442227 16726531 17098864 17736116 18112699 18123981 18505929 18771331 19193956 19684927 19985683
4755 19985683 20501071 20707600 20990073 21306174 21613657 21668562 21472385 21237359 21390114 21073911
4745 21073911 20854238 20965138 20985003 21052045 21085525 21140299 21346885 21492302 21713514 22192560
4735 22192560 22699771 23178048 23859109 24389035 25082716 26101453 27194941 28659387 29960957
4726 29960957 31290270 32593911 33853143 35181831 36413774 37471724 38631074 39906560
4718 39906560 41063819 42471369 43745763 44923801 45967009 46868666 47728406 48448307 49095019
4709D9095019O12106O07865N09207N38732K21034K47270O8493j26854K1024J69801
4699E1963697J16144K42412M85656P35688Q20863J217404J757182J878953K017644
4690F1235643K233813K287674K639188K433934K223476K268113K061166J763215
4682G9146222J395437J006056Q65354L39724K2553J58326J1681L10245L54391
4673H3609989M02439M76854P5047l63097m43251r11136j014437j277752j687944
4664G8866712j678669j626995j424573j365126j523700j511545j365425j160516
4656F7210163r18885q28405n70499P8021L14745R22562J526215J978754K125807
4647G1838478K134442K067260J919245J781446J157999N82764o0117q76520j306066
$$ plain form
4709 49095019 49707125 50314990 50824197 51362929 51583963 51831233 51899726 51772872 51793896 51963697
4699 51963697 52079841 52322253 52807909 53543597 54364460 55581864 57339046 59217999 61235643
4690 61235643 63469456 65757130 68396318 70830252 73053728 75321841 77383007 79146222
4682 79146222 80541659 81547715 82413069 82752793 82775346 82933672 82945353 83255598 83609989
4673 83609989 84012428 84489282 84564329 84201232 83757981 82846845 81832408 80554656 78866712
4664 78866712 77188043 75561048 74136475 72771349 71247649 69736104 68370679 67210163
4656 67210163 66291278 65462873 64892374 64970395 65285140 66207702 67733917 69712671 71838478
4647 71838478 73972920 76040180 77959425 79740871 80898870 81481634 81421517 80544997 79238931
4638G9238931j782451j862783k065640k282582j929313k171721k027280j663319
4630F3453842j904366j500922j532168j275371q84524q86568m27655k61674J13868
4621E4894462N83249N18422Q49149J159225J191164J720912K210315K473444K963658
4612F8564000L517829M056211M802619N215145N910439P112182Q429690J0102313
4604A17710428J2716509J6315914K0963700K5457908K9159867L0946572L0187081
4597B83457979K8009386K4978876K2518263K1433886K0752497K0032192J7893295
4590D39076374J4757406J0883871P049794M611289L027542j21025o210194j4518717
4582D58556340k2378933k8283597l2144603l3771674l3871571l2391182k9715125
$$ plain form
4638 79238931 77456480 75593697 73528057 71245475 69316162 67144441 65117161 63453842
4630 63453842 61549476 60048554 58516386 57241015 56356491 55469923 55042268 54780594 54894462
4621 54894462 55477711 55996133 56845282 58004507 59195671 60916583 63126898 65600342 68564000
4612 68564000 72081829 76138040 80940659 86155804 92066243 99178425 107608115 117710428
4604 117710428 130426937 146742851 167706551 193164459 222324326 253270898 283457979
4597 283457979 311467365 336446241 358964504 380398390 401150887 421183079 439076374
4590 439076374 453833780 464717651 471767445 476378734 479406276 479285251 473075057 458556340
4582 458556340 436177407 407893810 375749207 341977533 308105962 275714780 245999655
4575B45999655k6271641k2808249j9227975j5642968j2645816r851537p144899
4568A32406570m603243k378728j001302r30275j932188k963209l799107m287787
4560A10510731m430420m171950l630193k963982k263836j796205j026452k51026
4552H9976667P68639J943953L110343L368207K849153J670827K46322o46133j431515
4543A01856463j533513j041735k13673J110312L013428N885415R812264J5033338
4535A33922299K0828106K5181175K5956798K0790459J0784198R4102q693866j5245447
4527B13617824j9559787k1179473k0458410j8576953j6207084j3330274j0888012
4520I3417831q415870o697679n239627m300706l564893k931503k329490k004253
$$ plain form
4575 245999655 219728014 196919765 177691790 162048822 149403006 139551469 132406570
4568 132406570 127803327 125424599 124423297 123493022 121560834 118597625 114798518 110510731
4560 110510731 106080311 101908361 98278168 95314186 93050350 91254145 90227693 89976667
4552 89976667 90745306 92689259 95799602 99167809 102016962 103687789 103934111 103287978 101856463
4543 101856463 100322950 99281215 99067542 100177854 103191282 109076697 118888961 133922299
4535 133922299 154750405 179931580 205888378 226678837 237463035 237557137 228863271 213617824
4527 213617824 194058037 172878564 152420154 133843201 117636117 104305843 93417831
4520 93417831 85001961 78304282 73064655 68763949 65199056 62267553 59938063 57933810
4512E7933810j826944j330603j239866r33885p77079q43589p23525o24022o58412
4503D8975885o66082p51377m88490m28782n82818l06808j77372P5454L55423M93451
4493D6498484O88384M39171O91366O67731R47240R46859Q82514J104896J406589
4484E4273234J682403K450960L033545L893927M730792O094221P252496Q530309
4476I1941887R831402J0908161J1846551J2407219J2535121J1743849R270794
4469A70484984N831394J552889k829898o727939r824572j1402979j2230318j2255281
4461A22598280j1308262j0108097q816453p131131n780414m403361l502240k648486
4453F8899836j972221j384946p83719m41385l13328K81473Q00734J421593J847442
$$ plain form
4512 57933810 56106866 54776263 53536397 52602512 51825433 50981844 50258319 49634297 48975885
4503 48975885 48309803 47558426 47069936 46641154 46058336 45751528 45574156 45649610 46005033 46498484
4493 46498484 47186868 47626039 48317405 48985136 49932376 50879235 51761749 52866645 54273234
4484 54273234 55955637 58406597 61440142 65334069 70064861 76159082 83411578 91941887
4476 91941887 101773289 112681450 124528001 136935220 149470341 161214190 170484984
4469 170484984 176316378 177869267 175039369 168311430 158486858 147083879 134853561 122598280
4461 122598280 111290018 101181921 92365468 85234337 79453923 75050562 71548322 68899836
4453 68899836 66927615 65542669 64758950 64317565 64004237 64285710 65086444 66508037 68355479
4444F8355479K408658L239410L831373N175098O460614P843769J0369750J3406746
4436A21090897J7286545K1471438K5310412K7209135K6319165K1980779J5103767
4429B75772138P103175n36549n935059q679401q253657m660694Q68438O955771
4421B62634162J1481291J2553556R624896L050095m955545j3196636j9782919
4414B61408900k3934745k5974288k5830282k4275045k1647902j8507811j5492593
4407A05746234j2751258j0322506q162128o824154n852046m735590m321638l666365
4399D9110549l008348k535616k216744k046635j772649j582617j605513j221063
4391C3121364j268576j050455j009696j263394j021105j024774q40472o24148
$$ plain form
4444 68355479 70764137 74003547 77834920 83010018 89470632 97314401 107684151 121090897
4436 121090897 138377442 159848880 185159292 212368427 238687592 260668371 275772138
4429 275772138 282875313 282338764 276403705 267724304 259470647 254809953 255678391 262634162
4421 262634162 274115453 286669009 296293905 299344000 294388455 281191819 261408900
4414 261408900 237474155 211499867 185669585 161394540 139746638 121238827 105746234
4407 105746234 92994976 82672470 74510342 67686188 61834142 57098552 52776914 49110549
4399 49110549 46102201 43566585 41349841 39303206 37530557 35947940 34342427 33121364
4391 33121364 31852788 30802333 29792637 28529243 27508138 26483364 25642892 25018744
4383B5018744o81519n74727o33284n47248l80184l63537n13534m88322m45766
4374B0390623n24983m34854m68243m14686p22677n73513j90174l79912j83536
4365A6498045j69083l39872l73256k32390k88253k56107l94768l81510k87460
4356A3775346m80149l65351l31850k41752j97864l80407m25609j30807k31150
4347A0990407k86912k77451j82672k30612k57968j91619o2919j91098j70873j40426
4337H997857l46636k38030R5436j6502j8968l04615j83580N9299j23763k64810
4327G655688j9940J06016k0279p3423M3471n0736j28492j50361j96776n3847K22027
4316G333348L3377K10517R2882j86852J9070N3356J39353J03605P802r6888o4481
$$ plain form
4383 25018744 24337225 23762498 23129214 22581966 22201782 21838245 21324711 20836389 20390623
4374 20390623 19865640 19430786 18962543 18547857 17825180 17251667 17061493 16681581 16498045
4365 16498045 16328962 15989090 15615834 15383444 15095191 14839084 14444316 14062806 13775346
4356 13775346 13295197 12929846 12597996 12356244 12158380 11777973 11352364 11221557 10990407
4347 10990407 10703495 10426044 10243372 10012760 9754792 9563173 9500254 9309156 9138283 8997857
4337 8997857 8651221 8413191 8508627 8492125 8473157 8168542 7984962 8044261 7920498 7655688
4327 7655688 7635748 7741764 7721485 7648062 7691533 7640797 7512305 7361944 7165168 7111321 7333348
4316 7333348 7366725 7577242 7670124 7483272 7502342 7555698 7695051 7798656 7806458 7709570 7645089
4305G645089r9004m9162J89818k8193r6594j07428j91856j55630l03569j84605
4295F618866k36192m42142j38827j67223l0711j72991l77263l6953j73886k2066
4285D820612J08630m6197r6072p4657l00980l1534j6521L1606n7630j76501j09547
4274D051209Q1766j06464k4425j82085k0324J20136K0510n5670j54707j75005
4264C554941N780m3196l8832J42472j22299j82535m6808j39511j12362N7726N9023
4253C134399J5879o785J34870J8316q1323k6542O0487m8841Q0846Q5523k88870
4242C077959j66402j32653j31935p6213k64913J94506J86789j72123L96j01129
4232B414282m9698J02926l4402J64298k14150m5918J43724j43223O0257J0203
$$ plain form
4305 7645089 7546085 7496923 7686741 7658548 7561954 7454526 7262670 7107040 6803471 6618866
4295 6618866 6382674 5940532 5801705 5634482 5603771 5430780 5053517 5016564 4842678 4820612
4285 4820612 4929242 4883045 4786973 4712316 4411336 4379802 4363281 4394887 4337257 4160756 4051209
4274 4051209 4132975 4026511 4002086 3820001 3799677 3919813 3940323 3884653 3729946 3554941
4264 3554941 3560721 3517525 3478693 3621165 3498866 3316331 3269523 3130012 3017650 3075376 3134399
4253 3134399 3150278 3143493 3278363 3296679 3215356 3188814 3249301 3200460 3281306 3366829 3077959
4242 3077959 2911557 2778904 2646969 2570756 2305843 2500349 2687138 2515015 2515411 2414282
4232 2414282 2364584 2467510 2433108 2597406 2383256 2337338 2481062 2337839 2398096 2408299
4222B408299j19454N3647j92666j867Q1991k09575j24024j16639J58141j9880
4212A917973j15461J594L9912p6652L0510j51781j46814Q8814O2895N7404J69929
4201A878323j19460j26049N0471k9156R1980p60Q4304M0226P1966R1995L6149
4190B069989J9870l7333k104J69209J880N6200k8233j20015k9918J02954P4756
4179B277255k29453j86211j97452j63390J22452k0256N206j47785l63268J40020
4169A237118J52581m234Q0557j52346j43490m4491J51441K75987k28701j91509
4159A132913J78852m1808j9693J32999K03210n090N0953L1087J36375K15090J2676
4148B027564J47447j7882J55477K24749j12668L0177q9020l7555j6797O7673K09463
$$ plain form
4222 2408299 2288845 2342492 2149826 2147959 2229950 2020375 1896351 1779712 1937853 1917973
4212 1917973 1802512 1804106 1844018 1767366 1797876 1646095 1499281 1588095 1650990 1708394 1878323
4201 1878323 1758863 1632814 1683285 1654129 1746109 1745349 1829653 1869879 1941845 2033840 2069989
4190 2069989 2089859 2052526 2050422 2219631 2221511 2277711 2249478 2129463 2099545 2202499 2277255
4179 2277255 2047802 1861591 1664139 1500749 1623201 1602945 1608151 1460366 1097098 1237118
4169 1237118 1389699 1385465 1466022 1313676 1170186 1125695 1277136 1553123 1324422 1132913
4159 1132913 1311765 1269957 1250264 1383263 1586473 1581383 1632336 1663423 1799798 2014888 2027564
4148 2027564 2175011 2157129 2312606 2537355 2424687 2454864 2365844 2328289 2311492 2379165 2588628
4137B588628q8260o4597K3159j51995j03060M5559J8375k93715k94500n6966p9706
4126A542922o4124j55805j18569j79228l842R1957q6123M877r4334j56116J43883
4115I25498O6350O1902j71640j32216J25302M6653M8235N4599k34486n6774Q6008
4104H19431m3070J55010q5231j13345o0825q7237J08292M2126K9436L7740r1205
4093G11122k420K11191n9946l9923j4820r4865k6950n193Q8220r8173j69625L9794
4081E38412J55470Q204l3941p8955j34661R9888J17759M6754o2099k03459j4926
4070D38446J60358k0923N3787k32130j7411J10363J2662K31679R28m3195j50039
4059E44525K6002k6156j8370J66780l6333J3841j08659J863J06819J9837M7233
$$ plain form
4137 2588628 2500368 2435771 2458930 2306935 2203875 2249434 2267809 1974094 1679594 1622628 1542922
4126 1542922 1478798 1322993 1204424 1025196 1021354 1113311 1027188 1032065 937731 781615 925498
4115 925498 991848 1053750 882110 749894 875196 921849 970084 1024683 790197 733423 819431
4104 819431 776361 931371 846140 732795 671970 584733 693025 735151 764587 802327 711122
4093 711122 708702 919893 859947 820024 805204 710339 683389 678196 766416 668243 498618 538412
4081 538412 693882 702086 668145 589190 454529 554417 672176 718930 656831 453372 438446
4070 438446 598804 577881 631668 399538 382127 492490 505152 736831 737759 694564 544525
4059 544525 570527 544371 526001 692781 656448 670289 561630 563493 670312 690149 737382
4048G37382k79097k8367J88817j09109Q2203r3195k1955Q6609j92083J1069q9638
4037B92636m7565N901k5966J90857K6493j18341K5789o8712N8810J27026r2783
4026C74145j09202r925n6948J8140J54037J29780J9290l3217O2066l9556r2443
4015D16167m923l8403o2938J68764O1236M8960k8526k44888l5189P5209P3192
4004D28661J80720j41087n7070r9454r9223J11927Q3737j30604o0657J67698m1719
3993C42929J54740K2560p4959j10366q0054Q2843K3772k09940K1935j29620J72398
3982B16238J25504j5272N2547n3751j96036P9770O6112M7070P9416j42946K1026
3971B79678J17724j58516L22037j0514k20620M1003K1158J47260J5048j77825
$$ plain form
4048 737382 458285 429918 618735 509626 591829 498634 476679 563288 371205 382274 292636
4037 292636 245071 250972 225006 415863 442356 324015 349804 281092 339902 466928 374145
4026 374145 264943 255018 198070 216210 370247 500027 519317 486100 548166 508610 416167
4015 416167 411244 372841 309903 478667 539903 588863 560337 315449 280260 355469 428661
4004 428661 609381 468294 411224 311770 212547 324474 408211 277607 216950 384648 342929
3993 342929 497669 520229 445270 334904 254850 337693 361465 151525 173460 43840 216238
3982 216238 341742 326470 379017 325266 129230 209000 275112 322182 401598 258652 279678
3971 279678 397402 238886 560923 550409 329789 370792 391950 539210 554258 376433
3961C76433N1532J7330M6844J0100j22684q2334L6646R2272j4229Q066J3053O9178
3949E02207j21416J75538N9140J13755J29339p4291p2056n5778q9976R534j74031
3938D01965o7946j30612n8536j0058N5756j51753J65474J04654L0167L5406j9729
3927C54788j01086k8510J17855J65959L7233o6287L5672j12754R5482R5152j43557
3916D49947M6830j05415k9310J18283M7302J4696j29567n4458J26190P2488q2488
3905D74498j26949j08466j25347J33524J72941m7030j21429k46351J23065l7195
3895I1261l0546K75278j84541j26705N8847J24327K83824O8320o0136j62951k14010
3884A22968Q6487J81930m9396J0112j3472o134N5786P8807o7982j79744J8141
$$ plain form
3961 376433 427965 445295 492139 502239 379555 297221 333867 426139 411910 419976 433029 502207
3949 502207 380791 556329 615469 729224 858563 784272 712216 656438 566462 575996 401965
3938 401965 334019 203407 144871 134813 190569 38816 204290 308944 339111 374517 354788
3927 354788 253702 225192 343047 509006 546239 479952 515624 402870 498352 593504 449947
3916 449947 496777 391362 362052 480335 527637 542333 412766 358308 484498 556986 474498
3905 474498 347549 239083 113736 247260 420201 373171 251742 5391 128456 91261
3895 91261 60715 335993 151452 24747 83594 207921 491745 560065 499929 336978 122968
3884 122968 209455 391385 341989 352101 338629 332495 388281 467088 399106 219362 237503
3873B37503K09193J64211r604n0741q7542k34198N690J61752Q0848l23517p5618
3862G7977L3069O1402R9045j9580m9611q8768J03763L5511J43753J1076p1502
3851C36135j47700J9554R1525L7557O0243o3951j51985M2341J31116K57387n2761
3840E59461j02437m074r7512j08390L2799K38657j08232o4837J12029j5207n1508
3829C90749l8821k24216m9305J44552J30725J14232l3972k56499j34859K00227
3819B42813J90248P3055r1109k00828J27637K2549l4734M3619M2735r4378O5547
3808C87154k18976J56406j9751n8366L9247J40365M0678m3405n6576m9997j5504
3797C01275j44546K07704K65898k2274j61903q0112R5209N5062p9882J30546r682
$$ plain form
3873 237503 446696 610907 601303 550562 463020 228822 234512 396264 477112 153595 77977
3862 77977 111046 172448 271493 251913 202302 113534 217297 252808 396561 407637 336135
3851 336135 188435 207989 299514 337071 397314 333363 181378 223719 354835 612222 559461
3840 559461 457024 452950 355438 247048 279847 518504 410272 345435 457464 442257 390749
3829 390749 351928 127712 78407 222959 353684 467916 433944 177445 42586 242813
3819 242813 433061 506116 415007 214179 341816 364365 329631 373250 415985 321607 387154
3808 387154 168178 324584 304833 246467 285714 426079 466757 423352 366776 316779 301275
3797 301275 156729 364433 630331 608057 446154 366042 461251 516313 436431 566977 557295
3786E57295n419k748J45752Q0236j13045o8174m0621J04458J29827q2604n4086
3775F50871m182K3121l007J21337n5524j47064r3117M9281j4650J0730l182q741
3763E25873J6423l5845k049j03491R1236R0452P1937K37938q0022p8914j37244
3752E96294l2495L6465P6122K50175j8002j47125J67849k3369N4187Q6972k0571
3741A026502R9969O5494J20267n0621j66438j4638J69604L2860K3605J7082m4782
3730A278904Q4964j25813q0739N3315J12296J05578K6749o9244l4771l3433K2133
3719A339939Q2454j2894m0823J11541J61119J20413J6064J4413R0284L7190K06789
3708B126489O1749J03853P8498j8087J50495J52729K96247J09124J50159L78900
$$ plain form
3786 557295 551876 549128 694880 775116 662071 593897 553276 657734 787561 704957 650871
3775 650871 646689 669810 666803 788140 732616 585552 492435 541716 527066 537796 534614 525873
3763 525873 542296 506451 504402 400911 492147 582599 654536 892474 812452 733538 596294
3752 596294 563799 600264 676386 926561 908559 761434 929283 905914 960101 1047073 1026502
3741 1026502 1126471 1191965 1312232 1261611 1095173 1080535 1250139 1282999 1306604 1323686 1278904
3730 1278904 1363868 1238055 1157316 1210631 1322927 1428505 1455254 1386010 1351239 1317806 1339939
3719 1339939 1422393 1409499 1368676 1480217 1641336 1761749 1777813 1792226 1882510 1919700 2126489
3708 2126489 2188238 2292091 2370589 2352502 2502997 2655726 2951973 3061097 3211256 3590156
3698C590156L92853M87489N94566P63355O20138M62326O41402N23862N17736M88665
3688I082548N45531J058432J404562K250960L272634N575598J0007000J4706583
3680D7903848K0607205J9471464N176772m977116m460039p918433j1871902j1442309
3672E2489490j0226634q447886p659390n705892m063805k618633j543741r01209
3664A1322300p40442q93122q08816p51601q39343o00336n27000o35680o21529
3655D904431j64057l68098m10445k20504j94252j43157p1028m7315k27159k60360
3645B798056M5020q1108j20695o713m07924m3973j72905p8315j57349j69766N9847
3634A664175j40702M5831p07l4738q637k58474k1416N5747J86162R5677j35783
$$ plain form
3698 3590156 3983009 4470498 5065064 5828419 6448557 6910883 7552285 8076147 8593883 9082548
3688 9082548 9628079 10686511 12091073 14342033 17614667 23190265 33197265 47903848
3680 47903848 68511053 87982517 93159289 88182173 83722134 75803701 63931799 52489490
3672 52489490 42262856 33814970 26155580 20449688 16385883 13767250 12223509 11322300
3664 11322300 10581858 9688736 8879920 8128319 7288976 6688640 6161640 5525960 4904431
3655 4904431 4740374 4372276 3961831 3741327 3547075 3403918 3332890 3285575 3058416 2798056
3645 2798056 2843076 2761968 2641273 2634560 2226636 2182663 2009758 1931443 1774094 1604328 1664175
3634 1664175 1523473 1569304 1568597 1533859 1525222 1266748 1245332 1301079 1487241 1582918 1447135
3623A447135j09467j03719N8112J96591Q9390j26923k46673N7973o5962j18522
3613A077935j3447l1920j3885o8907N66J08553j18697q6653R1663j16163J7283
3602H46328K8147j13841k24467j16559k7276R3926K76146j00870m2741O1377k35182
3591D44988J84442m9621o5261J05186j04459K019r3950p931q67j84844P8152R7449
3579D05303J9990J65887j25775q5995K0735j4217O6514k1605j2793l4416m6275
3568C37353P5906r526J5823N9058r0755k6214M7033r9687q9707J7626J37960p9172
3556B95698K082j8239J37556M3851j39564n7683q447J7667K7627r2660j42096
3545F5792n6716J24449J0521j1003Q650j85842J96671p6468n1671J43946j8876
$$ plain form
3623 1447135 1337668 1233949 1292061 1488652 1578042 1451119 1204446 1262419 1196457 1077935
3613 1077935 1064488 1032568 1018683 949776 950342 1058895 940198 853545 945208 829045 846328
3602 846328 874475 760634 536167 419608 392332 486258 762404 661534 618793 680170 444988
3591 444988 629430 579809 514548 619734 515275 517294 423344 415413 414546 229702 307854 405303
3579 405303 425293 591180 465405 379410 400145 385928 452442 430837 418044 383628 337353
3568 337353 413259 403733 419556 478614 387859 361645 408678 308991 219284 236910 374870 295698
3556 295698 297780 279541 417097 460948 321384 263701 255254 272921 300548 207888 65792
3545 65792 9076 133525 144046 133043 141693 -44149 152522 76054 24383 168329 149453
3534A49453J33024R49k9333P8043o0488J48824M2789r8279J6164k19103l9091
3523A22952P9700O979M6270Q5210j14152l9756L7612J8269q3091J18979l0919
3512B48053j58233M5029n5789r212j18977K8708j26521r013J28608Q925j17260
3501a35682j73714p8952K47877P9940N4985L718j37920M3153J23899J02599m70
3490A29433m3889k62408j3644K09694O1892J53977j27811n0327L9142m7188J41693
3479A90564j571j24478l476J7520J55103j39105l6235N5120l7089K0684Q2662
3468A79699o8820m1846j14190j69054N8318J35467r338j48880k2475J06172R116
3457h5831M8281j32242p0848J56974j19837R4059J44315q4018J29148J14622p4616
$$ plain form
3534 149453 282477 283426 254093 332136 271648 420472 463261 364982 381146 162043 122952
3523 122952 202652 209631 255901 341111 226959 187203 224815 243084 159993 278972 248053
3512 248053 89820 134849 79060 69848 -49129 -20421 -146942 -155955 -27347 -18422 -135682
3501 -135682 -309396 -388348 -140471 -60531 -5546 -1828 -139748 -96595 27304 129903 129433
3490 129433 85544 -176864 -190508 19186 81078 235055 107244 56917 96059 48871 190564
3479 190564 188993 64515 61039 78559 233662 94557 58322 113442 76353 97037 179699
3468 179699 110879 69033 -45157 -214211 -155893 -20426 -29764 -178644 -201119 -94947 -85831
3457 -85831 -37550 -169792 -240640 -83666 -203503 -109444 34871 -49147 80001 194623 120007
3446A20007J68925p4714M4301j55005p4086N6039J57020K6674j5898j6288j7135
3435B19840r8765K6931J16670L1964j14972k62763l3384O7278M5060R9349O4498
3424A61706j08970Q869j20543L1693p6193q1806K09830p025L0150J56328k2016
3413A82023K2329O887J5683J02897Q0206K1748l492O919o9642j62208l8177o976
3401A58197O6669J09847k27618K8820k40032j7585L1667j14124K60169m8271l9525
3390c1786O6564j72417J989N8855J34784j87864J02441k4436k16211P0144j36767
3379c34704k7520J56311K62192K6306j38964r0822n2636k8611L36702J62806N634
3368B76694l70283k5605L1219n3691N8555j24062O6416J76772k715j52919j95527
$$ plain form
3446 120007 288932 214218 258519 103514 29428 85467 242487 269161 253263 236975 219840
3435 219840 121075 148006 264676 296640 181668 -81095 -114479 -47201 -2141 97208 161706
3424 161706 52736 61605 -58938 -27245 -103438 -185244 24586 17561 47711 204039 182023
3413 182023 204352 211239 226922 329819 410025 431773 428281 435200 365558 203350 165173 158197
3401 158197 224866 334713 107095 135915 -104117 -121702 -90035 -204159 56010 7739 -31786
3390 -31786 34778 -137639 -135650 -76795 57989 -129875 -27434 -51870 -268081 -197937 -334704
3379 -334704 -362224 -205913 56279 82585 -56379 -147201 -199837 -228448 108254 271060 276694
3368 276694 -93589 -119194 -87975 -141666 -83111 -207173 -140757 36015 33300 -119619 -315146
3357c15146m410L2411L04275K75214j73483j78598r7234k7677J03675M5154J76848
3346A41029N9113p0824o4150l5417o2120N3620j01381M2720K01591j00814j09286
3335d5919m8465j33861O9732J61950R5256p6155j98124J9950p4106P607J51098
3324g1037Q1237o6659J6920M9455q0351j31466M7516m7624J79287N4148o226R0450
3312A15650R869m4370k27180j6448J57221M1466O9165j18496L4140J28581k056
3301A47542l1565J6291p3418j59908O1683R1982K2646Q9183l25966J3206k5973
3290a74297P6824J69278l44843M7321k1363P3350J11454m8772j05346j11894M2076
3279b86212O5510J27781J37655p2310k5573q2970O1080L364M1397N0282j4200
$$ plain form
3357 -315146 -319556 -287145 17130 292344 118861 -59737 -156971 -184648 -80973 -35819 141029
3346 141029 200142 129318 65168 29751 -32369 21251 -80130 -37410 164181 63367 -45919
3335 -45919 -94384 -228245 -158513 3437 98693 22538 -175586 -155636 -229742 -222135 -71037
3324 -71037 10200 -56459 -39539 9916 -70435 -201901 -154385 -202009 -22722 31426 25200 115650
3312 115650 125519 81149 -146031 -162479 -5258 36208 105373 -13123 21017 149598 147542
3301 147542 115977 132268 58850 -101058 -39375 52607 75253 164436 -161530 -148324 -174297
3290 -174297 -97473 71805 -273038 -225717 -247080 -173730 -62276 -111048 -216394 -328288 -286212
3279 -286212 -220702 -92921 44734 -27576 -53149 -136119 -75039 -71675 -30278 20004 5804
3268E804l3261R4023o958L3631l3717l2794L1474m5914K145j46978q1792J69623
3256d4714J39276j6449O8264q6090k06918m6410J7052j9062J3592P201M3555Q5078
3244d5625q8273j84095L8081J83653L5947P0460J55452k64871L4513o7330J10218
3233b1870J55175k1310j5305o1821j00348R1369r011P4096R9727j17024q2373
3222h695J8245n4074N1743m4924p5377k782M9379J70660m5535j37064L8852n9842
3210i9414j83075K7907K1127K26861M5858j78955L22m5295k4112J3001K03555
3199G780J14383j88576p0824o0611j3698q616R9570l5465J59438m2279l8171O289
3187g0780O277l7492J10684k1421J8138P7317j82387J21657j03220o1566J38790
$$ plain form
3268 5804 -27457 66566 59608 93239 59522 26728 58202 12288 14433 -132545 -214337 -44714
3256 -44714 94562 78113 146377 60287 -146631 -193041 -175989 -195051 -181459 -174258 -130703 -45625
3244 -45625 -133898 -317993 -279912 -96259 -60312 10148 165600 -99271 -64758 -132088 -21870
3233 -21870 133305 111995 96690 34869 -65479 25890 16879 90975 190702 73678 -8695
3222 -8695 9550 -44524 7219 -37705 -113082 -115864 -66485 104175 58640 -78424 -39572 -99414
3210 -99414 -282489 -254582 -233455 -6594 39264 -139691 -139369 -184664 -208776 -195775 7780
3199 7780 122163 -66413 -137237 -197848 -211546 -220162 -120592 -156057 3381 -38898 -77069 -70780
3187 -70780 -64503 -101995 8689 -12732 5406 82723 -99664 21993 -81227 -142793 -4003
3176d003N8410p4102q5233J29508m8612o4257j40567J99013M8577j23134J74834
3165G0434p6767J17619J3667k83851J00879q7874J6017N3749O253O6240r5024
3154i8658j10844L9608K51836M8424j94401J183L0650l7842j71522O0567Q4223
3143i6776K1747K31764p603j18073M6388j05190Q396R9029k04Q0948q8113K1407
3131I3720j43547r7211O0595O0178J32402j09149q7251r96k28612K32047J38962
3120E1138K1223j05909p4320R4536p5631q577J28960J18251q5022n6288k5670
3109a7309j53174j1873j53105q6409K43044R2649J8860M2912j6637O820j8282
3098e2504m2081j67039Q868Q9600R9645L8504K9423k293K6703m0114K8150M2177
$$ plain form
3176 -4003 54407 -19695 -104928 24580 -24032 -88289 -228856 -29843 18734 -104400 70434
3165 70434 -6333 111286 124953 -158898 -58019 -145893 -129876 -76127 -69874 -3634 -98658
3154 -98658 -209502 -169894 81942 130366 -64035 -62852 -32202 -70044 -241566 -180999 -96776
3143 -96776 -75029 156735 149132 31059 77447 -27743 -19347 79682 79478 160426 72313 93720
3131 93720 -49827 -147038 -86443 -26265 106137 -3012 -90263 -91259 -319871 -87824 51138
3120 51138 72361 -33548 -107868 -13332 -88963 -97540 31420 149671 64649 8361 -17309
3109 -17309 -170483 -182356 -335461 -421870 -178826 -86177 -67317 -24405 -41042 -34222 -52504
3098 -52504 -94585 -261624 -252756 -163156 -63511 -25007 4416 2123 28826 -11288 16862 59039
3086E9039J90454q405j41388j23996j90327J72665J62903j26118O0737j10113
3076e4549j73308L4210N461l4409L973J0213k1254R7319J46186K6583j10835j14833
3064a85243j69206J07196K19915m116j36577J7297O4776M3394J214q987M3516
3053f821m8458r8795M0574J10441M9245l9391r9769Q8964R7627j8654J09520j01918
3041H2565j07946k35439j11318J54171L0111J53628J54911j98460k4j11056M9771
3030a39086J8843P979J23169n0234j32639p3400o723J71271n3588L1394Q8K1061
3018h1865o8066j17933N0720O9284m239J33256R0240j22636K0445P0463K047m4100
3006b384M4273q052J45548j36007q2552J2584P7811J29447k54996j15770R8553
$$ plain form
3086 59039 249493 241088 99700 -24296 -214623 -41958 120945 -5173 55564 -54549
3076 -54549 -227857 -193647 -188186 -222595 -218622 -208409 -229663 -132344 13842 40425 -70410 -185243
3064 -185243 -354449 -247253 -27338 -31454 -168031 -150734 -85958 -42564 -41350 -50337 -6821
3053 -6821 -55279 -154074 -113500 -3059 46186 6795 -92974 -4010 93617 74963 184483 82565
3041 82565 -25381 -260820 -372138 -217967 -187856 -34228 120683 -77777 -77801 -188857 -139086
3030 -139086 -120243 -112264 10905 -39329 -171968 -245368 -252091 -80820 -134408 -103014 -102926 -81865
3018 -81865 -149931 -267864 -217144 -147860 -152099 -18843 71397 -51239 -30794 39669 41716 -2384
3006 -2384 41889 33837 179385 43378 -39174 -26590 51221 180668 -74328 -190098 -91545
2995i1545j99108J26047J06702n5773P0768j79872n5542J53882O6457q2984q1677
2984b22645Q5453k0045j1851O0811K1879p8158Q7530N2046l1919p9171m5894J40728
2972d1236j9213J9062J194l6688o8213p962J97888n0324k3194J764p4855j07489
2960b09266J3693L287J66179p0368k0200L4225P0636o801l7545j8429L936K1905
2948d8748M2324J09167j08771j79073j01371J74297J72416j19136j28572n2893
2938b40360J18884P0957o6999O7432Q1491m7561R4993j26185l471K63679j38862
2927G3998l3269r4845o9547Q8032l3916J560J02368j11870O0936K1257M3198j84324
2915a36422k015m7666J19997J14979p0211N166o5761R0284l6333K3749m4960j52896
$$ plain form
2995 -91545 -290653 -164606 -57904 -113677 -42909 -222781 -278323 -124441 -57984 -140968 -222645
2984 -222645 -137192 -157237 -169088 -108277 -86398 -164556 -77026 -24980 -56899 -136070 -181964 -41236
2972 -41236 -60449 -41387 -40193 -76881 -145094 -153056 44832 -5492 -28686 -26922 -101777 -209266
2960 -209266 -195573 -192286 -26107 -96475 -116675 -82450 -11814 -18615 -56160 -74589 -70653 -48748
2948 -48748 -6424 102743 -6028 -185101 -286472 -112175 60241 -58895 -187467 -240360
2938 -240360 -121476 -50519 -117518 -50086 31405 -16156 78837 -47348 -50819 212860 73998
2927 73998 40729 -54116 -123663 -35631 -69547 -67987 34381 -77489 -16553 4704 47902 -136422
2915 -136422 -138437 -186103 -66106 48873 -21338 -16172 -81933 8351 -27982 -4233 -49193 -202089
2903b02089J49885J9929K6383l506j69820p1628K6933J13726J55327N0644n4902
2892D0882j50283p8219j23944J2846J74388K4018J52286o6359o8514o519M830
2881h4588K25502o6942j36812Q9153K1269o4643O946j27967J12810n113q637J07523
2869F8501O684Q0585j65539j13970Q5591J16744l5207m5663q5652q3214M407n9564
2857b26297O8297k0124j9800J22638p3969P0850j41355k4219R9537L9345l064
2846a08161Q268M859q9524l1116K3460O3170K24205m9117k21846l0913O5077N1836
2834h9802j3343P2804j16595m3068R8831q7576K53543O6202j55561R7025o5610
2823A6850k0007J30594L4126j47508r3395P6837M9844O7379j86200L3643N5837
$$ plain form
2903 -202089 -52204 -32275 -5892 -9398 -179218 -250846 -223913 -110187 45140 95784 40882
2892 40882 -109401 -187620 -311564 -298718 -124330 -100312 51974 -14385 -82899 -89418 -84588
2881 -84588 140914 73972 -62840 26313 47582 -17061 -10115 -138082 -25272 -30385 -39022 68501
2869 68501 75185 155770 -9769 -123739 -38148 78596 43389 -2274 -87926 -171140 -166733 -226297
2857 -226297 -158000 -178124 -197924 -75286 -149255 -78405 -219760 -243979 -144442 -105097 -108161
2846 -108161 -99893 -95034 -184558 -215674 -192214 -129044 95161 46044 -175802 -206715 -141638 -89802
2834 -89802 -103145 -30341 -146936 -190004 -91173 -178749 74794 140996 -14565 82460 16850
2823 16850 -3157 127437 161563 14055 -79340 -2503 47341 114720 -71480 -37837 18000
2812A8000k30860K9413L5246J2171M2471m05020O2984J05295Q8992Q0349q1351
2801b42310R3631p1823q6414J00912N3105M1386j63979o3277J98691J90458q6900
2790c6520j24555J06262J12978J98422l9115L1743j88315j52633L285J39325j3315
2779C7562N3007n0668L6872P783j12421J50798r6843k6432J3078l6788P5271j91629
2767a40410K2624Q8448N8907L8702o9618k43938j06994M0211k0236J0572J42073
2756a79659J15744R4962k7142p0463j8114n0563k3324m0959J79010J63504j33731
2745I265l7907r5083M8227J05637N4743m1104J07115j03312m8644J51119n2166
2734I7890m7182j20694n0037O6164j19903M7372Q4297m4100Q0870k00134R0495
$$ plain form
2812 18000 -212860 -183447 -148201 -136030 -93559 -498579 -435595 -330300 -241308 -160959 -242310
2801 -242310 -148679 -220502 -306916 -206004 -152899 -111513 -275492 -338769 -140078 50380 -36520
2790 -36520 -161075 -54813 58165 256587 217472 249215 60900 -91733 -88448 50877 37562
2779 37562 90569 39901 76773 84556 -27865 122933 26090 -342 12736 -24052 51219 -140410
2767 -140410 -117786 -29338 29569 68271 -1347 -245285 -352279 -312068 -332304 -321732 -179659
2756 -179659 -63915 31047 3905 -66558 -84672 -135235 -158559 -199518 -20508 142996 9265
2745 9265 -28642 -123725 -75498 30139 84882 43778 150893 47581 -1063 150056 97890
2734 97890 50708 -69986 -120023 -53859 -173762 -126390 -42093 -86193 -5323 -205457 -114962
2723a14962o9199j32204J56781r6391j07151J09871J30251K7430j29221o5834
2713b90629R3085M2398N6821J26496K7469l2635k1057k6029K2004K3522L987j3389
2701A2043n0509l000J37525K306q8054l4598r1639K01358p579j03463q1101J12185
2689E474j07942p3217P2698J14616j04948N3976m8738K3870o5030j2701M7668
2678i4274L5937j49472k1189J13362k6496R4281R7526p4744l8206j94389o0137
2667c17801K09718J16164J90869j18015j95636j34172R7943J299J91915K2192
2657F4476L2186L6074R3J6439o8950j80184Q0948P4450J54097q7462j39633j29209
2645a46675j68107P8372J86679J37478q9880j07508k4314q6936l5037R0390J09288
$$ plain form
2723 -114962 -184161 -316365 -159584 -255975 -363126 -253255 -123004 -95574 -224795 -290629
2713 -290629 -197544 -155146 -98325 28171 55640 23005 1948 -24081 -2077 21445 25432 12043
2701 12043 -38466 -41466 96059 98365 10311 -24287 -115926 85432 77853 -25610 -106711 5474
2689 5474 -102468 -175685 -102987 11629 -93319 -39343 -88081 -64211 -129241 -141942 -94274
2678 -94274 -58337 -207809 -228998 -115636 -142132 -47851 49675 -25069 -63275 -257664 -317801
2667 -317801 -108083 8081 198950 80935 -114701 -248873 -150930 -149631 42284 64476
2657 64476 96662 132736 132829 149268 80318 -99866 -18918 55532 209629 122167 -17466 -146675
2645 -146675 -314782 -236410 -49731 87747 -2133 -109641 -133955 -220891 -255928 -165538 -56250
2634e6250J6933j29825q1569J03985N2468j90727n237J94328J11911K7166p9001
2623c5818k8923l9841K0498o0971M3080J17631j48682m4742M2740o6880L1753
2612a70155K0686J57934J32333j87648j40420J39351m151m7605n1948J46802J96538
2601A91717k00614R823L3141r1890j21430M4307K0846J862Q8976K3159K5487p0595
2589d5211J4409L9460j22667J88053o7901m8294K987m1932L6265J915M8990O1301
2577F7375L280P5020j31124l5838j41926n7422K56192o1850Q742r6898P2608O6242
2565B4401P3115n4144j95326K9129p450N5694K09602r173o7482n1916k5553N4910
2553C5807k295r104l3944j47267L7002J39610l6741l0023j42663M1759J98031
$$ plain form
2634 -56250 -39317 -169142 -250711 -146726 -94258 -284985 -290222 -95894 16017 43183 -35818
2623 -35818 -64741 -104582 -84084 -145055 -101975 15656 -133026 -177768 -135028 -201908 -170155
2612 -170155 -149469 8465 140798 -46850 -187270 -47919 -52070 -99675 -151623 -4821 191717
2601 191717 -8897 926 34067 -57823 -179253 -134946 -114100 -112238 -23262 -103 25384 -45211
2589 -45211 -30802 8658 -114009 74044 6143 -42151 -39164 -81096 -44831 -42916 6074 67375
2577 67375 70655 145675 14551 -21287 -163213 -220635 35557 -26293 -17551 -114449 -41841 24401
2565 24401 97516 43372 -151954 -122825 -130275 -74581 135021 125848 58366 6450 -19103 35807
2553 35807 33512 24408 -9536 -156803 -119801 19809 -16932 -46955 -189618 -147859 50172
2542E0172q229l4958p7242q3043l181Q0034J99972N1220k36249j70351J67188
2531f4667j6876J15386M4818j00947k8380j15760J42041M3603j12943Q9840r6807
2520a00692k0945K31017o5873j3259j94189j15812L5273K62371J69535n3206k19075
2509h4855k35886j66873J40463J84089K4197r5949p6183Q6924J36444J19833o7016
2498c4812Q223j45507K5362K40660J4993n7853j16971j35766J15528R5915N3604
2487F3376M3180J4775j61127R0279j7053L9545p9015j22850R5740K09830M7497
2476B24177p5025k24432j112j20j27092K12513j096j8094p2870p0431L2598M8736
2464g2248j36565L2192P6487p6909M7858j39479l5459J20637L938Q2819o9377
$$ plain form
2542 50172 41943 6985 -70257 -153300 -156481 -76447 123525 174745 -61504 -231855 -64667
2531 -64667 -81543 33843 78661 -22286 -50666 -166426 -24385 19218 -93725 -3885 -100692
2520 -100692 -121637 109380 43507 30248 -163941 -279753 -244480 17891 187426 134220 -84855
2509 -84855 -320741 -487614 -347151 -163062 -138865 -234814 -310997 -224073 -87629 32204 -34812
2498 -34812 -26589 -172096 -146734 93926 108919 51066 -65905 -201671 -86143 9772 63376
2487 63376 106556 121331 -39796 50483 33430 72975 -6040 -128890 -33150 176680 224177
2476 224177 149152 -75280 -76392 -76512 -203604 8909 7813 -10281 -83151 -153582 -120984 -72248
2464 -72248 -208813 -176621 -100134 -177043 -129185 -268664 -304123 -183486 -179548 -96729 -166106
2453a66106J35776J0397j27806O9282K4070J2537J37704r9265Q9604J09448p0901
2442A24740O1494j95709m5695J67012R7765j61642j6551j26070k6685J34143o0915
2431d8113J70163Q242L2348o3307l06566R1188J10696J34056M3970j27805k11855
2420a66983J16282O9407r0488M7390q3865J7322J07561l020o8449p9336j2017
2409a46196N9382O2196J23597o4356l2527j5812J6564L7600L0275k8684r6925
2398e4886O242J1018J8548K9227o7957R9843L3722K0059m3750o8536k6458l1858
2386g4786N6630j3261o3898P1467k212n1047P2891n7337M1724K39866m3473j68544
2374H020k39858l8085K09564J31986J54868k9587k48400j11589N3800J20731L4065
$$ plain form
2453 -166106 -30330 -19933 -147739 -78457 -54387 -41850 95854 -3411 86193 195641 124740
2442 124740 186234 -9475 -55170 111842 209607 47965 31414 -94656 -121341 12802 -48113
2431 -48113 122050 130292 162640 99333 -207233 -116045 -5349 128707 172677 44872 -166983
2420 -166983 -50701 18706 -71782 -24392 -108257 -90935 16626 13606 -54843 -134179 -146196
2409 -146196 -86814 -24618 98979 34623 2096 -13716 2848 40448 70723 42039 -54886
2398 -54886 -48644 -37626 -19078 10149 -57808 42035 75757 95816 52066 -16470 -42928 -74786
2386 -74786 -18156 -31417 -95315 -23848 -26060 -77107 -4216 -61553 -19829 220037 176564 8020
2374 8020 -231838 -269923 -60359 71627 226495 196908 -51492 -163081 -109281 11450 45515
2363D5515q9512j35179r6203Q9201M9618p805N6185M9237N053M4770O9898j37524
2351e6746p8173N9321J4028K02481P4664l8407r4701j02797k3268J29439j5151
2340G0690r9291m6954Q8300J6295r7993j48730O6408L6899M6493J50296o0797
2329B1616r5234p3646J08032P3370n9614p2998L6432n0593M4970k7972p8771M0711
2317a33697o8485J07296K30296k4929o8777k57197l5775J83692J45498n9335O256
2306B4843O9751j18477j06468K4175Q6601J1182J19493K2526q1849j56118j1444
2295a15785J3875l0433Q0048J31520j1524j15909o3249K105j4865Q7099k9942
2284f7060K8101Q0646j09587n9600m7312j2367R3143J23306Q857l8439P493q8399
$$ plain form
2363 45515 -43997 -179176 -275379 -186178 -136560 -144365 -88180 -38943 -33890 10880 80778 -56746
2351 -56746 -134919 -75598 -61570 140911 215575 177168 82467 -20330 -43598 85841 70690
2340 70690 -28601 -75555 12745 29040 -68953 -217683 -151275 -114376 -67883 82413 21616
2329 21616 -73618 -147264 -39232 34138 -25476 -98474 -62042 -112635 -67665 -95637 -174408 -133697
2317 -133697 -202182 -94886 135410 110481 41704 -215493 -251268 -67576 77922 18587 24843
2306 24843 94594 -23883 -130351 -106176 -19575 -8393 111100 133626 51777 -104341 -115785
2295 -115785 -101910 -132343 -52295 79225 67701 -48208 -111457 -109352 -124217 -37118 -67060
2284 -67060 -38959 41687 -67900 -127500 -174812 -187179 -94036 29270 38127 -312 7181 -81218
2272h1218l8751R7816J4322o1675M7009Q9456O9507j11941O6090j69444j57255
2261b36084K77901M6215L2662q2692j44832R3688Q2123j41251j8406n1708n6899
2250a99283J91953j5169P536q9042k1022M9673m8530J83249q4739j38448M1773
2239a22049j0517J05666q711n7861O7260P0390P9252j26743n1550p2859L082M3332
2227h1308O8058J38544q3433N2979j08517M4172N1692j35578O9370q2783J07552
2216D0748J9190j24889o5039J19224Q8683k4518o5673N3336O4458m5328j05681
2205d5489j02795m2976O9795K51729J42416r3554k43387j64664k0612K4947J03912
2194a20678J1978O4939J37015j7326k7781N5177m8400o4827J61777j67417J84475
$$ plain form
2272 -81218 -119969 -22153 -7831 -69506 -22497 66959 136466 24525 90615 -78829 -236084
2261 -236084 41817 88032 120694 38002 -106830 -13142 68981 -72270 -90676 -142384 -199283
2250 -199283 -7330 -22499 -14963 -104005 -125027 -75354 -123884 59365 -25374 -163822 -122049
2239 -122049 -132566 -26900 -35611 -93472 -26212 44178 123430 -3313 -54863 -127722 -124640 -81308
2227 -81308 -13250 125294 41861 94840 -13677 30495 82187 -53391 15979 -66804 40748
2216 40748 59938 -64951 -129990 -10766 77917 53399 -12274 41062 105520 60192 -45489
2205 -45489 -148284 -191260 -121465 130264 272680 179126 -64261 -228925 -249537 -224590 -120678
2194 -120678 -108700 -43761 93254 75928 48147 103324 54924 -9903 151874 -15543 168932
2183A68932n6636k59244P449M1310J68336J07057m4421k69420j2151J8059J75478
2172D4749j3480J0975r6496j45802M4825L2499Q0715J1585j707K3550o8983j0667
2160h8237Q4541j65625K05103Q8279j25777m634n7296j01255Q4309q572J40036
2149E0872K6985j08157k4846k1059q6844J7095J56649L7381K1918j14723m0333
2138h5062p0791p2756J15816J83647K5077j76388k3605r279k1966M6407J1374
2127g7526J47963M5219r3838j24099Q5360P3910j13255J01482N4225j0961j9823
2116F8657j56105m5290l1811J0991J16313o2518j11229K06677M2586J35799j37766
2105C6304k4469K4705N106n5789O1399q599K2398J95964o9178l7178l1030r8877
$$ plain form
2183 168932 112296 -146948 -139499 -98189 70147 177204 132783 -136637 -148788 -130729 44749
2172 44749 31269 42244 -54252 -200054 -155229 -122730 -42015 -30430 -32137 -8587 -77570 -88237
2160 -88237 -3696 -169321 35782 124061 -1716 -6350 -63646 -164901 -80592 -89164 50872
2149 50872 77857 -30300 -55146 -76205 -163049 -145954 10695 48076 69994 -44729 -85062
2138 -85062 -155853 -228609 -112793 70854 95931 -80457 -104062 -113341 -135307 -88900 -77526
2127 -77526 70437 115656 21818 -102281 -16921 56989 -56266 45216 99441 88480 68657
2116 68657 -87448 -132738 -164549 -153558 -37245 -99763 -210992 -4315 38271 174070 36304
2105 36304 11835 36540 41646 -14143 47256 38657 61055 257019 187841 150663 119633 20756
2093B0756N4878Q8029l8477j2885p6301N6618j9165m5898l2858R755j7957j01898
2081a15403m2950J08981n3438R7208O5587j27014J25687j3408j18083R8962r107
2070A7022l6865n9360L2123q2232J17095L586J23488j19036j03383J50088J127
2059D3653N5292j36079J02703J8807K0434J12328n7979j74151m7075o5770P2436
2048e5401N7771O819n349j32765K1689P3627O2321n174j75315L6707R0915P6831
2036E2676O2999j69339m0093J0225J05865L2555j1910J38031l0848j235l2126
2025A16800j27920j97138K14401J64049o4602j68443j39933J18031L2414R4698
2015D2357O4148j09004j36777l184P5180J4990L181N6042p1779Q0748Q7664N7757
$$ plain form
2093 20756 75634 163663 125186 112301 36000 92618 73453 27555 -5303 4452 -13505 -115403
2081 -115403 -158353 -49372 -102810 -5602 59985 -67029 58658 45250 -72833 26129 17022
2070 17022 -19843 -79203 -47080 -129312 -12217 -8631 114857 -4179 -107562 42526 43653
2059 43653 98945 -37134 65569 84376 104810 217138 159159 -14992 -62067 -127837 -55401
2048 -55401 2370 9189 3840 -128925 -107236 -33609 28712 23538 -151777 -115070 -24155 52676
2036 52676 115675 -53664 -93757 -83532 22333 54888 42978 181009 150161 148926 116800
2025 116800 -11120 -208258 6143 170192 105590 -62853 -202786 -84755 -52341 42357
2015 42357 106505 -2499 -139276 -142460 -67280 -52290 -49109 6933 -64846 15902 103566 161323
2003A61323P5877j06887k01565P4712k7555P5870K4794j07107p1739k9691J12572
1992a9396L0032J13558p5410r8843N5646L4889J3740p1629p4463j6336j1013J93158
1980G3933K894j16043k7867q9096K7956J22871L090R5000r7397j53131n5980K9206
1968a84564N3150J03553L1025M3803j2010p4630K60361k9104k31530j37512P5023
1957a02435J41752Q4184o3323O2839k34807k9522J05356J56229J9614m7553p7055
1946A5279J2122J43434J6837k7609p1797r3369P2537j93581j30848K39121l7685
1935e5559K7449r2982J03520J5958m455J2575m9562o3071q6481J29799J81672
1924A18863k3065o0185l8529m8845K0308O0159P9240j06301j60414J08219N6589
$$ plain form
2003 161323 237200 130313 -71252 3460 -24095 51775 76569 -30538 -102277 -131968 -19396
1992 -19396 10636 124194 48784 -50059 5587 40476 54216 -17413 -91876 -108212 -119225 73933
1980 73933 76827 -39216 -67083 -156179 -128223 -5352 -2262 92738 -4659 -157790 -213770 -184564
1968 -184564 -131414 -27861 3164 46967 34957 -39673 220688 191584 -39946 -177458 -102435
1957 -102435 39317 123501 60178 123017 -111790 -141312 -35956 120273 139887 92334 15279
1946 15279 27401 170835 187672 160063 88266 -5103 67434 -126147 -256995 -17874 -55559
1935 -55559 -28110 -121092 -17572 -1614 -6069 6506 -43056 -106127 -192608 -62809 118863
1924 118863 95798 35613 -2916 -51761 -31453 28706 107946 1645 -158769 -50550 6039
1913F039J20364n6548o6872j10033O0515o545K3053J07200P475j77617j32201
1902b25170J16549N1207O5869L6676k3646j68435l7296J03015P3299O3441j96371
1891a40862k5742J63212l1922j5212J08120j5579j246j71236R5650r7649k562
1880a35028O9315k6223M0401J8945Q9878q2138r8853j32041R0764J17786M8939
1869A745O0782j75432j24J93907m6221J60675j73701q6408r3186J06074p409K1334
1857c7964n788n556M8323J631J13196m7284r2543j13432k5431J05224J41580P9543
1845A61499q1498k01552N4834N8056m473j17493Q0122J45741j8175m0913j16137
1834g9989q4825m0752O8133K61994P2103l334j16994k27916P6243j3734O6625
$$ plain form
1913 6039 126403 69855 2983 -107050 -46535 -53080 -30027 77173 84648 -92969 -225170
1902 -225170 -108621 -57414 8455 45131 21485 -146950 -184246 -81231 -7932 55509 -140862
1891 -140862 -166604 -3392 -35314 -50526 57594 42015 40769 -130467 -34817 -132466 -135028
1880 -135028 -65713 -91936 -51535 -32590 57288 -24850 -123703 -255744 -164980 -47194 1745
1869 1745 62527 -112905 -113029 80878 34657 195332 21631 -64777 -157963 -51889 -59298 -37964
1857 -37964 -43752 -49308 -985 646 113842 66558 -25985 -139417 -164848 -59624 81956 161499
1845 161499 80001 -121551 -66717 -8661 -13134 -130627 -50505 95236 77061 36148 -79989
1834 -79989 -164814 -205566 -137433 124561 196664 193330 76336 -151580 -75337 -89071 -22446
1823b2446O2437q2907M7800N3959K4462n6010j26043K8528R6906J6587m0602q0917
1811g8246j23835O285J58410k669K9066K5301q8597n8094k4002J50010q1330P3940
1799a3761O4240q8489M0334R169m7875P1092K7167J45848j44942j98809L0493
1788a05533K2594J19374j8370j75569m0430O328J54593l583J6117p2873M8101
1777d9251k8829L2525J55405m4591j78437q5829K07563R5281l3294j09727N843
1766c3341J8614M1730J75159J087q8081l9363j20367P2315j0710o7025M480J02744
1754E7242j38169R1009j9628K8998Q2097n6469J03743p8924m4793J44939N363
1743A75408n2685j09178q8387P1120R3934K3965o7979j66121k7318L3613J31934
$$ plain form
1823 -22446 39991 -42916 4884 58843 83305 27295 -98748 -70220 26686 43273 2671 -78246
1811 -78246 -202081 -195796 -37386 -40055 -10989 14312 -74285 -132379 -156381 -6371 -87701 -13761
1799 -13761 50479 -38010 2324 11493 -36382 34710 61877 207725 62783 -136026 -105533
1788 -105533 -82939 36435 18065 -157504 -197934 -191606 -37013 -40596 -24479 -97352 -49251
1777 -49251 -78080 -45555 109850 65259 -113178 -199007 8556 103837 70543 -39184 -33341
1766 -33341 -14727 27003 202162 203249 115168 75805 -44562 27753 17043 -49982 -45502 57242
1754 57242 -80927 10082 -9546 19452 101549 45080 148823 69899 25106 170045 175408
1743 175408 122723 13545 -74842 -3722 90212 114177 46198 -119923 -147241 -113628 18306
1732A8306Q676j01246j66919l4475L9410L14141N261j32731q7628J8510K06972
1721H8277Q1856o8347o7619j21495P0286J4750R6483j04j07794K8754j03043Q1004
1709f992M9727l4746m6107N8867L1429J3492o8941M5485q5633m8992N4118j5666
1697e3959m9537R2528o9611p1290R8813M5108J11772j57511k30807k5541Q8639
1686b21396J39835k404k7061j7383l5932K6194N9157Q8870p4723j2610p4067N619
1674a45901J23802M2274j25422j6994L9207j25729J07301P9260R541O2062n0262
1663h61R7340j61490m5109R4364k4786L1015j34333K27856l6466k46869r986J90064
1651a9261J49221n4551l4622l77n4623N0605K5185K0885j07273k5841j35090n9190
$$ plain form
1732 18306 26982 -74264 -241183 -275658 -236248 77893 83154 -49577 -137205 -118695 88277
1721 88277 170133 101786 34167 -87328 -17042 -2292 94191 94087 -13707 15047 -87996 -6992
1709 -6992 42735 7989 -38118 20749 52178 65670 -3271 42214 -43419 -92411 -38293 -53959
1697 -53959 -103496 -10968 -80579 -151869 -53056 -7948 103824 -53687 -284494 -310035 -221396
1686 -221396 -81561 -83965 -111026 -128409 -164341 -138147 -78990 9880 -64843 -77453 -151520 -145901
1674 -145901 -22099 20175 -105247 -122241 -83034 -208763 -101462 -22202 -12661 49401 -861
1663 -861 96479 -65011 -110120 -15756 -40542 -9527 -143860 83996 47530 -199339 -209325 -19261
1651 -19261 129960 75409 40787 40410 -14213 36392 61577 82462 -24811 -50652 -185742 -244932
1639b44932N9564N8264J18228P0822k7734J4127n5114j45666r5657Q4639M4329
1628a19130J72555K7464k28016j68745K1950j6305O2967J05120R1586J69651q2891
1617C6206n0602K9646j46844J07779M5550Q0689N6595p0934J65387j74552p3710
1606E210m7660J6303J74928M7124p2629j64364q6339l7671m2438J59830J77659
1595A29953k65714j81640J33291R4144O728J9928n9059j23254P8466k6262J46259
1584d7160p2577j16087P9840J45189J73345N3282M2343k07330j06096N7414j10838
1573a08675J06512O5624j33594n5335N4960L07141o0366j69460J3805j24905M7451
1562e6842M8279q9233J89772j1229k3249j333j7561J13492j44295n1451N4727
$$ plain form
1639 -244932 -185368 -127104 -8876 61946 34212 48339 -6775 -152441 -248098 -163459 -119130
1628 -119130 53425 80889 -147127 -315872 -293922 -310227 -247260 -142140 -50554 119097 36206
1617 36206 -14396 15250 -131594 -23815 21735 102424 159019 88085 253472 78920 5210
1606 5210 -42450 -26147 148781 195905 123276 -41088 -127427 -165098 -207536 -47706 129953
1595 129953 -135761 -317401 -184110 -89966 -83238 -63310 -122369 -245623 -167157 -193419 -47160
1584 -47160 -119737 -235824 -155984 -10795 162550 215832 258175 50845 -55251 2163 -108675
1573 -108675 -2163 63461 -70133 -125468 -70508 236633 176267 6807 20612 -104293 -56842
1562 -56842 -8563 -97796 91976 80747 57498 56165 38604 152096 7801 -43650 11077
1551A1077q6601o7931P5834M8889J42770j3515q1103P1681o951k4017J0313j67995
1539h7549J34135n1669N4210L61251j66870k14807M1627M7929R7957k9534J00074
1528B86754j82921j55592M4894L4832l7533J4515o8042p0616K36122q803q6942
1517F668o6844j76321P5978J05921J13844N4735m7861j01364p2552J07004P1421
1506G0629M5304m5655j36741J02914q8445n9481K36756n2005J36100j93888j92355
1495a76867P7298l996J45252j2731j0711J06213n2912P7200K1217k20010j04744
1484a54791n9732Q3139K27224j2582p1505q6710p9720j1757J45001L8711L0645
$$ plain form
1551 11077 -75524 -143455 -67621 -18732 124038 110523 29420 101101 94150 70133 80446 -87549
1539 -87549 46586 -5083 49127 410378 243508 28701 70328 118257 216214 186680 286754
1528 286754 103833 -51759 -6865 27967 -9566 4949 -63093 -133709 102413 93610 6668
1517 6668 -60176 -236497 -160519 -54598 59246 113981 66120 -35244 -107796 -792 70629
1506 70629 115933 70278 -66463 36451 -51994 -111475 125281 73276 209376 15488 -176867
1495 -176867 -99569 -103565 41687 28956 18245 124458 71546 148746 169963 -50047 -154791
1484 -154791 -214523 -131384 95840 83258 11753 -74957 -154677 -166434 -21433 17278 47923
$$ [...]
##END NTUPLES=NMR SPECTRUM
##END=
