##TITLE=1H_TG-2409-2
 200.13Hz, CDCl3.
 8 sc
 15.6.2026
##JCAMPDX= 6.0         $$ Bruker NMR JCAMP-DX V2.0
##DATA TYPE= NMR SPECTRUM
##DATA CLASS= NTUPLES
##ORIGIN= UXNMR, Bruker Analytische Messtechnik GmbH
##OWNER= pz
$$ XWIN-NMR		Version 3.5
$$ Mon Jun 15 13:57:14 2026 Russian Standard Time (UT+4h)  she@DPX200
##.OBSERVE FREQUENCY= 200.131
##.OBSERVE NUCLEUS= ^1H
##.ACQUISITION MODE= SIMULTANEOUS
##.ACQUISITION SCHEME= undefined
##.AVERAGES= 8
##.DIGITISER RES= 18
##SPECTROMETER/DATA SYSTEM= spect
##.PULSE SEQUENCE= zg30
##.SOLVENT NAME= CDCl3
##.SHIFT REFERENCE= (INTERNAL, CDCl3, 0, 13.9444)
##AUDIT TRAIL= $$ (NUMBER, WHEN, WHO, WHERE, WHAT)
$$ ##TITLE= Audit trail, XWIN-NMR		Version 3.5
$$ ##JCAMPDX= 5.01
$$ ##ORIGIN= Bruker BioSpin GmbH
$$ ##OWNER= she
$$ F:/spectra/data/she/nmr/H-C/1/pdata/1/auditp.txt
$$ ##AUDIT TRAIL=  $$ (NUMBER, WHEN, WHO, WHERE, WHAT)
(   1,<2026-06-15 13:55:50.29 +0400>,<she>,<DPX200>,
      <created by zg, POWCHK disabled, PULCHK disabled
       configuration hash MD5:
       00 E9 B6 7A A2 85 ED C7 34 08 36 98 17 FE 4E 26
       data hash MD5: 16K
       92 66 ED 79 DC DB 9C 53 68 F5 ED 7D D0 2F 91 B8>)
(   2,<2026-06-15 13:55:52.51 +0400>,<she>,<DPX200>,
      <Start of raw data processing
       efp BC_mod = 2 LB = 0.25 FT_mod = 6 PKNL = 1 PHC0 = -4211.004 PHC1 = 0.592293 SI = 16K 
       data hash MD5: 16K
       7C 6D B8 44 B0 07 B5 09 9F 44 1F 53 77 05 BD 4C>)
(   3,<2026-06-15 13:56:17.07 +0400>,<she>,<DPX200>,
      <pk PHC0 = -164.3805 PHC1 = 7.799999 
       data hash MD5: 16K
       01 56 A9 41 9D 6D 5D 62 CD 82 E4 F1 76 24 CC B4>)
(   4,<2026-06-15 13:56:21.07 +0400>,<she>,<DPX200>,
      <abs ABSG = 5 
       data hash MD5: 16K
       03 F0 E2 7F 8E 94 76 B3 16 40 47 F9 2A 9F 49 BD>)
$$ ##END=
$$ 
$$ hash MD5
$$ A5 70 DD 68 4A 36 58 12 83 C9 63 57 2A BC E0 0D
##$RELAX= 
##$RELAX= 
##$RELAX= 
##$RELAX= 
##$RELAX= 
##$RELAX= 
$$ Bruker specific parameters
$$ --------------------------
##$DU= <F:/spectra>
##$EXPNO= 1
##$NAME= <H-C>
##$PROCNO= 1
##$TYPE= <nmr>
##$USER= <she>
##$AMP= (0..31)
100 100 100 100 100 100 100 100 100 100 100 100 100 100 100 100 100 100 
100 100 100 100 100 100 100 100 100 100 100 100 100 100 
##$AQSEQ= 0
##$AQ_mod= 1
##$AUNM= <au_zg>
##$AUTOPOS= <>
##$BF1= 200.13
##$BF2= 200.13
##$BF3= 200.13
##$BF4= 200.13
##$BF5= 200.13
##$BF6= 200.13
##$BF7= 200.13
##$BF8= 200.13
##$BYTORDA= 1
##$CFDGTYP= 0
##$CFRGTYP= 5
##$CHEMSTR= <none>
##$CNST= (0..31)
1 1 145 1 1 1 1 1 1 1 1 1 1 1 1 1 1 1 1 1 1 1 1 1 1 1 1 1 1 1 1 1 
##$CPDPRG= <>
##$CPDPRG1= <>
##$CPDPRG2= <>
##$CPDPRG3= <>
##$CPDPRG4= <mlev>
##$CPDPRG5= <mlev>
##$CPDPRG6= <mlev>
##$CPDPRG7= <mlev>
##$CPDPRG8= <mlev>
##$CPDPRGB= <>
##$CPDPRGT= <>
##$D= (0..31)
0 0.7 0 0 0 0 0 0 0 0 0 0.03 0 0 0 0 0 0 0 0 0 0 0 0 0 0 0 0 0 0 0 0 
##$DATE= 1781517349
##$DBL= (0..7)
120 120 120 120 120 120 120 120 
##$DBP= (0..7)
150 150 150 150 150 150 150 150 
##$DBP07= 0
##$DBPNAM0= <>
##$DBPNAM1= <>
##$DBPNAM2= <>
##$DBPNAM3= <>
##$DBPNAM4= <>
$$ [...]
##$SUBNAM3= <"">
##$SUBNAM4= <"">
##$SUBNAM5= <"">
##$SUBNAM6= <"">
##$SUBNAM7= <"">
##$SUBNAM8= <"">
##$SUBNAM9= <"">
##$SW= 18.0517599122864
##$SWIBOX= (0..15)
0 0 2 0 0 0 0 0 0 0 0 0 0 0 0 0 
##$SW_h= 3612.71676300578
##$TD= 16384
##$TD0= 1
##$TE= 0
##$TE2= 300
##$TE3= 300
##$TEG= 300
##$TL= (0..7)
0 120 120 120 120 120 120 120 
##$TP= (0..7)
150 150 150 150 150 150 150 150 
##$TP07= 0
##$TPNAME0= <>
##$TPNAME1= <>
##$TPNAME2= <>
##$TPNAME3= <>
##$TPNAME4= <>
##$TPNAME5= <>
##$TPNAME6= <>
##$TPNAME7= <>
##$TPOAL= (0..7)
0.5 0.5 0.5 0.5 0.5 0.5 0.5 0.5 
##$TPOFFS= (0..7)
0 0 0 0 0 0 0 0 
##$TUNHIN= 0
##$TUNHOUT= 0
##$TUNXOUT= 0
##$USERA1= <user>
##$USERA2= <user>
##$USERA3= <user>
##$USERA4= <user>
##$USERA5= <user>
##$V9= 5
##$VALIST= <valist>
##$VCLIST= <CCCCCCCCCCCCCCC>
##$VD= 0
##$VDLIST= <DDDDDDDDDDDDDDD>
##$VPLIST= <PPPPPPPPPPPPPPP>
##$VTLIST= <TTTTTTTTTTTTTTT>
##$WBST= 1024
##$WBSW= 4
##$XGAIN= (0..3)
0 0 0 0 
##$XL= 0
##$YL= 0
##$YMAX_a= 231719
##$YMIN_a= -376445
##$ZGOPTNS= <>
##$ZL1= 120
##$ZL2= 120
##$ZL3= 120
##$ZL4= 120
##$ABSF1= 13.99943
##$ABSF2= -4.05242
##$ABSG= 5
##$ABSL= 3
##$ALPHA= 0
##$AQORDER= 0
##$ASSFAC= 0
##$ASSFACI= 0
##$ASSFACX= 0
##$ASSWID= 0
##$AUNMP= <proc_1d>
##$AZFE= 0.1
##$AZFW= 0.1
##$BCFW= 0
##$BC_mod= 2
##$BYTORDP= 0
##$COROFFS= 0
##$CY= -3
##$DATMOD= 1
##$DC= 0
##$DFILT= <>
##$DTYPP= 0
##$F1P= 0
##$F2P= 0
##$FCOR= 1
##$FTSIZE= 16384
##$FT_mod= 6
##$GAMMA= 0
##$GB= 0
##$INTBC= 1
##$INTSCL= 3.241238e-09
##$ISEN= 128
##$LB= 0.25
##$LEV0= 0
##$LPBIN= 0
##$MAXI= 10000
##$MC2= 0
##$MEAN= 0
##$ME_mod= 0
##$MI= 1.114404
##$NCOEF= 0
##$NC_proc= -7
##$NLEV= 6
##$NOISF1= 3.799351
##$NOISF2= 2.8
##$NSP= 0
##$NTH_PI= 0
##$NZP= 0
##$OFFSET= 13.94435
##$PC= 1
##$PHC0= -4375.384
##$PHC1= 8.392292
##$PH_mod= 1
##$PKNL= yes
##$PPARMOD= 0
##$PSCAL= 0
##$PSIGN= 0
##$REVERSE= no
##$SF= 200.130015675051
##$SI= 16384
##$SIGF1= 3
##$SIGF2= 2
##$SINO= 0.751879
##$SIOLD= 32768
##$SREGLST= <19F.Aceton>
##$SSB= 0
##$STSI= 16384
##$STSR= 0
##$SW_p= 3612.71676300579
##$SYMM= 0
##$S_DEV= 0
##$TDeff= 16384
##$TDoff= 0
##$TI= <>
##$TILT= no
##$TM1= 0
##$TM2= 0
##$TOPLEV= 0
##$USERP1= <user>
##$USERP2= <user>
##$USERP3= <user>
##$USERP4= <user>
##$USERP5= <user>
##$WDW= 1
##$XDIM= 16384
##$YMAX_p= 346424770
##$YMIN_p= -269237
$$ End of Bruker specific parameters
$$ ---------------------------------
##NTUPLES= NMR SPECTRUM
##VAR_NAME=  FREQUENCY,     SPECTRUM/REAL,   SPECTRUM/IMAG
##SYMBOL=    X,             R,               I
##VAR_TYPE=  INDEPENDENT,   DEPENDENT,       DEPENDENT
##VAR_FORM=  AFFN,          ASDF,            ASDF
##VAR_DIM=   16384,         16384,           16384
##UNITS=     HZ,            ARBITRARY UNITS, ARBITRARY UNITS
##FACTOR=    0.220516191357248, 1,           1
##FIRST=     2790.68303263289, 0,            0
##LAST=      -822.0337303729, 0,             0
##MIN=       -822.0337303729, -269237,       0
##MAX=       2790.68303263289, 346424770,    0
$$ Real data points
##PAGE= N=1
##DATA TABLE= (X++(R..R)), XYDATA
$$ [...]
7260A9707772j07576j90097k08277k22880k49508k11223k63701l06382k92642
$$ 19707772 19600196 19410099 19201822 18978942 18729434 18518211 18254510 17948128 17655486
7251A7655486l12209k46675j38289k33607n8243l9908j63218j34562j16868j98255
$$ 17655486 17343277 17096602 16958313 16724706 16666463 16626555 16463337 16328775 16211907 16013652
7241A6013652k31098k63607k21094k61663m21138l93864m27396m50842n05018
$$ 16013652 15782554 15518947 15297853 15036190 14615052 14221188 13793792 13342950 12837932
7232A2837932l84544l32262l57749j84499j56891k64407k38272j70710j33512
$$ 12837932 12453388 12121126 11763377 11578878 11421987 11157580 10919308 10748598 10615086
7223A0615086r0477p9937m8420j27665j58074j85745k37069k45010k51935k89729
$$ 10615086 10524609 10444672 10396252 10268587 10110513 9924768 9687699 9442689 9190754 8901025
7213H901025l71965l68204l37112l16739k92873k86570l19559j91754k27538j51037
$$ 8901025 8529060 8160856 7823744 7507005 7214132 6927562 6608003 6416249 6188711 6037674
7203F037674k28994j79839r0906J5722j07543o4804o2267p7037j06127n8668M153
$$ 6037674 5808680 5628841 5537935 5553657 5446114 5381310 5319043 5242006 5135879 5077211 5081364
7192E081364j12511p0661K9726j23926j60368j10936j36050k25789j34795q0672
$$ 5081364 4968853 4898192 4927918 4803992 4643624 4532688 4396638 4170849 4036054 3955382
7182C955382j29981p7876j13075r6910p3622q6749K799o6030k3697K2340O5985
$$ 3955382 3825401 3747525 3634450 3537540 3463918 3377169 3379968 3313938 3290241 3312581 3378566
7171C378566m0515p878j704k4463M2119l6813n6093j0649J02515p3046j09997
$$ 3378566 3338051 3330173 3328469 3304006 3346125 3309312 3253219 3242570 3345085 3272039 3162042
7160C162042l9169m7852p6597L639k217r3219M3549K9952M320M9807M3013Q600
$$ 3162042 3122873 3075021 2998424 3002063 2999846 2906627 2950176 2980128 2984448 3034255 3077268 3085868
7148C085868N876K4188O2028K8023J00092O4397j4140p746m4715J3689n9679o6557
$$ 3085868 3091744 3115932 3177960 3205983 3306075 3370472 3356332 3348586 3303871 3317560 3257881 3191324
7136C191324r6939J5551N9846j3590n9905j7358j03378N013n4698o2303l8685
$$ 3191324 3094385 3109936 3169782 3156192 3096287 3078929 2975551 2980564 2925866 2863563 2824878
7125B824878n5422n9042K7687L1624k3807l2776k1215K2871k3054K249m1634k407
$$ 2824878 2769456 2710414 2738101 2769725 2745918 2713142 2691927 2714798 2691744 2693993 2652359 2649952
7113B649952k692K0968P559P593j8591L2970R8443L2304P093K2328L0119J3340
$$ 2649952 2647260 2668228 2675787 2683380 2664789 2697759 2796202 2828506 2835599 2857927 2888046 2901386
7101B901386K9744K8562j1119j9924n5294O8354J01231N7061m7194m5405p5055
$$ 2901386 2931130 2959692 2948573 2928649 2873355 2941709 3042940 3100001 3052807 3007402 2932347
7090B932347k0076J0667j7725k5104o3842K035m985l7616j623J4164R579R2559
$$ 2932347 2912271 2922938 2905213 2880109 2816267 2818302 2813317 2775701 2774078 2788242 2797821 2890380
7078B890380J2504r2909J3291M6048Q090O1385J75359L1693J28422J49290J59593
$$ 2890380 2902884 2809975 2823266 2869314 2877404 2938789 3114148 3145841 3274263 3423553 3583146
7067C583146J30219J28981J57217R0724N0349l7001j18302j69942r2936q3943
$$ 3583146 3713365 3842346 3999563 4090287 4140636 4103635 3985333 3815391 3722455 3638512
7057C638512O745J651M0713J26115J33871K14367K53217J43056J37527J51925
$$ 3638512 3645257 3646908 3687621 3813736 3947607 4161974 4415191 4558247 4695774 4847699
7047D847699N2199j5529j6430j06567j04949r5482j4176P1606K16966K02077L11892
$$ 4847699 4899898 4884369 4867939 4761372 4656423 4560941 4546765 4618371 4835337 5037414 5349306
7036E349306L06165L35573K59804J35194R3733L3928j93884k41321j73354j57932
$$ 5349306 5655471 5991044 6250848 6386042 6479775 6513703 6319819 6078498 5905144 5747212
7026E747212j95715k25184l0397J34365J43544K58051L10103L76566L61947K08720
$$ 5747212 5551497 5326313 5295916 5430281 5573825 5831876 6141979 6518545 6880492 7089212
7016G089212J30286l9354k17774k61874k16709k65422l22304k01761j37606J9781
$$ 7089212 7219498 7180144 6962370 6700496 6483787 6218365 5896061 5694300 5556694 5576475
7006E576475M2632J24942K36532K75817J33146Q5091J31338q4702j03451j61957
$$ 5576475 5619107 5744049 5980581 6256398 6389544 6474635 6605973 6521271 6417820 6255863
6996F255863l55383l34669k84206k65942j37610o7239j1817M0071R1553J13224
$$ 6255863 5900480 5565811 5281605 5015663 4878053 4810814 4798997 4839068 4930621 5043845
6986E043845J30181j819l7477o0266j31792j58129k30588k37826k28895j84961
$$ 5043845 5174026 5172207 5134730 5074464 4942672 4784543 4553955 4316129 4087234 3902273
6976C902273j03939n9640l8288k2025m3127M7764R0345M6305P6927l0708n0241
$$ 3902273 3798334 3738694 3700406 3678381 3635254 3683018 3773363 3819668 3896595 3865887 3815646
6965C815646n9613j38722j69088l0509j80662j30154j27141j37352m4938j50686
$$ 3815646 3756033 3617311 3448223 3417714 3237052 3106898 2979757 2842405 2797467 2646781
6955B646781l7697r1539o1327o8633M746J7146j7652k5468q2922o5785m3542P1217
$$ 2646781 2609084 2517545 2456218 2387585 2392331 2409477 2391825 2366357 2283435 2217650 2174108 2245325
6943B245325l7296M6999j3261O8156J3435O50K2706k1213J4484J1594k577J8991
$$ 2245325 2208029 2255028 2241767 2309923 2323358 2324008 2346714 2325501 2339985 2351579 2349002 2367993
6931B367993L3257K9771l6733K4845j7980L320j9182P177m060m1671k3991j8008
$$ 2367993 2401250 2431021 2394288 2419133 2401153 2404473 2385291 2392468 2388408 2346737 2322746 2304738
6919B304738Q56n3476k8731l5706N8526P3357k953k2250M1216J0437q6220k2014
$$ 2304738 2305594 2252118 2223387 2187681 2246207 2319564 2316611 2294361 2335577 2346014 2259794 2237780
6907B237780p6439K1959J6953p3680r1186M1151q8584q9521l3402j9324N4427
$$ 2237780 2161341 2183300 2200253 2126573 2035387 2076538 1987954 1898433 1865031 1845707 1900134
6896A900134p7238m0799k6382j880n3622k9182r912j4311K3917N8926n5332j4513
$$ 1900134 1822896 1782097 1755715 1753835 1700213 1671031 1661119 1646808 1670725 1729651 1674319 1659806
6884A659806L105p7617j5298M7270j6365m4190j2566m8652R228L2618M1790R2127
$$ 1659806 1662911 1585294 1569996 1617266 1600901 1556711 1544145 1495493 1504721 1537339 1579129 1671256
6872A671256p163O5707N2332o3639p0174R50o9980o4613L8806J1875o3056O7663
$$ 1671256 1664093 1729800 1782132 1718493 1648319 1649269 1579289 1514676 1553482 1565357 1502301 1569964
6860A569964O6071l8734k4974J5414L007M0475q636l5539K7444K3763J6725N9630
$$ 1569964 1636035 1597301 1572327 1587741 1590748 1631223 1622587 1587048 1614492 1638255 1654980 1714610
6848A714610j2674J3004K7547l450L8669O8265k4512O1004J3605j05406m0888
$$ 1714610 1701936 1714940 1742487 1739037 1777706 1845971 1821459 1882463 1896068 1790662 1749774
6837A749774O1860o6224m2047n3963M6279K1522L2476J7356K616O7286P15L7889
$$ 1749774 1811634 1745410 1703363 1649400 1695679 1717201 1749677 1767033 1769649 1836935 1837650 1875539
6825A875539j9005r035o6204J2373n8460n1777M203l4907j5290J3787L8697n698
$$ 1875539 1856534 1847499 1781295 1793668 1735208 1683431 1687634 1652727 1637437 1651224 1689921 1684223
6813A684223l6441j4678n5818L47J8332l7262J0912O8989Q134m1623p6673j4668
$$ 1684223 1647782 1633104 1577286 1577633 1595965 1558703 1569615 1638604 1646738 1605115 1528442 1513774
6801A513774j3483j1737K5075L685P4353L6381m7072l755k5499L4939N7332o864
$$ 1513774 1500291 1488554 1513629 1517314 1591667 1628048 1580976 1577221 1551722 1586661 1643993 1637129
6789A637129J2360k4006R017l3553q4556P8415Q952l1035n3536l7444n646M1698
$$ 1637129 1649489 1625483 1634500 1600947 1516391 1594806 1603758 1572723 1519187 1481743 1476097 1517795
6777A517795k697P9101M2246p5557R4937L0725m1840m2630p0153m2012L8336j7797
$$ 1517795 1515098 1594199 1636445 1560888 1655825 1686550 1644710 1602080 1531927 1489915 1528251 1510454
6765A510454k3050j4479K2607L6052L5132n2318m2837k902M5080J9310m8228L7592
$$ 1510454 1487404 1472925 1495532 1531584 1566716 1514398 1471561 1468659 1513739 1533049 1484821 1522413
6753A522413k1147l0621J1313K3514L6729r007l2738O5806k1926n6275J6630L6169
$$ 1522413 1501266 1470645 1481958 1505472 1542201 1533194 1500456 1566262 1544336 1488061 1504691 1540860
6741A540860K7283J8348P9973j5865J0522L0222K8131P849j767k88Q293j8429
$$ 1540860 1568143 1586491 1666464 1650599 1661121 1691343 1719474 1727323 1725556 1725268 1733561 1715132
6729A715132l2563j5005l5973j0537l0197l1037M5303J10203L7893l5274L1642
$$ 1715132 1682569 1667564 1631591 1621054 1590857 1559820 1605123 1715326 1753219 1717945 1749587
6718A749587P8336L6459M958l9937J1522Q166J2710k335l3511p5507K0768j3390
$$ 1749587 1827923 1864382 1869340 1829403 1840925 1849091 1861801 1859466 1825955 1750448 1771216 1757826
6706A757826M3569L4161O2693l6031P2225K6754L364J4082n2214J3547Q287k054
$$ 1757826 1801395 1835556 1898249 1862218 1934443 1961197 1964561 1978643 1926429 1939976 1948263 1946209
6694A946209O0038J5832l0657m7677k2871K4743k5828o4473N6452P7113n6427
$$ 1946209 2006247 2022079 1991422 1943745 1920874 1945617 1919789 1855316 1911768 1988881 1932454
6683A932454O3565O2885J5874M3246M7418p0785O814J5394m1814P830n9489r656
$$ 1932454 1996019 2058904 2074778 2118024 2165442 2094657 2101471 2116865 2075051 2082881 2023392 2013736
6671B013736J6818l0830K7832n4959M6541P5232K2580j1703O7977j4216m6238
$$ 2013736 2030554 1999724 2027556 1972597 2019138 2094370 2116950 2105247 2173224 2159008 2112770
6660B112770o561j01715n2541N5490j9741m2620m1313J134M0177P690n150K4896
$$ 2112770 2106209 2004494 1951953 2007443 1987702 1945082 1903769 1904903 1945080 1952770 1947620 1972516
6648A972516K5134J5944M3781l2589K0828N4627j9094p3831m2426K7338n2837
$$ 1972516 1997650 2013594 2057375 2024786 2045614 2100241 2081147 2007316 1964890 1992228 1939391
6637A939391L5889L6999L0749l4616J28806J20258k0913k7410n796L4280M7021
$$ 1939391 1975280 2012279 2043028 2008412 2137218 2257476 2236563 2209153 2203357 2237637 2284658
6626B284658M0419l3637J5187j0692J0385j9962N3986k8681o3280L1028M4966
$$ 2284658 2325077 2291440 2306627 2295935 2306320 2286358 2340344 2311663 2248383 2279411 2324377
6615B324377K4112N6724m832q732q3943N9285o436o5540p249K2364L5708J2555
$$ 2324377 2348489 2405213 2400381 2391649 2307706 2366991 2360555 2295015 2287766 2310130 2345838 2358393
6603B358393j1257l6610j8663J73J22080O8320J02853P3598O9467K6730L2670
$$ 2358393 2347136 2310526 2291863 2292036 2414116 2482436 2585289 2658887 2728354 2755084 2787754
6592B787754J09794p2760j2873R9090n6555j5180l9613N5230j004l7881K756K9953
$$ 2787754 2897548 2824788 2811915 2911005 2854450 2839270 2799657 2854887 2853883 2816002 2818758 2848711
6580B848711m4892j4220o6518L0694R270k3056K4198j8357K7749P8978N2743P1309
$$ 2848711 2803819 2789599 2723081 2753775 2763045 2739989 2764187 2745830 2773579 2852557 2905300 2976609
6568B976609J17900P4988O5056J43004J15592J26198P6698Q6525P3816M229M0951
$$ 2976609 3094509 3169497 3234553 3377557 3493149 3619347 3696045 3782570 3856386 3860615 3901566
6557C901566L4185L2203l2056l9253J5754K5164r1730k4609p2764p2261n0611
$$ 3901566 3935751 3967954 3935898 3896645 3912399 3937563 3845833 3821224 3748460 3676199 3625588
6546C625588o7972r6611m297l7899m8429m4336q618k6777j1272P41K3066l1552
$$ 3625588 3557616 3461005 3456708 3418809 3370380 3326044 3317426 3290649 3279377 3280118 3303184 3271632
6534C271632P0648Q89K4951J19902k3053K2394J0456N0070Q8078j0632L0778j5371
$$ 3271632 3342280 3343169 3368120 3488022 3464969 3487363 3497819 3547889 3635967 3625335 3656113 3640742
6522C640742J6868N237m4020j2290J0561r2963l3519j5702j9295L280k8640J4764
$$ 3640742 3657610 3662847 3618827 3606537 3617098 3524135 3490616 3474914 3455619 3458899 3430259 3445023
6510C445023j00638m556J3594p7309J1902j3041O623J3183K971m0085L0295L2521
$$ 3445023 3344385 3339829 3353423 3276114 3288016 3274975 3281598 3294781 3297752 3257667 3287962 3320483
6498C320483k1432J2761p353K2482m5413J0725L6420N787M2245k4873J7930O5263
$$ 3320483 3299051 3311812 3304459 3326941 3281528 3292253 3328673 3334460 3376705 3351832 3369762 3435025
6486C435025R5063K8084o552O3843l120N9083O9154P8975R6807K6062p964Q4129
$$ 3435025 3530088 3558172 3551620 3615463 3612343 3671426 3740580 3819555 3916362 3942424 3934460 4018589
6474D018589J9202L9538m1100J19621R7054m4005n510L413L9497K7484l8193M7827
$$ 4018589 4037791 4077329 4036229 4155850 4252904 4208899 4203389 4206802 4246299 4273783 4235590 4283417
6462D283417P8787j3036J5663P4596M0627O0193J13533J62928R8474Q1281Q3266
$$ 4283417 4362204 4349168 4364831 4439427 4480054 4540247 4653780 4816708 4915182 4996463 5079729
6451E079729O7572k2855J1569j3898M98M7319O9928J30543J14952O3627Q3415
$$ 5079729 5147301 5124446 5136015 5122117 5122615 5169934 5239862 5370405 5485357 5548984 5632399
6440E632399J61543O758k5860L33O8618M3359L8463N9264P0032M7745P9853J21927
$$ 5632399 5793942 5800700 5774840 5775173 5843791 5887150 5925613 5984877 6054909 6102654 6182507 6304434
6428F304434J20098J02793J09218R0568J0008r546O9231n8595o1659r4519j38307
$$ 6304434 6424532 6527325 6636543 6727111 6737119 6727573 6796804 6738209 6676550 6582031 6443724
6417F443724n3538j02022j08301l7068l0676K5965l687O7767Q4952P7004J10001
$$ 6443724 6390186 6288164 6179863 6142795 6112119 6138084 6134397 6202164 6287116 6364120 6474121
6406F474121R8837J44098P8729P8689Q8851K5354n4567j4309n4432j07557j26588
$$ 6474121 6572958 6717056 6795785 6874474 6963325 6988679 6934112 6919803 6865371 6757814 6631226
6395F631226j7509k0464j82739q7074o3143q1109M299r6297q7162m725J1007N290
$$ 6631226 6613717 6593253 6410514 6323440 6260297 6179188 6183487 6087190 6000028 5995303 6006310 6011600
6383F011600J2147J4824L55K3891J5934P0669P6564K6585J8712m2783K147P9047
$$ 6011600 6023747 6038571 6038926 6062817 6078751 6149420 6225984 6252569 6271281 6228498 6230645 6309692
6371F309692j852o4950L3769K9237r5144J683J12190J3925R3673K47465J66985
$$ 6309692 6307840 6242890 6276659 6305896 6210752 6212435 6324625 6338550 6432223 6679688 6846673
6360F846673L29148J62747K1805K1081q4886m2316q5932j8009r5086K5635j4664
$$ 6846673 7175821 7338568 7360373 7381454 7296568 7254252 7168320 7150311 7055225 7080860 7066196
6349G066196p7693k972l3157N2614Q4572Q268O9510J9164k9916M2121P5466P3238
$$ 7066196 6988503 6985531 6952374 7004988 7089560 7097828 7167338 7186502 7156586 7198707 7274173 7347411
6337G347411J7494L5669J03044J16785N6219O2952R5890J95701P5359M8531J21238
$$ 7347411 7364905 7400574 7503618 7620403 7676622 7739574 7835464 8031165 8106524 8155055 8276293
6326H276293l4239M9904J04357J08346M5910J01201Q6324R8725J13251N6169J81126
$$ 8276293 8242054 8291958 8396315 8504661 8550571 8651772 8738096 8836821 8950072 9006241 9187367
6315I187367J74642J88493K02021J73595J43928J81024K73278K86618J26656K43289
$$ 9187367 9362009 9550502 9752523 9926118 10070046 10251070 10524348 10810966 10937622 11180911
6305A1180911J60409K9688l2326j13472j14548m8672j05575P149j0244m1463k8993
$$ 11180911 11341320 11371008 11338682 11225210 11110662 11061990 10956415 10963564 10953320 10911857 10882864
6294A0882864j7562N147M0170J6304K8451K8136N9766L184L6395J79881Q6244
$$ 10882864 10865302 10870449 10910619 10926923 10955374 10983510 11043276 11046460 11082855 11262736 11348980
6283A1348980Q6541R0718J06048J09680J73450J43823Q8233K19464L09848L27853
$$ 11348980 11435521 11526239 11632287 11741967 11915417 12059240 12147473 12366937 12676785 13004638
6273A3004638M10650N13116N61823P70284P88078O30045L68403K10006p367k09529
$$ 13004638 13415288 13928404 14490227 15260511 16048589 16678634 17047037 17257043 17249676 17040147
6263A7040147j16520k93433l07649k23112j18858m5115R7203J88111L13373M75382
$$ 17040147 16923627 16630194 16322545 16099433 15980575 15935460 16032663 16220774 16534147 17009529
6253A7009529P46157P21200P49964N99434L06207J46689k374m4551o4305J6695
$$ 17009529 17755686 18476886 19226850 19826284 20132491 20279180 20276806 20232255 20167950 20184645
6243B0184645J37760J65509J76268L28955N23579N43075O93629Q17538Q86962
$$ 20184645 20322405 20487914 20664182 20993137 21516716 22059791 22753420 23570958 24457920
6234B4457920J019257J087730J067616J210204J146888J152744J166927J210078
$$ 24457920 25477177 26564907 27632523 28842727 29989615 31142359 32309286 33519364
6226C3519364J274009J252311J284118J315892J455204J471076J504340J595040
$$ 33519364 34793373 36045684 37329802 38645694 40100898 41571974 43076314 44671354
6218D4671354J684374J836051K089921K196786K250855J972705J663425J468466
$$ 44671354 46355728 48191779 50281700 52478486 54729341 56702046 58365471 59833937
6210E9833937J271539J133741J194285J387263J535438J700648J872384K047687
$$ 59833937 61105476 62239217 63433502 64820765 66356203 68056851 69929235 71976922
6202G1976922K078809K100448K051000K015612J851701J673365J414056J151959
$$ 71976922 74055731 76156179 78207179 80222791 82074492 83747857 85161913 86313872
6194H6313872Q83897O57224N23214N05317M89796M15112M38777L37746L09016
$$ 86313872 87197769 87854993 88378207 88883524 89373320 89788432 90227209 90564955 90873971
6185I0873971K66003N1405k69542n52164q39761j059400j333426j407369j318420
$$ 90873971 91139974 91191379 90921837 90369673 89529912 88470512 87137086 85729717 84411297
6176H4411297j302555j129348q19246l95161L0395N61530J150115J713116K192705
$$ 84411297 83108742 81979394 81160148 80764987 80795382 81356912 82507027 84220143 86412848
6167H6412848K428113K619506K585299K485900K144248J718382J215156O97565
$$ 86412848 88840961 91460467 94045766 96531666 98675914 100394296 101609452 102307017
6159A02307017r795p43163j313227j838005k226911k537254k744531k787438k848252
$$ 102307017 102297222 101554059 100240832 98402827 96175916 93638662 90894131 88106693 85258441
6150H5258441k791650k564995k325702k139967j972596j830328j562716j308829
$$ 85258441 82466791 79901796 77576094 75436127 73463531 71633203 70070487 68761658
6142F8761658j098929q35820p06444l98022r0077M2193K40258L58187J60660l271
$$ 68761658 67662729 66826909 66120465 65722443 65632366 65674559 65914817 66273004 66433664 66430393
6132F6430393l04232n04616o58343r09715j215252j622068k069878k355632k644569
$$ 66430393 66126161 65621545 64963202 64053487 62838235 61216167 59146289 56790657 54146088
6123E4146088k866663k752524k663257k402316k181253j691879j258434q14618
$$ 54146088 51279425 48526901 45863644 43461328 41280075 39588196 38329762 37515144
6115C7515144n06403j30660L23119L66360L27516J50519k20263m95098q04465
$$ 37515144 37008741 36878081 37201200 37567560 37895076 38045595 37825332 37330234 36525769
6106C6525769r11129r66134q14383n66996k58015n9976j38910k82375n12862q34079
$$ 36525769 35614640 34648506 33834123 33267127 33009112 32949136 32810226 32527851 32014989 31180910
6096C1180910r12157r47629j064530r66687p94463o57390n60519m13313j80077
$$ 31180910 30268753 29321124 28256594 27289907 26495444 25838054 25277535 24864222 24684145
6087B4684145J3512J59594L99035O24186Q86799J016634R92308P65778N82116
$$ 24684145 24697657 24857251 25256286 25880472 26767271 27783905 28776213 29541991 30124107
6078C0124107M76664M60672M41888N69520M69216K32884J82797j71031m46519
$$ 30124107 30600771 31061443 31503331 32072851 32542067 32774951 32957748 32786717 32340198
6069C2340198n42392p50673o86254o84173m56387k63472j75406J29300N44676
$$ 32340198 31797806 31047133 30360879 29676706 29220319 28956847 28781441 28910741 29455417
6060B9455417Q97918J128450J309454J284877J131483Q29493M83982M3134m93297
$$ 29455417 30353335 31481785 32791239 34076116 35207599 36037092 36521074 36564208 36070911
6051C6070911q78374j253133j439199j476100j447356j374979j173686j010101
$$ 36070911 35192537 33939404 32500205 31024105 29576749 28201770 27028084 26017983
6043B6017983p83493o01404l72133l12978l4252J65376K62492M06489O29416P39598
$$ 26017983 25234490 24633086 24260953 23947975 23913723 24079099 24341591 24748080 25377496 26117094
6033B6117094P01271Q04104O93865O82519O73161O05179P33147J009730J471132
$$ 26117094 26818365 27622469 28316334 28998853 29672014 30277193 31010340 32020070 33491202
6024C3491202J991628K652343L367237L920116M302910M267345L849895L054738
$$ 33491202 35482830 38135173 41502410 45422526 49725436 53992781 57842676 60897414
6016F0897414K066416R62583m9542r99565j934609k551664k770146k651357k413876
$$ 60897414 62963830 63926413 63876871 62877306 60942697 58391033 55620887 52969530 50555654
6007E0555654j815594j178054n89042m5534N68115J014761J064415J174600J254711
$$ 50555654 48740060 47562006 46972964 46927430 47495545 48510306 49574721 50749321 52004032
5998E2004032J031844O84014J94085j66942m64296n01105l56238k57967K7993
$$ 52004032 53035876 53719890 53913975 53747033 53282737 52781632 52425394 52167427 52195420
5989E2195420K8424L884q4073p5838q2041P7033K63914N10106N58700K35934j20332
$$ 52195420 52223844 52227728 52143655 52067817 51985776 52062809 52326723 52836829 53395529 53631463 53511131
5978E3511131m47479p58851r04320r55584q78048o37591l90613k05615M4605M38362
$$ 53511131 53063652 52304801 51400481 50444897 49566849 48929258 48538645 48333030 48377635 48815997
5968D8815997R04257J314307J581381J968870J913275J790959J670549J441016
$$ 48815997 49720254 51034561 52615942 54584812 56498087 58289046 59959595 61400611
5960F1400611J160661Q74125M76488J06910q8580k48994k88041k54742n4322L37300
$$ 61400611 62561272 63435397 63911885 64018795 63930215 63681221 63393180 63138438 63084116 63421416
5950F3421416Q48267J295440J783983K440599K960373L512930M220732M874409
$$ 63421416 64269683 65565123 67349106 69789705 72750078 76263008 80483740 85358149
5942H5358149N917286P502036J0204033J4167521J9075450K3939966K7533939
$$ 85358149 91275435 98777471 108981504 123149025 142224475 166164441 193698380
5935A93698380K8686615K6732734K1315634J3000555K888995p121916j5914601
$$ 193698380 222384995 249117729 270433363 283433918 286322913 279200997 263286396
5928B63286396k2169081k5335689k5693946k4015275k1228147j7861172j4791395
$$ 263286396 241117315 215781626 190087680 166072405 144844258 126983086 112191691
5921A12191691j2158835r845817q073846o665765n626996m645679l825729l176729
$$ 112191691 100032856 90187039 82113193 75447428 69820432 65174753 61349024 58172295
5913E8172295k470506j951119j694690j609907j539331j607912j842102j657768
$$ 58172295 55701789 53750670 52055980 50446073 48906742 47298830 45456728 43798960
5905D3798960j497385j349479j159821r12360o34681m90729m18170l58308k30610
$$ 43798960 42301575 40952096 39792275 38879915 38245234 37754505 37336335 36978027 36747417
5896C6747417j36942M0879K70089L03526K73989K42268P4459j17978m04722p75823
$$ 36747417 36610475 36651354 36921443 37224969 37498958 37741226 37815685 37697707 37292985 36517162
5886C6517162j144114j306482j390803j511564j487626j364025j228498j124645
$$ 36517162 35373048 34066566 32675763 31164199 29676573 28312548 27084050 25959405
5878B5959405j020874q63201p59953o00886m95431n26820m58417m05657m27889
$$ 25959405 24938531 24075330 23315377 22714491 22219060 21692240 21233823 20828166 20400277
5869B0400277l36451k82403l45103l03452k30819k33062k66670k83053j73335
$$ 20400277 20063826 19781423 19436320 19132868 18902049 18668987 18402317 18119264 17945929
5860A7945929j04123j29447j02836j58260j72424j15524j11363l3600j13587p4044
$$ 17945929 17841806 17712359 17609523 17451263 17278839 17163315 17051952 17018352 16904765 16830721
5850A6830721p5151O030M1043J18122J36350K08200K47268L75298L32621M11944
$$ 16830721 16755570 16761600 16802643 16920765 17057115 17265315 17512583 17887881 18220502 18632446
5840A8632446L85791L31635J33681l9027j09352j55600l64276m09964k90379l40429
$$ 18632446 19018237 19349872 19483553 19444526 19335174 19179574 18815298 18405334 18114955 17774526
5830A7774526k45892m8036J0407L493P7389K8597L6091Q989j35132j72914k36001
$$ 17774526 17528634 17480598 17491005 17494498 17571887 17600484 17636575 17645564 17510432 17337518 17101517
5819A7101517k08846k82758k44518j59358j77128j11697j48540n3197m8598k3322
$$ 17101517 16892671 16609913 16365395 16206037 16028909 15917212 15768672 15715475 15666877 15643555
5809A5643555k3900n8183q9832m1497L2423j2982j0611j05844j6302n4906k1713
$$ 15643555 15619655 15561472 15471640 15430143 15462566 15449584 15438973 15333129 15316827 15261921 15240208
5798A5240208n5208j02926j34173j84131j10856n0896o6961o9827j89448q9415
$$ 15240208 15185000 15082074 14947901 14763770 14652914 14602018 14535057 14465230 14275782 14186367
5788A4186367p3822r3824l3494O2816k7755o4702M4994Q5084J01077J32539K83893
$$ 14186367 14112545 14018721 13985227 14048043 14020288 13955586 14000580 14085664 14186741 14319280 14603173
5777A4603173M10921N39599N08642M66236K79036P9953q5407j81405k92682k52426
$$ 14603173 15014094 15553693 16062335 16528571 16807607 16887560 16802153 16620748 16328066 16075640
5767A6075640k66197j98064j66812j45449j69075q1593j614m6539j20909q1859
$$ 16075640 15809443 15611379 15444567 15299118 15130043 15048450 15046836 15000297 14879388 14797529
5757A4797529q5914p9857j8752k503J043r1210N6900N3734j6206N2770K3850R2446
$$ 14797529 14711615 14631758 14613006 14610503 14611546 14520336 14577236 14630970 14614764 14667534 14691384 14783830
5745A4783830R3730J83026J54835K12094P4865J59120J94535J14918M4178p218
$$ 14783830 14877560 15060586 15215421 15427515 15502380 15661500 15856035 15970953 16015131 16007913
5735A6007913J954L6929q4836j15522j23005j33174o0270l7738j63417p5916j6393
$$ 16007913 16009867 16046796 15961960 15846438 15723433 15590259 15529989 15492251 15328834 15252918 15236525
5724A5236525k8465m9413l5166M3077M8181J26762Q0726P8491Q8514J00472Q1746
$$ 15236525 15208060 15158647 15123481 15166558 15214739 15341501 15422227 15500718 15589232 15689704 15771450
5713A5771450J22642J70851P5393L1601Q5119J11218j3756P0343K6760p1955j25111
$$ 15771450 15894092 16064943 16140336 16171937 16257056 16368274 16354518 16424861 16451621 16379666 16254555
5702A6254555l8137n3466q4058R045O4896L6592J47408K25867J92189K58579K26737
$$ 16254555 16216418 16162952 16078894 16087939 16152835 16189427 16336835 16562702 16754891 17013470 17240207
5691A7240207K29401K21003J17264J9236l1921j11166j17959n7253p1314k7309
$$ 17240207 17469608 17690611 17807875 17827111 17795190 17684024 17566065 17508812 17437498 17410189
5681A7410189Q131J58420J80096K17450K80002K98227J95432J48820O9819J3712
$$ 17410189 17418320 17576740 17756836 17974286 18254288 18552515 18747947 18896767 18966586 18980298
5671A8980298j4506N790j11712k09088j44924k23334k15866k50980j97764j50977
$$ 18980298 18965792 18971582 18859870 18650782 18505858 18282524 18066658 17815678 17617914 17466937
5661A7466937j73344o1702O3978N7894J70049J84409J68818L3107R9218M3503
$$ 17466937 17293593 17231891 17295869 17353763 17523812 17708221 17877039 17910146 18009364 18052867
5651A8052867q1397o3824J7622M371P9878M7493M9773n9901j29447j70605j10131
$$ 18052867 17971470 17907646 17925268 17929639 18009517 18057010 18106783 18046882 17917435 17746830 17636699
5640A7636699j97239r3926P703J53822K77606L86782L86070M50106M74902L55459
$$ 17636699 17439460 17345534 17353237 17507059 17784665 18171447 18557517 19007623 19482525 19837984
5630A9837984K72919J34991n7568p7216j652q5289j25715j7053N4957l150P9719
$$ 19837984 20110903 20245894 20188326 20111110 20109458 20024169 19898454 19881401 19936358 19933208 20012927
5619B0012927P2222L0628J42102O8444K4124N7988L7336R8367J23359o6423q3349
$$ 20012927 20085149 20115777 20257879 20326323 20350447 20408435 20445771 20544138 20667497 20601074 20517725
5608B0517725j97937m16678m78829m03706m84939m12636k11271q8802m2574K1568
$$ 20517725 20319788 19903110 19424281 19020575 18535636 18123000 17911729 17822927 17780353 17801921
5598A7801921k1651P2397k0070r5328j85611j88172j58169j11515j35008r4456
$$ 17801921 17780270 17852667 17832597 17737269 17551658 17363486 17205317 17093802 16958794 16864338
5588A6864338K086Q496j04737j13265j12168k75453k50055k07971j42798q4114
$$ 16864338 16866424 16874920 16770183 16656918 16544750 16269297 16019242 15811271 15668473 15584359
5578A5584359M8718M6162R6594K23535J94794K31851J97440J28037J18362Q7254
$$ 15584359 15633077 15679239 15775833 15999368 16194162 16426013 16623453 16751490 16869852 16957106
5568A6957106J05214J9404L1110m5663j80729j83387j99145k82760k64665k32860
$$ 16957106 17062320 17081724 17112834 17067171 16886442 16703055 16503910 16221150 15956485 15723625
5558A5723625m3788r1406j2266M6028J38067J74830J32019M2413J3641j33122
$$ 15723625 15679837 15588431 15576165 15622193 15760260 15935090 16067109 16109522 16123163 15990041
5548A5990041j89032j48440k02198k91256k13848k55915k11000j02688j45455
$$ 15990041 15801009 15652569 15450371 15159115 14945267 14689352 14478352 14375664 14230209
5539A4230209j23049m3728p1206O8860M0217Q1020M9052P6892J79796K05415J52361
$$ 14230209 14107160 14063432 13992226 14061086 14101303 14182323 14231375 14308267 14488063 14693478 14845839
5528A4845839J21451K02687L10472K42209K88501L39844K94374L81305L78593
$$ 14845839 14967290 15169977 15480449 15722658 16011159 16351003 16645377 17026682 17405275
5519A7405275J88885K69374K83504K73609J82479K07289K52972J87566K19235
$$ 17405275 17594160 17863534 18147038 18420647 18603126 18810415 19063387 19250953 19470188
5510A9470188K78091L24168M36591N07445M79478N32805N72283N77793N56935
$$ 19470188 19748279 20072447 20509038 21016483 21495961 22028766 22601049 23178842 23735777
5501B3735777N25483M44856M84363M90102M56857M47232M93143M32263M22722
$$ 23735777 24261260 24706116 25190479 25680581 26137438 26584670 27077813 27510076 27932798
5492B7932798M43982L76601M55964M01605M05004L99684L66286M38296M88028
$$ 27932798 28376780 28753381 29209345 29610950 30015954 30415638 30781924 31220220 31708248
5483C1708248N64496O82694Q37599R46063J025052J142435J031528R58303P83364
$$ 31708248 32272744 32955438 33793037 34739100 35764152 36906587 37938115 38896418 39679782
5474C9679782O52745N40158M87168M09364K50462L49002K07622J36556J76467
$$ 39679782 40332527 40872685 41359853 41769217 42019679 42368681 42576303 42712859 42889326
5465D2889326K14952J77132K54799J84117K64741K62515J88696K97512L01026
$$ 42889326 43104278 43281410 43536209 43720326 43985067 44247582 44436278 44733790 45034816
5456D5034816L37755N88960P44754R17672J296436J458866J529406J595875J628158
$$ 45034816 45372571 45961531 46706285 47623957 48920393 50379259 51908665 53504540 55132698
5447E5132698J566363J455154J304182J286353J157912J012267J020159P46750
$$ 55132698 56699061 58154215 59458397 60744750 61902662 62914929 63935088 64681838
5439F4681838O60273N83966M72036J61003J02651m9432j51283j55399j94006j86331
$$ 64681838 65342111 65926077 66398113 66559116 66661767 66612335 66461052 66305653 66111647 65925316
5429F5925316j56182j95096k16903k24726j54122j36478r1700r105M2001P0292
$$ 65925316 65769134 65574038 65357135 65132409 64978287 64841809 64750109 64741004 64783005 64853297
5419F4853297K85774L84188M32241N40319N72151M02150L19688L06054Q9816j50518
$$ 64853297 65139071 65523259 65955500 66495819 67067970 67470120 67789808 68095862 68185678 68035160
5409F8035160k90660n02247o91004p84586r32862j002025j111424j361737j504068
$$ 68035160 67744500 67242253 66551249 65766663 64833801 63831776 62720352 61358615 59854547
5400E9854547j650104j615477j624795j554189j247201r84920p81435m84055l70483
$$ 59854547 58204443 56588966 54964171 53409982 52162781 51177861 50396426 49912371 49541888
5391D9541888k54379k00181j61968j06286k22560j55780j89731k94306m04560
$$ 49541888 49287509 49087328 48925360 48819074 48596514 48440734 48251003 47956697 47552137
5382D7552137l12183m14306l42027k51365j95800j64383j56948k32965m35553
$$ 47552137 47239954 46825648 46483621 46232256 46036456 45872073 45715125 45482160 45046607
5373D5046607o28516q67792r01578j014699j015306j023322r16794p47475p61524
$$ 45046607 44418091 43550299 42648721 41634022 40618716 39595394 38678600 37931125 37169601
5364C7169601o61812o35403o81357o39807n29526m96650m96311m88243m40924
$$ 37169601 36507789 35872386 35191029 34551222 34021696 33525046 33028735 32540492 32099568
5355C2099568l16096l82637k63494k87182l44113l55161l95562m91348m73809
$$ 32099568 31783472 31400835 31137341 30850159 30506046 30150885 29755323 29263975 28790166
5346B8790166n18585o41926o14957o23169n69092n13929n23277n01560l63956
$$ 28790166 28271581 27629655 27014698 26391529 25822437 25308508 24785231 24283671 23919715
5337B3919715m06113l36572l47584k37035j70172j90244j63161r3870j08705j73315
$$ 23919715 23513602 23177030 22829446 22592411 22422239 22231995 22068834 21974964 21866259 21692944
5327B1692944j62236j62340k44908j38260j47053j75690k06264m9322O0408l7628
$$ 21692944 21530708 21368368 21123460 20985200 20838147 20662457 20456193 20406871 20467279 20429651
5317B0429651N1760O5445P6350N2431O6592J63154J94452J98356J62123K15984
$$ 20429651 20481411 20546856 20623206 20675637 20742229 20905383 21099835 21298191 21460314 21676298
5307B1676298K31304L28444K00998K64805J62333J62850K04645K30415J67573
$$ 21676298 21907602 22236046 22437044 22701849 22864182 23027032 23231677 23462092 23629665
5298B3629665J75744K29928K28486J81070J80970J76961K77105L00503L11012
$$ 23629665 23805409 24035337 24263823 24444893 24625863 24802824 25079929 25380432 25691444
5289B5691444K70868L19166L18110K49528K20621K03324J59186J43373J16801
$$ 25691444 25962312 26281478 26599588 26849116 27069737 27273061 27432247 27575620 27692421
5280B7692421R1041J62316J86898K73576K07486L38655M25042M91789O35833N83665
$$ 27692421 27783462 27945778 28132676 28406252 28613738 28952393 29377435 29869224 30505057 31088722
5270C1088722O63111Q28462Q92744R24074R66830J018523J066212J109341J196661
$$ 31088722 31751833 32580295 33473039 34397113 35363943 36382466 37448678 38558019 39754680
5261C9754680J332905J454928J613910J637740J763553J781159J744538J656434
$$ 39754680 41087585 42542513 44156423 45794163 47557716 49338875 51083413 52739847
5253E2739847J619046J628184J657360J546345J494099J395124J275880J132065
$$ 52739847 54358893 55987077 57644437 59190782 60684881 62080005 63355885 64487950
5245F4487950R91340R03835P06445M61780K94553K14337K75235K28597J51879
$$ 64487950 65479290 66383125 67089570 67551350 67845903 68060240 68335475 68564072 68715951
5236F8715951K08760R1175k9947r1565j72761l56664m21172m85551o84386q12863
$$ 68715951 68924711 69015886 68985939 68894374 68721613 68364949 67943777 67458226 66773840 65960977
5226F5960977r51097j092003j048177r59379r26190p33513p79221p86577q05716
$$ 65960977 65009880 63917877 62869700 61910321 60984131 60250618 59471397 58684820 57879104
5217E7879104q68371r95803r56203j056623j023772q91359q51445p05403n93454
$$ 57879104 57010733 56014930 55058727 54002104 52978332 52086973 51235528 50530125 49936671
5208D9936671m81223l99298j76290n2538N34Q3100n4158j29803k36741m31834
$$ 49936671 49455448 49056150 48879860 48827322 48827856 48910956 48856798 48726995 48490254 48058420
5198D8058420n03201n77020o26236n69836m37646l26816l59446k45487j8220J17551
$$ 48058420 47555219 46978199 46351963 45782127 45344481 45017665 44658219 44412732 44394512 44512063
5188D4512063K78401N45062O82398Q49950J144757J234561J317246J438481J434282
$$ 44512063 44790464 45335526 46017924 46867874 48012631 49247192 50564438 52002919 53437201
5179E3437201J418628J198309R49309N56222N9255l56561o12680q69469p90123
$$ 53437201 54855829 56054138 57003447 57559669 57618924 57262363 56649683 55780214 54990091
5170E4990091p36116m57521q617L00246P97093J201773J497872J894275K185510
$$ 54990091 54253975 53796454 53787837 54088083 54885176 56086949 57584821 59479096 61664606
5161F1664606K535596K693853K689652K547171K201681J708067R46339J65102
$$ 61664606 64200202 66894055 69583707 72130878 74332559 76040626 76986965 77152067
5153G7152067n56083j043139j332888j305431j175897r59562m96096j62973J94836
$$ 77152067 76595984 75552845 74219957 72914526 71738629 70779067 70282971 70119998 70314834
5144G0314834M62638N94097P10480O49755N18828N52153M06617K48834J48339
$$ 70314834 70777472 71371569 72082049 72731804 73250632 73802785 74209402 74458236 74606575
5135G4606575L353k68825o11414q18755j199944j139861r95062o82455m87343
$$ 74606575 74609928 74341103 73729689 72910934 71710990 70571129 69576067 68893612 68406269
5126F8406269l58754l00031l04549m04502m56859m00147l24031j70894k46934
$$ 68406269 68047515 67747484 67442935 67038433 66581574 66181427 65857396 65686502 65439568
5117F5439568k31183k81770l20581n46497o44851n66054o27646o50725n38851
$$ 65439568 65208385 64926615 64606034 64059537 63414686 62848632 62220986 61570261 61031410
5108F1031410n65668n99934m09713m38247n35064o88730q25260r76689j049204
$$ 61031410 60465742 59865808 59456095 59017848 58482784 57794054 56968794 55992105 54942901
5099E4942901j146999j142438j160327j016671j049794r30673j006606r60876
$$ 54942901 53795902 52653464 51493137 50476466 49426672 48495999 47489393 46528517
5091D6528517r58518r32275r00331r46344r59963p88164p79602o79010o04678
$$ 46528517 45569999 44637724 43737393 42791049 41831086 41042922 40263320 39584310 38979632
5082C8979632m78240m73657n96540n72341n89078o94570q71334r53137j050918
$$ 38979632 38501392 38027735 37431195 36858854 36269776 35575206 34703872 33750735 32699817
5073C2699817j131244j120149j005683j083144j020984r26460q33892p40896o32140
$$ 32699817 31568573 30448424 29442741 28359597 27338613 26412153 25578261 24837365 24205225
5064B4205225n54674n41829m76767n20619n46583m69754m74934m90311l56233
$$ 24205225 23650551 23108722 22631955 22111336 21564753 21094999 20620065 20129754 19773521
5055A9773521l94315l04451k71835j50064j33116j63887K857L0419K7330J45375
$$ 19773521 19379206 19074755 18802920 18652856 18519740 18355853 18358710 18389129 18416459 18561834
5045A8561834J96730J57212K55501K84167K32241M0376k375j63512l60587n47595
$$ 18561834 18758564 18915776 19171277 19455444 19687685 19728061 19725686 19562174 19201587 18653992
5035A8653992n23530n73972n20816n29590n14510n03104k97368k50826k70586
$$ 18653992 18130462 17556490 17035674 16506084 15991574 15488470 15191102 14940276 14669690
5026A4669690j96524p0180o1558j88311j77107k04678j57303k26244k46004k59488
$$ 14669690 14473166 14402986 14341428 14153117 13976010 13771332 13614029 13387785 13141781 12882293
5016A2882293l26735k28304k16948k97619k67034k91878l71442k56044k14406
$$ 12882293 12555558 12327254 12110306 11812687 11545653 11253775 10882333 10626289 10411883
5007A0411883j68882j74308j14724p9876p2545j09951r5593j40986j31939k5114
$$ 10411883 10243001 10068693 9953969 9874093 9801548 9691597 9596004 9455018 9323079 9297965
4997I297965j00568j01100r6389j38747j38289j17215j05240p0306j03074j47428
$$ 9297965 9197397 9096297 8999908 8861161 8722872 8605657 8500417 8430111 8327037 8179609
4987H179609o8723j38022j37584j06598m8512j5618n9433q1567o9076J3239m3944
$$ 8179609 8110886 7972864 7835280 7728682 7680170 7664552 7605119 7523552 7454476 7467715 7423771
4976G423771K1715j8319j14069L2307k0360o7229M1551k040n4808q382m6015n3297
$$ 7423771 7445486 7427167 7313098 7345405 7325045 7257816 7299367 7297327 7242519 7234137 7188122 7134825
4964G134825k6266L149R661j05280m4256j9622m4328J2467k5414m5167P1697K5410
$$ 7134825 7108559 7111708 7121369 7016089 6971833 6952211 6907883 6920350 6894936 6849769 6921466 6946876
4952F946876j7064P5763O4640k5943K5560m0560j5841J3617Q7594P8135m1856
$$ 6946876 6929812 7005575 7070215 7044272 7069832 7029272 7013431 7027048 7114642 7192777 7150921
4941G150921L4242M1387P6652K7185L9888K6165J5635P2441J22188K3453R3956
$$ 7150921 7185163 7226550 7303202 7330387 7370275 7396440 7412075 7484516 7606704 7630157 7724113
4930G724113J02689J09857J34782J41465K03036J36467J66009K11895K04716J92303
$$ 7724113 7826802 7936659 8071441 8212906 8415942 8552409 8718418 8930313 9135029 9327332
4920I327332J77638J74495J72467J91623J85204K99500K31609K49960J62951J64818
$$ 9327332 9504970 9679465 9851932 10043555 10228759 10528259 10759868 11009828 11172779 11337597
4910A1337597J24678P9947O8181Q4302N6625M0973J33856R4058J53972J41937
$$ 11337597 11462275 11542222 11610403 11694705 11751330 11792303 11926159 12020217 12174189 12316126
4900A2316126J97578K69752J98052K72872L05440J41729J03917M6007R7924Q8997
$$ 12316126 12513704 12783456 12981508 13254380 13559820 13701549 13805466 13851473 13949397 14038394
4890A4038394J45780Q5257R4425K18226J56611R8406J74686J03282N8814P5484
$$ 14038394 14184174 14269431 14363856 14582082 14738693 14837099 15011785 15115067 15173881 15249365
4880A5249365k036L6930M9011J19178N9287M1830J6158N6357K2808j58341l5514
$$ 15249365 15247329 15284259 15333270 15452448 15511735 15553565 15569723 15626080 15648888 15490547 15455033
4869A5455033o2334N4384L8581l2167j01782r7490k0594m1239l4631N6655J8080
$$ 15455033 15392699 15447083 15485664 15453497 15351715 15254225 15233631 15192392 15157761 15214416 15232496
4858A5232496J71223J65668J08481L9019M8772Q4104O4936K44205K81440L25125
$$ 15232496 15403719 15569387 15677868 15716887 15765659 15849763 15914699 16158904 16440344 16765469
4848A6765469K95377K05324J98863J37111Q7253J11463P3336L7526J28487N5041
$$ 16765469 17060846 17266170 17465033 17602144 17689397 17800860 17874196 17911722 18040209 18095250
4838A8095250R3010J16718N9099L498j3728j55848j19361j26248j12028j64591
$$ 18095250 18188260 18304978 18364077 18367575 18353847 18197999 18078638 17952390 17840362 17675771
4828A7675771j81991j71124j78467j64175j67119j37315k04461k94454j43170
$$ 17675771 17493780 17322656 17144189 16980014 16812895 16675580 16471119 16176665 16033495
4819A6033495q7745j05584j11060j73884k90599k98400l76047l80105k78951j83162
$$ 16033495 15945750 15840166 15729106 15555222 15264623 14966223 14590176 14210071 13931120 13747958
4809A3747958j72315J9028J46487K52246M26594M22369L95184L54364J78181l8680
$$ 13747958 13575643 13594671 13741158 13993404 14419998 14842367 15237551 15591915 15770096 15731416
4799A5731416k06683l52051k93583l36207l47012k72878j21284m9600L5652J2708
$$ 15731416 15524733 15172682 14879099 14542892 14195880 13923002 13801718 13752118 13787770 13800478
4789A3800478K65707K56827K33335K71216K54133K04494J53030K27308J42770
$$ 13800478 14066185 14323012 14556347 14827563 15081696 15286190 15439220 15666528 15809298
4780A5809298J93331K38555L42487L81070K95353K51486K74411M34626K98645
$$ 15809298 16002629 16241184 16583671 16964741 17260094 17511580 17785991 18220617 18519262
4771A8519262K91041J54323J88707Q7397k7715p6747j31364j57002j27547j24061
$$ 18519262 18810303 18964626 19153333 19240730 19213015 19136268 19004904 18847902 18720355 18596294
4761A8596294j40991j32325k49857j87613j00098p8969J3587L0778J39096P2746
$$ 18596294 18455303 18322978 18073121 17885508 17785410 17706441 17720028 17750806 17889902 17962648
4751A7962648K36288K60111K78646L67999N61470O17643P58855Q71066J044806
$$ 17962648 18198936 18459047 18737693 19105692 19667162 20284805 21043660 21914726 22959532
4742B2959532R88213R23485P76143N75636L48806Q1173j70044l44252k85169l61665
$$ 22959532 23947745 24871230 25647373 26223009 26571815 26652988 26482944 26138692 25853523 25491858
4732B5491858k97582j83493j45612j08365j76631p7575Q4832O5243Q1836K69802
$$ 25491858 25194276 25010783 24865171 24756806 24580175 24502600 24587432 24652675 24734511 25004313
4722B5004313L06363M16752M19412M43933M02468L53266K30980L39609L61805
$$ 25004313 25310676 25727428 26146840 26590773 26993241 27346507 27577487 27917096 28278901
4713B8278901L84438N59235N78677Q52666R73531J157872J375392J729893K032204
$$ 28278901 28663339 29222574 29801251 30653917 31627448 32785320 34160712 35890605 37922809
4704C7922809K351322K717120L099962L150099L107092K633614J995791J207212
$$ 37922809 40274131 42991251 46091213 49241312 52348404 54982018 56977809 58185021
4696E8185021K67872p35496j460181j929617k264546k368951k214399k007651
$$ 58185021 58452893 57717397 56257216 54327599 52063053 49694102 47479703 45472052
4688D5472052j717388j390351j064840q16956m96143j07177J51275M19372O63665
$$ 45472052 43754664 42364313 41299473 40482517 39986374 39879197 40030472 40449844 41113509
4679D1113509P79336R10000J025840J319093J488614J761989J900963J965988
$$ 41113509 41892845 42802845 43828685 45147778 46636392 48398381 50299344 52265332
4671E2265332J984035K023869J756309J556706J469189J420681J587102J688708
$$ 52265332 54249367 56273236 58029545 59586251 61055440 62476121 64063223 65751931
4663F5751931J787368J666625J274646N77206j99647r85989j692364k232980k565062
$$ 65751931 67539299 69205924 70480570 71057776 70858129 69872140 68179776 65946796 63381734
4654F3381734k623906k548075k262363j986202j520620r79270n31265j28773K14652
$$ 63381734 60757828 58209753 55947390 53961188 52440568 51461298 50930033 50801260 51015912
4645E1015912O29769R91124J335942J856489K433546L293734M434371N868218
$$ 51015912 51645681 52636805 53972747 55829236 58262782 61556516 65990887 71859105
4637G1859105P641246R562173J1401670J2718244J3084578J2319534J0200232
$$ 71859105 79500351 89062524 100464194 113182438 126267016 138586550 148786782
4630A48786782P102944L150736r52532n025208q354865j0479185j1369374j1276415
$$ 148786782 155889726 159040462 158087930 153062722 144707857 134228672 122859298 111582883
4622A11582883j0455800r085934p603880o128241m727904l867118l147879k800985
$$ 111582883 101127083 92041149 84437269 78309028 73581124 69714006 66566127 63765142
4614F3765142k627430k482924k357355k248676k172227k000190j867813j533720
$$ 63765142 61137712 58654788 56297433 54048757 51876530 49876340 48008527 46474807
4606D6474807j357149j128935q61183p49140o73562n22223n28338n99853m35592
$$ 46474807 45117658 43988723 43127540 42378400 41704838 41182615 40654277 40054424 39618832
4597C9618832l96106k60341o8369K3197K97457M18420Q00770J050296J373097
$$ 39618832 39222726 38962385 38894016 38917213 39214670 39633090 40433860 41484156 42857253
4588D2857253J685540K168606K677277L484694M482709N706944P010250Q117279
$$ 42857253 44542793 46711399 49388676 52873370 57356079 63063023 70073273 78190552
4580G8190552Q436268P899374O724474N115434L650403K541083J659826Q48197
$$ 78190552 86626820 94526194 101250668 106366102 110016505 112557588 114217414 115065611
4572A15065611l67115j818889l665268n568384o927293p653698p720052p057648
$$ 115065611 114698496 112879607 109214339 103645955 96718662 89064964 81344912 74287264
4564G4287264o116950m948987l901640k860638k197198j840338j509793j417955
$$ 74287264 68170314 63221327 59319687 56459049 54261851 52421513 50911720 49493765
4556D9493765j438598j403004j299152j031178o99719n19458k71262p1608J11440
$$ 49493765 48055167 46652163 45353011 44321833 43622114 43102656 42831394 42759786 42871226
4547D2871226M01303P79732R50146J103479J256563J242179J135738Q16770N93860
$$ 42871226 43272529 44052261 45002407 46105886 47362449 48604628 49740366 50557136 51150996
4538E1150996K06014n9623j54260n7851J23137O01752J157285J825331K357318
$$ 51150996 51357010 51297387 51143127 51085276 51208413 51810165 52967450 54792781 57150099
4529E7150099K945486L334744L674700M360267N391103P105085R112433J0320628
$$ 57150099 60095585 63430329 67105029 71465296 76856399 83961484 93073917 103394545
4521A03394545R969735P909925M736694J537339p31011j389375m13710J547032
$$ 103394545 113364280 121274205 126010899 127548238 126817227 125427852 125014142 126561174
4513A26561174K848483K556259O81396j939910m568711o592205p672189p580690
$$ 126561174 129409657 131965916 132647312 130707402 126138691 119546486 111874297 104293607
4505A04293607o844743n869493m866498l848919k926447k147735j412541q18294
$$ 104293607 97448864 91579371 86712873 82863954 79937507 77789772 76377231 75558937
4497G5558937k53439L85066R00296J431643J948382K420460K804918L420592M079483
$$ 75558937 75305498 75690564 76590860 78022503 79970885 82391345 85196263 88616855 92696338
4488I2696338N080325O561905Q528377J0732853J3296238J5862248J7866737J8896902
$$ 92696338 97776663 104338568 112866945 123599798 136896036 152758284 170625021 189521923
4480A89521923J9007475J8056167J5999726J2641011Q430991L386735j855061
$$ 189521923 208529398 226585565 242585291 255226302 263657293 267044028 265188967
4473B65188967o324523r530670j0615342r474944o363888j533938L736997Q471812
$$ 265188967 258864444 249333774 238718432 229243488 222879600 221345662 225082659 233554471
4465B33554471J2343713J4990866J5984122J5405576J3443706J0744697P979998
$$ 233554471 245898184 260889050 276873172 292278748 305722454 316467151 324447149
4458C24447149N700482M497839M631835M547687K599778j387660o915610j2686985
$$ 324447149 330147631 334645470 339277305 343824992 346424770 345037110 338121500 325434515
4450C25434515j7533644k0240858k0469601j8515393j5660936j2807856j0355474
$$ 325434515 307900871 287660013 267190412 248675019 233014083 220206227 209850753
4443B09850753q665743p184963o055248n243743m674585m626086n057550n920653
$$ 209850753 201185010 194000047 187944799 182701056 178026471 173400385 168342835 162422182
4435A62422182o751767o988649o424601m820962j958496J249788L756446M220363
$$ 162422182 155670415 148681766 142257165 137436203 135477707 136727495 140483941 144704304
4427A44704304K329594j187421n181792q589196j0908263j1631338j1008571r675441
$$ 144704304 147033898 145846477 140664685 132075489 121167226 109535888 98527317 88851876
4419H8851876q354635o880631n501938m301712l360316k595854k192890j933839
$$ 88851876 80497241 73616610 68114672 63812960 60452644 57856790 55663900 53730061
4411E3730061j716093j630300j488943j419902j411731j432495j559757j692574
$$ 53730061 52013968 50383668 48894725 47474823 46063092 44630597 43070840 41378266
4403D1378266j722452j789145j879267j810697j637113j527387j274767j075268
$$ 41378266 39655814 37866669 35987402 34176705 32539592 31012205 29737438 28662170
4395B8662170j018540q88501p76694o96625n71987n64478n03856n10293m78447
$$ 28662170 27643630 26755129 25978435 25281810 24709823 24145345 23641489 23131196 22652749
4386B2652749m24383m32834l44884l22975k33952k13310j48035j3557L9664K17336
$$ 22652749 22228366 21795532 21450648 21127673 20893721 20680411 20532376 20518819 20558483 20775819
4376B0775819L10464M47586O24665Q39857Q47950Q22668P54852M99424J08587
$$ 20775819 21086283 21533869 22158534 22998391 23846341 24669009 25423861 25923285 26031872
4367B6031872k98196o14429p67309r69409r69892r42874p33567o62868m01334
$$ 26031872 25733676 25119247 24351938 23382529 22412637 21469763 20736196 20073328 19671994
4358A9671994j42023K1742K54622M83976O03605P16441O49760M19270J01217j75965
$$ 19671994 19529971 19551713 19806335 20290311 20893916 21610357 22260117 22679387 22780604 22604639
4348B2604639m42607p74761j033326j208270j215311j257918j102854q92133p74864
$$ 22604639 22162032 21387271 20353945 19145675 17930364 16672446 15569592 14677459 13902595
4339A3902595o80906o05046m40864l90311m17316j66975k13066k13056j02686
$$ 13902595 13221689 12616643 12175779 11785468 11368152 11201177 10988111 10775055 10672369
4330A0672369j29769l7046j58827j72844j95591p0096j74783j40820q1348j00778
$$ 10672369 10542600 10505554 10346727 10173883 9978292 9908196 9733413 9592593 9511245 9410467
4320I410467K5213J20544K49338K91932M17407M98621L97891L29755J97010n1697
$$ 9410467 9435680 9556224 9805562 10097494 10514901 11013522 11411413 11741168 11938178 11886481
4310A1886481k60478l70736m04929n25288m65260m83751l45928k36810j32641
$$ 11886481 11626003 11255267 10850338 10325050 9859790 9376039 9030111 8793301 8660660
4301H660660J8405J11154K93103L72219M03784M46916L02161J43328N8858k15739
$$ 8660660 8679065 8790219 9083322 9455541 9859325 10306241 10608402 10751730 10810588 10594849
4291A0594849l70213m94758o39065o01853n28544n04066n53720n00462l44743
$$ 10594849 10224636 9729878 9090813 8488960 7960416 7456350 6902630 6402168 6057425
4282F057425l46518k44560j66140j59190k43981j85486l6534n3899j38061r6164
$$ 6057425 5710907 5466347 5300207 5141017 4897036 4711550 4675016 4621117 4483056 4386892
4272D386892p9564m7605q4693j06062q2971o2110R942o5874J9125r2815r1758
$$ 4386892 4307328 4259723 4175030 4068968 3985997 3923887 3933829 3867955 3887080 3794265 3702507
4261C702507q3143n5491p3046k0118q6749j2718l3480J464n1965k6506n2291k3760
$$ 3702507 3619364 3563873 3490827 3470709 3383960 3371242 3337762 3339226 3287261 3260755 3208464 3184704
4249C184704l7818o4218J3901k8099m5706j8206l6402J2421n262j383P8695Q1757
$$ 3184704 3146886 3082668 3096569 3068470 3022764 3004558 2968156 2980577 2975315 2973932 3052627 3134384
4237C134384M3940J4271j9833J3583j0285J10196j2766L3365q671p1550m3470
$$ 3134384 3178324 3192595 3172762 3186345 3176060 3286256 3273490 3306855 3298184 3226634 3183164
4226C183164k033p6714j64418q7668o5090o3755n4992K5346o8722p1523k7908
$$ 3183164 3181131 3104417 2939999 2852331 2787241 2723486 2668494 2693840 2625118 2553595 2525687
4215B525687k2148j25173o4438M4855K980p516M8370l6647L0062j0768M0343Q5255
$$ 2525687 2503539 2378366 2313928 2358783 2361763 2354247 2402617 2365970 2396032 2385264 2425607 2510862
4203B510862k0709K8327N4269P8686N5466M3122Q4131K079Q4910L5798L5695M2178
$$ 2510862 2490153 2518480 2572749 2651435 2706901 2750023 2834154 2836233 2921143 2956941 2992636 3034814
4191C034814l7912k5327j07333o6264q1802j6819j0827o0034n25K7799P1688J17411
$$ 3034814 2996902 2971575 2864242 2797978 2716176 2699357 2688530 2628496 2627971 2655770 2727458 2844869
4179B844869M7062k6340Q3370M2656N884L7263P7877o10j121l1644o1541q4473
$$ 2844869 2891931 2865591 2948961 2991617 2997501 3034764 3112641 3112031 3110910 3079266 3017725 2933252
4167B933252j16718j38238j04595j02694j14763j09909o410j6618n0959j45177
$$ 2933252 2816534 2678296 2573701 2471007 2356244 2246335 2239925 2223307 2172348 2027171
4157B027171r3611m6571K3454P738J8348n8936q4741K815K4621m9168N5733j9949
$$ 2027171 1933560 1886989 1910443 1918181 1936529 1877593 1792852 1795667 1820288 1771120 1826853 1806904
4145A806904k3463J24p4990o6444M0851j096p9720j08571l4699l8570o4728k2667
$$ 1806904 1783441 1783565 1708575 1642131 1682982 1681886 1602166 1493595 1458896 1420326 1355598 1332931
4133A332931m3206q8508q480K6709m6215K9277k5382m4243l4112K0755L6292q8031
$$ 1332931 1289725 1201217 1192737 1219446 1173231 1202508 1177126 1132883 1098771 1119526 1155818 1067787
4121A067787k7723j0590J6234N1031K658k7429m1507k2880p5139K0381M6658R893
$$ 1067787 1040064 1029474 1045708 1096739 1099397 1071968 1030461 1007581 932442 952823 999481 1009374
4109A009374j9928k9230o471P096k8586K4173k1727r639l5473l095r595K3322
$$ 1009374 989446 960216 953745 960841 932255 956428 934701 925062 889589 886494 876899 900221
4097I00221o4361l0603K8502K3362m0435J0037L7804M3988l487n6562L9018j7261
$$ 900221 835860 805257 833759 857121 816686 826723 864527 908515 905028 848466 887484 870223
4085H70223m785n4688J458P893k2973K9558n1119J1523P712N738K0815K2100k5462
$$ 870223 865438 810750 812208 820101 797128 826686 775567 787090 794802 800540 821355 843455 817993
4072H17993Q881M404L1729j3772J0896q2796l1925j4284j9264j8627J4250l3520
$$ 817993 826874 831278 863007 849235 860131 777335 745410 731126 711862 693235 707485 673965
4060F73965o5030J9282l7620J4397J4991j8015N1032j4737m3243M6736N9806Q7803
$$ 673965 608935 628217 590597 604994 619985 601970 653002 638265 595022 641758 701564 789367
4048G89367o2466p3921j05979O1757L5552j879k7001j02756L7435P836O3451Q015
$$ 789367 726901 652980 547001 608758 644310 642431 615430 512674 550109 557945 621396 629411
4036F29411j0998j9858l8309l7912J5872N2654j0071r010J434K5066J8870k871
$$ 629411 618413 598555 560246 522334 538206 590860 580789 571779 573213 598279 617149 614278
4024F14278m3550K2094L5838J1046J7228k312K4576m2985K1252L8722K7900l5156
$$ 614278 570728 592822 628660 639706 656934 654622 679198 636213 657465 696187 724087 688931
4012F88931l5147j6580n6350J6940M0726P926l5956k6897N507K0663L6034m914
$$ 688931 653784 637204 580854 597794 638520 646446 610490 583593 589100 609763 645797 640883
4000F40883m9430J37162J6998M0249r355k937o670j21637J9686l3819o0196j2197
$$ 640883 591453 728615 745613 785862 776507 773570 766900 645263 664949 631130 570934 558737
3988E58737j7616l7739K5523j9783O07j7092M3592Q377N2402M0297j3039P5980
$$ 558737 541121 503382 528905 509122 509729 492637 536229 544606 597008 637305 624266 700246
3976G00246k0114r3228l8825k7475m3653N964J5894o0922J4817J2819l1417r71
$$ 700246 680132 586904 548079 520604 476951 482915 498809 437887 452704 465523 434106 433135
3964D33135K8723L8705K2612l0341J3942J0720l0282J9150M132J06491n4512k3404
$$ 433135 461858 500563 523175 492834 506776 517496 487214 506364 510496 616987 562475 539071
3952E39071p7284j9212K4956K0965o2031L8204J1822j1351q989Q4008P0883p8426
$$ 539071 461787 442575 467531 488496 426465 464669 476491 465140 456151 540159 611042 532616
3940E32616J6810K1701O732L156n0875L8292n272J1724j8950m4118J8607m8102
$$ 532616 549426 571127 577859 581015 530140 568432 563160 574884 555934 511816 530423 482321
3928D82321r708j4444l5611L1740L6305p2990K342J0831n7753p4726O102M0071
$$ 482321 472613 458169 422558 454298 490603 417613 419955 430786 373033 298307 304409 344480
3916C44480R5319K1586p2194R0985j1409q0516j9274P0994J4644J8617k8354m7329
$$ 344480 439799 461385 389191 480176 468767 388251 368977 439971 454615 473232 444878 397549
3904C97549Q408K3079j3802K2754K9902K9450l117k6128N600o6378M8370M2263
$$ 397549 405957 429036 415234 437988 467890 497340 494223 468095 473695 407317 455687 497950
3892D97950j8395m3307n7404O7176K5434j00554k1455K3209N0096N4882j9468
$$ 497950 479555 436248 378844 446020 471454 370900 349445 372654 422750 477632 458164
3881D58164k7343N9518j3674J2471k0605k4583j4602n4003l8511P209k8148k2198
$$ 458164 430821 490339 476665 489136 468531 443948 429346 375343 336832 344041 315893 293695
3869B93695J1343M4933P6682M6943k2669J8450M17J4162j2933M0439j0878k5435
$$ 293695 305038 349971 426653 473596 450927 469377 469794 483956 471023 511462 500584 475149
3857D75149o695J1847m4726j1423M584L3709j1231J8373r185R5164R3207l3383
$$ 475149 468454 480301 435575 424152 428736 462445 451214 469587 460402 555566 648773 615390
3845F15390J0340k6321j8053K6446k0382m3842p9718m2929K3273j2423q5371Q9818
$$ 615390 625730 599409 581356 607802 587420 543578 463860 420931 444204 431781 346410 436228
3833D36228J21119j15775L2634J13829q0157j8614N3729k5328j3151K3840m6631
$$ 436228 557347 441572 474206 588035 507878 489264 542993 517665 504514 528354 481723
3822D81723L9105P4824M5950N77o0004M8834p083N1592l2898k430K0883k9936
$$ 481723 520828 595652 641602 642179 582175 631009 623926 675518 642620 640190 661073 631137
3810F31137l0077l3855K0155R629p2564j2392L1653O9956m2403l9237J3835o073
$$ 631137 601060 567205 587360 596989 524425 512033 543686 613642 571239 532002 545837 539764
3798E39764m4819q504P9568P5685O633k9679P392j5254K3701K8551j4503m2228
$$ 539764 494945 486441 566009 641694 648327 618648 626040 610786 634487 663038 648535 606307
3786F06307l205K4042N7203K6558n7084M5868L8992R412M852j7254L4273K8669
$$ 606307 603102 627144 684347 710905 653821 699689 738681 748093 752945 735691 769964 798633
3774G98633K0401M983L0145j1067J257Q0062r048q1097L7531O0834m321J17766
$$ 798633 819034 824017 854162 843095 844352 924414 915366 834269 871800 932634 928313 1046079
3762A046079R2217m2910r8222M9607Q7284L0676N6921P0784M4266L8037J35063
$$ 1046079 1138296 1095386 997164 1046771 1134055 1164731 1221652 1292436 1336702 1374739 1509802
3751A509802J20167Q6967J42182K10176K96053M63598M25606K48470K03749J18336
$$ 1509802 1629969 1716936 1859118 2069294 2365347 2828945 3254551 3503021 3706770 3825106
3741C825106J57063K30853L91722N88326P54790J090870J476551K773819N026164
$$ 3825106 3982169 4213022 4604744 5193070 5947860 7038730 8515281 11289100 16315264
3732A6315264Q330516Q481977O404526L044119j011655l279991n903433o459423
$$ 16315264 24645780 33127757 39532283 42576402 41564747 38284756 32381323 25921900
3724B5921900n173276m064537l570015k722953k074830j495745r00875n71141
$$ 25921900 20748624 16684087 13114072 10391119 8316289 6820544 5919669 5348528
3716E348528m66202k68969k22047l14683l08066l25347k98590j78097j34535j48768
$$ 5348528 4882326 4613357 4391310 4076627 3768561 3443214 3144624 2966527 2831992 2683224
3706B683224j35207j84263j55587k0343j01849q9764l4175j56271j85345o9930
$$ 2683224 2548017 2363754 2208167 2187824 2085975 1996211 1962036 1805765 1620420 1550490
3696A550490o0728j45453j13016k3198k1044o8398k4951K457p7575m9226j3783
$$ 1550490 1489762 1344309 1231293 1208095 1187051 1118653 1093702 1096159 1018584 969358 955575
3685I55575K0409o346k4676J7124l8155k2589o6092n2175l4613M9165j402k8340
$$ 955575 975984 969638 944962 962086 923931 901342 835250 783075 748462 797627 796225 767885
3673G67885o5012M0060q2036J7507l835p2763K5687j8095k0819j3076j1851n483
$$ 767885 702873 742933 660897 678404 674569 601806 627493 609398 588579 575503 563652 558169
3661E58169M3374J5460m173q1377m775N8510N560l8064J2921P249l5639J3940
$$ 558169 601543 617003 612830 531453 526678 585188 590748 552684 565605 572854 537215 551155
3649E51155m1444m8817n8043J4327k76J4942l3378k2029N9369K5107N6166K6111
$$ 551155 509711 460894 402851 417178 416902 431844 398466 376437 435806 460913 517079 543190
3637E43190j2752j4895k3218J3512n9475L1009q3273J8591l1479n6871O0379l0642
$$ 543190 530438 515543 492325 505837 446362 477371 394098 412689 381210 324339 384718 354076
3625C54076m2123L3179m8327M1301J2134Q38O9334p2403l6550k0020m6159M9305
$$ 354076 311953 345132 296805 338106 350240 351078 420412 348009 311459 291439 245280 294585
3613B94585Q25l4493J1120k8113m2453N8690k7875N946R651K8281J6167k5423
$$ 294585 295410 260917 272037 243924 201471 260161 232286 238232 247883 276164 292331 266908
3601B66908K6205M590m7896M5486j0009r7950p5264L9631M7350m2803L5819L2460
$$ 266908 293113 297703 249807 295293 285284 187334 112070 151701 199051 156248 192067 224527
3589B24527J0945j2156L6824M9760j5153r5211J0793k539l7123J6499K668m4519
$$ 224527 235472 223316 260140 309900 294747 199536 210329 207790 170667 187166 189834 145315
3577A45315j21993k0944Q8174n1102J5085M3730L2626M5822J0334n7852N5266
$$ 145315 23322 2378 90552 39450 54535 98265 130891 176713 187047 129195 184461
3566A84461m8077O480J1934n6373j00344K544J03178k4008N8154M3774j08686
$$ 184461 136384 142864 154798 98425 -1919 625 103803 79795 137949 181723 73037
3555G3037N080K5700M6498n3499J0236K1688m786j4764j588j3166l6600L8574
$$ 73037 78117 103817 150315 96816 107052 128740 123954 109190 107602 94436 57836 96410
3543I6410j0003k8729N0223N6851k1105o7855Q093m957n0164O7503J07177K0899
$$ 96410 86407 57678 107901 164752 143647 75792 83885 78928 28764 96267 203444 224343
3531B24343K1065m4632k4970j1125n3459K4242P6697L0502r0624n0173k3464Q36
$$ 224343 245408 200776 175806 164681 111222 135464 212161 242663 152039 101866 78402 79238
3519G9238k3190L9679K7155m0980J6383N0186M0163o7204k9946o0168L1010j5785
$$ 79238 56048 95727 122882 81902 98285 148471 188634 121430 91484 31316 62326 46541
3507D6541n4903j1675K0993J7443j7600Q374M0399k5296j3603M5984m9412K0951
$$ 46541 -8362 -20037 956 18399 799 9173 49572 24276 10673 56657 7245 28196
3495B8196O9749R705K2483n2305q6955Q3180N7212p580l0519m8445k7895L4009
$$ 28196 97945 107650 130133 77828 -9127 74053 131265 123685 93166 44721 16826 50835
3483E0835O8008j4444O551P431K5607P2595j01092j4182K571n5869j6238N0819
$$ 50835 118843 104399 110950 118381 143988 216583 115491 101309 103880 48011 31773 82592
3471H2592l0565j8642L2916K5568N6055k890j6731L8666K7211M4581k1635L0920
$$ 82592 52027 33385 66301 91869 147924 145034 128303 166969 194180 238761 217126 248046
3459B48046O4516J3855j06911j09667l8079l4547k538O502J6072j4192J878L6973
$$ 248046 312562 326417 219506 109839 71760 37213 34675 41177 57249 43057 44935 81908
3447H1908L6397N7486J9300p3059k3903q7025k2876M040j6943K481Q3755J9151
$$ 81908 118305 175791 195091 122032 98129 11104 -11772 -7732 -24675 -22194 61561 80712
3435H0712k3672k9848N6014l2177m1819J0514J8161N7774J003m9773J4569p936
$$ 80712 57040 27192 83206 51029 9210 19724 37885 95659 96662 46889 61458 53522
3423E3522o9061L5027l1060l692L9656O700L3160R052n6896P0205O407j8427P681
$$ 53522 -15539 19488 -11572 -15264 24392 31092 64252 73304 16408 86613 93020 74593 82274
3410H2274n979n4239N2103j0435N1951k6492m8932k8778m6389o655N2212L3910
$$ 82274 76295 22056 74159 63724 115675 89183 40251 11473 -34916 -41571 10641 44551
3398D4551L2422p300l129m3795O840J8180L6396o0571K5251n3429o1553Q148J258
$$ 44551 76973 69673 66544 22749 29589 47769 84165 23594 48845 -4584 -66137 -57989 -56731
3385e6731m136P086j7096J7532R5784l620p0071J1879P496k497j4389J0548k6187
$$ -56731 -60867 -53781 -70877 -53345 42439 38819 -31252 -19373 -11877 -14374 -28763 -18215 -44402
3372d4402l3366N0442l326J8274n5798J7425q647J39475j2011l0768O9961K5320
$$ -44402 -77768 -27326 -30652 -12378 -68176 -50751 -59398 80077 68066 37298 107259 132579
3360A32579j3655k5023m3944j6367m7084k5114m2274j517J7545L7148K3403N9175
$$ 132579 118924 93901 49957 33590 -13494 -38608 -80882 -82399 -64854 -27706 -4303 54872
3348E4872N6707j3825K3216o3781L193M3342o7636p070M4503l2088k2869J0590
$$ 54872 111579 97754 120970 57189 60382 103724 36088 29018 73521 41433 18564 29154
3336B9154J0742j5533n0995M49n0145L9162k3341J8975J4944K282L4260Q3658
$$ 29154 39896 24363 -26632 -26183 -76328 -37166 -60507 -41532 -26588 -24306 9954 93612
3324I3612l6995j06771l8499Q9087k5902k2327P6405n0912j8760O9026J7968P434
$$ 93612 56617 -50154 -88653 434 -25468 -47795 28610 -22302 -41062 27964 45932 53366
3312E3366k8295p2730L465L8411Q489J4157Q9735p070k2789l0405q4322j4137
$$ 53366 25071 -47659 -44194 -5783 2706 16863 106598 99528 76739 46334 -37988 -52125
3300e2125J6155m3666M7616J9616j9270M9631Q833j4128K5817M3990Q50l0788
$$ -52125 -35970 -79636 -32020 -12404 -31674 17957 26790 12662 38479 82469 83319 52531
3288E2531J680l001L4381n8140n3324J8764L0189J1153r2724m4539N9077R8166
$$ 52531 54211 51210 85591 27451 -25873 -7109 23080 34233 -58491 -103030 -43953 54213
3276E4213m220j3622k8640L5200k8096R0482m4295m9804R142K5124p6302m612
$$ 54213 49993 36371 7731 42931 14835 105317 61022 11218 20360 45484 -30818 -35430
3264c5430O1937l2678k6443P855K019J3168K6685q1514o4021N3277O8058J5203
$$ -35430 26507 -6171 -32614 -24759 -22740 -9572 17113 -64401 -128422 -75145 -7087 8116
3252H116L4565k5853j2660r8938n2205O182R5562Q697K8117K0081j510J5827m3338
$$ 8116 42681 16828 4168 -94770 -146975 -140793 -45231 -36534 -8417 11664 10154 25981 -17357
3239a7357L2220Q379m7566j1508L3936m4059j0798L3424n276l1891m4933L2870
$$ -17357 14863 23242 -24324 -35832 -1896 -45955 -56753 -23329 -28605 -60496 -105429 -72559
3227g2559J5781K7060o187M6435k380K6273J0942O67k5726q793M597n5344q141
$$ -72559 -56778 -29718 -35905 10530 8150 34423 45365 46032 20306 11513 16110 -39234 -47375
3214d7375P0179j1312J4193l7045M0814k268q1274l1913L9846o222j1845J367
$$ -47375 22804 11492 25685 -11360 29454 27186 -54088 -86001 -46155 -52377 -64222 -62855
3202f2855R2681K8880k5841n5834m5255M807j2543L2190M1590j0068N470J2018
$$ -62855 29826 58706 32865 -22969 -68224 -63417 -75960 -43770 -2180 -12248 -6778 5240
3190E240j7474K6375J5635k1728k7437j7710M5061l8948m0857N3847K6595m3589
$$ 5240 -12234 14141 29776 8048 -19389 -37099 7962 -30986 -71843 -17996 8599 -34990
3178c4990j3235J0622J6861j8186j4617l5783m308Q9824Q1718l6379l5840K6763
$$ -34990 -48225 -37603 -20742 -38928 -53545 -89328 -93636 -3812 77906 41527 5687 32450
3166C2450j439k4477l6088l216M4945Q456k743L4296k7734L1944L3030l999q089
$$ 32450 31011 6534 -29554 -32770 12175 20631 17888 52184 24450 56394 89424 85425 77336
3153G7336j6986o116l0909q725n214l300j0711p4729J8561L3078k5220J3363n0425
$$ 77336 60350 54234 23325 14600 9386 6086 -4625 -79354 -60793 -27715 -52935 -39572 -89997
3140h9997k2099O213O6822j9351q6093K9514P3444J4587n2947L4889m5130Q3656
$$ -89997 -112096 -105883 -39061 -58412 -144505 -114991 -41547 -26960 -79907 -45018 -90148 -6492
3128f492l2976k0797L1541N723K4882k1537J4314L1360L4491K200o0083j4509
$$ -6492 -39468 -60265 -28724 -23001 1881 -19656 -5342 26018 60509 62709 2626 -11883
3116a1883j8600N9973J0574q863m0192j2899l1704m0627J4422P4946J2651J1150
$$ -11883 -30483 29490 40064 31201 -8991 -21890 -53594 -94221 -79799 -4853 7798 18948
3104A8948M0802K1085l1280N5434p14j16941J2944j9006Q295o4356l0528R9390
$$ 18948 59750 80835 49555 104989 104275 -12666 278 -18728 -10433 -74789 -105317 -5927
3092e927p959p320L7007L6683n1881N159j7673L7073m5216k2269J421L0972J7544
$$ -5927 -13886 -21206 15801 52484 603 5762 -11911 25162 -20054 -42323 -40902 -9930 7614
3079G614k3469m7149R366k0142K5027L2622k7183k82o239P5409q1969m3875P7791
$$ 7614 -15855 -63004 -53638 -73780 -48753 -16131 -43314 -43596 -49835 25574 -56395 -100270 -22479
3066b2479L0377n406l7236n0375k922M215l0624L641N1075j3695m6090J2202L689
$$ -22479 7898 2492 -34744 -85119 -88041 -83826 -114450 -110809 -59734 -73429 -119519 -107317 -103628
3053a03628P7841L4153j1321M6473n951n7456K8916j1616L75K0876l2131p1474
$$ -103628 -25787 8366 -2955 43518 37567 -19889 9027 -2589 -2214 18662 -13469 -84943
3041h4943l949J7459M282L7589J3788O9342J1412l1029l8264N9287n1298m2146
$$ -84943 -88892 -71433 -67151 -29562 -15774 53568 64980 33951 -4313 54974 3676 -38470
3029c8470J0744P1209q203m6588M2351j5396N637m6728j4463L1324P605J3147
$$ -38470 -27726 43483 35280 -11308 31043 15647 21284 -25444 -39907 -8583 -978 12169
3017A2169j5893M7656m3491K266j8390Q568J3259q314N9232o702n3237P6408k4299
$$ 12169 -3724 43932 441 2707 -15683 -7115 6144 -2170 57062 50360 -2877 73531 49232
3004D9232l0734p181J9799q636J7069k6261P5773m7245j1309M283O2163M7774
$$ 49232 18498 11317 31116 22480 39549 13288 89061 41816 30507 34790 96953 144727
2992A44727r3858P664N232k1777k7389j7746n922K56k4991l5247K2615J14460
$$ 144727 50869 58533 63765 41988 14599 -3147 -9069 -8813 -33804 -69051 -46436 68024
2980F8024L071N5301k6123J4078l4091l1570Q7728p6560k5927r6951l0441N2459
$$ 68024 71095 126396 100273 114351 80260 48690 136418 59858 33931 -63020 -93461 -41002
2968d1002Q4212j11335J722M3149R376j26j7837L7753J5712l8600L071P3170K8406
$$ -41002 43210 -68125 -66403 -23254 -13878 -14004 -31841 5912 21624 -16976 -13905 59265 87671
2955H7671k1665o0863k5883K585j4609m763J1687l1940l9918L211M2762K504K8420
$$ 87671 66006 5143 -20740 -18155 -32764 -37527 -25840 -57780 -97698 -94487 -51725 -49221 -20801
2942b0801K4525M3100J5698j03811M187k8241k8506L4233K7072J5915o0437K3297
$$ -20801 3724 46824 62522 -41289 -37102 -65343 -93849 -59616 -32544 -16629 -77066 -53769
2930e3769O0906K5034k5660M0755K3683N0106m0038n073K8800J7524l0395j4732
$$ -53769 7137 32171 6511 47266 70949 121055 81017 75944 104744 122268 91873 77141
2918G7141j3080j0883q6325m7572o670J3609P79M586o20J11859n0641L7912J811
$$ 77141 64061 53178 -33147 -80719 -87389 -73780 -73001 -68415 -69035 42824 -7817 30095 31906
2905C1906J8610n358o9635N196j0038k1882j4539k5247k3575O3925O2603n8015
$$ 31906 50516 45158 -24477 -19281 -29319 -51201 -65740 -90987 -114562 -50637 11966 -46049
2893d6049l0592N4277M1130K2540n4243j0932K0446j9591K9741k5951j2409j7145
$$ -46049 -76641 -22364 18766 41306 -12937 -23869 -3423 -23014 6727 -19224 -31633 -48778
2881d8778J2628N946m1848N3333M2978k5705o6119N4705q278L9421L1229k4372
$$ -48778 -36150 -30204 -72052 -18719 24259 -1446 -67565 -12860 -21138 18283 49512 25140
2869B5140m1118L3892j3484L6887K2966j00938M7444K4812q1475J7419j8463L1080
$$ 25140 -15978 17914 4430 41317 64283 -36655 10789 35601 -45874 -28455 -46918 -15838
2857a5838M3545K96j0980r9055j0405O0226o233J4708m264k9472K4339k8514Q9049
$$ -15838 27707 28003 17023 -82032 -92437 -32211 -38444 -23736 -28000 -57472 -33133 -61647 27402
2844B7402M636j7188k9213K3540m4261m5850n627J03497J1965l3431k6914o0928
$$ 27402 32038 14850 -14363 9177 -35084 -80934 -86561 16936 28901 -4530 -31444 -92372
2832i2372N4879J8720o5123L4657M7883l4610j6669l3207K9124M2441n4836J974
$$ -92372 -37493 -18773 -83896 -49239 -1356 -35966 -52635 -85842 -56718 -14277 -69113 -67139
2820f7139J4429m6586J4705n2306L84K6710K8539R673Q3048n1054k4693O8521
$$ -67139 -52710 -99296 -84591 -136897 -136513 -109803 -81264 -71591 11457 -39597 -64290 4231
2808D231L720k4234l791j2653n2605O4227M739p6241m8803J0697L6087N6192k3630
$$ 4231 7951 -16283 -20074 -32727 -85332 -21105 -16366 -92607 -141410 -130713 -94626 -38434 -62064
2795f2064L483K4671N0637N4019n2670m3211L719J1055m3687l2262N7122l0480
$$ -62064 -58581 -33910 16727 70746 18076 -25135 -21416 -10361 -54048 -86310 -29188 -59668
2783e9668m0156M7534k4685L0174m781R8944j6029L7257Q13K1537o5114m9919
$$ -59668 -99824 -52290 -76975 -46801 -51582 47362 31333 68590 69403 90940 25826 -24093
2771b4093k2205J306J8848m046J9020j0953l0462L039K4899J867q4883Q1450R168
$$ -24093 -46298 -44992 -26144 -30190 -11170 -22123 -52585 -49546 -24647 -22780 -107663 -26213 -17045
2758a7045P405O4148N3465k4372l5747L6876l6072q8705l2997J1467Q951l8042
$$ -17045 -9640 54508 107973 83601 47854 84730 48658 -40047 -73044 -61577 -52626 -90668
2746i0668L0256J5232l1619L4261K050L8648n5756J15676K5189k4630J5086J142
$$ -90668 -60412 -45180 -76799 -42538 -40488 -1840 -57596 58080 83269 58639 73725 74867
2734G4867l524j03562K6949n2364L203j5689r479K5623J7841J9683l2690J7347
$$ 74867 71343 -32219 -5270 -57634 -54431 -70120 -79599 -53976 -36135 -16452 -49142 -31795
2722c1795Q705J253J7051J02476m0974m0263p64j5750j8226k2347j636l2808M0644
$$ -31795 -23090 -21837 -4786 97690 56716 16453 15689 -61 -18287 -40634 -42270 -75078 -34434
2709c4434M2338n1329J5270l2098O4070L682l3717L5223o999n6721K5638m8141
$$ -34434 7904 -43425 -28155 -60253 3817 7499 -26218 9005 2006 -54715 -29077 -77218
2697g7218j1295m2242M3463n4801k3992P4958q426k9550O7307R431K7372R853
$$ -77218 -88513 -130755 -87292 -142093 -166085 -91127 -99553 -129103 -61796 -52365 -24993 -15140
2685a5140r313L2297N422k3786R114O7448j38o6239p2160M5655p4518Q0086L9127
$$ -15140 -24453 7844 13266 -10520 -1406 66042 65904 -335 -72495 -26840 -101358 -21272 17855
2672A7855M059j7662K7387K9616M249j4529l4115j3011M1348O698j53446J1726
$$ 17855 21914 4252 31639 61255 65504 50975 16860 3849 45197 51895 -101551 -89825
2660h9825O559K2487j1334N7115R8099M279m3324J9397M1573n8859l6098r247
$$ -89825 -83266 -60779 -72113 -14998 83101 87380 44056 63453 105026 46167 10069 822
2648H22M9033J4247m8976K736l7840l6333N60L4023k3404k0156M087J7733k5577
$$ 822 49855 64102 15126 17862 -19978 -56311 -55751 -21728 -45132 -65288 -61201 -43468 -69045
2635f9045m2822O9906M2479K2971K8880J5743j831m5273K229N8457l3321j07978
$$ -69045 -111867 -41961 518 23489 52369 68112 66281 21008 23237 81694 48373 -59605
2623e9605K8618K0880m4948K1599O9405R523j9831m2120J4182n938J1568K4999
$$ -59605 -30987 -10107 -55055 -33456 35949 45472 25641 -16479 -2297 -8235 3333 28332
2611B8332o7673J6151l6978j1493L6256o3081j2538L1283j9246R3268K8309j1463
$$ 28332 -39341 -23190 -60168 -71661 -35405 -98486 -111024 -79741 -98987 -5719 22590 11127
2599A1127l9678K3026o0441j1243O7691k5818l6149J7143p99K7387R294k3806
$$ 11127 -28551 -5525 -65966 -77209 -9518 -35336 -71485 -54342 -55141 -27754 -18460 -42266
2587d2266k1745m4088O4777M9477l2070r164J7988K912N466k9685r1284J3689
$$ -42266 -64011 -108099 -43322 6155 -25915 -35079 -17091 -14179 -8713 -38398 -129682 -115993
2575a15993N1196k6431M5258P196K5313l7780N5803l7323M0684N550L0466J2652
$$ -115993 -64797 -91228 -45970 -38774 -13461 -51241 4562 -32761 7923 13473 43939 56591
2563E6591Q073O837l9739l6346o2778L6155N9434l398O7304q4948L6986J00073
$$ 56591 64664 71501 31762 -4584 -67362 -31207 28227 24829 92133 7185 44171 144244
2551A44244p3704K0588K5962m2596q6542J4647k2764q664j9787L6277J1066l8324
$$ 144244 70540 91128 117090 74494 -12048 2599 -20165 -28829 -48616 -12339 -1273 -39597
2539c9597o0291P9505o1811J043N8177N8973j1653m6015K5164l7672p8907P940
$$ -39597 -99888 -20383 -82194 -81151 -22974 35999 24346 -21669 3495 -34177 -113084 -105144
2527a05144O3032J3227p0488L9327K931j9062J8154n524J5364N9700J0890l4125
$$ -105144 -42112 -28885 -99373 -60046 -57115 -76177 -58023 -63547 -48183 11517 22407 -11718
2515a1718P2609L69j25772K9828J5803K9137j02518l7275J19307k9309q7426M3906
$$ -11718 60891 61260 -64512 -34684 -18881 10256 -92262 -129537 -10230 -39539 -126965 -83059
2503h3059L5799K9236Q678L4200N0053n5438l825j5507J0514m489p2732k5405
$$ -83059 -47260 -18024 -9346 24854 74907 19469 15644 137 10651 6162 -66570 -91975
2491i1975j3318M915M432j350n388N8879M8378K4842J9462n1816J6436L9134M1888
$$ -91975 -105293 -100378 -95946 -97296 -102684 -43805 4573 29415 48877 -2939 13497 52631 94519
2478I4519k2787k4118j3543q0387K539k8748l1085k0289l8693J8579J01479p922
$$ 94519 71732 47614 34071 -46316 -43777 -72525 -103610 -123899 -162592 -144013 -42534 -50456
2466e0456m4952J9225M8069j8320l1852L5408L4306o1775o188J7961J2063K1392
$$ -50456 -95408 -76183 -28114 -46434 -78286 -42878 -8572 -70347 -76535 -58574 -46511 -25119
2454b5119q319p0475o0201M8743P194L4438L2326N1668l4236K6044N1052o3328
$$ -25119 -33438 -103913 -164114 -115371 -108177 -73739 -41413 10255 -23981 2063 53115 -10213
2442a0213O018N4264k4207l5101k2991J3267K7692Q246m9248N5490j9443L7737
$$ -10213 -4195 50069 25862 -9239 -32230 -18963 8729 16975 -32273 23217 3774 41511
2430D1511j049J8692M5598m6595m7877L7400L210j5367n8998K5593j8092m6908
$$ 41511 40462 59154 104752 58157 10280 47680 50890 35523 -23475 2118 -15974 -62882
2418f2882J8329L3998m3053J8916J762o3585J1713N9771J8677O5882K312q143
$$ -62882 -44553 -10555 -53608 -34692 -32930 -96515 -84802 -25031 -6354 59528 61840 53697
2406E3697n3492m3749m6878k0032J7549O3569L0547l1018j5643n0093k5448M1725
$$ 53697 205 -43544 -90422 -110454 -92905 -29336 1211 -29807 -45450 -95543 -120991 -79266
2394g9266p473N8057m0379M7596J9347j1345J5603K0627k2770l6581r732j4277
$$ -79266 -86739 -28682 -69061 -21465 -2118 -13463 2140 22767 -3 -36584 -46316 -60593
2382f0593K7419L1991m9348k409j30279K4352Q1780K474Q4010R8357j741o6327
$$ -60593 -33174 -1183 -50531 -52940 -183219 -158867 -77087 -74613 9397 107754 106013 39686
2370C9686q689m9005m5256K5304K0811j7891P044m4958J7419l1676L2371j5138
$$ 39686 30997 -18008 -63264 -37960 -17149 -35040 -27996 -72954 -55535 -87211 -54840 -69978
2358f9978P1675K0494q3886j1879k4747J20812M2959n8075N4050l4714p880o7747
$$ -69978 1697 22191 -61695 -73574 -98321 22491 65450 7375 61425 26711 18831 -48916
2346d8916O526p8208K9976J8094m978N4880m8496k1679N4910m4170M7528J4480
$$ -48916 -42390 -120598 -90622 -72528 -77506 -22626 -71122 -92801 -37891 -82061 -34533 -20053
2334b0053j1528M9435L549m0285P358q8502n7891K5589O0130K2395R44k4758K6635
$$ -20053 -31581 17854 21403 -18882 -11524 -100026 -157917 -132328 -72198 -49803 -48859 -73617 -46982
2321d6982L2970N35m7119O2083n1433K1158o5464K6764P6389M0055O119j4422
$$ -46982 -14012 -13477 -60596 1487 -49946 -28788 -94252 -67488 8901 48956 55075 40653
2309D0653o1427K5013k5788o4515J648O5383j7757k1013m5461J05484Q6088n8665
$$ 40653 -20774 4239 -21549 -86064 -84416 -19033 -36790 -57803 -103264 2220 88308 29643
2297B9643k7609k8654J3665L5754r44p1344Q069L3448K7804m5112o2298j724L010
$$ 29643 2034 -26620 -12955 22799 21855 -49489 -41420 -7972 19832 -25280 -87578 -89302 -86292
2284h6292K4549n2902J3152P4349Q905j0498j0700O3566K2022k9017k1816R9152
$$ -86292 -61743 -114645 -101493 -27144 -18239 -28737 -39437 24129 46151 17134 -4682 94470
2272I4470R439l7707j29852k3070k1602m3759K660j7295O2519J29024Q0189l9828
$$ 94470 103909 66202 -63650 -86720 -108322 -152081 -149421 -166716 -104197 24827 105016 65188
2260F5188j5132M5343q047L3396N258l1352p1213m1259o8560O6925M0080j7382
$$ 65188 50056 95399 87352 120748 126006 94654 23441 -17818 -86378 -19453 20627 3245
2248C245l1921Q2183M417k0049P6978l5512j0125M5581P404r4869j17516j7473
$$ 3245 -28676 53507 57924 37875 114853 79341 69216 114797 122201 27332 -90184 -107657
2236a07657j845J8100j4869M4131R887L5990N5574j2053k4630K3267k9283M2645
$$ -107657 -109502 -91402 -106271 -62140 -52253 -16263 39311 27258 2628 25895 -3388 39257
2224C9257j4733M1265l3671m5280m2841k034n1272R980j2107q520J7632R559N4127
$$ 39257 24524 65789 32118 -13162 -56003 -58037 -109309 -99329 -111436 -119956 -102324 -92765 -38638
2211c8638m2808K6672K8060N6222N0033l7041q3690K7896K6018o4656M127j6149
$$ -38638 -81446 -54774 -26714 29508 79541 42500 -41190 -13294 12724 -51932 -47805 -63954
2199f3954M9149l5439n065j5384k1053O9193L5265N0574K0024O889m8457J2645
$$ -63954 -14805 -50244 -55309 -70693 -91746 -22553 12712 63286 83310 90199 41742 54387
2187E4387k2357N9937m8922r0079K0706J2200L2415q072O8675K5987o4876o287
$$ 54387 32030 91967 43045 -47034 -26328 -14128 18287 10215 78890 104877 40001 33714
2175C3714M520k5353q2635m7544K7763J9056J5254L0767K1039k3688K3885J3866
$$ 33714 38234 12881 -69754 -117298 -89535 -70479 -55225 -24458 -3419 -27107 -3222 10644
2163A0644J7686j3038j0975j0302Q86o5178J9335k0929n727l3128P735K5402K2714
$$ 10644 28330 15292 4317 -5985 -5099 -70277 -50942 -71871 -77598 -110726 -102991 -77589 -54875
2150e4875K0721L0956N2668M5051o1951P979J09146j8740p9539q2566m0140j5614
$$ -54875 -34154 -3198 49470 94521 32570 40549 149695 130955 51416 -31150 -71290 -86904
2138h6904J7697k232j4573M6358K3841m7691J4771L5266J04630J1147J8568q6421
$$ -86904 -69207 -71439 -86012 -39654 -15813 -63504 -48733 -13467 91163 102310 120878 34457
2126C4457J8051l6353n6140j7501j0109m7018j8733L9652J28519j8270Q870l4395
$$ 34457 52508 16155 -39985 -57486 -67595 -114613 -133346 -93694 34825 16555 25425 -8970
2114h970N6592O6170n0528N292o1298r6077K5240J0813p3701N972J8980l2835
$$ -8970 47622 113792 63264 68556 7258 -88819 -63579 -52766 -126467 -120495 -101515 -134350
2102a34350K8934m8843P7218Q0972L7402j9675M4461o1896o211o162K419J5654
$$ -134350 -105416 -154259 -77041 3931 41333 21658 66119 4223 -1988 -8150 -5731 9923
2090I923m1031k7717m0202j6799N6034k8855n260O0202P5471p1776l1869N9776
$$ 9923 -31108 -58825 -99027 -115826 -59792 -88647 -93907 -33705 41766 -30010 -61879 -2103
2078b103K7085K3554j2898n868m6328k0316j9740J8901q448j3017j0186o255K3050
$$ -2103 24982 48536 35638 29770 -16558 -36874 -56614 -37713 -46161 -59178 -69364 -75619 -52569
2065e2569L7908P6929j4270K6762J5532o4848j0122j2246J797j4719P567k9634
$$ -52569 -14661 62268 47998 74760 90292 25444 15322 3076 4873 -9846 -2279 -31913
2053c1913m1999N4605J8435n0068M2452O5308j5909m1640j8982j8067K2540m5981
$$ -31913 -73912 -19307 -872 -50940 -8488 56820 40911 -729 -19711 -37778 -15238 -61219
2041f1219R2528k7185K2015l9694p038R527j5342L2419n0891L6626L1493l9704
$$ -61219 31309 4124 26139 -13555 -20593 -11066 -26408 6011 -44880 -8254 23239 -16465
2029a6465p4466k6743O2525M7742J2797l2621J8092m8585N6247K767P7202l7659
$$ -16465 -90931 -117674 -55149 -7407 5390 -27231 -9139 -57724 -1477 1290 78492 40833
2017D0833J7528k8372l4851Q982m9499M2549M3526J3334k2184j5349n6568M3685
$$ 40833 58361 29989 -4862 4120 -45379 -2830 40696 54030 31846 16497 -40071 3614
2005C614J08791L3023O125k3483k3285l4458n7540j1045L4968k9920l7195k1733
$$ 3614 112405 145428 151553 128070 104785 70327 12787 1742 36710 6790 -30405 -52138
1993e2138k4619K4175J8020k3354J08286K3840p5220j2758k2952N5324J2347p6549
$$ -52138 -76757 -52582 -34562 -57916 50370 74210 -1010 -13768 -36720 18604 30951 -45598
1981d5598l0915k0371J01126j386J8479M5792j08504j4068J848k8900l0657L1252
$$ -45598 -76513 -96884 4242 2856 21335 67127 -41377 -55445 -53597 -82497 -113154 -81902
1969h1902K5020N2904M8250m9343J0366o55J584L9051n655P212K081K4554j2555
$$ -81902 -56882 -3978 44272 -5071 5295 4640 6224 45275 39620 46832 48913 73467 60912
1956F0912o0834k1338L6441j4223k2601J2258m4688K6007l6638N8359j7646j7683
$$ 60912 78 -21260 15181 958 -21643 -9385 -54073 -28066 -64704 -6345 -23991 -41674
1944d1674J896Q852L6864J6686J795P3463M3409o5571n2247n0559L3169j1005
$$ -41674 -39778 -30926 5938 22624 24419 97882 141291 75720 23473 -27086 6083 -4922
1932d922l3458l1709L6651M6820M4048L3028l8326M980M1788k496l9004j0062
$$ -4922 -38380 -70089 -33438 13382 57430 90458 52132 57112 98900 96404 57400 47338
1920D7338j7591n7568K0577J1460K642O911r930n8771K1723Q367K1744m1503Q7446
$$ 47338 29747 -27821 -7244 4216 6858 13769 3839 -54932 -33209 -24842 -3098 -44601 42845
1907D2845N3150n8915l5701J04386N2804o6837p6146q3835j4228l3733j1081J10273
$$ 42845 95995 37080 1379 105765 158569 91732 15586 -68249 -82477 -116210 -127291 -17018
1895a7018o026P4767N5435n0058n3449M9671K6442J3969K0385p610q1657k5345
$$ -17018 -23044 51723 107158 57100 3651 53322 79764 93733 114118 106508 24851 -494
1883d94N0554j4165N137j0477p0069N731N0925N3669l6582Q445K2382M7422m1782
$$ -494 50060 35895 41032 30555 -39514 -33783 17142 70811 34229 42674 65056 112478 70696
1870G0696j1492L3593K0551k0214m9719m4306r6056n7764k8443P1237O5477M8119
$$ 70696 59204 92797 113348 93134 43415 -891 -96947 -154711 -183154 -111917 -46440 1679
1858A679l394m8702O1295M0610J7965j2644j5553L079k3928n4071k2748K5775
$$ 1679 -1715 -50417 10878 51488 69453 56809 41256 44335 20407 -33664 -56412 -30637
1846c0637N9346n0435l2750O3779l1107n1215L3897N9537j414Q0780k4550n4685
$$ -30637 28709 -21726 -54476 9303 -21804 -73019 -39122 20415 19001 99781 75231 20546
1834B0546l3271K1382o035j7788K989j6345j702k1056k2350Q433K8238O0071m4560
$$ 20546 -12725 8657 2622 -15166 -12177 -28522 -30224 -51280 -73630 -65197 -36959 23112 -21448
1821b1448O6576N1450j6619m115l8400L259k9271l6137K5349m2940K3173J2611
$$ -21448 45128 96578 79959 75844 37444 40703 11432 -24705 644 -42296 -19123 -6512
1809f512L820J5636o2994M1990l7406j0573L4821J9591J5048k4967M2078J1214
$$ -6512 -2692 12944 -50050 -8060 -45466 -56039 -21218 -1627 13421 -11546 30532 41746
1797D1746k7644P1543j9617m4754o2221q5140N4931O3201k2696k6203M2425n4176
$$ 41746 14102 85645 66028 21274 -40947 -126087 -71156 -7955 -30651 -56854 -14429 -68605
1785f8605j7703Q2659K9445l7081J8455K0728L0871j7469l0510l8633j9847m265
$$ -68605 -86308 -3649 25796 -11285 7170 27898 58769 41300 10790 -27843 -47690 -51955
1773e1955M9786P5L3971l8709O271n4127K5431L8521l1541N4270k5348O5343k5565
$$ -51955 -2169 -2094 31877 -6832 -561 -54688 -29257 9264 -22277 31993 6645 71988 46423
1760D6423m1721L4649K2750M3463k8381l3188l9572J0676m3380o081L2694j7441
$$ 46423 4702 39351 62101 105564 77183 43995 4423 15099 -28281 -34362 -1668 -19109
1748a9109j217J8889K3899K9101l6050m2705j3615L3087l316Q7093k4767q6298
$$ -19109 -20326 -1437 22462 51563 15513 -27192 -40807 -7720 -11036 76057 51290 -35008
1736c5008m4487Q679M6324Q0825J6492j4577N4122k4117O961j13264l799J0648
$$ -35008 -79495 -70816 -24492 56333 72825 58248 112370 88253 95214 -18050 -21849 -11201
1724a1201n1503P2205M3447J8338o6690n2143j4856N8566m4438K8871J0790L7375
$$ -11201 -62704 9501 52948 71286 4596 -47547 -62403 -3837 -48275 -19404 -8614 28761
1712B8761M9371P5805l7785l3244j339m4685N3323K37j8059p6663k4346L2739
$$ 28761 78132 153937 116152 82908 81569 36884 90207 90444 72385 -4278 -28624 4115
1700D115q582j9134N8490M836J6428k0509N7861p1961N7710j1425q2877K150l7434
$$ 4115 -4467 -23601 34889 39725 56153 35644 93505 21544 79254 67829 -15048 -12898 -50332
1687e0332O688J4288l4363k6429R7559L2532j05252K1213J0709J8505R535l495
$$ -50332 -43644 -29356 -63719 -90148 7411 39943 -65309 -44096 -33387 -14882 -5347 -8842
1675h842m1220M1279o2525Q5671l0364r9394L6828L8594j2421O3480O4442j9410
$$ -8842 -50062 -8783 -71308 14363 -16001 -115395 -78567 -39973 -52394 11086 75528 56118
1663E6118o2308j6385L0453k0407l9530M1867j7625n4817J4078J6941L622N9736
$$ 56118 -6190 -22575 7878 -12529 -52059 -10192 -27817 -82634 -68556 -51615 -47993 11743
1651A1743N6463m8581l8759J1735m1487J5676n61m8729L7696K5856k0792P433
$$ 11743 68206 19625 -19134 -7399 -48886 -33210 -33771 -82500 -44804 -18948 -39740 -32307
1639c2307q6438k7693M7272N7366N1210k5750L3829Q853L0478l0541k6562k492
$$ -32307 -118745 -146438 -99166 -41800 9410 -16340 17489 26342 56820 26279 -283 -2775
1627b775o2497L6831l9285N9020L332J4897N6944j6774n6753m8766K7057N0771
$$ -2775 -65272 -28441 -67726 -8706 -5374 9523 66467 49693 -7060 -55826 -28769 22002
1615B2002N9346n3030o3111j2893M1773l1042M8684L3454p0955k3425J0989K4821
$$ 22002 81348 28318 -34793 -47686 -5913 -36955 11729 45183 -25772 -49197 -38208 -13387
1603a3387J6844j127R871J2080K4528p0859M087l069K135n9003j0461M1942M0009
$$ -13387 3457 2330 12201 24281 48809 -22050 -17963 -21032 -18897 -77900 -88361 -46419 -6410
1590f410J7289j9087q1697O3153M6159n9080O4560L3323R648r034k3785O178k7551
$$ -6410 10879 -8208 -89905 -26752 19407 -39673 24887 58210 67858 58824 35039 41217 13666
1577A3666j8568K0988K162J9855q652l0651M546Q755J2516j8784M668q492j710
$$ 13666 -4902 16086 18248 38103 29451 -1200 3346 12101 24617 5833 10501 2009 299
1564B99N119N3731n0017J526J1855j3691j030O583N503K6613o0205k1408N9033
$$ 299 5418 59149 9132 10658 22513 8822 7792 14375 19878 46491 -13714 -35122 23911
1551B3911j1468k7673P2230M0266n1290p4621n0255k3431o942M0847M130M3791
$$ 23911 12443 -15230 57000 97266 45976 -28645 -78900 -102331 -109273 -68426 -64296 -20505
1539b0505P0430j8977m0875l6003K5995K7979K7185K5625J057q898M5878J0700
$$ -20505 49925 30948 -9927 -45930 -19935 8044 35229 60854 61911 53013 98891 109591
1527A09591p2435m3378m5343r432K5411N2267J1543l5975M10K6153M9291m8961
$$ 109591 37156 -6222 -51565 -60997 -35586 16681 28224 -7751 -7341 18812 68103 19142
1515A9142J3750q2434o123L9216m439K2892L3992k8353k8378j9045K0611l2473
$$ 19142 32892 -49542 -55665 -16449 -20888 2004 35996 7643 -20735 -39780 -19169 -51642
1503e1642k8472N9713K3728N1405m401j9420l3403l5907m9332J3310N1885k8892
$$ -51642 -80114 -20401 3327 54732 50331 30911 -2492 -38399 -87731 -74421 -22536 -51428
1491e1428J2324L081L8119q640M5167J7797q678N6361j3P083j5717j0293q0340
$$ -51428 -39104 -36023 2096 -6544 38623 56420 47742 104103 104090 111173 95456 85163 4823
1478D823K017n248K6123n4921m3947k1620M0385m751l6939J2350L4458L5407N8679
$$ 4823 6840 1592 27715 -27206 -71153 -92773 -52388 -57139 -94078 -81728 -47270 -11863 46816
1465D6816J853j0455j8041J1295j7392L2585m9633l6464L3944J9087l4643K1125
$$ 46816 48669 38214 20173 31468 14076 46661 -2972 -39436 -5492 13595 -21048 77
1453G7K9614K557k032J1759j7680M8973J9386K4066k917k2066q5164K3437k2611
$$ 77 29691 32248 30216 41975 24295 73268 92654 116720 113803 91737 6573 30010 7399
1440G399N5552j724j5317k4225m7037L0909J648L1453n7875l3115L6419K3777
$$ 7399 62951 61227 45910 21685 -25352 5557 7205 38658 -19217 -52332 -15913 7864
1428G864N9009k4676n747J1756K807R986q742m6395j1960O6278o0995N086m21
$$ 7864 66873 42197 36450 48206 51013 60999 52257 5862 -6098 60180 -815 4271 3850
1415C850k0095j0234K7102m405J0493k688l3002L5969O1365k7616p4913n6293
$$ 3850 -16245 -26479 623 -3782 6711 4023 -28979 6990 68355 40739 -34174 -90467
1403i0467O9794j4133K0536J7188m8437k4390M0332m1964K0566P278J6029K0033
$$ -90467 -20673 -34806 -14270 2918 -45519 -69909 -29577 -71541 -50975 -43697 -27668 -7635
1391g635l7606P7543l5684o7166N0389k0057k1291J07423L0753k5324m6186q6086
$$ -7635 -45241 32302 -3382 -70548 -20159 -40216 -61507 45916 76669 51345 5159 -80927
1379h0927l228L803K9383N760j7091L7648J0342M5907L6425m0260l5162K9088
$$ -80927 -84155 -80352 -50969 -45209 -62300 -24652 -14310 31597 68022 27762 -7400 21688
1367B1688J1349n215j4976J8396K2350j2458Q2311L3839p0845k6813N1910O6045
$$ 21688 33037 27822 12846 31242 53592 41134 123445 157284 86439 59626 111536 177581
1355A77581o7951n5686J0073l4985L1970L0839o5292j4186n1012j5544M5718N7363
$$ 177581 109630 53944 64017 29032 61002 91841 26549 12363 -38649 -54193 -8475 48888
1343D8888M1390k8128j5584k6679o8032j0634R137O465L2450n611M3420J3330
$$ 48888 90278 62150 46566 19887 -48145 -58779 -49642 -43177 -10727 -16338 27082 40412
1331D0412N976l2080M0660P7908k7957o5982j9709m5209n9951k6041J03716J5173
$$ 40412 46388 14308 54968 132876 104919 38937 19228 -25981 -85932 -111973 -8257 6916
1319F916J8362K4005o3398L9647M7228k945j9814k8169M853K2798l2840k8094
$$ 6916 25278 49283 -14115 25532 72760 69815 50001 21832 26685 49483 16643 -11451
1307a1451n0296J306M6344L710L9812j705J4259j4498k7468J7335K6286j3280
$$ -11451 -61747 -60441 -14097 -10387 29425 27720 41979 27481 13 17348 43634 30354
1295C0354O5978l5231l5974j1857N098j4330j0412n8563k2002J8349P7820j6900
$$ 30354 96332 61101 25127 13270 18368 4038 -6374 -64937 -86939 -68590 9230 -7670
1283g670n918K3935L0776k382m8904j976m1257J6086Q7738o8549N251j2024M4512
$$ -7670 -13588 10347 41123 38741 -10163 -12139 -53396 -37310 50428 -18121 -12870 -24894 19618
1270A9618L4041j9239J7471k1247L1933o515k2673J1564N6104J1327n0721o9534
$$ 19618 53659 34420 51891 30644 62577 56062 33389 44953 101057 112384 61663 -7871
1258g871m709K5039l2959m6590J2880j7902l1482N0079L3470M380N2613R513J0556
$$ -7871 -12580 12459 -20500 -67090 -54210 -72112 -103594 -53515 -20045 -15665 36948 46461 57017
1245E7017k3953L7145m4394J1377k9197m6399K287J3508R322M8351L6776R164
$$ 57017 33064 70209 25815 37192 7995 -38404 -36117 -22609 -13287 35064 71840 81004
1233H1004o7017O885J8895Q1055r177m9402j9491M103l6147J2125k3114L4653
$$ 81004 13987 20872 39767 120822 111645 62243 42752 46855 10708 22833 -281 34372
1221C4372n3076o7877L2885j0227l8820J19204L7584l5319K934L0765n4968J4832
$$ 34372 -18704 -86581 -53696 -63923 -102743 16461 54045 18726 21660 52425 -2543 12289
1209A2289n3817N5067J0882l7140P638j2905N93M2760O0766j3638L2440K2005
$$ 12289 -41528 13539 24421 -12719 -5081 -17986 -17393 25367 86133 72495 104935 126940
1197A26940l0481l1790M634K1913m1054p034J29447r481j16049j12583j8673N9470
$$ 126940 96459 64669 69303 91216 50162 43128 172575 163094 47045 -65538 -84211 -24741
1185b4741j2811O4820O0003K3866n5597j1086L4356K6319J7988q4269J0696k775
$$ -24741 -37552 27268 87271 111137 55540 44454 78810 105129 123117 38848 49544 46769
1173D6769n4546o3980M7993n5165j3145Q4093N8083J3430k928O395P385k4758
$$ 46769 -7777 -71757 -23764 -78929 -92074 -7981 50102 63532 60604 66999 74384 49626
1161D9626j0424J0919q654M2902l4576o0378K5488l1265K1524j043R942o3598
$$ 49626 39202 50121 41467 84369 49793 -10585 14903 -16362 5162 4119 14061 -49537
1149d9537Q3412O45j2545M8748l5241k342o307J308l2991j7011L3608J6431k6870
$$ -49537 33875 34520 21975 70723 35482 33140 26833 28141 -4850 -21861 11747 28178 1308
1136A308l4358P7446n8420q0071P7555N355J9184R9227j1651l4776K4249L7749
$$ 1308 -33050 44396 -14024 -94095 -16540 -11185 7999 107226 95575 60799 85048 122797
1124A22797k0202m590o135k4305l3386j8954m7260j3752l4541L7812K3399K120
$$ 122797 102595 98005 91870 67565 34179 15225 -32035 -45787 -80328 -42516 -19117 -16997
1112a6997j1100J9528N7000M2705m0702L758k6723k46m873m3574l0226k905r678
$$ -16997 -28097 -8569 48431 91136 50434 54192 27469 27223 22350 -21224 -51450 -54355 -64033
1099f4033M2852j7245p655l8818K0083M9584O5786M1202m7119M0166M2304m1232
$$ -64033 -21181 -38426 -46081 -84899 -64816 -15232 50554 91756 44637 84803 127107 85875
1087H5875r889j6086j0466m9402k4358P01q913N9790o0470O013N8326n173J6193
$$ 85875 75986 59900 49434 32 -24326 -23625 -32538 27252 -33218 -27205 31121 25948 42141
1074D2141R622N8778K0585m5483n3650J3478j2226J2183m63m6530M6758o839l4704
$$ 42141 51763 110541 131126 85643 31993 45471 33245 45428 44965 -1565 45193 38354 3650
$$ [...]
##END NTUPLES=NMR SPECTRUM
##END=
