##TITLE=1H_TG-2405
 200.13Hz, CDCl3.
 8 sc
 
 20.4.2026
##JCAMPDX= 6.0         $$ Bruker NMR JCAMP-DX V2.0
##DATA TYPE= NMR SPECTRUM
##DATA CLASS= NTUPLES
##ORIGIN= UXNMR, Bruker Analytische Messtechnik GmbH
##OWNER= pz
$$ XWIN-NMR		Version 3.5
$$ Mon Apr 20 14:40:18 2026 Russian Standard Time (UT+4h)  she@DPX200
##.OBSERVE FREQUENCY= 200.1313
##.OBSERVE NUCLEUS= ^1H
##.ACQUISITION MODE= SIMULTANEOUS
##.ACQUISITION SCHEME= undefined
##.AVERAGES= 8
##.DIGITISER RES= 18
##SPECTROMETER/DATA SYSTEM= spect
##.PULSE SEQUENCE= zg30
##.SOLVENT NAME= CDCl3
##.SHIFT REFERENCE= (INTERNAL, CDCl3, 0, 15.4703)
##AUDIT TRAIL= $$ (NUMBER, WHEN, WHO, WHERE, WHAT)
$$ ##TITLE= Audit trail, XWIN-NMR		Version 3.5
$$ ##JCAMPDX= 5.01
$$ ##ORIGIN= Bruker BioSpin GmbH
$$ ##OWNER= she
$$ F:/spectra/data/she/nmr/H-C/1/pdata/1/auditp.txt
$$ ##AUDIT TRAIL=  $$ (NUMBER, WHEN, WHO, WHERE, WHAT)
(   1,<2026-04-20 14:38:57.35 +0400>,<she>,<DPX200>,
      <created by zg, POWCHK disabled, PULCHK disabled
       configuration hash MD5:
       00 E9 B6 7A A2 85 ED C7 34 08 36 98 17 FE 4E 26
       data hash MD5: 16K
       93 84 08 F9 8C E8 44 04 84 1F FA 6E B8 B3 47 EE>)
(   2,<2026-04-20 14:39:00.01 +0400>,<she>,<DPX200>,
      <Start of raw data processing
       efp BC_mod = 2 LB = 0.25 FT_mod = 6 PKNL = 1 PHC0 = -3716.613 PHC1 = 26.39229 SI = 16K 
       data hash MD5: 16K
       EC 81 8A 43 0D 2E AD 41 B9 6E AF 4F 93 68 5B 50>)
(   3,<2026-04-20 14:39:25.60 +0400>,<she>,<DPX200>,
      <pk PHC0 = 12.82946 PHC1 = -18.6 
       data hash MD5: 16K
       DC D0 9F 19 52 56 32 A0 DC 36 CA 07 45 68 95 7D>)
(   4,<2026-04-20 14:39:29.46 +0400>,<she>,<DPX200>,
      <abs ABSG = 5 
       data hash MD5: 16K
       3A E1 80 AB B1 E9 0E DB D2 20 1B 2D D0 CF AF FB>)
$$ ##END=
$$ 
$$ hash MD5
$$ FB 17 77 33 D6 28 EB D4 DE 9C 8B 76 E3 95 17 BC
##$RELAX= 
##$RELAX= 
##$RELAX= 
##$RELAX= 
##$RELAX= 
##$RELAX= 
$$ Bruker specific parameters
$$ --------------------------
##$DU= <F:/spectra>
##$EXPNO= 1
##$NAME= <H-C>
##$PROCNO= 1
##$TYPE= <nmr>
##$USER= <she>
##$AMP= (0..31)
100 100 100 100 100 100 100 100 100 100 100 100 100 100 100 100 100 100 
100 100 100 100 100 100 100 100 100 100 100 100 100 100 
##$AQSEQ= 0
##$AQ_mod= 1
##$AUNM= <au_zg>
##$AUTOPOS= <>
##$BF1= 200.13
##$BF2= 200.13
##$BF3= 200.13
##$BF4= 200.13
##$BF5= 200.13
##$BF6= 200.13
##$BF7= 200.13
##$BF8= 200.13
##$BYTORDA= 1
##$CFDGTYP= 0
##$CFRGTYP= 5
##$CHEMSTR= <none>
##$CNST= (0..31)
1 1 145 1 1 1 1 1 1 1 1 1 1 1 1 1 1 1 1 1 1 1 1 1 1 1 1 1 1 1 1 1 
##$CPDPRG= <>
##$CPDPRG1= <>
##$CPDPRG2= <>
##$CPDPRG3= <>
##$CPDPRG4= <mlev>
##$CPDPRG5= <mlev>
##$CPDPRG6= <mlev>
##$CPDPRG7= <mlev>
##$CPDPRG8= <mlev>
##$CPDPRGB= <>
##$CPDPRGT= <>
##$D= (0..31)
0 0.7 0 0 0 0 0 0 0 0 0 0.03 0 0 0 0 0 0 0 0 0 0 0 0 0 0 0 0 0 0 0 0 
##$DATE= 1776681536
##$DBL= (0..7)
120 120 120 120 120 120 120 120 
##$DBP= (0..7)
150 150 150 150 150 150 150 150 
##$DBP07= 0
##$DBPNAM0= <>
##$DBPNAM1= <>
##$DBPNAM2= <>
##$DBPNAM3= <>
##$DBPNAM4= <>
$$ [...]
##$SUBNAM3= <"">
##$SUBNAM4= <"">
##$SUBNAM5= <"">
##$SUBNAM6= <"">
##$SUBNAM7= <"">
##$SUBNAM8= <"">
##$SUBNAM9= <"">
##$SW= 18.0517328524113
##$SWIBOX= (0..15)
0 0 2 0 0 0 0 0 0 0 0 0 0 0 0 0 
##$SW_h= 3612.71676300578
##$TD= 16384
##$TD0= 1
##$TE= 0
##$TE2= 300
##$TE3= 300
##$TEG= 300
##$TL= (0..7)
0 120 120 120 120 120 120 120 
##$TP= (0..7)
150 150 150 150 150 150 150 150 
##$TP07= 0
##$TPNAME0= <>
##$TPNAME1= <>
##$TPNAME2= <>
##$TPNAME3= <>
##$TPNAME4= <>
##$TPNAME5= <>
##$TPNAME6= <>
##$TPNAME7= <>
##$TPOAL= (0..7)
0.5 0.5 0.5 0.5 0.5 0.5 0.5 0.5 
##$TPOFFS= (0..7)
0 0 0 0 0 0 0 0 
##$TUNHIN= 0
##$TUNHOUT= 0
##$TUNXOUT= 0
##$USERA1= <user>
##$USERA2= <user>
##$USERA3= <user>
##$USERA4= <user>
##$USERA5= <user>
##$V9= 5
##$VALIST= <valist>
##$VCLIST= <CCCCCCCCCCCCCCC>
##$VD= 0
##$VDLIST= <DDDDDDDDDDDDDDD>
##$VPLIST= <PPPPPPPPPPPPPPP>
##$VTLIST= <TTTTTTTTTTTTTTT>
##$WBST= 1024
##$WBSW= 4
##$XGAIN= (0..3)
0 0 0 0 
##$XL= 0
##$YL= 0
##$YMAX_a= 587911
##$YMIN_a= -685748
##$ZGOPTNS= <>
##$ZL1= 120
##$ZL2= 120
##$ZL3= 120
##$ZL4= 120
##$ABSF1= 15.4594
##$ABSF2= -2.592449
##$ABSG= 5
##$ABSL= 3
##$ALPHA= 0
##$AQORDER= 0
##$ASSFAC= 0
##$ASSFACI= 0
##$ASSFACX= 0
##$ASSWID= 0
##$AUNMP= <proc_1d>
##$AZFE= 0.1
##$AZFW= 0.1
##$BCFW= 0
##$BC_mod= 2
##$BYTORDP= 0
##$COROFFS= 0
##$CY= -3
##$DATMOD= 1
##$DC= 0
##$DFILT= <>
##$DTYPP= 0
##$F1P= 0
##$F2P= 0
##$FCOR= 1
##$FTSIZE= 16384
##$FT_mod= 6
##$GAMMA= 0
##$GB= 0
##$INTBC= 1
##$INTSCL= 3.241238e-09
##$ISEN= 128
##$LB= 0.25
##$LEV0= 0
##$LPBIN= 0
##$MAXI= 10000
##$MC2= 0
##$MEAN= 0
##$ME_mod= 0
##$MI= 1.114404
##$NCOEF= 0
##$NC_proc= -6
##$NLEV= 6
##$NOISF1= 3.799351
##$NOISF2= 2.8
##$NSP= 0
##$NTH_PI= 0
##$NZP= 0
##$OFFSET= 15.47034
##$PC= 1
##$PHC0= -3703.784
##$PHC1= 7.79229
##$PH_mod= 1
##$PKNL= yes
##$PPARMOD= 0
##$PSCAL= 0
##$PSIGN= 0
##$REVERSE= no
##$SF= 200.130010278843
##$SI= 16384
##$SIGF1= 3
##$SIGF2= 2
##$SINO= 0.751879
##$SIOLD= 32768
##$SREGLST= <19F.Aceton>
##$SSB= 0
##$STSI= 16384
##$STSR= 0
##$SW_p= 3612.71676300578
##$SYMM= 0
##$S_DEV= 0
##$TDeff= 16384
##$TDoff= 0
##$TI= <>
##$TILT= no
##$TM1= 0
##$TM2= 0
##$TOPLEV= 0
##$USERP1= <user>
##$USERP2= <user>
##$USERP3= <user>
##$USERP4= <user>
##$USERP5= <user>
##$WDW= 1
##$XDIM= 16384
##$YMAX_p= 362682317
##$YMIN_p= -1775693
$$ End of Bruker specific parameters
$$ ---------------------------------
##NTUPLES= NMR SPECTRUM
##VAR_NAME=  FREQUENCY,     SPECTRUM/REAL,   SPECTRUM/IMAG
##SYMBOL=    X,             R,               I
##VAR_TYPE=  INDEPENDENT,   DEPENDENT,       DEPENDENT
##VAR_FORM=  AFFN,          ASDF,            ASDF
##VAR_DIM=   16384,         16384,           16384
##UNITS=     HZ,            ARBITRARY UNITS, ARBITRARY UNITS
##FACTOR=    0.220516191357247, 1,           1
##FIRST=     3096.07925820504, 0,            0
##LAST=      -516.637504800735, 0,           0
##MIN=       -516.637504800735, -1775693,    0
##MAX=       3096.07925820504, 362682317,    0
$$ Real data points
##PAGE= N=1
##DATA TABLE= (X++(R..R)), XYDATA
$$ [...]
6018E891075j50415L73563j78096J2694M6665j80137J4350r3900p6386j96796
$$ 5891075 5740660 6114223 5936127 5948821 5995486 5815349 5829699 5735799 5659413 5462617
6008E462617N32375L99105k14447k72792K80315L98880K79704J15093p7744n35105
$$ 5462617 5994992 6394097 6179650 5906858 6187173 6586053 6865757 6980850 6903106 6368001
5998F368001k11163M12780j50076M13772M43909k59181J10605Q339N88916P82051
$$ 6368001 6156838 6569618 6419542 6833314 7277223 7018042 7128647 7136986 7725902 8507953
5988H507953N72112r7099K39734j87575M03447Q07359J51916L55865L30722N454
$$ 8507953 9080065 8982966 9222700 9035125 9438572 10245931 10397847 10753712 11084434 11089888
5978A1089888K59957M63192M18140P280n89051M72144J29747P66934L88415L28048
$$ 11089888 11349845 11813037 12231177 12238457 11649406 12121550 12251297 13018231 13406646 13734694
5968A3734694q2044J25799N28028L87508L99674K67292M71301O83943M83985M22031
$$ 13734694 13652650 13778449 14306477 14693985 15093659 15360951 15832252 16516195 17000180 17422211
5958A7422211O43852K71567O59943P12870M49067K46300N90307L97659L38290
$$ 17422211 18066063 18337630 18997573 19710443 20159510 20405810 20996117 21393776 21732066
5949B1732066M56042p8737j19813J92326Q33541L95417L60204L73642R83222O39746
$$ 21732066 22188108 22109371 21989558 22181884 23015425 23410842 23771046 24144688 25127910 25767656
5939B5767656Q62896P99482J65562K66593M75926j72521j75604K34349J95318
$$ 25767656 26630552 27430034 27595596 27862189 28338115 28165594 27989990 28224339 28419657
5930B8419657R32215o1733j00337L84976Q74941M53842N56843J40363K04554k42545
$$ 28419657 29351872 29290139 29189802 29574778 30449719 30903561 31460404 31600767 31805321 31562776
5920C1562776P82825M18727M8570K80176j12077N10391k70182l97412M34557K73418
$$ 31562776 32345601 32764328 32812898 33093074 32980997 33491388 33221206 32823794 33258351 33531769
5910C3531769l55118p1953l57391m37555k52059j1014k62210J09852K56933P1794
$$ 33531769 33176651 33104698 32747307 32309752 32057693 32046679 31784469 31894321 32151254 32223048
5900C2223048K55220J38954n83363k67728j2057k45788l15559k3585n54540k61238
$$ 32223048 32478268 32617222 32033859 31766131 31754074 31508286 31192727 31169142 30614602 30353364
5890C0353364n64713k4283l783j151514j22205l71808m24674p37063r17376r33141
$$ 30353364 29788651 29764368 29760585 28609071 28486866 28115058 27690384 26953321 26035945 25102804
5880B5102804n18996l95730k4303J50901k25187p72631m73312K12798l62525k17809
$$ 25102804 24583808 24188078 24163775 24314676 24089489 23316858 22843546 23056344 22693819 22476010
5870B2476010l89656m1260o90035m01633m68984n07284p82631j19825m84027j106537
$$ 22476010 22086354 22045094 21355059 20953426 20484442 19977158 19194527 19074702 18590675 17484138
5860A7484138l17381n97295n58588n20922k53601l17190Q1362p55326N6309q13309
$$ 17484138 17166757 16569462 16010874 15489952 15236351 14919161 15000523 14245197 14301506 13488197
5850A3488197n47869k13511J27762q55321m82156p3474n52980n49797m7769P536
$$ 13488197 12940328 12726817 12854579 11999258 11517102 11443628 10890648 10340851 10293082 10300618
5840A0300618J38808k49395k03696k37618n98175p4124l61698l09700r7114j31876
$$ 10300618 10439426 10190031 9986335 9748717 9150542 9076418 8714720 8405020 8307906 8176030
5830H176030m64086P6882k76763m34675k84455J53230l18097N8887L2093J08748
$$ 8176030 7711944 7788826 7512063 7077388 6792933 6946163 6628066 6686953 6719046 6827794
5820F827794m99065j58943M5992k03642m96940l3980n0652R7606J9413n4083k39019
$$ 6827794 6328729 6169786 6215778 6012136 5515196 5481216 5430564 5528170 5547583 5493500 5254481
5809E254481M2419j97952K19916j03920k71974m88492l21340K27859O0805R5853
$$ 5254481 5296900 5098948 5318864 5214944 4942970 4454478 4133138 4360997 4421802 4517655
5799D517655N74500j24938m05765j22862k48535L87077m68346J73643j16780J74532
$$ 4517655 5092155 4967217 4561452 4438590 4190055 4577132 4108786 4282429 4165649 4340181
5789D340181K90198j36420j41455M9777P1098L0168L90824m83007K14266M10837
$$ 4340181 4630379 4493959 4352504 4402281 4473379 4503547 4894371 4411364 4625630 5036467
5779E036467K73858K20649j78659o1641l69417P3666J36603n4572o29965K77341
$$ 5036467 5310325 5530974 5352315 5290674 4921257 4994923 5131526 5076954 4446989 4724330
5769D724330J58804m98180l19358j97146k22623M39185L90170m01636l70898L40696
$$ 4724330 4883134 4384954 4065596 3868450 3645827 4085012 4475182 4073546 3702648 4043344
5759D043344l759N54876L49605o57554n1013m57923J2933j7381m44394O68625
$$ 4043344 4039585 4594461 4944066 4286512 4235499 3777576 3790509 3773128 3328734 3997359
5749C997359K23705r3227k71818j18096J27630L65376J40914r2121q5910j06985
$$ 3997359 4221064 4127837 3856019 3737923 3865553 4230929 4371843 4279722 4193812 4086827
5739D086827M15708K72299p54513n28390L51146K79829Q9521l20838L47684K69625
$$ 4086827 4502535 4774834 4020321 3491931 3843077 4122906 4212427 3891589 4239273 4508898
5729D508898l5366Q5352q08015m72974K57601J40363N20987j75001m08209O24626
$$ 4508898 4473532 4558884 3750869 3277895 3535496 3675859 4196846 4021845 3613636 4238262
5719D238262m6548m52018j67804P0908J37243L14376j66p3902j12681j45179O45983
$$ 4238262 4191714 3739696 3571892 3642800 3780043 4094419 4094253 4020351 3907670 3762491 4408474
5708D408474l36629j05988J69501m17789J46595k24283j63243L90370k79615M4508
$$ 4408474 4071845 3965857 4135358 3717569 3864164 3639881 3476638 3867008 3587393 3631901
5698C631901K74663J7079j73026M85599k77472K77644o44443j53614J53418m45442
$$ 3631901 3906564 3923643 3750617 4236216 3958744 4236388 3591945 3438331 3591749 3146307
5688C146307l896L72498L01029l2162L52358j33904K77962p7367k755n12974O6195
$$ 3146307 3142411 3514909 3815938 3783776 4136134 4002230 4280192 4202825 4200070 3687096 3753291
5677C753291Q0087K4039n9761q9502K1915Q5353J84408k23250k42158P5883K81914
$$ 3753291 3833378 3857417 3797656 3708154 3730069 3815422 3999830 3776580 3534422 3610305 3892219
5666C892219j52628M2374J41398L09088l51717k34418o20357m51298J3731O40221
$$ 3892219 3739591 3781965 3923363 4232451 3880734 3646316 3025959 2574661 2588392 3228613
5656C228613L8847K13906k4213N3723M32954j53625k62199m08808j07889O31711
$$ 3228613 3267460 3481366 3457153 3510876 3943830 3790205 3528006 3119198 3011309 3643020
5646C643020j08510m04499L52324n50792N12347k91088q053J90067k21309L83747
$$ 3643020 3534510 3130011 3482335 2931543 3443890 3152802 3144749 3334816 3113507 3497254
5636C497254K26054m00449j7009K35540K34870K59174n55070m43407K19524l08064
$$ 3497254 3723308 3322859 3305850 3541390 3776260 4035434 3480364 3036957 3256481 2948417
5626B948417K13505j03545l80711l91296J97788K81221J82386K46841M36015l3160
$$ 2948417 3161922 3058377 2677666 2286370 2484158 2765379 2947765 3194606 3630621 3597461
5616C597461j48975P9973p0871J14786l78740O2372k2796l03070K00513n0182
$$ 3597461 3448486 3528459 3457588 3572374 3193634 3256006 3233210 2930140 3130653 3080471
5606C080471Q5623J11025k0060j7718R547O24581J85706K64074r4808n40668j92341
$$ 3080471 3166094 3277119 3257059 3239341 3248888 3873469 4059175 4323249 4228441 3687773 3495432
5595C495432K84105k82379j35354l04493J54695J09954k36995N83106k32465M0979
$$ 3495432 3779537 3497158 3361804 3057311 3212006 3321960 3084965 3668071 3435606 3476585
5585C476585J74973k58829k22296j03442j8806n0520m9297k20407J66298L28346
$$ 3476585 3651558 3392729 3170433 3066991 3048185 2997665 2948368 2727961 2894259 3222605
5575C222605P76162M48139q70016l64169k61066m78133J04420L60362J28434o64126
$$ 3222605 3998767 4446906 3576890 3212721 2951655 2473522 2577942 2938304 3066738 2402612
5565B402612l3524J193796K5868J27526j20964k29027j39466j56105K37951j98813
$$ 2402612 2369088 3562884 3588752 3716278 3595314 3366287 3226821 3070716 3308667 3109854
5555C109854L39765j04702k5981m97355m06515L81539O66492L06898m28136o62701
$$ 3109854 3449619 3344917 3318936 2821581 2415066 2796605 3463097 3769995 3341859 2679158
5545B679158L46841o0852J60603K55026k93075N5016J66831K08197j69143m21879
$$ 2679158 3025999 2965147 3125750 3380776 3087701 3142717 3309548 3517745 3348602 2926723
5535B926723l59266J70392J91937p3238m23430k71889M40373M83186M28917L17057
$$ 2926723 2567457 2737849 2929786 2856548 2433118 2161229 2601602 3084788 3513705 3830762
5525C830762l83263m11367K24696l8568j39727l37193L95945J7355m42035k83851
$$ 3830762 3447499 3036132 3260828 3222260 3082533 2745340 3141285 3158640 2716605 2432754
5515B432754K12318L65161K10280N3268k53946l6689L32267M27512n03266n99381
$$ 2432754 2645072 3010233 3220513 3273781 3019835 2983146 3315413 3742925 3239659 2640278
5505B640278k56677K07307K84770j28253j34616J98092L16870k9441k82419m6144
$$ 2640278 2383601 2590908 2875678 2747425 2612809 2810901 3127771 3098330 2815911 2769767
5495B769767k68182p32014L01832L72165J09288K48550M83145j6756k20098K2865
$$ 2769767 2501585 1769571 2071403 2443568 2552856 2801406 3284551 3267795 3047697 3070562
5485C070562P8327k27817k66716L59071o69268M4140k15358L23187K94910M0264
$$ 3070562 3148889 2921072 2654356 3013427 2344159 2388299 2172941 2496128 2791038 2831302
5475B831302J13470k18016K43087k9581n79944M5418J55397k89928m22415K10259
$$ 2831302 2944772 2726756 2969843 2940262 2360318 2405736 2561133 2271205 1848790 2059049
5465B059049K59268J01767q3702l9777J7269M575L7837j18086Q0871k81161L4671
$$ 2059049 2318317 2420084 2336382 2296605 2313874 2318449 2356286 2238200 2319071 2037910 2072581
5454B072581K63810Q5254m1382Q4127J93142j27980l90582L1422P05380k52145
$$ 2072581 2336391 2421645 2380263 2464390 2657532 2529552 2138970 2170392 2875772 2623627
5444B623627j14985l486k34878j76280l71275J21053M90793j56300R6755k01496
$$ 2623627 2508642 2505156 2270278 2093998 1722723 1843776 2334569 2178269 2275024 2073528
5434B073528J78263J91969l55717K02677K48684r707l01502m9625j83478j78953
$$ 2073528 2251791 2443760 2088043 2290720 2539404 2529697 2228195 2178570 1995092 1816139
5424A816139j0838M11856l03018l9755J52643R3164L22982k55656L19775M85628
$$ 1816139 1805301 2217157 1914139 1874384 2027027 2120191 2443173 2187517 2507292 2992920
5414B992920n20477j44611q2568M73836J88395k86935l28339K44526K3606l84205
$$ 2992920 2472443 2327832 2245264 2719100 2907495 2620560 2292221 2536747 2560353 2176148
5404B176148J46777l90778J12881M49609J93688J62217p43290K02625k03948r3
$$ 2176148 2322925 1932147 2045028 2494637 2688325 2850542 2107252 2309877 2105929 2105836
5394B105836L56745K30237l8194k50794O9184p5797n7489p3199k69882L9993K33255
$$ 2105836 2462581 2692818 2654624 2403830 2473014 2397217 2339728 2266529 1996647 2036640 2269895
5383B269895J8213k7887n35279K45947K98860m25820J4141k14347J50061N71890
$$ 2269895 2288108 2260221 1724942 1970889 2269749 1843929 1858070 1643723 1793784 2365674
5373B365674k29935L17409K6637M15089k09736J2553n07041k32179k80798O59623
$$ 2365674 2135739 2453148 2479785 2894874 2685138 2697691 2190650 1958471 1677673 2337296
5363B337296N4847m86272M36561o1029K72589l81236M75340J18663K75225K37397
$$ 2337296 2392143 1905871 2342432 2281403 2553992 2172756 2648096 2766759 3041984 3279381
5353C279381P35912n43413l82773l0715J92630J4981M0723k81941m15357O53298
$$ 3279381 4015293 3471880 3089107 3058392 3251022 3266003 3306726 3024785 2609428 3262726
5343C262726K81845K88865l48975L63058L88781O1674J14439L67356j67658j69454
$$ 3262726 3544571 3833436 3484461 3847519 4236300 4297974 4412413 4779769 4612111 4442657
5333D442657M90531J26465K36757O2286K50427N72395q05202O57784O26347O53701
$$ 4442657 4933188 5059653 5296410 5358696 5609123 6181518 5376316 6034100 6660447 7314148
5323G314148K92991K30193O1494J54256M55238N26343L95550j98762J02402k29025
$$ 7314148 7607139 7837332 7898826 8053082 8508320 9034663 9430213 9231451 9333853 9104828
5313I104828O19565L72468r1544K79493J44637N64427K61455Q9254r1895j34406
$$ 9104828 9724393 10096861 10005317 10284810 10429447 10993874 11255329 11344583 11252688 11118282
5303A1118282L68029P74843j39575k83025O3077l43434J39448J10287L65887M024
$$ 11118282 11486311 12261154 12121579 11838554 11901631 11558197 11697645 11807932 12173819 12177843
5293A2177843O6777n38555l76594j74280L32874m3915L45460q10669n88537k06938
$$ 12177843 12244620 11706065 11329471 11155191 11488065 11444150 11789610 10978941 10390404 10183466
5283A0183466j29226q4876m19746M4332J63666m37925l92703k87726k37349n46337
$$ 10183466 10054240 9969364 9549618 9593950 9757616 9319691 8926988 8639262 8401913 7855576
5273G855576n13661K11897p37578r48053J98186p5680k77820K30604j28933j58997
$$ 7855576 7341915 7553812 6816234 5868181 6066367 5990687 5712867 5943471 5814538 5655541
5263E655541p15100J69411o7792k81546k31043j43791n27780q0786k1922k27943
$$ 5655541 4940441 5109852 5042060 4760514 4529471 4385680 3857900 3777114 3755192 3527249
5253C527249J87097n4531j48525j05195l85210j9978j51852J9547J29456p7014
$$ 3527249 3714346 3659815 3511290 3406095 3020885 3000907 2849055 2868602 2998058 2921044
5243B921044n3346j47065L05473n0778n4059m82012j64972L19159J18039k07329
$$ 2921044 2867698 2720633 3026106 2975328 2921269 2439257 2274285 2593444 2711483 2504154
5233B504154K86985k30773l69326j2447k6428k91392j44484M93895j74069j2992
$$ 2504154 2791139 2560366 2191040 2178593 2152165 1860773 1716289 2210184 2036115 2023123
5223B023123k67387N8078l78203j66881L28568K01591J8687k55241J58852M15427
$$ 2023123 1755736 1813814 1435611 1268730 1597298 1798889 1817576 1562335 1721187 2136614
5213B136614m54680J47289Q8793l17552k33418k6574j10974R9502j4907J73905
$$ 2136614 1681934 1829223 1918016 1600464 1367046 1340472 1229498 1329000 1314093 1487998
5203A487998R8176j56785j16056Q9480k22621M53158L20779n00476K09296k16109
$$ 1487998 1586174 1429389 1313333 1402813 1180192 1633350 1954129 1453653 1662949 1446840
5193A446840K88587m99790J15004J68474j01258L22186M42619k88818n14878R2676
$$ 1446840 1735427 1235637 1350641 1519115 1417857 1740043 2182662 1893844 1378966 1471642
5183A471642J86687m03436N8949O9297L87091q7754J02388L007k39765Q4847L76137
$$ 1471642 1658329 1254893 1313842 1383139 1770230 1682476 1784864 1787871 1548106 1632953 2009090
5172B009090L73678l47476l48100O1441L0114L19844m3426j71736M58794p23294
$$ 2009090 2382768 2035292 1687192 1748633 1778747 2098591 2055165 1883429 2342223 1618929
5162A618929N176l64039K37968K38229M235M69528p20344p77389M10577O67797
$$ 1618929 1624105 1260066 1498034 1736263 1740498 2210026 1489682 712293 1122870 1790667
5152A790667L50255R1102k38384n49926J38778K26447K41900j20567l27726K14636
$$ 1790667 2140922 2232024 1993640 1443714 1582492 1808939 2050839 1930272 1602546 1817182
5142A817182l69275K79686j82438m7512L97774K89169l84732k43251J69977m1662
$$ 1817182 1447907 1727593 1545155 1497643 1895417 2184586 1799854 1556603 1726580 1684918
5132A684918L36303K01929K80239o76325k87017N50723k27156l33325k00824L10546
$$ 1684918 2021221 2223150 2503389 1827064 1540047 2090770 1863614 1530289 1329465 1640011
5122A640011J41764K54594l83915j99337L85640L30088J20315m82597k39372M2568
$$ 1640011 1781775 2036369 1652454 1453117 1838757 2168845 2289160 1806563 1567191 1609759
5112A609759M49801M08666j5560k41967J5526q4463l70633m85450N50514L40222
$$ 1609759 2059560 2468226 2452666 2210699 2226225 2141762 1771129 1285679 1836193 2176415
5102B176415k4490l00436O2919p7253Q6612J62787J54518r7143M01685o4146l76869
$$ 2176415 2151925 1851489 1914408 1837155 1923767 2086554 2241072 2143929 2545614 2481468 2104599
5091B104599j69616j99177L26567J95679J36334K6526J55003K03428j06630k92859
$$ 2104599 1934983 1735806 2062373 2258052 2394386 2420912 2575915 2779343 2672713 2379854
5081B379854M81152m13697r6271k77400j98386O5791R0362M48880L65755L3302
$$ 2379854 2861006 2447309 2351038 2073638 1875252 1941043 2031405 2480285 2846040 2879342
5071B879342M6927M84j16577p6835O2402n3748K59103k94247l1210k88850l16336
$$ 2879342 2926269 2926753 2810176 2733341 2795743 2741995 3001098 2706851 2675641 2386791 2070455
5060B070455N98115M58935L96656l1709N1064J22245l1625k34851K99991m69408
$$ 2070455 2668570 3127505 3524161 3492452 3543516 3665761 3634136 3399285 3699276 3229868
5050C229868O75747M87660k68901M31291L42774J29122l22147N7265n8886L21781
$$ 3229868 3905615 4393275 4124374 4555665 4898439 5027561 4705414 4762679 4703793 5025574
5040E025574J120286L69842J06398L54099R63513R24591K44381J146489Q61517
$$ 5025574 6145860 6515702 6622100 6976199 7939712 8864303 9108684 10255173 11116690
5031A1116690O16343L50017O3385j07505j17820j78665k59424j83710p07568P3177
$$ 11116690 11733033 12083050 12146435 12038930 11921110 11742445 11483021 11299311 10591743 10664920
5021A0664920J12317l58572N87506N31512q2191K57294K80863M53983Q02114L98220
$$ 10664920 10777237 10418665 11006171 11537683 11455492 11712786 11993649 12447632 13249746 13647966
5011A3647966J38348q78415k37857m90376m6212k59445p62399k6506o14021k03325
$$ 13647966 13786314 12907899 12670042 12179666 12133454 11874009 11111610 11085104 10471083 10267758
5001A0267758p5958J37658p3385k43544K3864P31561J46518M70610O64202k59420
$$ 10267758 10191800 10329458 10256073 10012529 10036393 10767954 10914472 11385082 12049284 11789864
4991A1789864m51128k60222J05997Q10531J92299j4244J86938J49227R10385J176541
$$ 11789864 11338736 11078514 11184511 11995042 12187341 12173097 12360035 12509262 13419647 14596188
4981A4596188N97847J175669P42099R58920Q12628P91783L7966k84192R0781o56394
$$ 14596188 15194035 16369704 17111803 18070723 18883351 19675134 19713100 19428908 19519689 18863295
4971A8863295o93178o96737m37610o94143m85490n17791M44289n28362k3054K56200
$$ 18863295 18170117 17473380 17035770 16341627 15856137 15338346 15782635 15254273 15231219 15487419
4961A5487419j22708J34038K92422N72380j4175j81947J38143k82578l72246m52923
$$ 15487419 15364711 15498749 15791171 16363551 16349376 16167429 16305572 16022994 15650748 15197825
4951A5197825r87415r65403o98120l69537k49885O42146K0696m67050j72632J44399
$$ 15197825 14210410 13245007 12546887 12177350 11927465 12569611 12590307 12123257 11950625 12095024
4941A2095024N1044J53335J88081j55419l10267m90328j88148m20653q29527l7182
$$ 12095024 12146068 12299403 12487484 12332065 12021798 11531470 11343322 10922669 10093142 10055960
4931A0055960M07344J96823J9657l81881k2714K09419k65544J96001K56938K38483
$$ 10055960 10463304 10660127 10679784 10297903 10275189 10484608 10219064 10415065 10672003 10910486
4921A0910486L31203J75647J95376O6173l2727k70670k65443p33314k02388L17059
$$ 10910486 11241689 11417336 11612712 11678885 11646158 11375488 11110045 10376731 10174343 10491402
4911A0491402K61807r8099k22410k30233J14051k75375n9196K20227k07041k37546
$$ 10491402 10753209 10655110 10432700 10202467 10316518 10041143 9981947 10202174 9995133 9757587
4901I757587j77578j37426p236m26537P6997K2708J43320k35924O23899n3080
$$ 9757587 9580009 9442583 9435347 9008810 9085807 9108515 9251835 9015911 9639810 9586730
4891I586730L17823N53881M86732M18505J8228M89641M8395J87607J18393R77070
$$ 9586730 9904553 10458434 10945166 11363671 11381899 11871540 11919935 12107542 12225935 13203005
4881A3203005M66050O32841j02495O69272P91864J203089L93292j05888j08868
$$ 13203005 13669055 14301896 14199401 14868673 15660537 16863626 17256918 17151030 17042162
4872A7042162o94163n8544j9502K1188K97158K81613K19005N92226J284026J405761
$$ 17042162 16347999 16289455 16269953 16291141 16588299 16869912 17088917 17681143 18965169 20370930
4862B0370930J748474J382816J301719R67298J547021R62753O72991L34992q5946
$$ 20370930 22119404 23502220 24803939 25771237 27318258 28281011 28954002 29288994 29203048
4853B9203048j85685k29585j148306j029967r84902l55706j76936l42550L46439
$$ 29203048 29017363 28787778 27639472 26609505 25624603 25268897 25091961 24749411 25095850
4844B5095850n72316K90061j58107o37152o02813O2725K04835k28403o86451p102
$$ 25095850 24523534 24813595 24655488 24018336 23415523 23478248 23683083 23454680 22768229 22761127
4834B2761127k34156o80681r50424j146504j686723o30400m56927r70707p95021
$$ 22761127 22526971 21846290 20895866 19749362 18062639 17432239 16975312 16004605 15209584
4825A5209584j067446n80005q44265r29778k43576n435j39379l2706O089j86578
$$ 15209584 14142138 13562133 12717868 11788090 11544514 11539079 11399700 11366994 11373083 11186505
4815A1186505K6363R80050Q65042N17859N48104P04016R42499N54395Q10771P33949
$$ 11186505 11212868 12192918 13057960 13575819 14123923 14827939 15770438 16324833 17135604 17869553
4805A7869553M91064P00954M0244k59787k82880j054290k83574o49720q42389
$$ 17869553 18360617 19061571 19101815 18842028 18559148 17504858 17221284 16571564 15729175
4796A5729175o14903l59063J47979L62418J43943M46853N35967Q13477J52293
$$ 15729175 15114272 14755209 14903188 15265606 15409549 15856402 16392369 17205846 17358139
4787A7358139n64186K5914l97221q26880r22985q08541j529792j195671q68869
$$ 17358139 16793953 16819867 16422646 15595766 14672781 13864240 12334448 11138777 10269908
4778A0269908o8315m96013q78585k59597p78236n17799m55234J24373n27482m41373
$$ 10269908 10201593 9705580 8826995 8567398 7789162 7271363 6816129 6940502 6413020 5971647
4768E971647k3114r9342k31831m30818j61475j06471M0144q4766J75915l4114
$$ 5971647 5948533 5849191 5617360 5186542 5025067 4918596 4958740 4873974 5049889 5015775
4758E015775J3766j46756o6788j47488q1231M25103m3249n88356j58473l22168
$$ 5015775 5029541 4882785 4815997 4668509 4587278 5012381 4969132 4380776 4222303 3900135
4748C900135K68490L12943n0833j09477m85794J69271M87381n00144l00351k19774
$$ 3900135 4168625 4481568 4430735 4321258 3835464 4004735 4492116 3991972 3691621 3471847
4738C471847J9721L51347N10347M30920K11136m60190L56507Q242q74502O08460
$$ 3471847 3491568 3842915 4353262 4784182 4995318 4535128 4891635 4899877 4025375 4633835
4728D633835M22158l88068K70033J88945j07585J41120L78730J54082j95155J23048
$$ 4633835 5055993 4667925 4937958 5126903 5019318 5160438 5539168 5693250 5498095 5621143
4718E621143P4557M14080l53316j17643J42272O6025Q50242K77191k02270K3613
$$ 5621143 5695700 6109780 5756464 5638821 5781093 5847118 6697360 6974551 6772281 6795894
4708F795894m9607P87226R50705K99633K34541P5204M33876P71708O65172O10332
$$ 6795894 6746287 7533513 8484218 8783851 9018392 9093596 9527472 10299180 10964352 11574684
4698A1574684J176737J444120J223849J200401k51327P04987N59580j40037J15866
$$ 11574684 12751421 14195541 15419390 16619791 16368464 17073451 17633031 17492994 17608860
4689A7608860m36759j47027o8462P8274m76208m43649p9832j1431l35566p04208
$$ 17608860 17172101 17025074 16956612 17034886 16558678 16115029 16035197 16023766 15688200 14983992
4679A4983992k56735j11671m16788j97229o25584o48868m43880n19493J68888
$$ 14983992 14727257 14615586 14198798 14001569 13375985 12727117 12283237 11763744 11932632
4670A1932632L3966J18730R84187L82132K83832J61876o7717N53046L24013J227228
$$ 11932632 11966598 12085328 13069515 13451647 13735479 13897355 13829638 14382684 14706697 15933925
4660A5933925Q78701Q58051R42987J173617R68787M17508Q47018N94820L54474
$$ 15933925 16812626 17670677 18613664 19787281 20756068 21173576 22020594 22615414 22969888
4651B2969888l44662Q33567K51252K76973L72413R0274n2417p7637N18961K92064
$$ 22969888 22625226 23458793 23710045 23987018 24359431 24449705 24397288 24319651 24838612 25130676
4641B5130676J2229k25300l32750j122208o28645j18925m72713l40801p45143
$$ 25130676 25142905 24917605 24584855 23462647 22834002 22715077 22242364 21901563 21156420
4632B1156420k54797j93634q5926J88511O05541p9459O20579O44174q2789N32312
$$ 21156420 20901623 20707989 20622063 20810574 21416115 21336656 21957235 22601409 22518620 23050932
4622B3050932J37923M71366j35850k24644m00659m30748m58775n85608o01066
$$ 23050932 23188855 23660221 23524371 23299727 22899068 22468320 22009545 21423937 20822871
4613B0822871m29101J78005q2698m29217O5256l89421L21213M01506L52805M00943
$$ 20822871 20393770 20571775 20489077 20059860 20125116 19735695 20056908 20458414 20811219 21212162
4603B1212162J13395N1407N49972k2068L79477M7810K31058J92814l7274m4591
$$ 21212162 21325557 21376964 21926936 21904868 22284345 22332155 22563213 22756027 22718753 22674162
4593B2674162k82528P28603O50506O14256O49088N00675J060824O73397P02666
$$ 22674162 22391634 23120237 23770743 24384999 25034087 25534762 26595586 27268983 27971649
4584B7971649J60295k6688J10074L7025o50377l9456O51871l31904J28166p38317
$$ 27971649 28131944 28105256 28215330 28252355 27601978 27562522 28214393 27882489 28010655 27272338
4574B7272338r80324q72586j63779j67189K22215L41715O21876K84968J95130
$$ 27272338 26292014 25419428 25255649 25088460 25310675 25652390 26274266 26559234 26754364
4565B6754364K29565K82421p33041n01722q08760l17914k24439k92661l27927
$$ 26754364 26983929 27266350 26533309 26031587 25222827 24904913 24680474 24387813 24059886
4556B4059886l06325m66509j85670o14469r15392n51686r49270j45455m09998
$$ 24059886 23753561 23287052 23101382 22486913 21571521 21019835 20070565 19925110 19515112
4547A9515112K37540o9997o4861q99229q49747l29105r50337n00831j59075j180864
$$ 19515112 19752652 19682655 19617794 18718565 17868818 17539713 16589376 16088545 15929470 14748606
4537A4748606o38785l65299n28550R1259k59064j17527K0466L32404K54967n6744
$$ 14748606 14109821 13744522 13215972 13307231 13048167 12930640 12951106 13283510 13538477 13481733
4527A3481733n75097n10186m65900n09039r7204j076582p90045o03897m95873
$$ 13481733 12906636 12396450 11930550 11421511 11324307 10247725 9457680 8853783 8357910
4518H357910l43115l31532n78121k59452q78714n87J75940l74894J33827l23003
$$ 8357910 8014795 7683263 7105142 6845690 5966976 5966389 6142329 5767435 5901262 5578259
4508E578259o69419o37834o173M28969J72348k7237j96800k87505l75034J42332
$$ 5578259 4908840 4271006 4264833 4693802 4866150 4838913 4642113 4354608 3979574 4121906
4498D121906K52906m11021l92590j96655j75373K38709L97234l47286J35957k83052
$$ 4121906 4374812 3963791 3571201 3374546 3199173 3437882 3835116 3487830 3623787 3340735
4488C340735L79007n15171M268R2676n70011j03200M33877K04805J54775L63768
$$ 3340735 3719742 3204571 3208839 3301515 2731504 2628304 3062181 3266986 3421761 3785529
4478C785529m98907m06291K32287M2491J51037L43552J02563J64239o79773n36457
$$ 3785529 3286622 2880331 3112618 3155109 3306146 3649698 3752261 3916500 3236727 2700270
4468B700270n86770k52104Q33167J34854K51050l28300K05149J27351o18429k13725
$$ 2700270 2113500 1861396 2694563 2829417 3080467 2752167 2957316 3084667 2466238 2252513
4458B252513l18710P1352M90716O4285Q4375L06668k4693P0780k2593o6299p05250
$$ 2252513 1933803 2005155 2495871 2560156 2644531 2951199 2926506 2997286 2974693 2908394 2203144
4447B203144P03117K74756l78768o65636P1955K9237j41900L23555q7981J47111
$$ 2203144 2906261 3181017 2802249 2136613 2208568 2237805 2095905 2419460 2331479 2478590
4437B478590K56459K75918j1361o37579r4513K50655r7476N8073m4071J03189
$$ 2478590 2735049 3010967 2999606 2362027 2267514 2518169 2420693 2478766 2434695 2537884
4427B537884m1496M86875j20265o72201m2955O40572P3321j26039M2475j43141
$$ 2537884 2496388 2983263 2862998 2190797 2147842 2788414 2861735 2735696 2778171 2635030
4417B635030j77516L38912Q3894m42430M32330M49183R0173m18321k13362K6529
$$ 2635030 2457514 2796426 2880320 2437890 2870220 3319403 3409576 2991255 2777893 2804422
4407B804422M26594r0605l10998n68501J80843N82364N6070l17026L55655m06449
$$ 2804422 3231016 3140411 2829413 2260912 2441755 3024119 3080189 2763163 3118818 2712369
4397B712369o6397K29214L4818K53767j7042J20783r2268j94430m3918K15878
$$ 2712369 2645972 2875186 2910004 3163771 3146729 3267512 3175244 2980814 2936896 3152774
4387C152774K0588M43982K5453k14222J6551J05515j39300M12426l26902j30000
$$ 3152774 3173362 3617344 3642797 3428575 3445126 3550641 3411341 3823767 3496865 3366865
4377C366865N00701R9598j16280J57798j14477K12M80292l31712M55769J3224
$$ 3366865 3867566 3967164 3850884 4008682 3894205 3894417 4374709 4042997 4498766 4511990
4367D511990M46441K77353n74482j95277J06538J012292M77893J43751j56505
$$ 4511990 4958431 5235784 4661302 4466025 4572563 5584855 6062748 6206499 6049994
4358F049994L51976O1434R03373M57467O04356N86692N68463O38706J053135J062553
$$ 6049994 6401970 6463404 7366777 7824244 8428600 9015292 9583755 10222461 11275596 12338149
4348A2338149J194180J484176Q19920J028248O26439J118586N63453K68948M19597
$$ 12338149 13532329 15016505 15836425 16864673 17491112 18609698 19173151 19442099 19861696
4339A9861696j73726q9825K97367o69238n32854j426271j316853p26863r31577
$$ 19861696 19687970 19598145 19895512 19226274 18693420 17267149 15950296 15223433 14291856
4330A4291856q26774j379394q38976p66715q37317n21565l14220o11301n61636
$$ 14291856 13465082 12085688 11246712 10479997 9642680 9121115 8806895 8195594 7633958
4321G633958l45103l85974k70685m60726l31171J44835m1192n9213J76165n1510
$$ 7633958 7288855 6902881 6632196 6171470 5840299 5985134 5943942 5884729 6060894 6009384
4311F009384n33283n57080L56845K08400q8550P8370l82629K02672k60457n6685
$$ 6009384 5476101 4919021 5275866 5484266 5395716 5474086 5091457 5294129 5033672 4976987
4301D976987p4251m0727L82717j47597K0724L90363P0725K76986J95316l42236
$$ 4976987 4902736 4862009 5244726 5097129 5117853 5508216 5578941 5855927 6051243 5709007
4291E709007R2950L58343j96231k62897j36469k33771N27387M81018k15197J1490
$$ 5709007 5801957 6160300 5964069 5701172 5564703 5330932 5858319 6339337 6124140 6135630
4281F135630n2675r4519M59921J47548N04771l93303L69437p8202n36543m70230
$$ 6135630 6082955 5988436 6448357 6595905 7100676 6707373 7076810 6998608 6462065 5991835
4271E991835L76638K40284J16108O98721k47484J08239M23944L564J5095l06037
$$ 5991835 6368473 6608757 6724865 7423586 7176102 7284341 7708285 7711849 7726944 7420907
4261G420907O86860O60764J07564j88870j16428L62688M25001R97376J97907k26712
$$ 7420907 8107767 8768531 8876095 8687225 8570797 8933485 9358486 10355862 10553769 10327057
4251A0327057L57576Q82288J61066R06486Q45329J493996O90086Q39957J302185
$$ 10327057 10684633 11566921 11727987 12634473 13479802 14973798 15663884 16503841 17806026
4242A7806026J256185J661928J492364J726488J845324K469711K358329J989304
$$ 17806026 19062211 20724139 22216503 23942991 25788315 28258026 30616355 32605659
4234C2605659K000220J773976J429423J198297J209736M83681J70426K64006K93055
$$ 32605659 34605879 36379855 37809278 39007575 40217311 40700992 40871418 41135424 41428479
4225D1428479J09440L25715M49510l04573n09327R4250K94523J59193M44365m84037
$$ 41428479 41537919 41863634 42313144 42008571 41499244 41593494 41888017 42047210 42491575 42007538
4215D2007538l80942p3206n96082j53265j085340q94921p90629j859729j126912
$$ 42007538 41626596 41553390 40957308 40804043 39718703 38823782 38033153 36173424 35046512
4206C5046512j615779k335343k387270k094342k003826j632822j594923j489720
$$ 35046512 33430733 31095390 28708120 26613778 24609952 22977130 21382207 19892487
4198A9892487j717514j371230q42925j014902j019310n13888r44831o10212k8239
$$ 19892487 18174973 16803743 15960818 14945916 13926606 13412718 12467887 11857675 11829436
4189A1829436j99816n39469k45777j055801m96342J59652N91060m6284o99622
$$ 11829436 11629620 11090151 10844374 9788573 9292231 9451883 10042943 9996659 9297037
4180I297037l39322r2684k45415m95609L74935l68023n7650P0244K89079J51826
$$ 9297037 8957715 8865031 8619616 8124007 8498942 8130919 8073269 8143513 8432592 8584418
4170H584418P30281n9913k95181n21991l38385O59815P22836k17053n63676j61797
$$ 8584418 9314699 9254786 8959605 8437614 8099229 8759044 9481880 9264827 8701151 8539354
4160H539354M87811M12890K82671J18381N69643L08520M20506L83189O21045M65887
$$ 8539354 9027165 9440055 9722726 9841107 10410750 10719270 11139776 11522965 12144010 12609897
4150A2609897Q55986J060235J066578J781985K121137K682937K401196K926542
$$ 12609897 13465883 14526118 15592696 17374681 19495818 22178755 24579951 27506493
4142B7506493K661773J890578J94874j367153k494594k788524j994896j863530
$$ 27506493 30168266 32058844 32253718 30886565 28391971 25603447 23608551 21745021
4134B1745021k515577j649321j385795j030809p18769k31431q09705m56738l69226
$$ 21745021 19229444 17580123 16194328 15163519 14444750 14213319 13403614 12946876 12577650
4125A2577650J55096k38979n58365j91680J64914n47135j74573j62804L75657
$$ 12577650 12732746 12493767 11935402 11743722 11908636 11361501 11186928 11024124 11399781
4116A1399781O00777O8388J12855J78338N80223J39664N32821J7561o5573K65089
$$ 11399781 12000558 12068946 12181801 12360139 12940362 13080026 13612847 13630408 13564835 13829924
4106A3829924l07759j73902l10617l15320J73723n10383k86859j39626k31732
$$ 13829924 13522165 13348263 13037646 12722326 12896049 12385666 12098807 11959181 11727449
4097A1727449p97201m01511j071253o27028m60421j95422l09503k25823J35071
$$ 11727449 10930248 10528737 9457484 8830456 8370035 8174613 7865110 7639287 7774358
4088G774358m26640m96256J74514l94384m28359l14065q0875N3471J26897p3357
$$ 7774358 7347718 6851462 7025976 6631592 6203233 5889168 5808293 5861764 5988661 5915304
4078E915304J23031K3164j45380Q3239m57515K84003J30971K18377j07225k81895
$$ 5915304 6038335 6061499 5916119 5999358 5541843 5825846 5956817 6175194 6067969 5786074
4068E786074m18265L26672M26655j72681l07720j87557M55812j71507M57638J47383
$$ 5786074 5367809 5694481 6121136 5948455 5640735 5453178 5908990 5737483 6195121 6342504
4058F342504l07716j98631J62749k81010n95291L6023O7085K7603L3167N09540
$$ 6342504 6034788 5836157 5998906 5717896 5122605 5158628 5225713 5253316 5286483 5796023
4048E796023r8322J52206M64581J40609k56805m64513m51244L83973J01889r1349
$$ 5796023 5697701 5849907 6314488 6455097 6198292 5733779 5282535 5666508 5768397 5677048
4038E677048J03784J63238L52854K21951k06713J95530L55400L7014K88278N5156
$$ 5677048 5780832 5944070 6296924 6518875 6312162 6507692 6863092 6900106 7188384 7243540
4028G243540m147J19672J57855k02170O4682q9928N13684K69205N42569M99402
$$ 7243540 7239393 7359065 7516920 7314750 7379432 7289504 7803188 8072393 8614962 9114364
4018I114364M85637K45906k49119L86357L26082M11588N03071Q35348N73548R10190
$$ 9114364 9600001 9845907 9596788 9983145 10309227 10720815 11223886 12059234 12632782 13542972
4008A3542972J120683P17167N08520J246872R69850O82409O89756Q18699K96785
$$ 13542972 14663655 15380822 15889342 17136214 18106064 18788473 19478229 20296928 20593713
3999B0593713R70785M78777J34273j53394n0880j39741m14234k07440o67953n97351
$$ 20593713 21564498 22043275 22177548 22024154 21973274 21833533 21419299 21211859 20543906 19946555
3989A9946555n82310k84093q03769o05135k44247L35676K33783J01293J68372
$$ 19946555 19364245 19080152 18276383 17671248 17427001 17762677 17996460 18097753 18266125
3980A8266125N37533L53166J415991R33507j60448L04725L90626K62551j12285
$$ 18266125 18803658 19156824 20572815 21506322 21345874 21650599 22041225 22303776 22191491
3971B2191491M18557L65094J60096j22096j06915p46570p72661m41842l12877
$$ 22191491 22610048 22975142 23135238 23013142 22906227 22159657 21386996 20945154 20632277
3962B0632277q06907p98045j185603j024010j015072p05134o32756p50741J58549
$$ 20632277 19825370 19027325 17841722 16817712 15802640 15097506 14464750 13714009 13872558
3953A3872558n47091k34030k80782m72029o13260o73674m71936J63276o42786
$$ 13872558 13325467 13091437 12810655 12338626 11725366 11051692 10579756 10743032 10100246
3944A0100246M85438J16946j34634L33655m86927l6333j46698k208l44233J1589
$$ 10100246 10585684 10702630 10567996 10901651 10414724 10378391 10231693 10229485 9885252 9896841
3934I896841K81370k17925m21083l56628K9175j66615K95591O85725P5841q7546
$$ 9896841 10178211 9960286 9539203 9182575 9211750 9045135 9340726 10026451 10102292 10014746
3924A0014746K25630O5950j84595L3670L6483q7786j75047r0787L22493L09887
$$ 10014746 10240376 10306326 10121731 10155401 10191884 10104098 9929051 9838264 10160757 10470644
3914A0470644K72168J4249K29101r1743L22398j52805j04126K09713j96786l1408
$$ 10470644 10742812 10757061 10986162 10894419 11216817 11064012 10959886 11169599 10972813 10941405
3904A0941405p9030L26670l91844L01961N31394r249J13891q08n21610L32132
$$ 10941405 10862375 11189045 10797201 11099162 11630556 11621307 11735198 11734390 11212780 11544912
3894A1544912n98514m5287K19322o9946p2289J4440K23084M01956M27729J2774
$$ 11544912 10946398 10901111 11120433 11050487 10978198 10992638 11215722 11617678 12045407 12058181
3884A2058181L7275k83361N2559K07413P1489k03989n1603m3315L92822L12020
$$ 12058181 12095456 11812095 11864654 12072067 12143556 11939567 11887964 11844649 12237471 12549491
3874A2549491M38645J32543L70916N2397r949K31218J26517N37933N20455O23634
$$ 12549491 12988136 13120679 13491595 13543992 13534043 13765261 13891778 14429711 14950166 15573800
3864A5573800M25987k33402Q7772O69164K29321R13260R7686M99413O90926K93069
$$ 15573800 15999787 15766385 15854157 16523321 16752642 17665902 17763588 18263001 18953927 19246996
3854A9246996O82519J69565R06844K30210Q18493O94100J008042Q57767J106563
$$ 19246996 19929515 20099080 21005924 21236134 22054627 22748727 23756769 24614536 25721099
3845B5721099J024311P85004J463486N64248R62286R45688N66338R66491O44686
$$ 25721099 26745410 27530414 28993900 29558148 30520434 31466122 32032460 32998951 33643637
3836C3643637J100193R31890R04615J088222Q14707O65302R46834J224167J083523
$$ 33643637 34743830 35675720 36580335 37668557 38483264 39148566 40095400 41319567 42403090
3827D2403090J147212R86933J742896J271868J335554J719156J594712R57305
$$ 42403090 43550302 44537235 46280131 47551999 48887553 50606709 52201421 53158726
3819E3158726J423885R04652J078111J011591R48013J143418P13468J060673J227415
$$ 53158726 54582611 55487263 56565374 57576965 58524978 59668396 60381864 61442537 62669952
3810F2669952J087830J794900J556808Q14024J113779J366367O20255J210664
$$ 62669952 63757782 65552682 67109490 67923514 69037293 70403660 71023915 72234579
3802G2234579Q47458J75615M03315L12254N39172J95302j18554P1475k83632j237817
$$ 72234579 73082037 73257652 73660967 73973221 74512393 74707695 74589141 74660616 74376984 73139167
3792G3139167o07807j018634l72549q01034j586114j582823j437898q61114j528704
$$ 73139167 72531360 71512726 71140177 70339143 68753029 67170206 65732308 64871194 63342490
3783F3342490j924561k303280j483670j640086j673292j740245k144568j364686
$$ 63342490 61417929 59114649 57630979 55990893 54317601 52577356 50432788 49068102
3775D9068102j052472j183506j008367k87030k45821M72752K94481K98933M47689
$$ 49068102 48015630 46832124 45823757 45536727 45290906 45763658 46058139 46357072 46804761
3766D6804761P42548O93309O61245P08294J510371J977429J753324J216546J447250
$$ 46804761 47547309 48240618 48901863 49610157 51120528 53097957 54851281 56067827 57515077
3757E7515077J994796J595497J611454J716053J304607J280006J368982O65268
$$ 57515077 59509873 61105370 62716824 64432877 65737484 67017490 68386472 69051740
3749F9051740N57220Q04116P49061M97642J8813J49675l63785l86398l63439q13701
$$ 69051740 69608960 70413076 71162137 71659779 71678592 71828267 71464482 71078084 70714645 69900944
3739F9900944j282234r05828o71837q99811j210317j087090j222266j763862j788419
$$ 69900944 68618710 67712882 67041045 66141234 64930917 63843827 62621561 60857699 59069280
3730E9069280j770595k333882j937926j022873j668180j173116j073732q14591
$$ 59069280 57298685 54964803 53026877 52004004 50335824 49162708 48088976 47274385
3722D7274385j142180n04914n20008q78559n08494m75355p63735Q0139N41362
$$ 47274385 46132205 45627291 45107283 44228724 43720230 43244875 42481140 42561279 43102641
3713D3102641N363r8242q5283L79301L36618J38162K75447l1298j49362l3L34082
$$ 43102641 43108004 43009762 42924479 43303780 43640398 43778560 44054007 44022709 43873347 43873314 44207396
3702D4207396M19942M72802N34930N81657K72212Q1603N21552N91772O49932j26188
$$ 44207396 44627338 45100140 45635070 46216727 46488939 46570542 47092094 47683866 48333798 48207610
3692D8207610k48752J99239R9165L82098N86362j55590n72676j03021k49774J67133
$$ 48207610 47958858 48158097 48257262 48639360 49225722 49070132 48497456 48394435 48144661 48311794
3682D8311794J7788M42177j17290k59163j2675o34847J28789n18965p98411j012112
$$ 48311794 48329582 48771759 48654469 48395306 48382631 47747784 47876573 47357608 46559197 45547085
3672D5547085j66020o11594m36670J31572J6001j6523p90772k63058K07331J91623
$$ 45547085 45381065 44769471 44332801 44464373 44480374 44463851 43673079 43410021 43617352 43808975
3662D3808975K31576k3637K2910L03788J119560Q63835K42993N62297L54519P97439
$$ 43808975 44040551 44016914 44039824 44343612 45463172 46327007 46570000 47132297 47486816 48284255
3652D8284255O80674K91835M72977Q65880O77757J349204J409129J292951O84147
$$ 48284255 48964929 49256764 49729741 50595621 51273378 52622582 54031711 55324662 56008809
3643E6008809R24025J279035P60824P30201R22128O45804K39416J60054Q36662
$$ 56008809 56932834 58211869 58972693 59702894 60625022 61270826 61510242 61670296 62506958
3634F2506958J096295K98438R66766M73294j60701J17006L09172M91615k50796
$$ 62506958 63603253 63901691 64868457 65341751 65181050 65298056 65607228 66098843 65848047
3625F5848047L13817M23765n76176j8492R9281j48918L16008o9655o24263N9669
$$ 65848047 66161864 66585629 66009453 65990961 66090242 65941324 66257332 66187677 65563414 65623083
3615F5623083N5337k30198k14051K12257q030j85458P8171R0002m36485j8603
$$ 65623083 65678420 65448222 65234171 65446428 65438398 65252940 65331111 65421113 64984628 64966025
3605F4966025R41587O12357N51255k7111L74477N14101J46895Q79351L33908K62944
$$ 64966025 65907612 66519969 67071224 67044113 67418590 67932691 68079586 68958937 69292845 69555789
3595F9555789N59535J182112P80847L67002P0251j95680m80471o39968o15733
$$ 69555789 70115324 71297436 72078283 72445285 72515536 72319856 71839385 71199417 70583684
3586G0583684o23733m57595j040191q35771m01601l69037m0290P30387L34988
$$ 70583684 69959951 69502356 68462165 67626394 67224793 66855756 66815466 67545853 67880841
3577F7880841j36998l89514m6957n23385l27087k22190l68963L75248P91455M59187
$$ 67880841 67743843 67354329 67307372 66783987 66456900 66234710 65865747 66240995 67032450 67491637
3567F7491637N33408Q40279L45702M74458N20369L05627M7851O57103n67146l24186
$$ 67491637 68025045 68865324 69211026 69685484 70205853 70511480 70559331 71216434 70649288 70325102
3557G0325102l80466l32500q52061r48660j548471j305264p42312m06561l58480
$$ 70325102 69944636 69612136 68760075 67811415 66262944 64957680 64215368 63808807 63450327
3548F3450327q87536m55626p9800m21380j231567j09460q69483q03668j280051
$$ 63450327 62562791 62107165 62027365 61605985 60374418 60264958 59395475 58591807 57311756
3539E7311756j671299j882939j621386j711617j964065j795745k126404j197218
$$ 57311756 55640457 53757518 52136132 50424515 48460450 46664705 44538301 43341083
3531D3341083j201583j694642j390554j075818k65834r48518m20658l45086k54345
$$ 43341083 42139500 40444858 39054304 37978486 37712652 36764134 36343476 35998390 35744045
3522C5744045Q6785J88841k90987l43434M11320k86507J84340k97975K86707K05213
$$ 35744045 35830830 36019671 35728684 35385250 35796570 35510063 35694403 35396428 35683135 35888348
3512C5888348J98250K82448m1844K92191N16871R37296K73559l8281O5034M86047
$$ 35888348 36086598 36369046 36327202 36619393 37136264 38073560 38347119 38308838 38373872 38859919
3502C8859919L67058P15682M08607p464P1329O26135L55209J18497O32017M04142
$$ 38859919 39226977 39942659 40351266 40343802 40415131 41041266 41396475 41514972 42146989 42551131
3492D2551131L3254k92939K69829K09552J24912N2667k25609n0524l24205m14424
$$ 42551131 42584385 42291446 42561275 42770827 42895739 42948406 42722797 42672273 42348068 41933644
3482D1933644n18727j245912m48917l52801r3922M97r17249l63777p61865r40158
$$ 41933644 41414917 40169005 39720088 39367287 39273365 39273862 38356613 37992836 37230971 36290813
3472C6290813r59864k04701k09620l45783l83618n28323m14450j21595J4602k36578
$$ 36290813 35330949 35126248 34916628 34570845 34187227 33658904 33244454 33122859 33137461 32900883
3462C2900883k76528k36090O7328L01811l6293j57245O74362Q0712M38174J39701
$$ 32900883 32624355 32388265 32455593 32757404 32721111 32563866 33238228 33318940 33757114 33896815
3452C3896815j23738k20137k83111P7265j63053M91649Q7872k80356O45903L85658
$$ 33896815 33773077 33552940 33269829 33347094 33184041 33675690 33763562 33483206 34129109 34514767
3442C4514767L34469L20003P26862P12410N48103M60483J256931J123202n877
$$ 34514767 34849236 35169239 35896101 36608511 37156614 37617097 38874028 39997230 39991353
3433C9991353L56269M85454N74631L22037P50501P14192K77653m30432O61489
$$ 39991353 40347622 40833076 41407707 41729744 42480245 43194437 43472090 43041658 43703147
3424D3703147k68961k78466k1899o13413K7416K6900n1665j71584p89759q13563
$$ 43703147 43434186 43155720 43133821 42520408 42547824 42574724 42523059 42351475 41561716 40748153
3414D0748153n79536l37868K74205k88092o6950j97212L81916M89894N1352M84248
$$ 40748153 40168617 39830749 40104954 39816862 39749912 39552700 39934616 40424510 40475862 40960110
3404D0960110K90178j92550J73060J087857J091652M87648K59747J11842q3395
$$ 40960110 41250288 41057738 41230798 42318655 43410307 43897955 44157702 44269544 44186149
3395D4186149j40962K4207M74385J39798P7657J28623M05093J36795k2035K72684
$$ 44186149 44045187 44069394 44543779 44683577 44761234 44889857 45294950 45431745 45409710 45682394
3385D5682394j20326P1914l32535K86313L04445L36732K37816Q66912J21497Q55049
$$ 45682394 45562068 45633982 45301447 45587760 45892205 46228937 46466753 47333665 47455162 48310211
3375D8310211L27176J255444Q13101J266691J719976Q63781R47654P28429K78161
$$ 48310211 48637387 49892831 50705932 51972623 53692599 54556380 55504034 56232463 56510624
3366E6510624Q65408J282304P29313O10853O64992P06181K74214R15797R01323
$$ 56510624 57376032 58658336 59387649 59998502 60663494 61369675 61643889 62559686 63461009
3357F3461009N56044L01690P70685j43557Q17861J97888L37943L40411M90364
$$ 63461009 64017053 64318743 65089428 64945871 65763732 65961620 66299563 66639974 67130338
3348F7130338J07371R99002J033069J067179J148596R75041J040029P54565J116783
$$ 67130338 67237709 68236711 69269780 70336959 71485555 72460596 73500625 74255190 75371973
3339G5371973Q17354O22416P66787R07529Q29235M67265N21668Q21020M93313
$$ 75371973 76189327 76811743 77578530 78486059 79315294 79782559 80304227 81125247 81618560
3330H1618560P9770k70494n83286n31500k57347M26596k83976m74105m18521j219955
$$ 81618560 81698330 81427836 80844550 80313050 80055703 80482299 80198323 79724218 79305697 78085742
3320G8085742j232881r84298l64125p3915l25863n64691j34462j91163L94992
$$ 78085742 76852861 75868563 75504438 75430523 75104660 74539969 74405507 74214344 74609336
3311G4609336R12359J174330R73670J328021K045297K347371K519195L026452
$$ 74609336 75521695 76696025 77669695 78997716 81043013 83390384 85909579 88936031
3303H8936031L781605M584364M591599N193696N439700O173862O597621P196615
$$ 88936031 92717636 97302000 101893599 107087295 112526995 118700857 125298478 132495093
3295A32495093Q374415R031334J0774819J1836585J1902939J0302102P900426
$$ 132495093 140869508 149900842 160675661 172512246 184415185 194717287 202617713
3288B02617713M020157O29823l316795p279163q996498r184803r146788q276917
$$ 202617713 206637870 207267693 203950898 196671735 187675237 178490434 169343646 161066729
3280A61066729p954661o836714n899120n072940m229967l327756k548722k030988
$$ 161066729 153112068 146275354 140376234 135303294 131073327 127745571 125196849 123165861
3272A23165861r81150N4173q6955P40383K640761K603779L588667L974340N368085
$$ 123165861 122184711 122238884 122151929 122892312 125533073 128136852 131725519 135699859 141067944
3263A41067944O798549P856919Q520872J0142566J1327407J2449211J3196282
$$ 141067944 147866493 155723412 164244284 174386850 185714257 198163468 211359750
3256B11359750J4772594J3077515J1004580Q213704O014855L179899P88672K15022
$$ 211359750 226132344 239209859 250214439 258428143 264442998 267622897 268411569 268626591
3248B68626591l13854j7159r21392j255083k567181l567727n508653n929291o615797
$$ 268626591 268312737 268295578 267374186 266119103 263551922 259984195 254475542 248546251 241930454
3239B41930454o763773o322398m754423l470942k725463j667692J167666L181108
$$ 241930454 235166681 228844283 224089860 220618918 217893455 216225763 217393429 220574537
3231B20574537M443655O561462Q338831Q167092Q531478Q237233Q645747Q588921
$$ 220574537 225018192 231579654 239918485 248085577 256617055 264854288 273500035 282088956
3223B82088956R408314J0847383J2231737J2973797J1817466J1129343Q410981
$$ 282088956 291497270 302344653 314576390 327550187 339367653 350496996 358907977
3216C58907977L774340r88152n761691r001399j0939962j1555625j0241922r552584
$$ 358907977 362682317 361694165 355932474 346931075 335991113 324435488 314193566 304640982
3208C04640982q213641p716315p104097q792342j0785851j2931133j3627898j4297099
$$ 304640982 296427341 288711026 281606929 272814587 262028736 249097603 235469705 221172606
3200B21172606j4056854j2975317j1315242r855750q282116o802704m643817l865744
$$ 221172606 207115752 194140435 182825193 172969443 164687327 157884623 153240806 149375062
3192A49375062l040891j884897j647029k140336k562660k023153k639910k642304
$$ 149375062 146334171 144449274 142802245 140661909 138099249 136076096 133436186 130793882
3184A30793882j685166j499074r06374M05565J832526L328128M146183N318276
$$ 130793882 129108716 127609642 126703268 127108833 128941359 132269487 136415670 141733946
3176A41733946N986084N581994M603870K436961L5476k171311n425215p578940
$$ 141733946 147720030 153302024 157905894 160342855 160378331 158207020 152781805 145202865
3168A45202865r195515r378703r818512q799872o941263o612459n999784n048498
$$ 145202865 136007350 126628647 116810135 108010263 101069000 94456541 88456757 83408259
3160H3408259m454617m234921l625976k704368l085414k492935k538628j825314
$$ 83408259 78953642 74718721 71092745 68388377 65302963 62810028 60271400 58446086
3152E8446086j811993j618992j511449j015254r53756j272374p33656m17746o00887
$$ 58446086 56634093 55015101 53503652 52488398 51534642 50262268 49528612 49110866 48509979
3143D8509979K2312o45020o10347m84678q09107j51202r3807J12617k74208O94836
$$ 48509979 48532291 47887271 47276924 46792246 45983139 45831937 45738130 45850747 45576539 46271375
3133D6271375L23483j97418n5503J005733P22860P13221O49599R99817O50829
$$ 46271375 46594858 46397440 46341937 47347670 48070530 48783751 49433350 50433167 51083996
3124E1083996J797630J425171K227052K349370K671145L934341L909859M396399
$$ 51083996 52881626 54306797 56533849 58883219 61554364 65488705 69398564 73794963
3116G3794963M895882N741316O811682P524358Q546168Q960975Q937065P785988
$$ 73794963 78690845 84432161 91243843 98768201 107314369 116275344 125212409 132998397
3108A32998397N703981L628945N87902j104823m252431n746580o965650p124570
$$ 132998397 138702378 142331323 142919225 141814402 137561971 131815391 124849741 117725171
3100A17725171o331341n533005m339020l789279k998026k229123k941310l171557
$$ 117725171 111393830 105860825 101521805 97732526 94734500 92505377 89564067 86392510
3092H6392510l406860l730308m081361m001632l826019l289591k686257k483032
$$ 86392510 82985650 79255342 75173981 71172349 67346330 64056739 61370482 58887450
3084E8887450k505438j625237j618391l46671p79812k77586K62745J49502L65612
$$ 58887450 56382012 54756775 53138384 52791713 52011901 51734315 51997060 52146562 52512174
3075E2512174M50430P43218J629658K009455K039184K716547K270155K941844
$$ 52512174 52962604 53705822 55335480 57344935 59384119 62100666 64370821 67312665
3067F7312665L810072M342751M274090N586517O302276P663875Q375145Q979419
$$ 67312665 71122737 75465488 79739578 85326095 91628371 99292246 107667391 116646810
3059A16646810R510045R723578Q841842P402992N173673K750921N70871j060307
$$ 116646810 126156855 135880433 144722275 152125267 157298940 160049861 160620732 159560425
3051A59560425j968846k049752j754789m32005P31837J217971J413846J605009
$$ 159560425 157591579 155541827 153787038 153355033 154086870 155304841 156718687 158323696
3043A58323696j47107j425021m112066o575870p965109r220479r201582r987645
$$ 158323696 158176589 156751568 152639502 146063632 138098523 128878044 119676462 109688817
3035A09688817r227051q721889p154754o536631n666165n068585m526573l895374
$$ 109688817 100461766 91739877 84585123 78048492 72382327 67313742 62787169 58891795
3027E8891795k834631k932096k479419j372349j192759j021532r78849l88723
$$ 58891795 56057164 53125068 50645649 49273300 48080541 47059009 46080160 45691437
3019D5691437K58145J39901O82222Q53695J546592K085045K716319L453869M614458
$$ 45691437 45949582 46089483 46771705 47625400 49171992 51257037 53973356 57427225 62041683
3010F2041683N079583N524295N311567L817117K178585M58768j187775l221166
$$ 62041683 67121266 72645561 77957128 81774245 83952830 84411598 83223823 80002657
3002H0002657m886226o173929n771462o473385n681537m775380l758077l985387
$$ 80002657 75116431 68942502 63171040 56697655 51016118 46240738 42482661 38497274
2994C8497274l740010k879463k551226k105617j582129r94722j289468j880499
$$ 38497274 34757264 31877801 29326575 27220958 25638829 24644107 23354639 21474140
2986B1474140n52802j285738q17109n02133o72033m07530o29220m38971p47262
$$ 21474140 20921338 19635600 18818491 18316358 17644325 17236795 16607575 16168604 15421342
2977A5421342j70931J5652j8706m76380l68185n25042p13227m72981l00699J75586
$$ 15421342 15250411 15266063 15247357 14770977 14402792 13877750 13164523 12691542 12390843 12566429
2967A2566429n02263j05653j00205k73468m55535q5799P7331j08694l39696q58845
$$ 12566429 12064166 11958513 11858308 11584840 11129305 11043506 11120837 11012143 10672447 9813602
2957I813602L78462l25905k62540l18343o41783q2671J35652l41093l23839n28753
$$ 9813602 10192064 9866159 9603619 9285276 8643493 8560822 8696474 8355381 8031542 7502789
2947G502789p2137l6715N82680j00067j05477j73441m39970j5613l3926L50926
$$ 7502789 7430652 7393937 7976617 7876550 7771073 7597632 7157662 7142049 7108123 7459049
2937G459049J03760l98707j85216k3610j37404K32661l4129j74509j83362q4042
$$ 7459049 7562809 7164102 6978886 6955276 6817872 7050533 7016404 6841895 6658533 6574491
2927F574491k69008J30587O28970j39877n71010k53447P8504k46367J09116L3881
$$ 6574491 6305483 6436070 7065040 6925163 6354153 6100706 6179210 5932843 6041959 6075840
2917F075840j87455k55541k55556j1757k93726k14078K42367M02028n52313k47416
$$ 6075840 5888385 5632844 5377288 5365531 5071805 4857727 5100094 5502122 4949809 4702393
2907D702393r39666L66760l853M3538Q6245L9370L43609k70552l11748K5888j89481
$$ 4702393 3762727 4129487 4125634 4169172 4255417 4294787 4638396 4367844 4056096 4081984 3892503
2896C892503l98741P4268O862K73065L52496J23378m45347l90773r287m4957L00549
$$ 3892503 3493762 3568030 3574892 3847957 4200453 4323831 3878484 3487711 3478424 3433467 3734016
2885C734016L88958k52119l6380k02740l00158l05248P53926J80583L1936m69160
$$ 3734016 4122974 3870855 3834475 3631735 3331577 3026329 3780255 3960838 3992774 3523614
2875C523614l70257j58839N36140J93203m79760l15720l5233J46676K39445l26482
$$ 3523614 3153357 2994518 3530658 3723861 3244101 2928381 2893148 3039824 3279269 2952787
2865B952787l7066j84893N0764N75038o38172m50361K10508R6412J98060p1275
$$ 2952787 2915721 2730828 2781592 3356630 2718458 2268097 2478605 2575017 2773077 2701802
2855B701802K03441m8281o03738m942l31314j09712K39306L96350P5716j69577
$$ 2701802 2905243 2856962 2253224 2248282 1916968 1807256 2046562 2442912 2518628 2349051
2845B349051l96780K82427J72589K54035l73782j05995K30703K27225m76248n80579
$$ 2349051 1952271 2234698 2407287 2661322 2287540 2181545 2412248 2639473 2163225 1582646
2835A582646M75056J24480K4182O2014J54718L53501K0641M5639n71135K5659
$$ 1582646 2057702 2182182 2206364 2268378 2423096 2776597 2797238 2842877 2271742 2297401
2825B297401L7345J3256j08300l75047J65767Q8639K42481K56180j51171P7214
$$ 2297401 2334746 2348002 2239702 1864655 2030422 2119061 2361542 2617722 2466551 2543765
2815B543765J69346m27831l65696j38413K30831k09821K56373m67585j86599J56839
$$ 2543765 2713111 2285280 1919584 1781171 2012002 1802181 2058554 1590969 1404370 1561209
2805A561209K06537J14352O56510k60474k29721o57546j13157K96722O6534l38634
$$ 1561209 1767746 1882098 2538608 2278134 2048413 1390867 1277710 1574432 1640966 1302332
2795A302332J65871m4904k05885L68268k50588J47987n32703M39408K50985l05113
$$ 1302332 1468203 1423299 1217414 1585682 1335094 1483081 950378 1389786 1640771 1335658
2785A335658m99987N05480K45313R650m50730J85890L1430N5186k18134L20638
$$ 1335658 835671 1341151 1586464 1596114 1145384 1331274 1362704 1417890 1199756 1520394
2775A520394N5243k38067N71156J02371o5026K89858k68126L4466L15022M02322
$$ 1520394 1575637 1337570 1908726 2011097 1946071 2235929 1967803 2002269 2317291 2719613
2765B719613k77321k36072r0899m20387j53492K06727J61022q0088N94996J90444
$$ 2719613 2442292 2206220 2115321 1694934 1541442 1748169 1909191 1829103 2424099 2614543
2755B614543l87184l54336M66320k0643j41535q45253m60076L12446Q1063J14232
$$ 2614543 2227359 1873023 2339343 2318700 2177165 1331912 871836 1184282 1265345 1379577
2745A379577m941j07929l14004N46429L5471J64371k16688k64796m1923o7108
$$ 1379577 1374636 1266707 952703 1499132 1534603 1698974 1482286 1217490 1175567 1108459
2735A108459k07769m87974K19310j51254J73045J1323N80153J46720M7841N7129
$$ 1108459 900690 412716 632026 480772 653817 665140 1245293 1392013 1439854 1496983
2725A496983J15810o72071q9477M91848k97004m2458m88491j61942N73362n55764
$$ 1496983 1612793 940722 851245 1343093 1046089 1003631 515140 353198 926560 370796
2715C70796L22874j5581n54505r1074J89853J94477N45404K4237j8014L40666
$$ 370796 693670 678089 123584 32510 222363 416840 962244 986481 968467 1309133
2705A309133m87809j31459l57780j79399J91246K66404L43402P7771m15631K98621
$$ 1309133 821324 689865 332085 152686 343932 610336 953738 1031509 615878 914499
2695I14499K878q29350O2370J14306P36358q179r9168M35880n47949j63631K05555
$$ 914499 917377 88027 150397 264703 1001061 992882 893714 1329594 781645 618014 823569
2684H23569J49481J93892J1079j96954k35611o1932j91700j81331K61581N2454
$$ 823569 973050 1166942 1178021 981067 745456 683524 491824 310493 572074 624528
2674F24528n207m3766L25499p2247K5228L88081J8722l39234Q8478K83829k07171
$$ 624528 619321 575555 901054 828807 854035 1242116 1260838 921604 1010082 1293911 1086740
2663A086740n99278M2699m68213O67569k21431l54135R30219j76996k48320j97709
$$ 1086740 487462 530161 61948 729517 508086 153951 1084170 907174 658854 461145
2653D61145P3027K44263m62888j86531J93948o25041o0730Q46100r7384J04300
$$ 461145 534172 778435 315547 129016 322964 -302077 -362807 483293 385909 490209
2643D90209J78536K16296Q8551m45932k79344j55792K18290j74205m67762M29247
$$ 490209 668745 885041 973592 527660 248316 92524 310814 136609 -331153 98094
2633I8094N91874n9177M12418q5141k19234K07398J81011M44081m75900o86966
$$ 98094 689968 630791 1043209 958068 738834 946232 1127243 1571324 1095424 408458
2623D08458O9674j09470M50696j0590l52675J89770p8695J38855O22808j51236
$$ 408458 478132 368662 819358 808768 456093 645863 567168 706023 1328831 1177595
2613A177595N333J9722l0093J0708m56901L2273J90070k79649k24722j69994M39605
$$ 1177595 1182928 1202650 1172557 1183265 726364 758637 948707 669058 444336 274342 713947
2602G13947M38023J28896j95838m42678m15215L61982m7125q7309J73525j13924
$$ 713947 1151970 1280866 1085028 642350 227135 589117 541992 454683 628208 514284
2592E14284m38201l97175J65938M12004j08786K34466N24162p12819R516K80418
$$ 514284 76083 -321092 -155154 256850 148064 382530 906692 193873 203389 483807
2582D83807L68003j38407P02672k11657q47822j15671k31262L89401l70299j20691
$$ 483807 851810 713403 1416075 1204418 356596 240925 9663 399064 28765 -91926
2572i1926m4916n7082j66161J32231M8213L83528O80508J42851k77789j78179
$$ -91926 -136842 -193924 -360085 -227854 -179641 203887 884395 1027246 749457 571278
2562E71278K26471p0520o6956j79583r5516N7190l18676Q8686n03620M29951N03173
$$ 571278 797749 727229 660273 480690 385174 442364 123688 212374 -291246 138705 641878
2551F41878M8894K428m32181L50273L667M21126n42836j24255m6198K07216j17333
$$ 641878 690772 693200 261019 611292 614959 1036085 493249 368994 322796 530012 412679
2540D12679r946r3725o6841k57947j13167O0740J04252Q00457k23028k3419n07512
$$ 412679 402733 309008 242167 -15780 -128947 -68207 36045 836502 613474 590055 82543
2529H2543k71834R19143L08491n68129k88533K86027k2727J41801J1832l03013
$$ 82543 -189291 729852 1038343 470214 181681 467708 444981 586782 598614 295601
2519B95601o9798l7590j56208k50616J6139M85198J32310l3128J72274J64255
$$ 295601 225803 188213 32005 -218611 -202472 282726 415036 381908 554182 718437
2509G18437N01429P8463k36709R7608l7476r3801n8445l01645m68099J23769L51878
$$ 718437 1219866 1298329 1061620 1159228 1121752 1027951 969506 667861 199762 323531 675409
2498F75409j55727m0235J25471O70896j96951L35948k7971j60067k55122q0512
$$ 675409 519682 479447 604918 1275814 1078863 1414811 1386840 1226773 971651 891139
2488H91139m2756o76535L69611J17335L1222J83848l77504J3089M20282m73913
$$ 891139 848383 171848 541459 658794 690016 873864 496360 509449 929731 455818
2478D55818r7183L71970K52130j6589j70962Q797M4311j93536J77766k97568k88615
$$ 455818 358635 730605 982735 966146 795184 803981 848292 654756 832522 534954 246339
2467B46339K56462M32568n920k14895n64327K53302K02597M29188J75754l14453
$$ 246339 502801 935369 929449 714554 150227 403529 606126 1035314 1211068 896615
2457H96615M3472n49991l22235m22289L57856L57221J62249L04788J77901l48271
$$ 896615 940087 390096 67861 -354428 3428 360649 522898 827686 1005587 657316
2447F57316K29877M83849k19332l92875J28888L78480K19898m90125p8510m64606
$$ 657316 887193 1371042 1151710 758835 887723 1266203 1486101 995976 917466 452860
2437D52860m12102N76751P0949K59900K25683J47124M59447j87040j30040O6312
$$ 452860 40758 617509 688458 948358 1174041 1321165 1780612 1593572 1463532 1529844
2427A529844L35630m08984k45382j62487R9717K71745N65313J08113n93413j05583
$$ 1529844 1865474 1456490 1211108 1048621 1148338 1420083 1985396 2093509 1500096 1394513
2417A394513M9393J74740j20403k19208L46898J66679K64147P0154n12443Q6454
$$ 1394513 1443906 1618646 1498243 1279035 1625933 1792612 2056759 2126913 1614470 1700924
2407A700924K31769M7516K65911o5090R3599N27797K73392K29675n74939k44561
$$ 1700924 1932693 1980209 2246120 2181030 2274629 2802426 3075818 3305493 2730554 2485993
2397B485993j95827K05530K33456l0671k33824k34377L81638J66388K98768K12004
$$ 2485993 2290166 2495696 2729152 2698481 2464657 2230280 2611918 2778306 3077074 3289078
2387C289078k46263L55926P09073q610k54819O04864J83921m55740J0990N35708
$$ 3289078 3042815 3398741 4107814 4099204 3844385 4449249 4633170 4177430 4188420 4724128
2377D724128n968O48135M66275P28762K93635P3113O58858M30488K93743M1487
$$ 4724128 4718160 5366295 5832570 6561332 6854967 6928080 7586938 8017426 8311169 8352656
2367H352656Q90029R80287J007916J333645O95027J207613J023406J755886J780801
$$ 8352656 9242685 10222972 11230888 12564533 13259560 14467173 15490579 17246465 19027266
2358A9027266J334448J718384J761195K424432K330774K493843L760905N365546
$$ 19027266 20361714 22080098 23841293 26265725 28596499 31090342 34851247 40216793
2350D0216793O674594Q409456R998152J2214263J2490066J0912769O058421j22372
$$ 40216793 46891387 55300843 65298995 77513258 90003324 100916093 106974514 106852142
2342A06852142n917294r289293j1194892j1332514j0156143r092652o633456n786286
$$ 106852142 100934848 91645555 80450663 69118149 58962006 49869354 43235898 37449612
2334C7449612n634608m117585l199118k492645k032463j513369q82777j729960
$$ 37449612 31815004 27697419 24498301 22005656 19973193 18459824 17577047 15847087
2326A5847087j497357j670373j024993j135648j47859n61906r75804q09117m73846
$$ 15847087 14349730 12679357 11654364 10518716 10370857 9808951 8833147 8024030 7550184
2317G550184p07933L28223k08824p55233L21911l72183j95278n03697J81168n97494
$$ 7550184 6842251 7170474 6961650 6206417 6528328 6156145 5960867 5457170 5638338 5040844
2307E040844p37257k82034K29585m12209j74168J41458j11565j99149k27431m3842
$$ 5040844 4303587 4021553 4251138 3838929 3664761 3806219 3694654 3495505 3268074 3224232
2297C224232L22198j22180j29724r7270j52795r7826l02169o11477n6271m27513
$$ 3224232 3546430 3424250 3294526 3197256 3044461 2946635 2644466 2032989 1976718 1549205
2287A549205k5088L40493J9662k6556k15907K58448j95226m50849L20443M24279
$$ 1549205 1524117 1864610 1884272 1857716 1641809 1900257 1705031 1254182 1574625 1998904
2277A998904n61260j48058Q4123k6833R8242Q3116k64058j31714J67835J09557
$$ 1998904 1437644 1289586 1373709 1346876 1445118 1528234 1264176 1132462 1300297 1409854
2267A409854K04881n3797j72720N8401j57581N0452l97119n5302q7077Q4705P2144
$$ 1409854 1614735 1560938 1388218 1446619 1289038 1339490 942371 887069 799992 884697 956841
2256I56841k48583M24013l18433Q5515K00136J90464k42507j31280j15728m76506
$$ 956841 708258 1132271 813838 899353 1099489 1289953 1047446 916166 800438 323932
2246C23932l73343J47657L04978n7528k19121J72367K15527J6781j73622L4335
$$ 323932 -49411 98246 403224 345696 126575 298942 514469 531250 357628 391963
2236C91963j04216m7493j39991J34877K52867j19217L63221l04339k04759l69347
$$ 391963 287747 240254 100263 235140 488007 368790 732011 427672 222913 -146434
2226a46434O00598N81931J4310q83618R4309j2654l34630L23615j40319n11084
$$ -146434 454164 1036095 1050405 166787 261096 248442 -86188 237427 97108 -413976
2216d13976K08414J50003L00744L18038k86390L02610j08366k2761p33005k20241
$$ -413976 -205562 -55559 245185 563223 276833 579443 471077 448316 -284689 -504930
2206e04930P99516J62156K46537K05963n29658m13836k71656j10048P7300j07946
$$ -504930 294586 456742 703279 909242 379584 -34252 -305908 -415956 -338656 -446602
2196d46602L7875R00977j26329l10056J33614K65421R9486k56933j3951r683q2170
$$ -446602 -408727 492250 365921 55865 189479 454900 554386 297453 283502 273819 191649
2185A91649k01872J48360J3785j20000j64065M11205L22813n76030J1970L77509
$$ 191649 -10223 138137 151922 31922 -132143 279062 601875 25845 37815 415324
2175D15324J49359k44961j21148l84304m39134K34967R8342M62064R9384J59364
$$ 415324 564683 319722 198574 -185730 -624864 -389897 -291555 170509 269893 429257
2165D29257j28979K52520k50922l79803J68555k20383l6729j3356j22557L89966
$$ 429257 300278 552798 301876 -77927 90628 -129755 -166484 -179840 -302397 87569
2155H7569m4238N804K73656J20916j56704n21145N43200L5519k0838K70698n00376
$$ 87569 43331 49135 322791 443707 287003 -234142 309058 344577 323739 594437 94061
2144I4061j54969m07845j04698K01629M4630J21674r2968J62515l99084N14289
$$ 94061 -60908 -468753 -573451 -371822 -327192 -205518 -298486 -135971 -535055 -20766
2134b0766j95978M02726k25492k81857J57659j56803L51314K11472l56344R1186
$$ -20766 -216744 185982 -39510 -321367 -163708 -320511 30803 242275 -114069 -22883
2124b2883j93471r4978Q05293n59871K03057J9968n02192M49735M3420m9385R9434
$$ -22883 -216354 -311332 493961 -65910 137147 157115 -345077 104658 148078 98693 198127
2113A98127k68084j91822K30478L62458K4098k51727n90975K34454J76410K68662
$$ 198127 -69957 -261779 -31301 331157 355255 103528 -487447 -252993 -76583 192079
2103A92079O67811k10752k83867j31776m43867J93166k16351j420K24029K66669
$$ 192079 859890 649138 365271 233495 -210372 -17206 -233557 -234977 -10948 255721
2093B55721l48863l15535L88924m24031k09161o1160q1771N56983j7630K64245
$$ 255721 -93142 -408677 -19753 -443784 -652945 -714105 -795876 -238893 -256523 7722
2083G722j56628l40812L98957K12467j76129J3771k54141J01868J15392J61143
$$ 7722 -148906 -489718 -90761 121706 -54423 -40652 -294793 -192925 -77533 83610
2073H3610M15747m25463r7603L54288j19448j32986m0261o38120K0449K60389
$$ 83610 499357 73894 -23709 330579 211131 78145 37884 -600236 -579787 -319398
2063c19398Q7327J72997l76113M20562N9507r2398N02682k72980l9538k85611
$$ -319398 -232071 -59074 -435187 -14625 44882 -47516 455166 182186 142648 -142963
2053a42963k0883j77969L6901K41908K20037j67465k73991n8323p0034M4552O547
$$ -142963 -163846 -341815 -304914 -63006 157031 -10434 -284425 -342748 -412782 -368230 -361683
2042c61683K50565k4163k31665L35299M5941J47382q9228j42701j55297p6421
$$ -361683 -111118 -135281 -366946 -31647 14294 161676 72448 -70253 -225550 -301971
2032c01971k2652L97388j68745k3468K7332k39603K30971m27320m89482J42433
$$ -301971 -324623 72765 -95980 -119448 -92116 -331719 -100748 -528068 -1017550 -875117
2022h75117P11053M08637K23293m4125o375p98034R6952L07288K69351j02969
$$ -875117 -164064 244573 467866 423741 417366 -380668 -283716 23572 292923 189954
2012A89954k2071o6990m03676q8701P2953k7498l1731K94683M5868m1309k92831
$$ 189954 167883 100893 -302783 -391484 -318531 -346029 -377760 -83077 -37209 -78518 -371349
2001c71349j07826J23617j27063j06147J84941N8813J30324L5435K82150j11898
$$ -371349 -479175 -355558 -482621 -588768 -403827 -345014 -214690 -179255 102895 -9003
1991i003R9197j39268J10008l29272K1805r764k77396r6449K37528O7722L71982
$$ -9003 90194 -49074 60934 -268338 -246533 -256297 -533693 -630142 -392614 -324892 47090
1980D7090k86122j46566R6970n08957J21457J90875j1633J09049L55008r4032
$$ 47090 -239032 -385598 -288628 -797585 -676128 -485253 -496886 -387837 -32829 -126861
1970a26861L14638l47615j44536M072L18906l82246l21853M90230K51175m39750
$$ -126861 187777 -159838 -304374 -300302 18604 -363642 -685495 -195265 55910 -383840
1960c83840J63836J68500l91028m9571L12979K03320l15906M0162O31568k77314
$$ -383840 -220004 -51504 -442532 -492103 -179124 24196 -291710 -251548 380020 102706
1950A02706l31405j75737m48718j82318n2652O7587P02636K8909K39777N6788
$$ 102706 -228699 -404436 -853154 -1035472 -1088124 -1020537 -317901 -288992 -49215 7573
1940G573n02617K94701k70864L42081M22244m90919n97960K16326k68046J07007
$$ 7573 -495044 -200343 -471207 -129126 293118 -197801 -795761 -579435 -847481 -740474
1930g40474K37990K00263K43441o65125M1907q2731N57905M36855N60478n55521
$$ -740474 -502484 -302221 -58780 -723905 -681998 -764729 -206824 230031 790509 234988
1920B34988r11878K45912J5470K66939R1723n835J57133n1437L9077K34488m39491
$$ 234988 -676890 -430978 -415508 -148569 -56846 -62681 94452 43015 82092 316580 -122911
1909a22911J15635J52780n75022l46133M27641J93143n2863Q252k98840j12984
$$ -122911 -7276 145504 -429518 -775651 -348010 -154867 -207730 -199478 -498318 -611302
1899f11302J04477L01775N28163o03472L58198l6716j90872L9299M232J88869
$$ -611302 -506825 -205050 323113 -280359 77839 41123 -149749 -110450 -106218 82651
1889H2651k95153K16302l12712m63667L66528j4794M99453j31523l25617K68940
$$ 82651 -212502 3800 -308912 -772579 -406051 -420845 78608 -52915 -378532 -109592
1879a09592l03947N8130J44154K98057m0847L83642l29950m29952j55998p5667
$$ -109592 -413539 -355409 -211255 86802 45955 429597 99647 -330305 -486303 -561970
1869e61970K91426M75869n55689j9063P7866K27473k90805m3047L53268j21581
$$ -561970 -270544 205325 -350364 -369427 -291561 -64088 -354893 -397940 -44672 -166253
1859a66253K50296j0676J45874l4058k12913j49931M75659j93443R5701j302j28378
$$ -166253 84043 73367 219241 185183 -27730 -177661 297998 104555 200256 198954 70576
1848G0576j93427k06669K27154k9488q8034j15313L2203L9354l25418N04721L6233
$$ 70576 -122851 -329520 -102366 -131854 -219888 -335201 -302998 -263644 -589062 -84341 -48108
1837d8108j30576l24205k11814N38513m04544Q7L22177K7276j10773k6611L5988
$$ -48108 -178684 -502889 -714703 -176190 -580734 -580647 -258470 -231194 -341967 -368578 -332590
1826c32590J51728m26818k89735J55394J65199L59205L72207j82343n22299l85539
$$ -332590 -180862 -607680 -897415 -742021 -576822 -217617 154590 -27753 -550052 -935591
1816i35591M1370M60646k04461N81614L73756j20602j83811m34249J71821J12158
$$ -935591 -894221 -433575 -638036 -56422 317334 196732 12921 -421328 -249507 -137349
1806a37349j06422L29527k60682m87684K13707K37690l6991J16100k82794j00277
$$ -137349 -243771 85756 -174926 -662610 -448903 -211213 -248204 -132104 -414898 -515175
1796e15175J54776k12679L43568j06855K50795j57379k19796k7599j47673K08120
$$ -515175 -360399 -573078 -229510 -336365 -85570 -242949 -462745 -490344 -638017 -429897
1786d29897P31264k5558l26489n12880J33031J0868P372N26223l26635J15350
$$ -429897 301367 275809 -50680 -563560 -430529 -419661 -412289 113934 -212701 -97351
1776i7351m9000J78268m07163j0067J19363N2660k54394J65252m926K89490q7937
$$ -97351 -146351 31917 -375246 -385313 -265950 -213290 -467684 -302432 -307358 -17868 -105805
1765a05805J10095q30055M86726K39961m9984j98758J88245N06741o47243P50172
$$ -105805 4290 -825765 -339039 -99078 -149062 -347820 -159575 347166 -300077 450095
1755D50095m52525n85601m7481O86487L24097l67430j74399L41969j40298K0788
$$ 450095 -2430 -588031 -635512 50975 375072 7642 -166757 175212 34914 55702
1745E5702l5263j72710j69236r6041j26645N34051k22811P9207L74904l09347
$$ 55702 20439 -152271 -321507 -417548 -544193 -10142 -232953 -153746 221158 -88189
1735h8189n40760R502J26601P33742k03735n0922n5989l43282K52293J58614l4438
$$ -88189 -628949 -619447 -492846 240896 37161 -13761 -69750 -413032 -160739 -2125 -36563
1724c6563J37145k03484P9816j6522j82958j98988O4267L36512J44709K0348m27696
$$ -36563 100582 -102902 -23086 -39608 -222566 -421554 -357287 -20775 123934 144282 -283414
1713b83414K20224m1522J10589K67681j729k24602n39642J9599L47540l08550
$$ -283414 -63190 -104712 5877 273558 271829 47227 -492415 -472816 -125276 -433826
1703d33826K75090K08623N6316j71340K98771m4572l08919l329m95742K47648
$$ -433826 -158736 49887 106203 -65137 233634 189062 -119857 -123186 -618928 -371280
1693c71280K35202L25857L86016p75626N05070l6946k55022M32121o34812l54183
$$ -371280 -136078 189779 575795 -199831 305239 268293 13271 445392 -189420 -543603
1683e43603K49773l9694J03697j1323L0642J99877j38051j01162M68955k71272
$$ -543603 -293830 -333524 -229827 -241150 -210508 -10631 -148682 -249844 219111 -52161
1673e2161J06566j66808l61259R0598k3362k84817J8862J03716j2766K67757R9505
$$ -52161 54405 -112403 -473662 -383064 -406426 -691243 -672381 -568665 -581431 -313674 -214169
1662b14169m697k25941j4274L43090j77980P21511J41654l97604n99860k86598
$$ -214169 -218866 -444807 -459081 -115991 -293971 427540 569194 171590 -428270 -714868
1652g14868K95254K9223J17818r7869L08267j78268J44980j2287k61880m15856
$$ -714868 -419614 -390391 -272573 -370442 -62175 -240443 -95463 -107750 -369630 -785486
1642g85486J51447K27897J95931k91431J38781L05602l68291n9099L22266J99902
$$ -785486 -634039 -406142 -210211 -501642 -362861 -57259 -425550 -484649 -162383 37519
1632C7519R2174J89683o6860m23671k63414P4400J44368j89046J65408j26904
$$ 37519 129693 319376 252516 -171155 -434569 -360169 -215801 -404847 -239439 -366343
1622c66343J13092L20742k08903r645K05729Q4665m1499k19981j8182o3596N0751
$$ -366343 -253251 67491 -141412 -151057 54672 139337 97838 -122143 -140325 -203921 -153170
1611a53170L35482M1337Q974n2878l04049l21507n50219O1121L4596L63053k7373
$$ -153170 182312 223649 232623 179745 -124304 -445811 -996030 -934909 -900313 -537260 -564633
1600e64633O383K68343k7002j00501l803K62584K04007J88764j85075l87170P0690
$$ -564633 -558250 -289907 -316909 -417410 -421213 -158629 45378 234142 49067 -338103 -267413
1589b67413J24850k10989j60215j27304M5606L7272K03767J03264j91785M56869
$$ -267413 -142563 -353552 -513767 -641071 -595465 -558193 -354426 -251162 -442947 13922
1579A3922K09055p8909j13994L33892J15236o91001O6483p23096L49259P4140
$$ 13922 222977 144068 30074 363966 479202 -211799 -145316 -868412 -519153 -445013
1569d45013J16621j05760P8750p4913L19988k68779l02557L32174O25586J76023
$$ -445013 -328392 -434152 -355402 -430315 -110327 -379106 -681663 -349489 276097 452120
1559D52120l08044l95601K12987L7063N8534L1836L59372q8237l06760J15284
$$ 452120 144076 -251525 -38538 -1475 57059 88895 448267 360030 53270 168554
1549A68554j99406o49734k30704J48169j06194P36797M41643J49855p4134l96843
$$ 168554 -30852 -680586 -911290 -763121 -869315 -132518 309125 458980 384846 -11997
1539a1997n23191k19083o3336L66153P2161j94900k89215J19142J18574J248798
$$ -11997 -535188 -754271 -817607 -451454 -379293 -574193 -863408 -744266 -625692 623106
1529F23106n82038m90774k34772J46808J78635K98675j34713M8850l27372k25149
$$ 623106 41068 -449706 -684478 -537670 -359035 -60360 -195073 -146223 -473595 -698744
1519f98744N97512J21734k51516L28352N2199j28903P8566K1231L83088n84488
$$ -698744 -101232 20502 -231014 97338 149537 20634 99200 120431 503519 -80969
1509h0969m44605J66441L42650L34682k93050J89422k06332l94760N70350J29094
$$ -80969 -525574 -359133 -16483 318199 25149 214571 8239 -386521 183829 312923
1499C12923K6579l68036j53917j6552j36409l29014M41637j68823J66581K27431
$$ 312923 339502 -28534 -182451 -199003 -335412 -664426 -222789 -391612 -225031 2400
1489B400N9024J85646n53817J21263J77704p02651k37766L67847p8357K22701
$$ 2400 61424 247070 -306747 -185484 -7780 -710431 -948197 -580350 -658707 -436006
1479d36006L99499j45419J26545j64557J13673k44988j73007O7186m32099L10329
$$ -436006 -36507 -181926 -55381 -219938 -106265 -351253 -524260 -457074 -889173 -578844
1469e78844N43471j38748L89122K40193J07606o3898l65621K83169l98248l32375
$$ -578844 -35373 -174121 215001 455194 562800 498902 133281 416450 18202 -314173
1459c14173M22976l67111l41263J46806J25999l39j56138K69835L85379J46277
$$ -314173 108803 -258308 -599571 -452765 -326766 -327105 -483243 -213408 171971 318248
1449C18248J18488k8404j76105p9224M1158l8546n45742l38461k31680K91500
$$ 318248 436736 408332 232227 153003 194161 155615 -390127 -728588 -960268 -668768
1439f68768K30630K51320J44377l21381j70568l60979M99782O9208J56972k39134
$$ -668768 -438138 -186818 -42441 -363822 -534390 -895369 -395587 -326379 -169407 -408541
1429d08541j97621M2779k84349J02161L4446L73502j62552P8816J70686R2114
$$ -408541 -606162 -563383 -847732 -745571 -711125 -337623 -500175 -421359 -250673 -158559
1419a58559o2353J68504m99877k14076m2997J03048l25325j60007N63426L05339
$$ -158559 -220912 -52408 -552285 -766361 -809358 -706310 -1031635 -1191642 -628216 -322877
1409c22877L2464m9585J45578l10781J9519L12386N13627l17602j56709k36928
$$ -322877 -290413 -339998 -194420 -505201 -485682 -173296 340331 22729 -133980 -370908
1399c70908K27373p7484L35854J60179m76645l68648J4765O16220J70654O3390
$$ -370908 -143535 -221019 114835 275014 -201631 -570279 -555514 60706 231360 294750
1389B94750k91797K02557m05810P6529N60703l72122m59330j3548J80875N5346
$$ 294750 2953 205510 -200300 -123771 436932 64810 -394520 -408068 -227193 -171847
1379a71847K54535j24962l36668j06645J40981J80629k1500n7544j91446K88177
$$ -171847 82688 -42274 -378942 -485587 -344606 -163977 -185477 -243021 -434467 -146290
1369a46290r5602O4874p8913j62800Q4747l75676k76673M05680J12120N8255k50045
$$ -146290 -241892 -177018 -255931 -418731 -333984 -709660 -986333 -580653 -468533 -410278 -660323
1358f60323P9461O40645K93873j23125k40075k17902l002L01328l99042L05971
$$ -660323 -580862 59783 353656 230531 -9544 -227446 -230448 70880 -328162 -22191
1348b2191n96369l01354L04866J07979j70014M5975K94381K53483j44933L56985
$$ -22191 -618560 -919914 -615048 -507069 -677083 -631108 -336727 -83244 -228177 128808
1338A28808K16517n4666n97401L658j57277l53297N9764L66370n4150k92612J06971
$$ 128808 345325 290659 -306742 -303084 -460361 -813658 -753894 -387524 -441674 -734286 -627315
1327f27315K41202O77641l80446l18134j79262M6023L01495L80187J01950j13287
$$ -627315 -386113 291528 -88918 -407052 -586314 -540291 -238796 141391 243341 130054
1317A30054m86046M47014p6008k69191k15638K16057Q2526J33881j62160j09696
$$ 130054 -355992 91022 15014 -254177 -469815 -253758 -171232 -37351 -199511 -309207
1307c09207j50768M32527M07675l31035L9481j38019k8534M31766O8613k79739
$$ -309207 -459975 -27448 380227 49192 88673 -49346 -77880 353886 422499 142760
1297A42760j83197J8262Q8969k16766k79235K0167q1601J05652J37618l00797
$$ 142760 -40437 -22175 66794 -149972 -429207 -409040 -490641 -384989 -247371 -548168
1287e48168J05435O10196L16704m7346n77124j2957m960j1094j6082k98641l85302
$$ -548168 -442733 167463 484167 436821 -140303 -153260 -158220 -169314 -185396 -484037 -869339
1276h69339K67608N45671L01290K80922L4462l31787p54130j06705j9738N30434
$$ -869339 -601731 -56060 245230 526152 560614 228827 -525303 -632008 -651746 -121312
1266a21312K33000J61545n494P497K98550J84348m25230k82018k56496K74834
$$ -121312 111688 273233 267739 275236 573786 758134 332904 50886 -205610 69224
1256F9224K72815N44782N3203j63317m05758o7582l67509L6342M47168J65554
$$ 69224 342039 886821 940024 776707 370949 303367 -64142 -27800 419368 584922
1246E84922k55587l70694m3343N04703l4090N4061L0334k95399N8894j29847k00166
$$ 584922 329335 -41359 -84702 420001 385911 439972 470306 174907 233801 103954 -96212
1235i6212n36442J33195M77341j12598j41296M3542j00470J91681K25858q2547
$$ -96212 -632654 -499459 -22118 -134716 -276012 -232470 -332940 -141259 84599 2052
1225B052r63529J45905N18016L35432J41671L22896R1465L08380n24690m40518
$$ 2052 -961477 -815572 -297556 37876 179547 502443 593908 902288 377598 -62920
1215f2920k73500j6178L20387P8278k11658N9547M29202o503m34297m35098N119
$$ -62920 -336420 -352598 -32211 46067 -165591 -106044 323158 316655 -117642 -552740 -547621
1204e47621N27215N88213m28982p06137j78751L00530K52442Q4919j15979N9196
$$ -547621 -20406 567807 138825 -567312 -746063 -445533 -193091 -108172 -224151 -164955
1194a64955k45695N06164Q94338m19058K12493n89767j001605l55943q32Q78930
$$ -164955 -410650 95514 989852 570794 783287 193520 -808085 -1164028 -1164860 -285930
1184b85930J21440K4610k27342j79734K04171M05817K67674N6947k69650j70547
$$ -285930 -164490 -139880 -367222 -546956 -342785 63032 330706 387653 118003 -52544
1174e2544j19011K77385l44441J1174n04195k19961L07857J3394O30907K00444
$$ -52544 -171555 105830 -238611 -227437 -731632 -951593 -643736 -630342 565 201009
1164B01009J3924m61437J53009R1027j65799k25165L4541k67307K65168L96559
$$ 201009 214933 -246504 -93495 -2468 -168267 -393432 -358891 -626198 -361030 35529
1154C5529J73918l1788J5706M19781o37436R6049r6666o54448K65503J77903L19040
$$ 35529 209447 177659 193365 613146 -24290 71759 -24907 -679355 -413852 -235949 83091
1143H3091R0266j20133o7324r6071K77162K22818j33195m38692m62089K9225K75829
$$ 83091 173357 53224 -14100 -110171 166991 389809 256614 -182078 -644167 -614942 -339113
1132c39113J29685Q7976l01721L68949l52590M99567p3438j9949P8065q4852P9654
$$ -339113 -209428 -121452 -423173 -54224 -406814 92753 19315 -634 77431 -7421 72233
1121G2233m47404M28593M788j18839l35078j54850N10546L88155q1968R5943n10518
$$ 72233 -375171 53422 58210 -60629 -395707 -550557 -40011 348144 266176 362119 -148399
1110a48399n8542J3666M33620L86015l12977m5797l62164j93155J58962m58083
$$ -148399 -206941 -193275 240345 626360 313383 267586 -94578 -287733 -128771 -586854
1100e86854r3120j86948L28770L97002L06117J91757j00559k56231N7003o48334
$$ -586854 -679974 -866922 -538152 -141150 164967 356724 256165 -66 56937 -591397
1090e91397l36049N70587J98058j08351K08811K9098j20586k84518k81145K61869
$$ -591397 -927446 -356859 -158801 -267152 -58341 -29243 -149829 -434347 -715492 -453623
1080d53623K35672L77537J64275m9672k1141k49786L19488K02010m07764R0028
$$ -453623 -217951 159586 323861 274189 253048 3262 322750 524760 116996 207024
1070B07024j82369k61767k29366L00875J91923m7821j73269K3800m2283N11232
$$ 207024 24655 -237112 -466478 -165603 26320 -21501 -194770 -170970 -213253 297979
1060B97979j21669L03949j20447l54888n19288L45587j87357j56286j87706M0274
$$ 297979 176310 480259 359812 4924 -514364 -168777 -356134 -512420 -700126 -659852
1050f59852K69847L52897R01998L0210m25912n52537k96152l48485K11348L97586
$$ -659852 -390005 -37108 864890 895100 469188 -83349 -379501 -727986 -516638 -119052
1040a19052J004931o71822q3157m43383M4611M46762k22270o0263J61287N87975
$$ -119052 885879 214057 130900 -312483 -267872 178890 -43380 -103643 57644 645619
1030F45619J54113k75576k68678j56551K32339O7268l37386l01816O0411J06309
$$ 645619 799732 524156 255478 98927 331266 398534 61148 -240668 -180257 -73948
1020g3948L19812l82632o34085J99099K06247q1774q0029j34452K58489J16410
$$ -73948 245864 -136768 -770853 -571754 -365507 -447281 -527310 -661762 -403273 -286863
1010b86863J0035j52509r9494J18340M26125j88210l25767l54652o3314P22311
$$ -286863 -276828 -429337 -528831 -410491 15634 -172576 -498343 -852995 -916309 -193998
1000a93998Q0268J00610l99857k0445K67124o8223L7148M23219k29286q6319l12112
$$ -193998 -113730 -13120 -412977 -433422 -166298 -234521 -197373 225846 -3440 -89759 -401871
989d01871O8081l57437K33084R64049j23057o98060m8303k24693N07213l75020
$$ -401871 -333790 -691227 -458143 505906 382849 -315211 -363514 -588207 -80994 -456014
979d56014L83264n6843k9150j10539Q2665l00178M8536M74246j51308L38378l63722
$$ -456014 -72750 -129593 -158743 -269282 -186617 -486795 -438259 35987 -115321 223057 -140665
968a40665N05676k89513r9121k54772K81475K17947K93627r9796K96715l9215
$$ -140665 365011 75498 -23623 -278395 3080 221027 514654 414858 711573 672358
958F72358j49055Q791m86648k07566K76426o9319m209J03486L91002k79106k40870
$$ 672358 523303 532094 45446 -162120 114306 44987 40778 144264 535266 256160 15290
947A5290J45452j15747P2232J46825n58614K19346K17833M0737L54895P3483l51531
$$ 15290 160742 44995 117227 264052 -294562 -75216 142617 183354 538249 611732 260201
936B60201j48186k85470j1178K32768L98983M72018L34209l88765p49135L35903
$$ 260201 112015 -173455 -184633 48135 447118 919136 1253345 864580 115445 451348
926D51348m56508L72135k06537N79878m93302K09650j57027k9936Q6222j96273
$$ 451348 -5160 366975 160438 740316 247014 456664 299637 269701 355923 159650
916A59650k0921K3488O4070Q4782j23840r3239K30840P3291j21093l52238k17243
$$ 159650 138729 162217 226287 311069 187229 93990 324830 398121 277028 -75210 -292453
905b92453K7911l34524J24922J9274P1360N37705J14272K34335p76996M05269
$$ -292453 -264542 -599066 -474144 -454870 -383510 154195 268467 502802 -274194 131075
895A31075k20579L13865j41903r0114k58750N37803m90187m37550K69753M33107
$$ 131075 -89504 224361 82458 -7656 -266406 271397 -218790 -656340 -386587 46520
885D6520r9323L08403l5265l27584n44212N27727L36323o9450k51412J74456J5393
$$ 46520 -52803 255600 220335 -107249 -651461 -123734 212589 143139 -108273 66183 81576
874H1576m4036K75612L78062K96183n25323l15599j19986L60149n06805n5887
$$ 81576 37540 313152 691214 987397 462074 146475 26489 386638 -120167 -176054
864a76054q0238P4631k43078M33601L97950J92110o04032M97932o6258k21941
$$ -176054 -256292 -181661 -424739 8862 406812 598922 -5110 492822 426564 204623
854B04623l7490J23428n30759o17157O5329P03117j01200L7776r3234R7297k31616
$$ 204623 167133 290561 -240198 -857355 -792026 -88909 -190109 -152333 -245567 -148270 -379886
843c79886J69346k13304P6105j7357L25615J25563n15608j07724K1166J86430
$$ -379886 -210540 -423844 -347739 -365096 -39481 86082 -429526 -537250 -516084 -329654
833c29654J8066P68575J53027R1629J02613L9616o77107k4569J36120n38790K623
$$ -329654 -311588 456987 610014 701643 804256 843872 166765 142196 278316 -260474 -257851
822b57851K26102J30482j21927o9043L78622l35408J95062r7236l3228J31955
$$ -257851 -31749 98733 -23194 -92237 286385 -49023 146039 48803 15575 147530
812A47530L78242j66559k65511j06901K78046k48897l26056L06866K60610j29349
$$ 147530 525772 359213 93702 -13199 264847 15950 -310106 -3240 257370 128021
802A28021N17750J29284k98082j45866l85992q9367j66884O25871O4047l61319
$$ 128021 645771 775055 476973 331107 -54885 -144252 -311136 314735 378782 17463
792A7463L16783n38273M6590K65042p5721J52602n6125j49173j54315L7107M54602
$$ 17463 334246 -204027 -157437 107605 31884 184486 128361 -20812 -175127 -138020 316582
781C16582K83803l02515l93383j48036J51845l8056K87105N1162r3150q8554J88126
$$ 316582 600385 297870 -95513 -243549 -91704 -129760 157345 208507 115357 26803 214929
770B14929n70634L31309K88688q627L64890j89992R9215m92633j42396K71705
$$ 214929 -355705 -24396 264292 255665 620555 430563 529778 37145 -105251 166454
760A66454j0118L51043J52661j21102n4668k64663R784K26055k9796J30717R0036
$$ 166454 156336 507379 660040 538938 484270 219607 229391 455446 425650 556367 646403
749F46403m35095j18382L38876L8279m25122j53472m61849J17742K08112L15275
$$ 646403 211308 92926 431802 470081 44959 -108513 -570362 -452620 -244508 70767
739G0767k65594k50193k29677J67467M10546k22204L46775L3716l73975J80007
$$ 70767 -194827 -445020 -674697 -507230 -96684 -318888 27887 61603 -312372 -132365
729a32365j79395J35860J93313j91289J80848k71546J13942Q3920N46500J40279
$$ -132365 -311760 -175900 17413 -173876 6972 -264574 -150632 -66712 479788 620067
719F20067j54681j91764k37560k6668J79045j34396p4624j65243o9745J75635
$$ 620067 465386 273622 36062 9394 188439 54043 -20581 -185824 -255569 -79934
709g9934q2776j06689J47025R4671L80832O2104l07759K53146J60965o72753O957
$$ -79934 -162710 -269399 -122374 -27703 353129 415233 107474 360620 521585 -151168 -144211
698a44211K07351L75098k7027l91698l10194j98470M20433L73137j96859j44137
$$ -144211 63140 438238 411211 19513 -290681 -489151 -68718 304419 107560 -36577
688c6577K23152J74759J73956R9595J06534l57621l56234J49674l47547J33573
$$ -36577 186575 361334 535290 634885 741419 383798 27564 177238 -170309 -36736
678c6736K85454J64277n2151J84952K28823j44953J5948k14049m5917l49570J00956
$$ -36736 248718 412995 360844 545796 774619 629666 645614 431565 385648 36078 137034
667A37034m8890K61931j43485j5975k97834q9796j7493O8610j36769j53272M19340
$$ 137034 88144 350075 206590 190615 -107219 -197015 -214508 -145898 -282667 -435939 -16599
656a6599K25597N51998m44470j16228k89252J40176L25805r7258J65594q5424
$$ -16599 208998 760996 316526 200298 -88954 51222 377027 279769 445363 359939
646C59939j40732K3385Q200j98065M30378J88075J50540n38940l72646J58381
$$ 359939 219207 242592 250792 52727 483105 671180 821720 282780 -89866 68515
636F8515O11773j53090j11053o75849J04166L06680K40585J63821m76548l37762
$$ 68515 680288 527198 416145 -259704 -155538 151142 391727 555548 79000 -258762
626b58762J38057N38248k93875K06685N9321r0520m78786l78294J80176K50360
$$ -258762 -120705 417543 123668 330353 389674 299154 -179632 -557926 -377750 -127390
616a27390J05983k63339o273j4235K7882L66607k22797M6329l88706p892K13655
$$ -127390 -21407 -284746 -291019 -305254 -277372 89235 -133562 -87233 -475939 -483831 -270176
605b70176j23010M98699j01091k33396M98372m97985n5125Q2928P6375K75999
$$ -270176 -393186 105513 4422 -228974 269398 -228587 -283712 -200784 -124409 151590
595A51590j6540J00979J4592k37592n23596J76519K66903O58680q8924j4850m4488
$$ 151590 135050 236029 250621 13029 -510567 -334048 -67145 591535 502611 487761 443273
584D43273j27291m2360L35500k83063m45285M4319M73122L30563m99395J20990
$$ 443273 315982 273622 609122 326059 -119226 -74907 398215 728778 229383 350373
574C50373L65925p9805m27291R5486N21591O3082j40430l02799p18246Q10203
$$ 350373 716298 636493 209202 304688 826279 889361 748931 446132 -272114 538089
564E38089l70591N9506J73542n72999J37356M72352L22098k68583n40731l26959
$$ 538089 167498 227004 400546 -172453 -35097 437255 759353 490770 -49961 -376920
554c76920K5796j54599J58793L20784K18438o8070k6217L40141O4027j57017l87337
$$ -376920 -351124 -505723 -346930 -26146 192292 124222 98005 438146 502173 345156 -42181
543d2181L6007j12164m2L20772O14624p11510p96490l08315J28195N45421K88980
$$ -42181 -6174 -118338 -118380 202392 817016 105506 -690984 -999299 -871104 -325683 -36703
532c6703P83589p8445o97202j64501R2385j0418N66051m80385K23742M40278m14385
$$ -36703 746886 668441 -28761 -193262 -100877 -111295 454756 -25629 198113 638391 224006
521B24006k00072J4969L31024l19055J21180P3002j78333j33185K40927K33122
$$ 224006 23934 38903 369927 50872 172052 245054 66721 -66464 174463 407585
511D07585j77559j865L05343L45446k62104m15492J36406K63769K31483p7735
$$ 407585 230026 228161 533504 878950 616846 201354 337760 601529 833012 755277
501G55277l72363k06134L02886k8833r3532O2963m3900J52287M0845n4356r97498
$$ 755277 382914 176780 479666 450833 357301 420264 376364 528651 569496 515140 -482358
490d82358J52259N65187O86336l9260N6881l99363m04577j17116J64563K64799
$$ -482358 -330099 235088 921424 882164 939045 539682 135105 17989 182552 447351
480D47351o0539k9761j93266k77166k04972L52554O03587K29293j75604j75676
$$ 447351 386812 357051 163785 -113381 -318353 34201 637788 867081 691477 515801
470E15801j16986j03304l5699j13106j63096k0008M5020L33561K11803m7479m4819
$$ 515801 398815 295511 259812 146706 -16390 -36398 8622 342183 553986 506507 461688
459D61688l39029k07101j02209K35363Q3259m48179M6649J98195O27671J83361
$$ 461688 122659 -84442 -186651 48712 131971 -316208 -269559 -71364 556307 739668
449G39668j39497n40494k02427L7438J32573k95141j40157N95207L74846k57326
$$ 739668 600171 59677 -142750 -105312 27261 -267880 -408037 187170 562016 304690
439C04690j1955k34041j0271j57378l24286j26580N77996Q78372l81193J14711
$$ 304690 292735 58694 48423 -108955 -433241 -559821 18175 896547 515354 630065
429F30065j044297M6859O19797l696j07706j19922j39052K04186R2790j2751K50346
$$ 630065 -414232 -367373 252424 248728 141022 21100 -117952 86234 179024 166273 416619
418D16619m90392Q2533J89401m89581L66557L06501l55769M80002j26770r5181
$$ 416619 -73773 8760 198161 -291420 75137 381638 25869 505871 379101 283920
408B83920p3815M47101J50181m24208n0322L40108j57105J62270J61282m82524
$$ 283920 210105 657206 807387 383179 332857 672965 515860 678130 839412 356888
398C56888j52863p6960R8118j12495m5360o9976K90450K00747k44621n2841K55114
$$ 356888 204025 127065 225183 112688 67328 -2648 287802 488549 243928 191087 446201
387D46201J14436k67003K45820M9984m19235j60088l9892m8138K90560K69731
$$ 446201 560637 293634 539454 589438 170203 10115 -29777 -77915 212645 482376
377D82376J53879l17014j38593J62139k30057J54368p9596K65852o73814L98950
$$ 482376 636255 319241 180648 342787 112730 267098 187502 453354 -220460 178490
367A78490N56711o35386K76646Q0687Q7590j82118l24908L23099q9097m4795M99692
$$ 178490 735201 99815 376461 457148 544738 362620 37712 360811 271714 226919 726611
356G26611j58095m89402R708Q7039r6766P7115L26994P29463J66515k16818o05314
$$ 726611 568516 79114 88822 175861 79095 156210 483204 1212667 1379182 1162364 557050
345E57050r3630N0411K90020o36406L35479L3779o6698j90205r3809r9415j51319
$$ 557050 463420 513831 803851 167445 502924 536703 470005 279800 185991 86576 -64743
334f4743L61774J25666k50568J72603L53068M8639l8523m91425J64917k49447
$$ -64743 297031 422697 172129 344732 697800 746439 707916 216491 381408 131961
324A31961M05135R6698k35105k14799P1916r8054J87884n1698R9520K79215J47943
$$ 131961 537096 633794 398689 183890 255806 157752 345636 293938 393458 672673 820616
313H20616l35778j38365m77950K39906P67449j64019k18223k88451J76795J90870
$$ 820616 484838 346473 -131477 108429 875878 711859 493636 205185 381980 572850
$$ [...]
##END NTUPLES=NMR SPECTRUM
##END=
