##TITLE=1H_TG-2404
 200.13Hz, CDCl3.
 8 sc
 
 20.4.2026
##JCAMPDX= 6.0         $$ Bruker NMR JCAMP-DX V2.0
##DATA TYPE= NMR SPECTRUM
##DATA CLASS= NTUPLES
##ORIGIN= UXNMR, Bruker Analytische Messtechnik GmbH
##OWNER= pz
$$ XWIN-NMR		Version 3.5
$$ Mon Apr 20 15:31:16 2026 Russian Standard Time (UT+4h)  she@DPX200
##.OBSERVE FREQUENCY= 200.1313
##.OBSERVE NUCLEUS= ^1H
##.ACQUISITION MODE= SIMULTANEOUS
##.ACQUISITION SCHEME= undefined
##.AVERAGES= 8
##.DIGITISER RES= 18
##SPECTROMETER/DATA SYSTEM= spect
##.PULSE SEQUENCE= zg30
##.SOLVENT NAME= CDCl3
##.SHIFT REFERENCE= (INTERNAL, CDCl3, 0, 15.4483)
##AUDIT TRAIL= $$ (NUMBER, WHEN, WHO, WHERE, WHAT)
$$ ##TITLE= Audit trail, XWIN-NMR		Version 3.5
$$ ##JCAMPDX= 5.01
$$ ##ORIGIN= Bruker BioSpin GmbH
$$ ##OWNER= she
$$ F:/spectra/data/she/nmr/H-C/1/pdata/1/auditp.txt
$$ ##AUDIT TRAIL=  $$ (NUMBER, WHEN, WHO, WHERE, WHAT)
(   1,<2026-04-20 15:29:48.43 +0400>,<she>,<DPX200>,
      <created by zg, POWCHK disabled, PULCHK disabled
       configuration hash MD5:
       00 E9 B6 7A A2 85 ED C7 34 08 36 98 17 FE 4E 26
       data hash MD5: 16K
       CB 03 4B A8 4C 19 9C 17 7D 90 C3 9E F9 2E A3 5F>)
(   2,<2026-04-20 15:29:51.21 +0400>,<she>,<DPX200>,
      <Start of raw data processing
       efp BC_mod = 2 LB = 0.25 FT_mod = 6 PKNL = 1 PHC0 = -3703.784 PHC1 = 7.792286 SI = 16K 
       data hash MD5: 16K
       E1 24 2F 13 A6 B0 02 0F FB 4A A3 1F 7C F2 9A E8>)
(   3,<2026-04-20 15:30:20.54 +0400>,<she>,<DPX200>,
      <pk PHC0 = -2.467488 PHC1 = 4.2 
       data hash MD5: 16K
       08 F9 6C A0 2F 9D 52 57 8F 0C 3A E2 29 1A 79 55>)
(   4,<2026-04-20 15:30:24.29 +0400>,<she>,<DPX200>,
      <abs ABSG = 5 
       data hash MD5: 16K
       3B CE D7 B9 55 57 73 25 DC D6 34 56 2E FF FD 91>)
$$ ##END=
$$ 
$$ hash MD5
$$ 37 7A 75 3E DC 84 07 30 8B F7 64 C3 7C 33 4F 74
##$RELAX= 
##$RELAX= 
##$RELAX= 
##$RELAX= 
##$RELAX= 
##$RELAX= 
$$ Bruker specific parameters
$$ --------------------------
##$DU= <F:/spectra>
##$EXPNO= 1
##$NAME= <H-C>
##$PROCNO= 1
##$TYPE= <nmr>
##$USER= <she>
##$AMP= (0..31)
100 100 100 100 100 100 100 100 100 100 100 100 100 100 100 100 100 100 
100 100 100 100 100 100 100 100 100 100 100 100 100 100 
##$AQSEQ= 0
##$AQ_mod= 1
##$AUNM= <au_zg>
##$AUTOPOS= <>
##$BF1= 200.13
##$BF2= 200.13
##$BF3= 200.13
##$BF4= 200.13
##$BF5= 200.13
##$BF6= 200.13
##$BF7= 200.13
##$BF8= 200.13
##$BYTORDA= 1
##$CFDGTYP= 0
##$CFRGTYP= 5
##$CHEMSTR= <none>
##$CNST= (0..31)
1 1 145 1 1 1 1 1 1 1 1 1 1 1 1 1 1 1 1 1 1 1 1 1 1 1 1 1 1 1 1 1 
##$CPDPRG= <>
##$CPDPRG1= <>
##$CPDPRG2= <>
##$CPDPRG3= <>
##$CPDPRG4= <mlev>
##$CPDPRG5= <mlev>
##$CPDPRG6= <mlev>
##$CPDPRG7= <mlev>
##$CPDPRG8= <mlev>
##$CPDPRGB= <>
##$CPDPRGT= <>
##$D= (0..31)
0 0.7 0 0 0 0 0 0 0 0 0 0.03 0 0 0 0 0 0 0 0 0 0 0 0 0 0 0 0 0 0 0 0 
##$DATE= 1776684587
##$DBL= (0..7)
120 120 120 120 120 120 120 120 
##$DBP= (0..7)
150 150 150 150 150 150 150 150 
##$DBP07= 0
##$DBPNAM0= <>
##$DBPNAM1= <>
##$DBPNAM2= <>
##$DBPNAM3= <>
##$DBPNAM4= <>
##$DBPNAM5= <>
$$ [...]
##$SUBNAM3= <"">
##$SUBNAM4= <"">
##$SUBNAM5= <"">
##$SUBNAM6= <"">
##$SUBNAM7= <"">
##$SUBNAM8= <"">
##$SUBNAM9= <"">
##$SW= 18.0517328524113
##$SWIBOX= (0..15)
0 0 2 0 0 0 0 0 0 0 0 0 0 0 0 0 
##$SW_h= 3612.71676300578
##$TD= 16384
##$TD0= 1
##$TE= 0
##$TE2= 300
##$TE3= 300
##$TEG= 300
##$TL= (0..7)
0 120 120 120 120 120 120 120 
##$TP= (0..7)
150 150 150 150 150 150 150 150 
##$TP07= 0
##$TPNAME0= <>
##$TPNAME1= <>
##$TPNAME2= <>
##$TPNAME3= <>
##$TPNAME4= <>
##$TPNAME5= <>
##$TPNAME6= <>
##$TPNAME7= <>
##$TPOAL= (0..7)
0.5 0.5 0.5 0.5 0.5 0.5 0.5 0.5 
##$TPOFFS= (0..7)
0 0 0 0 0 0 0 0 
##$TUNHIN= 0
##$TUNHOUT= 0
##$TUNXOUT= 0
##$USERA1= <user>
##$USERA2= <user>
##$USERA3= <user>
##$USERA4= <user>
##$USERA5= <user>
##$V9= 5
##$VALIST= <valist>
##$VCLIST= <CCCCCCCCCCCCCCC>
##$VD= 0
##$VDLIST= <DDDDDDDDDDDDDDD>
##$VPLIST= <PPPPPPPPPPPPPPP>
##$VTLIST= <TTTTTTTTTTTTTTT>
##$WBST= 1024
##$WBSW= 4
##$XGAIN= (0..3)
0 0 0 0 
##$XL= 0
##$YL= 0
##$YMAX_a= 924785
##$YMIN_a= -1064833
##$ZGOPTNS= <>
##$ZL1= 120
##$ZL2= 120
##$ZL3= 120
##$ZL4= 120
##$ABSF1= 15.47034
##$ABSF2= -2.58151
##$ABSG= 5
##$ABSL= 3
##$ALPHA= 0
##$AQORDER= 0
##$ASSFAC= 0
##$ASSFACI= 0
##$ASSFACX= 0
##$ASSWID= 0
##$AUNMP= <proc_1d>
##$AZFE= 0.1
##$AZFW= 0.1
##$BCFW= 0
##$BC_mod= 2
##$BYTORDP= 0
##$COROFFS= 0
##$CY= -3
##$DATMOD= 1
##$DC= 0
##$DFILT= <>
##$DTYPP= 0
##$F1P= 0
##$F2P= 0
##$FCOR= 1
##$FTSIZE= 16384
##$FT_mod= 6
##$GAMMA= 0
##$GB= 0
##$INTBC= 1
##$INTSCL= 3.241238e-09
##$ISEN= 128
##$LB= 0.25
##$LEV0= 0
##$LPBIN= 0
##$MAXI= 10000
##$MC2= 0
##$MEAN= 0
##$ME_mod= 0
##$MI= 1.114404
##$NCOEF= 0
##$NC_proc= -4
##$NLEV= 6
##$NOISF1= 3.799351
##$NOISF2= 2.8
##$NSP= 0
##$NTH_PI= 0
##$NZP= 0
##$OFFSET= 15.4483
##$PC= 1
##$PHC0= -3706.251
##$PHC1= 11.99229
##$PH_mod= 1
##$PKNL= yes
##$PPARMOD= 0
##$PSCAL= 0
##$PSIGN= 0
##$REVERSE= no
##$SF= 200.130014689294
##$SI= 16384
##$SIGF1= 3
##$SIGF2= 2
##$SINO= 0.751879
##$SIOLD= 32768
##$SREGLST= <19F.Aceton>
##$SSB= 0
##$STSI= 16384
##$STSR= 0
##$SW_p= 3612.71676300578
##$SYMM= 0
##$S_DEV= 0
##$TDeff= 16384
##$TDoff= 0
##$TI= <>
##$TILT= no
##$TM1= 0
##$TM2= 0
##$TOPLEV= 0
##$USERP1= <user>
##$USERP2= <user>
##$USERP3= <user>
##$USERP4= <user>
##$USERP5= <user>
##$WDW= 1
##$XDIM= 16384
##$YMAX_p= 276579144
##$YMIN_p= -279103
$$ End of Bruker specific parameters
$$ ---------------------------------
##NTUPLES= NMR SPECTRUM
##VAR_NAME=  FREQUENCY,     SPECTRUM/REAL,   SPECTRUM/IMAG
##SYMBOL=    X,             R,               I
##VAR_TYPE=  INDEPENDENT,   DEPENDENT,       DEPENDENT
##VAR_FORM=  AFFN,          ASDF,            ASDF
##VAR_DIM=   16384,         16384,           16384
##UNITS=     HZ,            ARBITRARY UNITS, ARBITRARY UNITS
##FACTOR=    0.220516191357247, 1,           1
##FIRST=     3091.6685782983, 0,             0
##LAST=      -521.048184707482, 0,           0
##MIN=       -521.048184707482, -279103,     0
##MAX=       3091.6685782983, 276579144,     0
$$ Real data points
##PAGE= N=1
##DATA TABLE= (X++(R..R)), XYDATA
$$ [...]
6066F784161l79797k30599j98230j71437j11850j40038p086m1225j11141j01146
$$ 6784161 6404364 6173765 5975535 5804098 5692248 5552210 5545124 5503899 5392758 5291612
6056E291612P919k3232q0656o6761p1756N9638o3590m433J4314J007N0398j123
$$ 5291612 5299531 5276299 5195643 5128882 5057126 5116764 5053174 5048741 5063055 5064062 5114460 5113337
6044E113337O2125J50716J48826O8585J38452R9793J79616N5779J81607Q2561
$$ 5113337 5175462 5326178 5475004 5543589 5682041 5781834 5961450 6017229 6198836 6281397
6034F281397o1010J01088j14909j56433j98579j38658j79151r6989j90426j00088
$$ 6281397 6220387 6321475 6206566 6050133 5851554 5712896 5533745 5436756 5246330 5146242
6024E146242q3553O8744o5889k7992J67457N2312J36037J04999J43381Q8315M8100
$$ 5146242 5062689 5131433 5065544 5037552 5205009 5257321 5393358 5498357 5641738 5730053 5778153
6013E778153Q8814j52070j50218j75251j85037l30310l11043l43179k14481k56746
$$ 5778153 5866967 5714897 5564679 5389428 5204391 4874081 4563038 4219859 4005378 3748632
6003C748632j88578k21235j95355j39571j27234r5326j35143K7918n9502r6681
$$ 3748632 3560054 3338819 3143464 3003893 2876659 2781333 2646190 2674108 2614606 2517925
5993B517925j9337j7899M4142R395p9450k2531q6932J6624l1064n8294q492R9870
$$ 2517925 2498588 2480689 2524831 2534226 2454776 2432245 2345313 2361937 2330873 2272579 2264087 2363957
5981B363957j6221k7354L1076P291l422j2633L1028O189N774M7325M0581K4947
$$ 2363957 2347736 2320382 2351458 2358749 2355327 2342694 2373722 2379911 2385685 2433010 2473591 2498538
5969B498538J25959J9878J7178Q5013n3024N0121M4602R0226N9309R1635J19272
$$ 2498538 2624497 2644375 2661553 2746566 2693542 2743663 2788265 2878491 2937800 3029435 3148707
5958C148707J54061N3369P7329P8062J09149N2507J53457J05782K09062N5744
$$ 3148707 3302768 3356137 3433466 3511528 3620677 3673184 3826641 3932423 4141485 4197229
5948D197229P3455M9119J33581j1059J16836P9929Q2453K00726J29085K26463
$$ 4197229 4270684 4319803 4453384 4442325 4559161 4639090 4721543 4922269 5051354 5277817
5938E277817J22661K23463K05118K83781K36835J68532K17257K63195J29287J92685
$$ 5277817 5400478 5623941 5829059 6112840 6349675 6518207 6735464 6998659 7127946 7320631
5928G320631L09281L01407K63083J41363L09934K01864J43590J33008N7152Q8323
$$ 7320631 7629912 7931319 8194402 8335765 8645699 8847563 8991153 9124161 9181313 9269636
5918I269636J50822K45404J01399K48713K55355L03067K98676K76543K33302K14936
$$ 9269636 9420458 9665862 9767261 10015974 10271329 10574396 10873072 11149615 11382917 11597853
5908A1597853K76517J87893J66371J80259L21078K19792J74194K38916J69986
$$ 11597853 11874370 12062263 12228634 12408893 12729971 12949763 13123957 13362873 13532859
5899A3532859J73783L6319J10078L5435M5098j6076J17143L8565R0890R6206K27795
$$ 13532859 13706642 13742961 13853039 13888474 13933572 13917496 14034639 14073204 14164094 14260300 14488095
5888A4488095J84280J06516J60006J42340q748l8499M4844k3372j4514n7165j00767
$$ 14488095 14672375 14778891 14938897 15081237 15072489 15033990 15078834 15055462 15040948 14983783 14883016
5877A4883016j33098j48012j56583j69305j46135j06545j08431j49478n8787j65549
$$ 14883016 14749918 14601906 14445323 14276018 14129883 14023338 13914907 13765429 13706642 13541093
5867A3541093q2551j59263q1311j04124j33153j66605j99334l05616m16785l28766
$$ 13541093 13458542 13299279 13217968 13113844 12980691 12814086 12614752 12309136 11892351 11563585
5857A1563585l35397l22779l57771k65266l57197l13420k40226k06333j23873
$$ 11563585 11228188 10905409 10547638 10282372 9925175 9611755 9371529 9165196 9041323
5848I041323j03378q9776p2016j47628o4255j22133j35108j78691k97374l68657
$$ 9041323 8937945 8848169 8776153 8628525 8564270 8442137 8307029 8128338 7830964 7462307
5838G462307k64381m36178m80854l24308k97663l54725l66150k47895k53122k69630
$$ 7462307 7197926 6761748 6280894 5956586 5658923 5304198 4938048 4690153 4437031 4167401
5828D167401k14034j53830j14404m3610r5103o0218l7492r1476o925n4963j47417
$$ 4167401 3953367 3799537 3685133 3641523 3546420 3486202 3448710 3357234 3350309 3295346 3147929
5817C147929N906p4344j69442j50458j65880j77725p9376j13840j10401q2498
$$ 3147929 3153835 3079491 2910049 2759591 2593711 2415986 2336610 2222770 2112369 2029871
5807B029871q4076j8944j76211j19806l8061p496k6257K0062q2138n0798m8704
$$ 2029871 1945795 1926851 1750640 1630834 1592773 1585277 1559020 1579082 1496944 1446146 1397442
5796A397442p1012n2274L1362N25l7755J2270j2131j04468l9078M2020J4120k3082
$$ 1397442 1326430 1274156 1305518 1306043 1268288 1280558 1268427 1163959 1124881 1166901 1181021 1157939
5784A157939N2851m0712L0986J974k4643k1560k906L9371J4725l7052n0840j3421
$$ 1157939 1210790 1170078 1201064 1203038 1178395 1156835 1153929 1193300 1208025 1170973 1120133 1106712
5772A106712J4510m8282k002M2422p838k7855k2645K3319l3038o330N687j2351
$$ 1106712 1121222 1072940 1070938 1113360 1105522 1077667 1055022 1078341 1045303 1038973 1044660 1032309
5760A032309Q291P742l1582m325K0390j9950o3306l158N5272m3083j4505R4928
$$ 1032309 1040600 1048342 1016760 1012435 1032825 1012875 949569 946411 1001683 958600 944095 1039023
5748A039023l0738l8676l5975P7553n3879M663M3208p1858k059j0823o4375J2789
$$ 1039023 1008285 969609 933634 1011187 957308 961971 1005179 933321 931262 920439 856064 868853
5736H68853Q4896p816j0231J8596k2603q4194o063N2862J4665k1146l4376J36786
$$ 868853 953749 945933 935702 954298 931695 847501 841438 894300 908965 887819 853443 990229
5724I90229r2284m0437r013j0943J03946o3398l4772k11J17222n2191l7836k1483
$$ 990229 897945 857508 848495 837552 941498 878100 843328 843117 960339 908148 870312 848829
5712H48829R4483n4335J0244L3643m3093j9604n0822R6076n2847R772o86M6134
$$ 848829 943312 888977 899221 932864 889771 870167 819345 915421 862574 872346 871660 917794
5700I17794m5571k6231J9624n9748M6009M6506k8847P2786K9441p5588j1408K4588
$$ 917794 872223 845992 865616 805868 851877 898383 869536 942322 971763 896175 884767 909355
5688I09355n0200m0679M7783Q6092p7835L3734L0672p4633N1745p3022L0320R4096
$$ 909355 859155 818476 866259 952351 874516 908250 938922 864289 916034 843012 873332 967428
5676I67428j4508l7286Q8755L2696L8312m7864m7553J18933L2054k4296j6271
$$ 967428 952920 915634 1004389 1037085 1075397 1027533 979980 1098913 1130967 1106671 1090400
5665A090400j3851Q881J9398k8090L1329J07562M3638n9689k8406k826l9702o716
$$ 1090400 1076549 1085430 1104828 1076738 1108067 1215629 1259267 1199578 1171172 1168346 1128644 1121928
5653A121928N7433o3904L0181J07218n3949k2780M5438j00325l148N3989N2012
$$ 1121928 1179361 1115457 1145638 1252856 1198907 1176127 1221565 1121240 1118092 1172081 1224093
5642A224093M8274K7986p5221J06807m3366Q710M221j1972p651R3985Q736J1031
$$ 1224093 1272367 1300353 1225132 1331939 1288573 1297283 1301504 1289532 1281881 1375866 1384602 1395633
5630A395633O6040K8142L7932n2665N8713J2289o5069O1572l8239l5927O4855
$$ 1395633 1461673 1489815 1527747 1475082 1533795 1546084 1481015 1542587 1504348 1468421 1533276
5619A533276K4665j9378K9290K6282j985j7240l9391J08441K7266n924O4226J12155
$$ 1533276 1557941 1538563 1567853 1594135 1592150 1574910 1535519 1643960 1671226 1665302 1729528 1841683
5607A841683m6549N9176k7779N3259K2879j1147K345L5734J4161q553k8258j2755
$$ 1841683 1795134 1854310 1826531 1879790 1902669 1891522 1893867 1929601 1943762 1935209 1906951 1894196
5595A894196J5765L6955K5429n442O3208p059M0055P5564L6174j1920j002l9168
$$ 1894196 1909961 1946916 1972345 1966903 2030111 2023052 2063107 2138671 2174845 2162925 2161923 2122755
5583B122755l4166R2130M0400j4350M4150O4899n5665M2660j4337L700J5950M3867
$$ 2122755 2088589 2180719 2221119 2206769 2250919 2315818 2260153 2302813 2288476 2292176 2308126 2351993
5571B351993M4382Q1810J9702P4718O2178r795M058J07349L2154n789m7642l2127
$$ 2351993 2396375 2478185 2497887 2572605 2634783 2624988 2629046 2736395 2768549 2762760 2715118 2682991
5559B682991m5885M0867Q524P8335J27315K8577k3560m5675J00394J2819k7686
$$ 2682991 2637106 2677973 2686497 2764832 2892147 2920724 2897164 2851489 2951883 2964702 2937016
5548B937016J1223O6586J21710l0021M0678N3618n0910j9156J23274n2198m4519
$$ 2937016 2948239 3014825 3136535 3106514 3147192 3200810 3149900 3130744 3254018 3201820 3157301
5537C157301M1950Q6796l9053M4681O6496j5629J14936P5792m3926m6352M9002
$$ 3157301 3199251 3286047 3246994 3291675 3358171 3342542 3457478 3533270 3489344 3442992 3491994
5526C491994j4046q9498J9277J95692P8032j8108n8742P2920o1982Q594k8024
$$ 3491994 3477948 3388450 3407727 3603419 3681451 3663343 3604601 3677521 3615539 3624133 3596109
5515C596109N1106R0463J55525m2421M644n4707L6114k0327n185P179o3752J59755
$$ 3596109 3647215 3737678 3893203 3850782 3855426 3800719 3836833 3816506 3811321 3818500 3754748 3914503
5503C914503P448j26363J8911N5862N5659j7460l342N1358k5301l3924J6032k5222
$$ 3914503 3921951 3795588 3814499 3870361 3926020 3908560 3905218 3956576 3931275 3897351 3913383 3888161
5491C888161O7757J09652j6210r5475M4764L2064j07068o9611N3839J10720O2290
$$ 3888161 3955918 4065570 4049360 3953885 3998649 4030713 3923645 3854034 3907873 4018593 4080883
5480D080883n9572P159n1593O0326J7232j11449O4431m9l813K0254K7184j19122
$$ 4080883 4021311 4028470 3976877 4037203 4054435 3942986 4007417 4007368 4003555 4023809 4050993 3931871
5468C931871J8887J3310Q8375q2079m715L083j3009o9601j6373R4951q4076J6910
$$ 3931871 3950758 3964068 4052443 3970364 3965649 3968732 3955723 3886122 3869749 3964700 3880624 3897534
5456C897534o9661L2928J5298o7390j51920l6813l3710N8412n5668K2001l9532
$$ 3897534 3827873 3860801 3876099 3808709 3656789 3619976 3586266 3644678 3589010 3611011 3571479
5445C571479p8235M6731l9867n4221P2684m1775M8964J2285o6812l3588j7487
$$ 3571479 3493244 3539975 3500108 3445887 3518571 3476796 3525760 3538045 3471233 3437645 3420158
5434C420158N0625q7438N0912K4517j0259l9491p1454l9308R8730l790p9109K4162
$$ 3420158 3470783 3383345 3434257 3458774 3448515 3409024 3337570 3298262 3396992 3393202 3314093 3338255
5422C338255L8414o3699j67351P9836J6751q7756r5745P9802J5955j40591M2818
$$ 3338255 3376669 3312970 3145619 3225455 3242206 3154450 3058705 3138507 3154462 3013871 3056689
5411C056689m7541j0085n299J00207r0743J026L4028n0925j31565k8755l9245
$$ 3056689 3009148 2999063 2993764 3093971 3003228 3004254 3038282 2987357 2855792 2827037 2787792
5400B787792l4066l2334n7135j4104O4078k2819j62147k2062K2774N308O2239
$$ 2787792 2753726 2721392 2664257 2650153 2714231 2691412 2529265 2507203 2529977 2535285 2597524
5389B597524j15415j2726k2088J7351q7303j27466O3869Q6559q1515q5122j6120
$$ 2597524 2482109 2469383 2447295 2464646 2377343 2249877 2313746 2400305 2318790 2233668 2217548
5378B217548K3854m7492j12517J08253o7266Q395J0360o0985K9768J3313k5469
$$ 2217548 2241402 2193910 2081393 2189646 2122380 2130775 2141135 2080150 2109918 2123231 2097762
5367B097762o8867M4663q5355P0994p992j06785o1326K9995L2090l4788k5810
$$ 2097762 2028895 2073558 1988203 2059197 2051205 1944420 1883094 1913089 1945179 1910391 1884581
5356A884581k4932L9616n5126K9748l4300K3389j6061o8994N0916j8183l1308
$$ 1884581 1859649 1899265 1844139 1873887 1839587 1862976 1846915 1777921 1828837 1810654 1779346
5345A779346M2503n7035j2952K1362n0962o6141L4946k9411M5486k6948J4675
$$ 1779346 1821849 1764814 1751862 1773224 1722262 1656121 1691067 1661656 1707142 1680194 1694869
5334A694869n7344k3948n833K7880l3781L6249K6339r7499P1724l6442k3749p1760
$$ 1694869 1637525 1613577 1607744 1635624 1601843 1638092 1664431 1566932 1638656 1602214 1578465 1506705
5322A506705P8851M4146o6883l046K5300o0005k5892J9967j13462P0401N8452
$$ 1506705 1585556 1629702 1562819 1559773 1585073 1525068 1499176 1519143 1405681 1476082 1534534
5311A534534J1038n551O899M004M6167q025L7053R4729n610K2889M8397J261L3044
$$ 1534534 1545572 1540021 1546920 1550924 1597091 1589066 1626119 1720848 1715238 1738127 1786524 1787785 1820829
5298A820829O2319J52847N0071K5898J16188Q3248N0116P1245J60140J41832O1985
$$ 1820829 1883148 2035995 2086066 2111964 2228152 2311400 2361516 2432761 2592901 2734733 2796718
5287B796718L6815J65485R3578P1036N4881J45674J83363J35821R1561J22334
$$ 2796718 2833533 2999018 3092596 3163632 3218513 3364187 3547550 3683371 3774932 3897266
5277C897266J33705P6276O0133J55674J27454N1216R7671Q0155J05433P0381J62991
$$ 3897266 4030971 4107247 4167380 4323054 4450508 4501724 4599395 4679550 4784983 4855364 5018355
5266E018355L2790O5933N565R6128J03825P957j8455L9925L3321q3200J9976K0073
$$ 5018355 5051145 5117078 5122643 5218771 5322596 5330553 5312098 5352023 5385344 5302144 5322120 5342193
5254E342193J3024q5326k8390l5252q0270m2003M79j57339j89737k303n5240j59942
$$ 5342193 5355217 5269891 5241501 5206249 5125979 5083976 5084455 4927116 4737379 4735076 4679836 4519894
5242D519894j12297j36164j56326j01608n2101j38278j56942j03131j49814j59295
$$ 4519894 4407597 4271433 4115107 4013499 3961398 3823120 3666178 3563047 3413233 3253938
5232C253938j05838r8427j24437j43693j68369j97518k3527n416j45516j13044
$$ 3253938 3148100 3049673 2925236 2781543 2613174 2415656 2392129 2386713 2241197 2128153
5222B128153n5134p4399o6740j33196j04665p1589r7949k8538r4769j24178m096
$$ 2128153 2073019 1998620 1931880 1798684 1694019 1622430 1524481 1495943 1401174 1276996 1272900
5211A272900k0328j10055k9985L5935k4330l2138j06029M2481L904j1369k6681
$$ 1272900 1252572 1142517 1112532 1148467 1124137 1091999 985970 1028451 1032355 1020986 994305
5200I94305m9213K403N201k4271J670q0039O433L9202j21559M4055Q7289k6044
$$ 994305 945092 947495 952696 928425 930095 850056 856489 895691 774132 818187 905476 879432
5188H79432m9487O329m5886J7684M4250n7150j4892k4684l3205O5414k2422J5803
$$ 879432 829945 836274 790388 808072 852322 795172 780280 755596 722391 787805 765383 781186
5176G81186J3454l5919J1092n566l7364Q5491j7757n216L5815l8712o776r8471
$$ 781186 794640 758721 769813 764247 726883 812374 794617 789401 825216 786504 779728 681257
5164F81257n9241M9290n9280l1347J7035L3664k5058m7244l5441j931J3840m3745
$$ 681257 622016 671306 612026 580679 597714 631378 606320 559076 523635 521704 535544 491799
5152D91799k1183L8781K21r268p691M3475L3185k8825P4877l8031o5114L2449
$$ 491799 470616 509397 509618 500350 492659 536134 569319 540494 615371 577340 512226 544675
5140E44675M9445l1777j16155O8545O4497k4178o7602J8741k1139k1313J0673
$$ 544675 594120 562343 446188 514733 579230 555052 487450 506191 485052 463739 474412
5129D74412L7792k249l4412L9952q5101k1244M5660M7251j8198j8012L6251m080
$$ 474412 512204 509955 475543 515495 430394 409150 454810 502061 483863 465851 502102 498022
5117D98022k9486q712M39l1348O351N9028m2009J4901J0058j4981l4987o4791
$$ 498022 468536 459824 460263 428915 435266 494294 452285 467186 477244 462263 427276 362485
5105C62485K3772N1782o6054m6476M9318l0640R1287n0696n2079P995N4635J0006
$$ 362485 386257 438039 371985 325509 374827 344187 435474 384778 332699 340694 395329 405335
5093D05335p9343K1638J1122J0969k9546L4520l5415M7968M2589m5164r3788Q7377
$$ 405335 325992 347630 358752 369721 340175 374695 339280 387248 429837 384673 290885 378262
5081C78262J5506o7204J39l099L3818L2616J9428P473o7288P4243k7848j712K995
$$ 378262 393768 326564 326703 323604 357422 390038 409466 416939 349651 423894 396046 394334 397329
5068C97329k2652L0594M8166P416l5753j1125j851j3376o5243L6021M1006J8878
$$ 397329 374677 405271 453437 460853 425100 413975 412124 398748 333505 369526 410532 429410
5056D29410j9724J1172k0781k4048k3087M3283K2060l2015M332K3760p2600k2515
$$ 429410 409686 420858 400077 376029 352942 396225 418285 386270 390602 414362 341762 319247
5044C19247P4015J4773R725p4623N4497m8454p2736Q347J0113L0736M5001K2322
$$ 319247 393262 408035 417760 343137 397634 349180 276444 284791 294904 325640 370641 392963
5032C92963M2554Q932j18662M7455r876r846J1646J9585j4774Q940l1017J826
$$ 392963 435517 444449 325787 373242 363366 353520 365166 384751 369977 378917 347900 349726
5020C49726j9317L262K9362l8033J7023j4868n0513k8977Q5678L8101K6224L3297
$$ 349726 330409 333671 363033 325000 342023 327155 276642 247665 333343 371444 397668 430965
5008D30965K4190k9310k391m8812Q696M6842k5035J5465r326Q952m6419K2158
$$ 430965 455155 425845 423454 374642 383338 430180 405145 420610 411284 420236 373817 395975
4996C95975o4958O19q34J17811k3779L064o3819Q2189p7052j4781O7986j3215
$$ 395975 331017 331636 330802 448613 424834 427898 364079 446268 369216 354435 422421 409206
4984D09206P051L4008k727j03646R886J899J744r7223O6463J4213j08o402P2421
$$ 409206 416257 450265 447538 343892 353778 355677 357421 260198 326661 340874 340766 334364 406785
4971D06785k3485o52J01296q8717L5621P2205k938n8823l645P9792M8510r1751
$$ 406785 383300 382648 483944 395227 430848 503053 500115 441292 437647 517439 565949 474198
4959D74198m26M3222n997n625l5848L2981j7818R607n1599K5432K8537J2531O2867
$$ 474198 473772 516994 510997 505372 469524 502505 484687 494294 442695 468127 496664 509195 572062
4946E72062k6927o3297N3079J16173l004r2367L1045O4526q4564l4144R0218M488
$$ 572062 545135 481838 534917 651090 648086 555719 586764 651290 566726 532582 622800 627288
4934F27288L5623l5889K499K9316j9876l2773J703K9351R0780m2710l9543P4221
$$ 627288 662911 627022 629521 658837 638961 606188 607891 637242 728022 685312 645769 719990
4922G19990M2095j01748J02420l0649n2063N5570L9279n8096o372l87L3303J0645
$$ 719990 762085 660337 762757 732108 680045 735615 774894 716798 710426 710039 743342 753987
4910G53987p930L2553L986M7147K7043m8246M4061J06513m7572P2908R5427m1097
$$ 753987 746057 778610 782596 829743 856786 808540 852601 959114 911542 984450 1079877 1038780
4898A038780m2150P596P464N6219j7102J12362o0872k6239J12935R108m6431J09951
$$ 1038780 996630 1004226 1011690 1067909 1050807 1163169 1102297 1076058 1188993 1198101 1151670 1261621
4886A261621l2615j860N7832J23817m7141K754J07158M5189J7350k2239Q2405
$$ 1261621 1229006 1227146 1284978 1408795 1361654 1364408 1471566 1516755 1534105 1511866 1594271
4875A594271N021J5089M6071J314o534J09970n559J44836K580K05843K54072Q8718
$$ 1594271 1599292 1614381 1660452 1661766 1655232 1765202 1759643 1904479 1907059 2112902 2366974 2455692
4863B455692K01469J74023K11542J94060J18782J87515K63466K21772J87420K37671
$$ 2455692 2657161 2831184 3042726 3236786 3355568 3543083 3806549 4028321 4215741 4453412
4853D453412M87022M22767L68433K49852K1333P2137m2725J11267J01467K04934
$$ 4453412 4940434 5363201 5731634 5981486 6002819 6074956 6032231 6143498 6244965 6449899
4843F449899M10942L69712L64199N34360M69632M85424N84962O59382P47178Q58384
$$ 6449899 6860841 7230553 7594752 8129112 8598744 9084168 9669130 10328512 11075690 11934074
4833A1934074Q79065O78243O12681M83303K49084j45609k36290k97747l58986
$$ 11934074 12813139 13491382 14104063 14587366 14836450 14690841 14454551 14156804 13797818
4824A3797818o04994m45747m86138l37043l08510k38214j29102r8183R4087K27736
$$ 13797818 13192824 12747077 12260939 11923896 11615386 11377172 11248070 11149887 11243974 11471710
4814A1471710K18434L09704N11826K28128q830k22840l74258n02993o82801o66682
$$ 11471710 11690144 11999848 12511674 12739802 12730972 12508132 12133874 11630881 10948080 10281398
4804A0281398p27215p03697o63107o10247o71628m86009l10860m23812l01412
$$ 10281398 9554183 8850486 8187379 7577132 6905504 6419495 6108635 5684823 5383411
4795E383411j57627p8632j10142m405Q1974J29838R9096K90377L97986L42586
$$ 5383411 5225784 5147152 5037010 5032605 5114579 5244417 5343513 5633890 6031876 6374462
4785F374462N18349N15881M82932M93267M69551N11104N53026O06129O35503O03206
$$ 6374462 6892811 7408692 7891624 8384891 8854442 9365546 9918572 10524701 11160204 11763410
4775A1763410N70024O40174M24422K54562J83831r947o1903p8674J9326j17028
$$ 11763410 12333434 12973608 13398030 13652592 13836423 13826476 13764573 13685899 13705225 13588197
4765A3588197n3809P538J16027R0993J30166L10788L74231L79729L38910K83956
$$ 13588197 13534388 13541926 13657953 13748946 13879112 14189900 14564131 14943860 15282770 15566726
4755A5566726K07380Q8356k39626l07686n49105p11565p92760p51677o66328p44523
$$ 15566726 15774106 15862462 15622836 15315150 14766045 14054480 13261720 12510043 11843715 11099192
4745A1099192o20774m80408m44383m75677k59685l51229m35108l95655m68732
$$ 11099192 10478418 9998010 9553627 9077950 8818265 8467036 8031928 7636273 7167541
4736G167541m53394m28840l79404m37503l44595l10824k16995l62208j04767r7845
$$ 7167541 6714147 6285307 5905903 5468400 5123805 4812981 4595986 4233778 4129011 4031166
4726D031166j96838r2232k9909P376m7527N6906P6333K9689J12902J55269J87125
$$ 4031166 3834328 3742096 3712187 3719563 3672036 3728942 3805275 3834964 3947866 4103135 4290260
4715D290260J84990K88789L46747L73102K91708K87979L43259M44362L75660L16450
$$ 4290260 4475250 4764039 5110786 5483888 5775596 6063575 6406834 6851196 7226856 7543306
4705G543306L69102L59093M01370J27970J06888n0368j13103j02980j83080j64355
$$ 7543306 7912408 8271501 8672871 8800841 8907729 8857361 8744258 8641278 8458198 8293843
4695H293843j54853r3131m1821j16795k8120J48989L9024L7783M7971n1074j98779
$$ 8293843 8138990 8045859 8004038 7887243 7859123 8008112 8047136 8084919 8132890 8081816 7883037
4684G883037k56991l85492m00872m89820m37954m78191m78664m13431l40763l07924
$$ 7883037 7626046 7240554 6839682 6349862 5911908 5433717 4955053 4541622 4200859 3892935
4674C892935l22598k18154j82501j43994j61433j08996j48870j22340J595L0036
$$ 3892935 3570337 3352183 3169682 3025688 2864255 2755259 2606389 2484049 2485644 2515680
4664B515680j28848j1729l9112M3396l5569n3117m5496Q2164R531M4903q2800
$$ 2515680 2386832 2375103 2335991 2379387 2343818 2290701 2245205 2327369 2336900 2381803 2299003
4653B299003l9854R5633l9305l5245K813J06320R0861O9080l8813O9861L6023
$$ 2299003 2259149 2354782 2315477 2280232 2283045 2389365 2480226 2549306 2510493 2580354 2616377
4642B616377J44809N9751j6908O0989J39368L2786p0494J8597J27486K1861m5592
$$ 2616377 2761186 2820937 2804029 2865018 3004386 3037172 2966678 2985275 3112761 3134622 3089030
4631C089030K2295P0953J09333J7250o499J2273N9317J3219L6973N9356P8922
$$ 3089030 3111325 3182278 3291611 3308861 3302362 3314635 3373952 3387171 3424144 3483500 3562422
4620C562422P3008J46456O1068p210J11881N5726R4574L8342J35639L1536O7983
$$ 3562422 3635430 3781886 3842954 3835744 3947625 4003351 4097925 4136267 4271906 4303442 4371425
4609D371425J41392M7920O792J10478J29982J16705J23954J58161K53005J50357
$$ 4371425 4512817 4560737 4567529 4678007 4807989 4924694 5048648 5206809 5459814 5610171
4599E610171K33296K38566L03374M09137L14753M60368M75419M78475N69762O28762
$$ 5610171 5843467 6082033 6385407 6794544 7109297 7569665 8045084 8523559 9093321 9722083
4589I722083P19011O95380Q14647Q86898Q83378P76296R59736Q95566P77791O05324
$$ 9722083 10441094 11136474 11951121 12838019 13721397 14497693 15457429 16352995 17130786 17736110
4579A7736110O75585M45740K83948K43810J30869J61075l7960M7963n8079j73348
$$ 17736110 18411695 18857435 19141383 19385193 19516062 19677137 19639177 19687140 19629061 19455713
4569A9455713j04802j97470l44982l33459l30976l37192k86951j94342J31016
$$ 19455713 19350911 19153441 18808459 18475000 18144024 17806832 17519881 17325539 17456555
4560A7456555J30062K45292M20223O63940P86880R10944R61877R16690P18305
$$ 17456555 17586617 17831909 18252132 18916072 19702952 20613896 21575773 22492463 23210768
4551B3210768M73288M27669L46470M70847O97941Q63402J002307J112918J120819
$$ 23210768 23684056 24111725 24458195 24929042 25626983 26490385 27492692 28605610 29726429
4542B9726429J085217Q74490O72956N03133M19883L89782M05306L33365L91737
$$ 29726429 30811646 31686136 32359092 32862225 33282108 33671890 34077196 34410561 34802298
4533C4802298J69464k07755n59432p69523j002014j037283j019648q32837p76247
$$ 34802298 34971762 34764007 34204575 33435052 32433038 31395755 30376107 29543270 28767023
4524B8767023n51784l32639j64984p0462M855J2399j42729j63161j17042k44803
$$ 28767023 28215239 27882600 27717616 27647154 27652009 27664408 27521679 27358518 27241476 26996673
4514B6996673k28908k88227l30109m63721n55661o01047o64038o78535o18621
$$ 26996673 26767765 26479538 26149429 25685708 25130047 24529000 23864962 23186427 22567806
4505B2567806m78383n54213m21433k85016k33505k43318k34166k85048k30418
$$ 22567806 22089423 21535210 21113777 20828761 20595256 20351938 20117772 19832724 19602306
4496A9602306m44508m32098l79834m09328l54744l61348k14537j46705k26300
$$ 19602306 19157798 18725700 18345866 17936538 17581794 17220446 17005909 16859204 16632904
4487A6632904r1920J5397L7747O5489K39090L65448L81081L86028M23870K96102
$$ 16632904 16540984 16556381 16594128 16659617 16898707 17264155 17645236 18031264 18455134 18751236
4477A8751236J58212j12896k28880n57516o87211p83431r73726r72843j106372
$$ 18751236 18909448 18796552 18567672 18010156 17322945 16539514 15565788 14592945 13486573
4468A3486573j054794j055188j014115q42241p97383q11957o12880n39849n00346
$$ 13486573 12431779 11376591 10362476 9520235 8722852 7910895 7298015 6758166 6257820
4459F257820m78180l79921l06100l56084l14507k13610j63249k48127j95451j27211
$$ 6257820 5779640 5399719 5093619 4737535 4423028 4209418 4046169 3798042 3602591 3475380
4449C475380p7418m7862j28075j30116m6716j60842j01976o452j34108K72o8172
$$ 3475380 3397962 3350100 3222025 3091909 3045193 2884351 2782375 2775923 2641815 2642087 2573915
4438B573915p3594r5246m9457l9224j50814r3815k181p2484q5504m2741J2861
$$ 2573915 2500321 2405075 2355618 2316394 2165580 2071765 2069584 1997100 1911596 1868855 1881716
4427A881716j06958m729R4658n7752k7581m411p7666K075r5466l3707O3405j29226
$$ 1881716 1774758 1770029 1864687 1806935 1779354 1774943 1697277 1699352 1603886 1570179 1633584 1504358
4415A504358J7948m4234K4747j172l3408o182O3020N195k0557Q0180K7797R3083
$$ 1504358 1522306 1478072 1502819 1501647 1468239 1462057 1525077 1530272 1509715 1589895 1617692 1710775
4403A710775j04285L8886N0068J07009J61387L89692M23436L86617M05660K63068
$$ 1710775 1606490 1645376 1695444 1802453 1963840 2353532 2776968 3163585 3569245 3832313
4393C832313L85990R6602j53483k08926k16860l71495l74016l97489j98168k32900
$$ 3832313 4218303 4314905 4161422 3952496 3735636 3364141 2990125 2592636 2394468 2161568
4383B161568l36763q8773j43539j56993j33120r5534q1083p2573o7336k3074k9687
$$ 2161568 1824805 1736032 1592493 1435500 1302380 1206846 1125763 1053190 985854 962780 933093
4372I33093n2069P684o1370o8591L001N6729j04863j2100m7369N3272N42p2809
$$ 933093 881024 888708 827338 758747 761748 818477 713614 701514 654145 707417 707959 635150
4360F35150m4805K4274P5463n460q5515l7429J7651Q698l2450p1766M1979j7308
$$ 635150 590345 614619 690082 684622 599107 561678 579329 588027 555577 483811 525790 508482
4348E08482l6601j2799k1909O1225l3732p4168l76J3832M7941j1338l4519M4691
$$ 508482 471881 459082 437173 498398 464666 390498 390122 403954 451895 440557 406038 450729
4336D50729K6263O0518J597k8071O9015K826k7170o6045L2854Q8823O1689j22489
$$ 450729 476992 537510 539107 511036 580051 582877 555707 489662 522516 611339 673028 550539
4324E50539j5417R3282N3645j16155K6358k1564P9785O6684m0061q0299j7048
$$ 550539 535122 628404 682049 565894 592252 570688 650473 717157 677096 596797 579749
4313E79749M0273K7180j13756O7235M2977q1839l4688m5450K8131M897K3099J9388
$$ 579749 620022 647202 533446 600681 643658 561819 527131 481681 509812 514709 537808 557196
4301E57196o3220L2526J9024J2273L6350J914N8451m3332M0484L1963m5661m9416
$$ 557196 493976 526502 545526 557799 594149 596063 654514 611182 651666 683629 637968 588552
4289E88552J5833p4972j07431l0677N0364m1261l1039J1210L2534N736L1168n885
$$ 588552 604385 529413 421982 391305 441669 400408 369369 380579 413113 418849 450017 444132
4277D44132K554q1539J10991o3572j9704L0414K8653O5571N432q5244M5655Q7498
$$ 444132 446686 365147 476138 412566 392862 423276 451929 517500 522932 437688 483343 570841
4265E70841o3780J3501o965Q6878L8015o947J6070o4582K1386O3180K9488r7719
$$ 570841 507061 520562 513597 600475 638490 631543 647613 583031 604417 667597 697085 599366
4253E99366J60124j0015p7446Q1469m944Q864m0126M2568L263o2881n1113N9970
$$ 599366 759490 749475 672029 753498 748554 757418 717292 759860 763123 700242 649129 709099
4241G09099o4315p963Q2601L6114J06380l4776k6244q547j8583l0436m2549o269
$$ 709099 644784 636821 719422 755536 861916 827140 800896 792349 773766 743330 700781 694512
4229F94512O1868Q2156q8329J1093o5380L9862l6147p6094q8608O2146j4849m5343
$$ 694512 756380 838536 750207 761300 695920 735782 699635 623541 534933 597079 582230 536887
4217E36887l177N3382O3657q5358J473L7623J0126J1848k1582L3345M157L5851
$$ 536887 533710 587092 650749 565391 566864 604487 614613 626461 604879 638224 642381 678232
4205F78232L0550N6080j09438j2110K4619r0976p4058M7020O9031r260Q5959k8827
$$ 678232 708782 764862 655424 643314 667933 576957 502899 549919 618950 609690 695649 666822
4193F66822L0276P7392O1988o8915N519R6280N1097n8528l3816J18240p4178k5797
$$ 666822 697098 774490 836478 767563 773082 869362 920459 861931 828115 946355 872177 846380
4181H46380J09682J1100j41681R485k2j18253n662L5171O4687L5127K4237j5377
$$ 846380 956062 967162 825481 834966 834944 716691 711029 746200 810887 846014 870251 854874
4169H54874L7831l9598K3315r5528R4993J26263K7914L573j5550L9631N7486m2518
$$ 854874 892705 853107 876422 780894 875887 1002150 1030064 1033637 1018087 1057718 1115204 1072686
4157A072686o1595K4665r0106k4870o951l4447j06162M173N2508q8201n8233o003
$$ 1072686 1011091 1035756 945650 920780 913829 879382 773220 777393 829901 741700 683467 677464
4145F77464R4346q5773l7098r220R7197L9268L6475J18117K31515J77712j1974
$$ 677464 771810 686037 648939 639719 736916 776184 812659 930776 1162291 1340003 1328029
4134A328029O7586K5065R2665J2624J30066J61684O7820J85019K17897r4538k03756
$$ 1328029 1395615 1420680 1513345 1525969 1656035 1817719 1885539 2070558 2288455 2193917 1990161
4123A990161j36328j54158j38778j77171q6880j06412q8798m9198j18533L677
$$ 1990161 1853833 1699675 1560897 1383726 1296846 1190434 1101636 1052438 933905 937582
4113I37582q7758m350p9544O633j7894j8050j5551j5223P2728k2517k4225Q7919
$$ 937582 849824 845474 765930 772563 754669 736619 721068 705845 778573 756056 731831 819750
4101H19750L9167r2099j2226L5466O8901p7923o5833J05843N3442o6292n6790
$$ 819750 858917 766818 754592 790058 858959 781036 715203 821046 874488 808196 751406
4090G51406j1235N3734K6448m1151J4655j2052J7566l5508K3807L7382M989N8556
$$ 751406 740171 793905 820353 779202 793857 781805 799371 763863 787670 825052 830041 888597
4078H88597n6718l4914J7928j1258R473L1129L1701N3464J03103K9765J9063N497
$$ 888597 831879 796965 814893 803635 813108 844237 875938 929402 1032505 1062270 1081333 1086830
4066A086830J14169O1678L0348R7366J03763J15644L0153R0127l9858Q581k4161
$$ 1086830 1200999 1262677 1293025 1390391 1494154 1609798 1639951 1730078 1690220 1698801 1674640
4055A674640P2601M2009K9957l5233j237n4720K6206K9921o7228K497m5590m2020
$$ 1674640 1747241 1789250 1819207 1783974 1782737 1728017 1754223 1784144 1716916 1719413 1673823 1631803
4043A631803p9005o0310m387K1368r5419L5904k069k3623J3639K5713K851K2810
$$ 1631803 1552798 1492488 1488101 1509469 1414050 1449954 1447885 1424262 1437901 1463614 1466465 1489275
4031A489275N6717K6669o0012k0577L4020n3254q2316O7246q1763k6936j7964
$$ 1489275 1545992 1572661 1512649 1492072 1526092 1472838 1390522 1457768 1376005 1349069 1331105
4020A331105j29330J19845Q6906n9731n2075P9292K6702L7101m6806P7508R214
$$ 1331105 1201775 1321620 1408526 1348795 1296720 1376012 1402714 1439815 1393009 1470517 1479731
4009A479731J5431j3365P8163p4287L7166L3259n5991j218M475J7125O5572j986
$$ 1479731 1495162 1481797 1559960 1485673 1522839 1556098 1500107 1498889 1503364 1520489 1586061 1584075
3997A584075J5410l6536K9679J06499N0301l1388L4422M1079K5198L6167r89Q8263
$$ 1584075 1599485 1562949 1592628 1699127 1749428 1718040 1752462 1793541 1818739 1854906 1853917 1942180
3985A942180M2499M6811N8048R331o4962N2059p8213p9626N8862R1627M1374l7462
$$ 1942180 1984679 2031490 2089538 2098869 2033907 2085966 2007753 1928127 1986989 2078616 2119990 2082528
3973B082528l5465M8519k7617J6182J172M3491N0531R7312l7648N0406K9569J16083
$$ 2082528 2047063 2095582 2067965 2084147 2085319 2128810 2179341 2276653 2239005 2289411 2318980 2435063
3961B435063J800M7219Q0903J02619L1165M33M6992N1473R2934R0421K5067N4925
$$ 2435063 2436863 2484082 2564985 2667604 2698769 2699202 2746194 2797667 2890601 2981022 3006089 3061014
3949C061014J37382O2103j8020j8944L3596J98232L7731O4225P921R1751J6997
$$ 3061014 3198396 3260499 3242479 3223535 3257131 3455363 3493094 3557319 3565240 3656991 3673988
3938C673988R6676M8338R2514J07202R6424J32581K050Q8684J59474K00028J03208
$$ 3673988 3770664 3819002 3911516 4018718 4115142 4247723 4249773 4338457 4497931 4697959 4801167
3927D801167J93369K31597J61739J07086J41596K17910R2141J91078K50785J86513
$$ 4801167 4994536 5226133 5387872 5494958 5636554 5854464 5946605 6137683 6388468 6574981
3917F574981J86931J68063K01201J85799K75685J11161K95683K43198K93839K13648
$$ 6574981 6761912 6929975 7131176 7316975 7592660 7703821 7999504 8242702 8536541 8750189
3907H750189L58605L29518K80410L06956K93461L54162L06652K71551K48265K71710
$$ 8750189 9108794 9438312 9718722 10025678 10319139 10673301 10979953 11251504 11499769 11771479
3897A1771479L36185L22723L42000L66680M72921L18456L38452L90971M21565
$$ 11771479 12107664 12430387 12772387 13139067 13611988 13930444 14268896 14659867 15081432
3888A5081432K34074M52289M68063L31271L08504M40516M34447M19366M89762
$$ 15081432 15315506 15767795 16235858 16567129 16875633 17316149 17750596 18169962 18659724
3879A8659724N43037P20011O92475P23817P50683Q82658Q69023R48391J037286
$$ 18659724 19202761 19922772 20615247 21339064 22089747 22972405 23841428 24789819 25827105
3870B5827105J076886J146648J014823J028836J021130Q85564P52000P39250O38686
$$ 25827105 26903991 28050639 29065462 30094298 31115428 32000992 32752992 33492242 34130928
3861C4130928N23780N50284O67902O35015O46917R58110R59514J009355Q72406
$$ 34130928 34654708 35204992 35872894 36507909 37154826 38112936 39072450 40081805 40954211
3852D0954211P90546M90256L42791K3160k77537m65808n86533p23529p60494o87953
$$ 40954211 41744757 42235013 42577804 42600964 42323427 41857619 41271086 40547557 39787063 39099110
3842C9099110o72097p14163n99700n74293o90710o56746o44597q19495q92158
$$ 39099110 38427013 37712850 37113150 36538857 35848147 35191401 34546804 33727309 32835151
3833C2835151q18480q23646q53453r39322q59385q55486r09505q40546p54429
$$ 32835151 32016671 31193025 30339572 29400250 28540865 27685379 26775874 25935328 25180899
3824B5180899p89424p01069n64312m68915l89954l97335k08836n0382l8877N6294
$$ 25180899 24391475 23690406 23126094 22657179 22267225 21869890 21661054 21610672 21571795 21628089
3814B1628089P6694J02769J60038L718j63882j50178k50385l55947m00984l82860
$$ 21628089 21704783 21807552 21967590 21971308 21807426 21657248 21406863 21050916 20649932 20267072
3804B0267072m40881n10006n44075n00411m38452m36573l36246l43319k10942
$$ 20267072 19826191 19316185 18772110 18271699 17833247 17396674 17060428 16717109 16506167
3795A6506167k12432k37975j01244j13521j00822j14955L5191O0209L1175p277
$$ 16506167 16293735 16055760 15954516 15840995 15740173 15625218 15660409 15720618 15751793 15744516
3785A5744516J85729J71072J19881K90477K40762J61343K55993K66818J47383
$$ 15744516 15930245 16101317 16221198 16511675 16752437 16913780 17169773 17436591 17583974
3776A7583974Q1878J53097K23215J82425l8606N6820J79198J38475J30459K98399
$$ 17583974 17665852 17818949 18042164 18224589 18185983 18242803 18422001 18560476 18690935 18989334
3766A8989334M47969O61480P18407Q06132J009001J205043J334012J235148J350195
$$ 18989334 19437303 20098783 20817190 21623322 22632323 23837366 25171378 26406526 27756721
3757B7756721J323414J262227R52375P26182N84226M42619L05793J12759r3038
$$ 27756721 29080135 30342362 31294737 32020919 32605145 33047764 33353557 33466316 33373278
3748C3373278m3485p4047j62994k30650j89411n8002k54767k36676k49628k57971
$$ 33373278 33329793 33255746 33092752 32862102 32672691 32614689 32359922 32123246 31873618 31615647
3738C1615647j87638j92432j33320n3854N9756Q0941K72715K82593L36161N30588
$$ 31615647 31428009 31235577 31102257 31048403 31108159 31189100 31461815 31744408 32080569 32611157
3728C2611157O53804O36407R58732J153588J313606J421098J543136J597323J488751
$$ 32611157 33264961 33901368 34860100 36013688 37327294 38748392 40291528 41888851 43377602
3719D3377602J486819J392633J067238R49066O18917M27072J25165l3174k45702
$$ 43377602 44864421 46257054 47324292 48273358 48892275 49319347 49444512 49411338 49165636
3710D9165636l54583n12875n95251p24723r21048q55206r01948r40908r45725
$$ 49165636 48811053 48298178 47702927 46978204 46057156 45201950 44300002 43359094 42413369
3701D2413369r37527r26007p90875r16268q74696o97809p50202q14260p56837
$$ 42413369 41475842 40549835 39758960 38842692 37967996 37270187 36519985 35705725 34948888
3692C4948888p23901q40542j020504j029844j094791j121070j229261j101637
$$ 34948888 34224987 33384445 32363941 31334097 30239306 29118236 27888975 26787338
3684B6787338j078552r13708q98667o87953n95155n21087n26620n21159n17677
$$ 26787338 25708786 24795078 23896411 23208458 22613303 22092216 21565596 21044437 20526760
3675B0526760n12401n63726m98028m31044m60848m18954k74726k31838k55447
$$ 20526760 20014359 19450633 18952605 18521561 18060713 17641759 17367033 17135195 16879748
3666A6879748j86787j24849j19568q9964k8424j58391j27472j29116r0217j43687
$$ 16879748 16692961 16568112 16448544 16358580 16330156 16171765 16044293 15915177 15824960 15681273
3656A5681273L6482M5896P5756J59713J28756J50267M7038J04332Q1973j3677
$$ 15681273 15717755 15763651 15839407 15999120 16127876 16278143 16325181 16429513 16511486 16497809
3646A6497809o0923j71050k51825k15402l54376m27144k61365l53264m39052n36345
$$ 16497809 16436886 16265836 16014011 15798609 15444233 15017089 14755724 14402460 13963408 13427063
3636A3427063l67685m53222o23488n24154m96426m95378n86440l69647l86636
$$ 13427063 13059378 12606156 11982668 11458514 10962088 10466710 9880270 9510623 9123987
3627I123987l84304l55841k81391l69772j83502j37124m2139j50743j43312j37304
$$ 9123987 8739683 8383842 8102451 7732679 7549177 7412053 7369914 7219171 7075859 6938555
3617F938555k14920j79760j31412j76839j00132l2824L631J6783j06905j6135
$$ 6938555 6723635 6543875 6412463 6235624 6135492 6102668 6106299 6123082 6016177 6000042
3607F000042o4870J9086l5578L6708r2261P292Q579q1943m660J06957m9675J8993
$$ 6000042 5935172 5954258 5918680 5955388 5863127 5870419 5878998 5797055 5792395 5899352 5849677 5868670
3595E868670P72p3331N5958o0578K5287o1155j046R3597O4492n7180P0960N1881
$$ 5868670 5869442 5796111 5852069 5791491 5816778 5755623 5754577 5848174 5912666 5855486 5926446 5978327
3583E978327N5168M0236L012J21587J41314P2071L3342P4399J6286L6534l3435
$$ 5978327 6033495 6073731 6076743 6198330 6339644 6411715 6445057 6519456 6535742 6572276 6538841
3572F538841P5406k9419n8272J16399r311j09810R8224M1736j3753J80676R9492
$$ 6538841 6614247 6584828 6526556 6642955 6633644 6523834 6622058 6663794 6650041 6830717 6930209
3561F930209P6064O4703J23784K07953J83557K19241K95297L14466J49910K36657
$$ 6930209 7006273 7070976 7194760 7402713 7586270 7805511 8100808 8415274 8565184 8801841
3551H801841J87270J30631K06620J97911K23736K37774K13998K41221J28893J87318
$$ 8801841 8989111 9119742 9326362 9524273 9748009 9985783 10199781 10441002 10569895 10757213
3541A0757213J56472J14347J70220J63784Q7352M0243J94629J86547K40059K71431
$$ 10757213 10913685 11028032 11198252 11362036 11449388 11489631 11684260 11870807 12110866 12382297
3531A2382297L01022L56341M68319M99151M44022L77394M98306N10053K62710
$$ 12382297 12683319 13039660 13507979 14007130 14451152 14828546 15326852 15836905 16099615
3522A6099615M35604M91041L97897M26006M97307N57876P59883J013036J194272
$$ 16099615 16535219 17026260 17424157 17850163 18347470 18905346 19665229 20678265 21872537
3513B1872537J358872J703355J954724K139038K234030K475498K481470K259089
$$ 21872537 23231409 24934764 26889488 29028526 31262556 33738054 36219524 38478613
3505C8478613J931043J569201J006116N79220k6273n19141r16423j141976j213101
$$ 38478613 40409656 41978857 42984973 43564193 43537920 43018779 42102356 40960380 39747279
3496C9747279j364158j193023j217047j237160j094277j089571j147275j209330
$$ 39747279 38383121 37190098 35973051 34735891 33641614 32552043 31404768 30195438
3488C0195438j219497j272529j270429j251559j273227j286535j154713j091850
$$ 30195438 28975941 27703412 26432983 25181424 23908197 22621662 21466949 20375099
3480B0375099j035042j066556j011151q00105q40592p56340p57729n73607n65933
$$ 20375099 19340057 18273501 17262350 16462245 15621653 14865313 14107584 13533977 12968044
3471A2968044n04029n13608m63714k92276l05199l83559k30803k31634k55957
$$ 12968044 12464015 11950407 11486693 11194417 10889218 10505659 10274856 10043222 9787265
3462I787265k11574k21830k20380j73086r8617j20131j69359k4161p5505j32215
$$ 9787265 9575691 9353861 9133481 8960395 8861778 8741647 8572288 8548127 8472622 8340407
3452H340407o6657n7966r0376j31059q5780r8959m9778j7221n0559K3339k1516
$$ 8340407 8273750 8215784 8125408 7994349 7908569 7809610 7759832 7742611 7692052 7715391 7693875
3441G693875k8381j60538j56450r8263j45996k33796o7125j54802j73471n0992
$$ 7693875 7665494 7504956 7348506 7250243 7104247 6870451 6803326 6648524 6475053 6424061
3431F424061j48248l8615j13827p5883J2626p4237m5905J4787l8473m5770l155
$$ 6424061 6275813 6237198 6123371 6047488 6060114 5985877 5939972 5954759 5916286 5870516 5867361
3420E867361N7408j1989K104J4628k4417q2214L801R270n92r546O71P9073L0607
$$ 5867361 5924769 5912780 5914884 5929512 5905095 5822881 5826682 5835952 5835360 5825814 5826485 5905558 5936165
3407E936165R0952n322K43475M4748J16644J00856N4146L5806K8505j5905n3141
$$ 5936165 6027117 6021795 6265270 6310018 6426662 6527518 6581664 6617470 6645975 6630070 6576929
3396F576929p7919k7864N2313j29256P844j0317m6409j9974N2936J6806M0914
$$ 6576929 6499010 6471146 6523459 6394203 6402047 6391730 6345321 6325347 6378283 6395089 6436003
3385F436003J67865J10j3444O5918O9338O2038L4290J54199N3521L579O2681J22119
$$ 6436003 6603868 6603978 6590534 6656452 6725790 6787828 6822118 6976317 7029838 7033417 7096098 7218217
3373G218217o288J14329J55516R7964J97689J13069J34021R3164R3710O9804P9959
$$ 7218217 7211929 7326258 7481774 7579738 7777427 7890496 8024517 8117681 8211391 8281195 8361154
3362H361154P2063Q6436Q3733K5680Q0401P2163J22065J13746K07745J86394K32240
$$ 8361154 8433217 8519653 8603386 8629066 8709467 8781630 8903695 9017441 9225186 9411580 9643820
3351I643820J75941K49802J77191J16663K00120K31024Q9458N8478Q6800J65436
$$ 9643820 9819761 10069563 10246754 10363417 10563537 10794561 10884019 10942497 11029297 11194733
3341A1194733J49083J41238J74820K39098K61489K83520K39596K92407L71120
$$ 11194733 11343816 11485054 11659874 11898972 12160461 12443981 12683577 12975984 13347104
3332A3347104L61064K97583K61282J98020K11469J50553O0275J0821J01297J76064
$$ 13347104 13708168 14005751 14267033 14465053 14676522 14827075 14887350 14898171 14999468 15175532
3322A5175532R7012P4842J03235J30865j2818m5890l3985l9257L0144q102j8367
$$ 15175532 15272544 15347386 15450621 15581486 15568668 15522778 15488793 15449536 15479680 15471578 15453211
3311A5453211L5095k7073P2229J61753O5773J89960L33766K60693K56015K81144
$$ 15453211 15488306 15461233 15533462 15695215 15760988 15950948 16284714 16545407 16801422 17082566
3301A7082566L19761L89412M67832M53042N34544O98198P55466R89727J088041
$$ 17082566 17402327 17791739 18259571 18712613 19247157 19945355 20700821 21690548 22778589
3292B2778589J456641J764683K101060K556010K886845L233210L514431L516357
$$ 22778589 24235230 25999913 28100973 30656983 33543828 36777038 40291469 43807826
3284D3807826L211622K897471K251504J606857O48453r6502p36254j434749j852513
$$ 43807826 47019448 49916919 52168423 53775280 54423733 54327231 53590977 52156228 50303715
3275E0303715k348099k582210k610303k595541k617129k345894k163346j837424
$$ 50303715 47955616 45373406 42763103 40167562 37550433 35204539 33041193 31203769
3267C1203769j491644j357750j023171q07955n40816m71685k63339l4497J65711
$$ 31203769 29712125 28354375 27331204 26523249 25982433 25510748 25247409 25212912 25378623
3258B5378623L80905N99508Q12860J184869J617623J953406K207188K566385K759918
$$ 25378623 25759528 26359036 27171896 28356765 29974388 31927794 34134982 36701367 39461285
3249C9461285K707692K462881K041701J608740J138649M06261j8109m00644p48161
$$ 39461285 42168977 44631858 46673559 48282299 49420948 49827209 49809100 49408456 48660295
3240D8660295r54910j224912j295943j427031j549872j648729j752387j858392
$$ 48660295 47705385 46480473 45184530 43757499 42207627 40558898 38806511 36948119
3232C6948119j917035j783990j783854j661744j414420j268563j193123q41765
$$ 36948119 35031084 33247094 31463240 29801496 28387076 27118513 25925390 25083625
3224B5083625o56334l52654j27505R006J13142O279j51278j28358j06574p660
$$ 25083625 24427291 24074637 23947132 23956138 24069280 24075559 23924281 23795923 23689349 23681689
3214B3681689K5565J34447K40092L48961N36333M96530N64476L83653L28722K40473
$$ 23681689 23707254 23841701 24081793 24430754 24967087 25463617 26028093 26411746 26740468 26980941
3204B6980941J45922R2185J53999J47215K48308K21908L11767M46354N15213O38381
$$ 26980941 27126863 27219048 27373047 27520262 27768570 27990478 28302245 28748599 29263812 29902193
3194B9902193O13742Q21894R31002R40729J183315J319635J304392J424418J387075
$$ 29902193 30515935 31337829 32268831 33209560 34392875 35712510 37016902 38441320 39828395
3185C9828395J362840J487634J685714J902269K201580K839726L652880M891549
$$ 39828395 41191235 42678869 44364583 46266852 48468432 51308158 54961038 59852587
3177E9852587O588784Q070884R329301R930528R482739Q155679O389311M797534
$$ 59852587 66441371 74512255 83841556 93772084 103254823 111410502 117799813 122597347
3169A22597347L690107L723119M846839O700300Q410359R605293R456115P761089
$$ 122597347 126287454 130010573 134857412 141557712 149968071 159573364 169029479 176790568
3161A76790568N296480K392935j384937n296579q837497j1480187j2557775j2714627
$$ 176790568 182087048 184479983 183095046 177798467 168960970 157480783 144923008 132208381
3153A32208381j2274123j1705108j0655973r344195q087730o982009o020927n282583
$$ 132208381 119934258 108229150 97573177 88228982 80141252 73159243 67138316 61855733
3145F1855733m632100m063386l454500k943523k637105k213371j813438j551977
$$ 61855733 57223633 53160247 49705747 46762224 44125119 41911748 40098310 38546333
3137C8546333j365856j166096r11102o61590m72934k78549m7430J63517K11463
$$ 38546333 37180477 36014381 35103279 34441689 33968755 33690206 33642776 33806293 34017756
3128C4017756K29113j5839r0613k94686k89696m27769n55665m87232m40897n82518
$$ 34017756 34246869 34231030 34140417 33845731 33556035 33128266 32572601 32085369 31644472 31061954
3118C1061954o06403n51012n05351n09296m79214m23079m48118k98785k52985
$$ 31061954 30455551 29904539 29399188 28889892 28410678 27987599 27539481 27240696 26987711
3109B6987711k54342k24099l9152q1385o857K59791L69548M26659O36156N66558
$$ 26987711 26733369 26509270 26470118 26388733 26381876 26641667 27011215 27437874 28074030 28640588
3099B8640588M51377M03893L44471K69537J03593K38572K73964K74932N02730
$$ 28640588 29091965 29495858 29840329 30109866 30213459 30452031 30725995 31000927 31503657
3090C1503657O82622Q73775J083024J374351J776191K129947K450335K780223
$$ 31503657 32186279 33060054 34143078 35517429 37293620 39423567 41873902 44654125
3082D4654125L213216L886195M420887N363856O722675Q683999J1254467J4126144
$$ 44654125 47867341 51753536 56174423 61538279 68260954 76944953 88199420 102325564
3074A02325564J7134708K0389160K3778068K5956589K5550751K2687748J8211441
$$ 102325564 119460272 139849432 163627500 189584089 215134840 237822588 256034029
3067B56034029J2419104O372427J753584j140690k940079l827677m052667m369220
$$ 256034029 268453133 274825560 276579144 275438454 272498375 268670698 264618031 260248811
3059B60248811n095691p146752r972472j2724707j5114597j6600453j7251965
$$ 260248811 255153120 248006368 238033896 225309189 210194592 193594139 176342174
3052A76342174j7373134j6787950j5643634j4267935j2720927j1185290r565405
$$ 176342174 158969040 142181090 126537456 112269521 99548594 88363304 78797899
3045G8797899q279153p118931n938388m950598m198288l569684k990037k608166
$$ 78797899 70518746 63399815 57461427 52510829 48312541 44742857 41752820 39144654
3037C9144654k293521j957701j849844j555807j416628j168770j183196r93724
$$ 39144654 36851133 34893432 33043588 31487781 30071153 28902383 27719187 26725463
3029B6725463q51560p44630p01175n84802m60272l71165k20373l04378k83266
$$ 26725463 25873903 25129273 24428098 23843296 23383024 23011859 22791486 22487108 22203842
3020B2203842m29207m37081n85813p32934p36146o96804p15918q21970p34427
$$ 22203842 21774635 21337554 20751741 20018807 19282661 18585857 17869939 17047969 16313542
3011A6313542o73659n96816o17920o02135m44374m58875m52561m85896l36068
$$ 16313542 15639883 15043067 14425147 13823012 13378638 12919763 12467202 11981306 11645238
3002A1645238l49974r7797k12929j66519k49840k45187j86028l10786k91575k75099
$$ 11645238 11295264 11197467 10984538 10818019 10568179 10322992 10136964 9826178 9534603 9259504
2992I259504j06862j98088j51098k14929p8469j76939j70273j38102k17484j43209
$$ 9259504 9152642 8954554 8803456 8588527 8510058 8333119 8162846 8024744 7807260 7664051
2982G664051r0448j87946j75684p5774r0890j07049j18425p4252m4383j19668
$$ 7664051 7573603 7385657 7209973 7134199 7043309 6936260 6817835 6743583 6699200 6579532
2972F579532j4365J48358J32675K26782L71201L57793L6967j3406j97666k43967
$$ 6579532 6565167 6713525 6846200 7072982 7444183 7801976 7838943 7825537 7627871 7383904
2962G383904l04783k65145l25648l38809k36457k26580k27668k57089j60884j50451
$$ 7383904 7079121 6813976 6488328 6149519 5913062 5686482 5458814 5201725 5040841 4890390
2952D890390j17287j52552m4363j03331r2045M6413q1006j29092l8529m5386k2789
$$ 4890390 4773103 4620551 4576188 4472857 4380812 4427225 4346219 4217127 4178598 4133212 4110423
2941D110423r5488j17611P168r629r6142o9001J5681l3836r3064O0643p14j29471
$$ 4110423 4014935 3897324 3904492 3894863 3798721 3729720 3745401 3711565 3618501 3679144 3678430 3548959
2929C548959j8709J4892p3074o7852p9048j08449j02866k9009q6040q4643n4708
$$ 3548959 3530250 3545142 3472068 3404216 3325168 3216719 3113853 3084844 2998804 2914161 2859453
2918B859453o3895m2351j26996J455l9010n1966L1049p9680r4031p4817p9718
$$ 2859453 2795558 2753207 2626211 2627666 2588656 2536690 2567739 2488059 2394028 2319211 2239493
2907B239493J9112j9089k5811N2314K3381n9484o8708l5051K9261k6592m6029
$$ 2239493 2258605 2239516 2213705 2266019 2289400 2229916 2161208 2126157 2155418 2128826 2082797
2896B082797K5262Np3680m6565N7881k8396N1491M2795L5623m805n758n7905J0907
$$ 2082797 2108059 2108064 2034384 1987819 2045700 2017304 2068795 2111590 2147213 2142408 2136650 2078745 2089652
2883B089652J2650L488L1106N1532K4950k4209m5205r7890l5456n0080j04039
$$ 2089652 2102302 2105790 2136896 2188428 2213378 2189169 2143964 2046074 2010618 1960538 1856499
2872A856499q5535l4256j12873o4107p5227n6792o652n9843q676k769n2400K4761
$$ 1856499 1770964 1736708 1623835 1559728 1484501 1427709 1421057 1361214 1352538 1349769 1297369 1322130
2860A322130l7805j554j2365J1239l3765l1059Q072j9156L7617O196l8309K9156
$$ 1322130 1284325 1282771 1270406 1281645 1247880 1216821 1224893 1205737 1243354 1249550 1211241 1240397
2848A240397Q2980l7304M7747L806L6136N5214j9062O792o5942M8431l5040m6622
$$ 1240397 1323377 1286073 1333820 1337626 1373762 1428976 1409914 1416706 1350764 1399195 1364155 1317533
2836A317533p5710L3423l2709n5644n4417J5258L9254j39887l514n7045L7368
$$ 1317533 1241823 1275246 1242537 1186893 1132476 1147734 1186988 1047101 1043587 986542 1023910
2825A023910k9346M336j5994q2859l3452m5941j3540k0642n4445j6568K0017K2989
$$ 1023910 994564 998900 982906 900047 866595 820654 807114 786472 732027 715459 735476 758465
2813G58465k4273l2371M4742M6342k6751k0867n8873M0373j863L3852N0599o992
$$ 758465 734192 701821 746563 792905 766154 745287 686414 726787 724924 758776 809375 802383
2801H02383R979K5533N7918m8493k4537J027Q2143N1866k252R4632J27888N9688
$$ 802383 812362 837895 895813 847320 822783 823810 905953 957819 955567 1050199 1178087 1237775
2789A237775R8700J29934J14720J73886j2318K674P8334M1597L221k6657M9246
$$ 1237775 1336475 1466409 1581129 1755015 1742697 1745371 1823705 1865302 1868523 1841866 1891112
2778A891112k254J1269l7183q5980l4911m1236j16733m3790k6110j04615j06721
$$ 1891112 1888858 1900127 1862944 1776964 1742053 1700817 1584084 1540294 1514184 1409569 1302848
2767A302848j71693N1096j17957j31760j09941j5330q6982j41167N0123j1752
$$ 1302848 1131155 1182251 1064294 932534 822593 807263 720281 579114 629237 617485
2757F17485j7124j9269m8892L9322q788m0774j9549k7626N9599L1707r432N8571
$$ 617485 600361 581092 532200 571522 562734 521960 502411 474785 534384 566091 556659 615230
2745F15230k0579j2678m2465j7716J0553j1915O8943O9636l689r6013M8023K2140
$$ 615230 594651 581973 539508 521792 532345 520430 589373 659009 655320 559307 607330 629470
2733F29470l2732l8693P9804k0469o166j05734R9461K4773k3547o4290P8104R086
$$ 629470 596738 558045 637849 617380 611214 505480 604941 629714 606167 541877 619981 629067
2721F29067n2909n1735k905j6678l2169K2938l4606M5662L1747k3351j1064n1856
$$ 629067 576158 524423 521518 504840 472671 495609 461003 506665 538412 515061 503997 452141
2709D52141K7131R496j3834j6441J7709r749j3515r904p8136o0598R571j5874
$$ 452141 479272 488768 474934 458493 476202 466453 452938 443034 364898 304300 313871 297997
2697B97997J780Q5115J4052o7917P763m6299M660M0918p0914r147L8973J7119
$$ 297997 299777 384892 398944 331027 338790 292491 297151 338069 267155 258008 296981 314100
2685C14100p4035l0667j9993N7300o4271q419N2355k5320K1230r728m5911J8268
$$ 314100 240065 209398 189405 246705 182434 174015 226370 201050 222280 212552 166641 184909
2673A84909J08862m3555l3293O0407L3749n305l7166J315n6778P3102L238M6942
$$ 184909 293771 250216 216923 277330 311079 305774 268608 269923 213145 286247 289485 336427
2661C36427j3464N4488K086k6043J8244M8712k1277o963N5532m4424o6807J8423
$$ 336427 322963 377451 379537 353494 371738 420450 399173 392210 447742 403318 336511 354934
2649C54934m4573n0531n450N9668J6320P071m3534o1236N3061k4802K5770k3618
$$ 354934 310361 259830 254380 314048 330368 337439 293905 232669 285730 260928 286698 263080
2637B63080O9548p14n7386p8480Q9755k0844J042O4902m9977k0457j08769P1396
$$ 263080 332628 331914 274528 196048 285803 264959 266001 330903 280926 260469 151700 223096
2625B23096p0956K9953l2653j4567q094K1690q452m9390p088L2723n2534j6202
$$ 223096 152140 182093 149440 134873 126779 148469 140017 90627 83539 116262 63728 47526
2613D7526J9536K9121o5246j792J3986O8366m8773J2088R949K9845k7027n9815
$$ 47526 67062 96183 30937 29145 43131 111497 62724 74812 84761 114606 87579 27764
2601B7764N9741N412k6779L679j9037l840k7445q0203m2898O5796k806j0831Q120
$$ 27764 87505 92917 66138 69817 50780 46940 19495 -60708 -103606 -37810 -40616 -51447 -43327
2588d3327L6053l2980o2357N6166N7908J6576l2615J21681r0095j1045P128J0151
$$ -43327 -7274 -40254 -102611 -46445 11463 28039 -4576 117105 27010 15965 23093 33244
2576C3244M1953J2738j02095O280L7062j9629l0415r573N0237K3404j10543M1111
$$ 33244 75197 87935 -14160 -7880 29182 9553 -20862 -30435 19802 43206 -67337 -26226
2564b6226K0125l6260j22971L1803K9307L3359n0174J8601j5293m2243o3558O661
$$ -26226 -6101 -42361 -165332 -133529 -104222 -70863 -121037 -102436 -117729 -159972 -223530 -216869
2552b16869J2900m041K4305L3924P386P2829L6650m1709j9824P4187m1045j2420
$$ -216869 -203969 -208010 -183705 -149781 -142395 -69566 -32916 -74625 -94449 -20262 -61307 -73727
2540g3727M0904o0801l9214K5504l8941N1778L7610l0370J2136P188J9340l1249
$$ -73727 -32823 -93624 -132838 -107334 -146275 -94497 -56887 -87257 -75121 -67933 -48593 -79842
2528g9842J1361J379O1230J92J01377m0530q4057K8052M3877o5926m3411J706
$$ -79842 -68481 -67102 -5872 -5680 95697 55167 -28890 -838 43039 -22887 -66298 -64592
2516f4592K5724L0293j35023L6484K5308l2827L8202k3095l512M6632l5939m8955
$$ -64592 -38868 -8575 -143598 -107114 -81806 -114633 -76431 -99526 -103038 -56406 -92345 -141300
2504a41300J28062L1950l3048k3143n8173j6951Q0153p8140n0366J05237l6479
$$ -141300 -13238 18712 -14336 -37479 -95652 -112603 -32450 -110590 -160956 -55719 -92198
2493i2198N5144R646m6734J9888j5055J3333n0785K4677J07846J1613m7566l0528
$$ -92198 -37054 -27408 -74142 -54254 -69309 -55976 -106761 -82084 25762 37375 -10191 -40719
2481d0719n253p827L2928n8091P566o1028M3221j9597j1290L6277J8457Q740M3814
$$ -40719 -45972 -53799 -20871 -78962 -71396 -132424 -89203 -108800 -120090 -83813 -65356 -56616 -12802
2468a2802J11449j43120L7861O6945L5464j687O3135K0668R2972j12457L7772
$$ -12802 98647 -44473 -6612 60333 95797 94110 157245 177913 270885 158428 196200
2457A96200L3434j3557L2411m1799j5641L6263o0227K1346N235k6715n866N2400
$$ 196200 229634 216077 248488 206689 191048 227311 167084 188430 193665 166950 161084 213484
2445B13484M9536n7081l6784L3162O0851j05811l1681P8466M0869o657o5211J9554
$$ 213484 263020 205939 169155 202317 263168 157357 125676 204142 245011 238354 173143 192697
2433A92697M4092L2272o3345q257J5543L0031m0139p701k1546J9065Q4807J8670
$$ 192697 236789 269061 205716 197459 213002 243033 202894 195193 173647 192712 277519 296189
2421B96189j9845L6775O2624R313J587n5248P1318J7433J4325l0179M3660k2895
$$ 296189 276344 313119 375743 385056 386643 331395 402713 420146 434471 404292 447952 425057
2409D25057M953p2587q6837K3409M3364J3214r8673J7789O1851k1086n085J10713
$$ 425057 430010 357423 270586 293995 337359 350573 251900 269689 331540 310454 305369 416082
2397D16082J40896m8271M2184R1349m124j5660J42639L4994k1684O0595M9529
$$ 416082 556978 508707 550891 642240 638116 622456 765095 800089 778405 839000 888529
2386H88529M2123K0412R7036Q1215J90461K22946K94509K41637O1427J17483O3756
$$ 888529 930652 951064 1048100 1129315 1319776 1542722 1837231 2078868 2140295 2257778 2321534
2375B321534J53715J19807P3289J92487M17334O28388Q49269J414511L137343
$$ 2321534 2475249 2595056 2668345 2860832 3278166 3906554 4755823 6170334 9307677
2366I307677O233612Q407596O029246N42516k196411j856230j132327k278290
$$ 9307677 15541289 23948885 29978131 30520647 28324236 26468006 25335679 23057389
2358B3057389l095383k843782l049989k251441j553658j508881j478391j106011
$$ 23057389 19962006 17118224 14068235 11816794 10263136 8754255 7275864 6169853
2350F169853p15862n22229m92444m46227l52072l50191j74716k30248k41664k29471
$$ 6169853 5453991 4931762 4439318 3993091 3641019 3290828 3116112 2885864 2644200 2414729
2340B414729k13317n5776k77656j13514j16255k5275n3584r5108j35509m939n1401
$$ 2414729 2201412 2145636 1867980 1754466 1638211 1612936 1559352 1464244 1328735 1323796 1272395
2329A272395r8968m2018m1984J6941r1318J01661n8086j3938r9844N2679k4760
$$ 1272395 1173427 1131409 1089425 1106366 1015048 1116709 1058623 1044685 944841 997520 972760
2318I72760r9739Q532n494p0330l9397K8655o7005K8534p9117M4460K4502j17295
$$ 972760 873021 881553 876059 805729 766332 794987 727982 756516 677399 721859 746361 629066
2306F29066o3239Q497o6649J2289J6330n2381J4071l2774n5924m9229o0499j7749
$$ 629066 565827 574324 507675 519964 536294 483913 497984 465210 409286 360057 299558 281809
2294B81809k615J0982n621M1089o0563J1745r404l0976Q4835l2015k4326k6691
$$ 281809 279194 290176 284555 325644 265081 276826 267422 236446 321281 289266 264940 238249
2282B38249M291j26430N9091N6556o4007q1599P5151m5549n7293q252j9121N3664
$$ 238249 242540 116110 175201 231757 167750 86151 161302 115753 58460 50208 31087 84751
2270H4751o475N8316k0694m116M2818O1192j08636p6672R8342J3822r1821K048
$$ 84751 78276 136592 115898 111782 154600 215792 107156 30484 128826 142648 50827 52875
2258E2875p0771L2242L9903j4082p8077P8832K8884o2019l6232J2823O8035j6812
$$ 52875 -17896 14346 54249 40167 -37910 40922 69806 7787 -28445 -15622 52413 35601
2246C5601l2299K1109R1361n5000O2019k1290n1790K6748N2651p5076n9827O1694
$$ 35601 3302 24411 115772 60772 122791 101501 49711 76459 129110 54034 -5793 55901
2234E5901K5557k8464m7256J0138k6556L0225Q921K3844J718L2806l0334r2444
$$ 55901 81458 52994 5738 15876 -10680 19545 28466 52310 54028 86834 56500 -35944
2222c5944M3254l5462k3915K2249O7380L2788q1806n5957M8098l4094p147J0490
$$ -35944 7310 -28152 -52067 -29818 37562 70350 -11456 -67413 -19315 -53409 -60556 -50066
2210e0066J3426J2617M3492n4413M5143j0722J6180o0104M2635n053k8597m9768
$$ -50066 -36640 -24023 19469 -34944 10199 -523 15657 -44447 -1812 -6865 -35462 -85230
2198h5230K1901o724j0828M2025K4237O674n3412j3373k3459m5378K7082P2218
$$ -85230 -63329 -70053 -80881 -38856 -14619 -7945 -61357 -74730 -98189 -143567 -116485 -44267
2186d4267J2823R836r326o1011M6094k7907j7782M3754P0991K4908r2202j777
$$ -44267 -31444 -21608 -30934 -91945 -45851 -73758 -91540 -47786 23205 48113 -44089 -45866
2174d5866k3116L1865l768l3567L284K1507p3294n2124M7268P3820J7029l0060
$$ -45866 -68982 -37117 -40885 -74452 -71168 -49661 -122955 -175079 -127811 -53991 -36962 -67022
2162f7022O4113K395L013q5117O745k6775l4533J66636m8438M3712k1871O8682
$$ -67022 -2909 -514 2499 -82618 -75873 -102648 -137181 29455 -18983 24729 2858 71540
2150G1540r5857J2056k7055M4885K65J07135m0891o8068M2690N3279j6097l699
$$ 71540 -24317 -12261 -39316 5569 5834 112969 72078 4010 46700 99979 83882 80183
2138H0183M3216m6369m5100j0301M593K2603k9863M6749J5391n4601J165l3733
$$ 80183 123399 77030 31930 21629 26222 48825 18962 65711 81102 26501 27666 -6067
2126f067m3303K5773m7880N6937L9240J7180l8148m2593M8692K5855N29p346o975
$$ -6067 -49370 -23597 -71477 -14540 24700 41880 3732 -38861 9831 35686 36215 28869 21894
2113B1894o8859N8202l1310j8178l2630K9929Q646R523n3748m9760P3151k0594
$$ 21894 -46965 11237 -20073 -38251 -70881 -40952 -32306 -22783 -76531 -126291 -53140 -73734
2101g3734K2083p6947J21402R9272n4406J1805j5266L4600j5546m230n0005L9847
$$ -73734 -51651 -128598 -7196 92076 37670 49475 34209 68809 53263 49033 -972 38875
2089C8875o079l4856j7226m2404k6736j7644K209k2564L496P8251J529k9482j01610
$$ 38875 32796 -2060 -19286 -61690 -88426 -106070 -103861 -126425 -122929 -44678 -43149 -72631 -174241
2076a74241M7262n874L3013m9003N2178j4520j0455k9279k9725J7788O3790r902
$$ -174241 -126979 -132853 -99840 -148843 -96665 -111185 -121640 -150919 -180644 -162856 -99066 -108968
2064a08968j17904Q9604l1024j2612j1749k6601p110J9488L2459J6177q808n1120
$$ -108968 -226872 -137268 -168292 -180904 -192653 -219254 -226364 -206876 -174417 -158240 -167048 -218168
2052b18168R8285r3500K1600N0079R1237n8125l8023N1298o3681j8365M9860K0242
$$ -218168 -119883 -213383 -191783 -141704 -50467 -108592 -146615 -95317 -158998 -177363 -127503 -107261
2040a07261K4970Q0740p0822K5353O270m3934m2690K5175J8090J1033l6101o8090
$$ -107261 -82291 -1551 -72373 -47020 -40750 -84684 -127374 -102199 -84109 -73076 -109177 -177267
2028a77267N0614l8060r46n5151N9496J7706Q462j8994J4190n7999J6476N552
$$ -177267 -126653 -164713 -165659 -220810 -161314 -143608 -135146 -154140 -139950 -197949 -181473 -175921
2016a75921K986J05751q762M3185m8051k5953k8272L0385q3159O9090J2708j0017
$$ -175921 -172935 -67184 -75946 -32761 -80812 -106765 -135037 -104652 -187811 -118721 -106013 -116030
2004a16030l0459o280L8584J0762k4067n11K1522N304k641m1071o9104q710J07017
$$ -116030 -146489 -152769 -114185 -103423 -127490 -128001 -106479 -101175 -103816 -144887 -213991 -222701 -115684
1991a15684M6673j36667J3091J22182K965r2471m7645K4029R4108q418N8975l2139
$$ -115684 -69011 -205678 -192587 -70405 -67440 -159911 -207556 -183527 -89419 -97837 -38862 -71001
1979g1001K9050o8534j412k3942m1300R5658M4091r1844J1651L1132r8885n1456
$$ -71001 -41951 -110485 -111897 -135839 -177139 -81481 -37390 -129234 -117583 -86451 -185336 -236792
1967b36792L7435M9880k5982N8806k0261p7236l3352N2330P4143k8339O2792R7677
$$ -236792 -199357 -149477 -175459 -116653 -136914 -214150 -247502 -195172 -121029 -149368 -86576 11101
1955A1101j06284L7202j7782l8471l787M6778k1493J1289n358J7685p987J4959
$$ 11101 -95183 -57981 -75763 -114234 -118021 -71243 -92736 -81447 -86805 -69120 -77107 -62148
1943f2148K2810j00998N960M7266l693m0147O0974k9465J7549q94m7759O4681
$$ -62148 -39338 -140336 -134376 -87110 -90803 -130950 -69976 -99441 -81892 -82786 -130545 -65864
1931f5864n9508p048n549K0547O1635N0943n6749M936J42737r1517R044m7499
$$ -65864 -125372 -132420 -137969 -117422 -55787 -4844 -61593 -56657 86080 -5437 3607 -43892
1919d3892P2985k7534l2138L9294m149k7015n0767M5628K7710P7122j30229j4856
$$ -43892 29093 1559 -30579 8715 4566 -22449 -73216 -27588 122 77244 -52985 -67841
1907f7841k6093k5647l1145L4085K9999m3356N1048k2088J3910j45785L4907R1751
$$ -67841 -93934 -119581 -150726 -116641 -86642 -129998 -78950 -101038 -87128 -232913 -198006 -106255
1895a06255J562m1020J3360L6725r119K6997j15084J17588Q6928o7223n9095L4522
$$ -106255 -104693 -145713 -132353 -95628 -104747 -77750 -192834 -75246 11682 -55541 -114636 -80114
1883h0114m794l9294K6815N7654J158j7735k5499n9488m9521L0982P296K5246
$$ -80114 -84908 -124202 -97387 -39733 -38575 -56310 -81809 -141297 -190818 -159836 -152540 -127294
1871a27294J5301M100l4384O2487l8241q794j1781k2348M0183J1077m577O8212
$$ -127294 -111993 -107893 -142277 -79790 -118031 -126825 -138606 -160954 -120771 -109694 -114271 -46059
1859d6059n8453K5727J1043K0255N0629M645o5683M7520K8252q6399J7406j7161
$$ -46059 -104512 -78785 -67742 -47487 3142 7787 -57896 -10376 17876 -68523 -51117 -68278
1847f8278L3677n0551K8044m2078o3488o8459k6706L5283m172J35202m7666l820
$$ -68278 -34601 -85152 -57108 -99186 -162674 -231133 -257839 -222556 -226728 -91526 -139192 -143012
1835a43012L7449q8084Q1309J5152M750P7627l2987m8960M4518j12168K9524k3325
$$ -143012 -105563 -193647 -112338 -97186 -92436 -14809 -47796 -96756 -52238 -164406 -134882 -158207
1823a58207L8430K721k1615k8805l2411N6372l2174N2307O224K0183N1408l8170
$$ -158207 -119777 -117056 -138671 -167476 -199887 -143515 -175689 -123382 -117158 -96975 -45567 -83737
1811h3737N7M553m2866j4075L0290J0779L3158j34048L5030N1364l4264M5835
$$ -83737 -83680 -79127 -121993 -136068 -105778 -94999 -61841 -195889 -160859 -109495 -143759 -97924
1799i7924J1622j7509j835M5455m3529k7772M5706J14220k1534q9172O2252L0345
$$ -97924 -86302 -103811 -105646 -60191 -103720 -131492 -85786 28434 6900 -82272 -20020 10325
1787A0325o3259m8276K0204n5604J21701J7059q6349m8942M4186M5504p7037j2868
$$ 10325 -52934 -101210 -81006 -136610 -14909 2150 -84199 -133141 -88955 -43451 -120488 -133356
1775a33356R2567k187j4463n223l0168k8389M4162K6075J3093m3737K3621N7233
$$ -133356 -40789 -42976 -57439 -62662 -92830 -121219 -77057 -50982 -37889 -81626 -58005 -772
1763g72n8992j02337L9158K9143L9279l3296p8580J0387K6562N4420m6948L0457
$$ -772 -59764 -162101 -122943 -93800 -54521 -87817 -166397 -156010 -129448 -75028 -121976 -91519
1751i1519N0286J10663n2317J5168q045k7495J2241L2663r5431k4846K7316J208
$$ -91519 -41233 69430 17113 32281 24236 -3259 8982 41645 -53786 -78632 -51316 -50108
1739e0108k0931r3551M7565K1839p0m9604j0039L7692M4554k8055j4121Q6407
$$ -50108 -71039 -164590 -117025 -95186 -95256 -144860 -154899 -117207 -72653 -100708 -114829 -28422
1727b8422K2590K8057o4132J2775l0320L0619j8416m4717Q708L710J6064n4101
$$ -28422 -5832 22225 -41907 -29132 -59452 -28833 -47249 -91966 -83258 -79548 -63484 -117585
1715a17585N2646m2908L3076N2218j6400j1949M0342Q4958j5112p8621q9057R3500
$$ -117585 -64939 -107847 -74771 -22553 -38953 -50902 -10560 74398 59286 -19335 -108392 -14892
1703a4892o8484O6017o0439j3804J2790k7206P482o9134J03334l4226K5101l3397
$$ -14892 -83376 -17359 -77798 -91602 -78812 -106018 -98536 -167670 -64336 -98562 -73461 -106858
1691a06858l0882J2230J0227N2833O215j5430L7528J33693r5640n8541l6354K4885
$$ -106858 -137740 -125510 -115283 -62450 -56235 -71665 -34137 99556 3916 -54625 -90979 -66094
1679f6094K1242m5150R827K0503M3988k4291l4553r8571K379L4667n566L9622
$$ -66094 -44852 -90002 -80175 -59672 -15684 -39975 -74528 -173099 -170720 -136053 -141619 -101997
1667a01997K0857o1058J4598O8151q0979P7788o0113J5267j7645k4179J7521q387
$$ -101997 -81140 -142198 -127600 -59449 -140428 -62640 -122753 -107486 -125131 -149310 -131789 -140176
1655a40176M6856L6610N2592K242O8197q2518M5186O625j0887j6805j7846o169
$$ -140176 -93320 -56710 -4118 -1876 66321 -16197 28989 35614 24727 7922 -9924 -16093
1643a6093P436j8272L1831r069o1224K2228m5407m3550K7551J7983K1968M6221
$$ -16093 -8657 -26929 4902 -4167 -65391 -43163 -88570 -132120 -104569 -86586 -64618 -18397
1631a8397M292n7515j4544l569m6980m2869L1506j4321j1501L3446R078J7897
$$ -18397 -14105 -71620 -86164 -89733 -136713 -179582 -148076 -162397 -173898 -140452 -131374 -113477
1619a13477N9775L7788m4776q806J6510j1919k12N1526L793L236N3714m3996o391
$$ -113477 -53702 -15914 -60690 -69496 -52986 -64905 -65117 -13591 -9798 -6562 47152 3156 -3235
1606c235j0171M4961n5788n2487N1394J6901p5700j533L4018j167N436j3487o792
$$ -3235 -13406 31555 -24233 -76720 -25326 -8425 -84125 -85658 -51640 -52807 -47371 -60858 -67650
1593f7650N3134J807q3366Q0117L1249J5410K7143k8645N0273j8108m6104m315
$$ -67650 -14516 -12709 -96075 -15958 15291 30701 57844 29199 79472 61364 15260 10945
1581A0945K1557Q684J5661p5049L2032K9445m7018q120O0802j7562k3546J5556
$$ 10945 32502 41186 56847 -18202 13830 43275 -3743 -11863 48939 31377 7831 23387
1569B3387k0637j6145l9748J5099J3654l4012j3808N3230j35807j1935m4113J0009
$$ 23387 2750 -13395 -53143 -38044 -24390 -58402 -72210 -18980 -154787 -166722 -210835 -200826
1557b00826P6211L2419J3178J8662l867N980Q55j818j084l1154K0226m6292R4905
$$ -200826 -124615 -92196 -79018 -60356 -64223 -58243 -57388 -59206 -60290 -91444 -71218 -117510 -22605
1544b2605N0750r4593n8196O4507K019n7686j9775M1145K6860l0440n530L9816
$$ -22605 28145 -66448 -124644 -60137 -58118 -115804 -135579 -94434 -67574 -98014 -103544 -63728
1532f3728K6930j5812P240N887l7761O995o7892N580M9336R528p4405M0884L2217
$$ -63728 -36798 -52610 -45370 -39483 -77244 -70249 -138141 -132561 -83225 -73697 -148102 -107218 -75001
1519g5001p624J4218J2493K6625o307O3169n9068N7981j25948N0698L4178o1439
$$ -75001 -82625 -68407 -55914 -29289 -35596 27573 -31495 26486 -99462 -48764 -14586 -76025
1507g6025j7512M8827P6274l4874k4456n8310O6692l7555l1834j9673J0367K8373
$$ -76025 -93537 -44710 31564 -3310 -27766 -86076 -19384 -56939 -88773 -108446 -98079 -69706
1495f9706q859k2516J3557J02183j19995k2734J3424L9164J1181M667M3692L146
$$ -69706 -78565 -101081 -87524 14659 -105336 -128070 -114646 -75482 -64301 -59634 -15942 -12796
1483a2796l104L2090J7005q5394J1550N9969m4917k8967r61M6750p1357J3718
$$ -12796 -15900 16190 33195 -52199 -40649 19320 -25597 -54564 -55525 -8775 -80132 -66414
1471f6414j5538K1904n1634J3839p944l6035K9947P362P909M7248J36950m3785
$$ -66414 -81952 -60048 -111682 -97843 -105787 -141822 -111875 -104513 -96604 -49356 87594 43809
1459D3809m6366p3587O2309j03629k3923L9724K8705O0462l5738q606n0182L0645
$$ 43809 -2557 -76144 -13835 -117464 -141387 -101663 -72958 -12496 -48234 -56840 -107022 -76377
1447g6377j1628M1725P448k2864M3327k0335N4314R907m9856Q6287m3008j32976
$$ -76377 -88005 -46280 -38832 -61696 -18369 -38704 15610 25517 -24339 61948 18940 -114036
1435a14036L1348m9508l5590N8851k2394Q5151k663J5755J4666J4806m7646m0813
$$ -114036 -82688 -132196 -167786 -108935 -131329 -46178 -48841 -33086 -18420 -3614 -51260 -92073
1423i2073J0221L0668Q1596l6057K920l0178j5304q6250L7148m5777R9268r7879
$$ -92073 -81852 -51184 30412 -5645 -2725 -32903 -48207 -134457 -97309 -143086 -43818 -141697
1411a41697m7032L2705k2474j3477L451Q0830l651j5471j2366j9747o8322N0535
$$ -141697 -188729 -156024 -178498 -191975 -188524 -107694 -111345 -126816 -139182 -158929 -227251 -176716
1399a76716k5687J2887Q9414n456j5888k7339Q8670n6926j2856J039J7633j1656
$$ -176716 -202403 -189516 -100102 -105558 -121446 -148785 -60115 -117041 -129897 -128858 -111225 -122881
1387a22881K2080Q9177j4360o9186N1737J549k549k0784Q550Q492m0498j614J9181
$$ -122881 -100801 -11624 -25984 -95170 -43433 -41884 -44433 -65217 -56667 -48175 -88673 -90287 -71106
1374g1106N4417M3843q526l0726P494o8189K9391m9903K1437N834M4115J2924
$$ -71106 -16689 27154 18628 -12098 -4604 -72793 -43402 -93305 -71868 -66034 -21919 -8995
1362h995j6926n9539Q1751k3851K7046m4780L4025P4903m0103L7745p0170m446
$$ -8995 -25921 -85460 -3709 -27560 -514 -45294 -11269 63634 23531 61276 -8894 -13340
1350a3340K9696O1219j05085K2835k8859p5462l5412L791k1108P3908O5993j8054
$$ -13340 16356 77575 -27510 -4675 -33534 -108996 -144408 -140617 -161725 -87817 -21824 -39878
1338c9878L3385p1759L668J3494J1510k0582M1776M2910m5477n2670m1230M7397
$$ -39878 -6493 -78252 -74584 -61090 -49580 -70162 -28386 14524 -30953 -83623 -124853 -77456
1326g7456n2936k8835J1727P2473l6528q6226R6903M52J4439J0003K4251O8175
$$ -77456 -130392 -159227 -147500 -75027 -111555 -197781 -100878 -100426 -85987 -75984 -51733 16442
1314A6442j4358L367k0960j2825q775K5347L7544k986l5176j7525j4330J0491
$$ 16442 2084 5451 -15509 -28334 -37109 -11762 25782 22796 -12380 -29905 -44235 -33744
1302c3744M4932o9102J13874j4410L0930j1895j344k3130L3390L2195J7864n5419
$$ -33744 11188 -57914 55960 41550 72480 60585 59241 36111 69501 101696 119560 64141
1290F4141l4294M6273j22926l334K8413l0505K9042M452K0335j00698J05033j4914
$$ 64141 29847 76120 -46806 -50140 -21727 -52232 -23190 -18738 1597 -99101 5932 -8982
1278h982m7843N2845P100N5912r452j6964p902O4622k9539n8416m1257L2601k2075
$$ -8982 -56825 -3980 3120 59032 49580 32616 24714 89336 59797 1381 -39876 -7275 -29350
1265b9350m0728j473K8360k2212K2081N3637l3285m9020R4876j01918k043P9039
$$ -29350 -70078 -71551 -43191 -65403 -43322 10315 -22970 -71990 22886 -79032 -81075 -2036
1253b036P8251m2691o1524P842k3760J3369q748q197l2827L2442J8761m8320R434
$$ -2036 76215 33524 -28000 -20158 -43918 -30549 -39297 -47494 -80321 -47879 -29118 -77438 -68004
1240f8004L9957Q9610l6193q866m378O5762p6589j0493l3240L4762O4475p418
$$ -68004 -28047 61563 25370 16504 12126 77888 1299 -9194 -42434 -7672 56803 49385
1228D9385n9437L4871J5596k0877m191n9655P0139k5292M7697L2529J8685k2955
$$ 49385 -10052 24819 40415 19538 15347 -44308 25831 539 48236 80765 99450 76495
1216G6495O0733p0153M8285k907o4669j7936l442m5105k2901K6033J9132M6894
$$ 76495 137228 67075 115360 112453 47784 29848 26406 -18699 -41600 -15567 3565 50459
1204E0459R416m2373M1132n9931j0784L6640k3105N149N6590k4779J7497j21830
$$ 50459 59875 17502 58634 -1297 -12081 24559 1454 6603 63193 38414 55911 -65919
1192f5919M3190j438q2370K2188P2660k3722l7096j6939Q9112M0594l415J3397
$$ -65919 -22729 -24167 -106537 -84349 -11689 -35411 -72507 -89446 -334 40260 36845 50242
1180E0242P962M0551m5820k901n9575m6934O4627j468m1746L909r4460K214j01172
$$ 50242 58204 98755 52935 50034 -9541 -56475 8152 6684 -35062 -31153 -125613 -123399 -224571
1167b24571O5950L4963l0374L0815P0194j8190O2019K2534M327Q948O8708K6895
$$ -224571 -158621 -123658 -154032 -123217 -53023 -71213 -9194 13340 17667 26615 95323 122218
1155A22218q5619k1963m552m2285n320M1161R6380j4784M8728o3865n1699R870
$$ 122218 36599 14636 10084 -32201 -37521 3640 100020 85236 133964 70099 18400 28270
1143B8270K9786n2653P0305l4838K8438q7767n5812j4018k8039K0788m5349J3968
$$ 28270 58056 5403 75708 40870 69308 -18459 -74271 -88289 -116328 -95540 -140889 -126921
1131a26921j0657M6767k5182J1856R240O3776O0801K5452r2155K1566O0281j31053
$$ -126921 -137578 -90811 -115993 -104137 -94897 -31121 29680 55132 -37023 -15457 44824 -86229
1119h6229r947N9812j9441P8753L5549m8451n7535l6542m4372j1304p157Q8417
$$ -86229 -96176 -36364 -55805 22948 58497 10046 -47489 -84031 -128403 -139707 -146864 -58447
1107e8447L8465k5011j4410j6439M455O3652k2167k8816N3093l6058m5603m5173
$$ -58447 -19982 -44993 -59403 -75842 -71387 -7735 -29902 -58718 -5625 -41683 -87286 -132459
1095a32459J5273N6583p723M2883M9959k3875J916K9809m4728L1244L088M0452
$$ -132459 -117186 -60603 -68326 -25443 24516 641 2557 32366 -12362 18882 21970 62422
1083F2422k5058j9920J155M1107o7951m8467L6930M6M1343j9885k2121m4932j237
$$ 62422 37364 17444 18599 59706 -8245 -56712 -19782 -19736 21607 1722 -20399 -65331 -66568
1070f6568P7584j0535n5735M0123M5858k2807j1732J2024M1987l0360J0000o0345
$$ -66568 11016 481 -55254 -15131 30727 7920 -3812 8212 50199 19839 29839 -30506
1058c0506K4112k6852o037L9239l0481k9852N2320M4111j8371p784j2722R9971
$$ -30506 -6394 -33246 -39283 -44 -30525 -60377 -8057 36054 17683 9899 -2823 97148
1046I7148q8445m9847R3761q2705N0651r854J5423J8294p658q0282J9754k206
$$ 97148 8703 -41144 52617 -30088 20563 10709 26132 44426 36768 -43514 -23760 -25966
1034b5966o9854j5058L5537j1606n4873L1761q213N9777n5652L6855m9546R083
$$ -25966 -95820 -110878 -75341 -86947 -141820 -110059 -118272 -58495 -114147 -77292 -126838 -117755
1022a17755K0439J7453K0430M5533k5656K8491m855K147L0218l0781J0248L3837
$$ -117755 -97316 -79863 -59433 -13900 -39556 -11065 -15920 -13773 16445 -14336 -4088 29749
1010B9749j807K9956k1605J8982M0404j6035L820O3167q8555q0679Q8092j8284
$$ 29749 27942 57898 36293 55275 95679 79644 83464 146631 58076 -22603 65489 47205
998D7205q1689K5339O0725p9944J7951l1629N1595q7363J6394O1038k0666K4506
$$ 47205 -34484 -9145 51580 -28364 -10413 -42042 9553 -77810 -61416 -378 -21044 3462
986C462P55k7415M4606L8293m1865J3142K0788N1968r4870l6089O6024m54j3833
$$ 3462 4217 -23198 21408 59701 17836 30978 51766 103734 8864 -27225 38799 38345 24512
973B4512K3856M2353J7258o7145j1951m6806l3556J4201M3290R575o0058j6296
$$ 24512 48368 90721 107979 40834 28883 -17923 -51479 -37278 6012 15587 -44471 -60767
961f0767J11384j21948L1642m34m51L785R1662k5828j80271R4041K9991l4659
$$ -60767 50617 -71331 -39689 -40123 -40574 -36789 54873 29045 -151226 -57185 -27194 -61853
949f1853M440O2177L6355o7450l3689N2765l2441N2199J14620j20472J08246K3760
$$ -61853 -57413 4764 41119 -26331 -60020 -7255 -39696 12503 127123 6651 114897 138657
937A38657J3727m7776o2989J3008o2606L9355l984p4725O163J17068o8416k5034
$$ 138657 152384 104608 41619 54627 -7979 31376 27392 -47333 -41170 75898 7482 -17552
925a7552j7984N6762j7086J5191k9420j9865k2233M54k1930j9711L9087J30246
$$ -17552 -35536 21226 4140 19331 -10089 -29954 -52187 -51733 -73663 -93374 -54287 75959
913G5959j49975j3092K6911L7311m6417p136q91L6844P9961O6153j07032n4548
$$ 75959 -74016 -87108 -60197 -22886 -69303 -76439 -77330 -40486 39475 105628 -1404 -55952
901e5952J00176l5807O312L6996j5228l9940K8463j3515p1241n1496J00342O261
$$ -55952 44224 8417 14729 51725 36497 -3443 25020 11505 -59736 -111232 -10890 -4629
889d629o4101l0655N8005j02436M9740M5581j1714K2633J11464m2495j18919O3354
$$ -4629 -68730 -99385 -41380 -143816 -94076 -48495 -60209 -37576 73888 31393 -87526 -24172
877b4172R2414m6084j1439K7196O4598j8235l0366l6997K641j0482j8652J1961
$$ -24172 68242 22158 10719 37915 102513 84278 53912 16915 19556 9074 -9578 2383
865B383K5914P400Q5581l7904n0023J6640m3434K4681j2130l3302K103K0058j672
$$ 2383 28297 35697 121278 83374 33351 49991 6557 31238 19108 -14194 -12091 7967 6295
852F295n4293J2023R0496k7475o8375Q118J0608l7841l4753J21508K8690J1140
$$ 6295 -47998 -35975 54521 27046 -41329 -33211 -22603 -60444 -95197 26311 55001 66141
840F6141M8581j14002L0328L332o9993q7543L5044O1799n1969j8396M3663k6686
$$ 66141 114722 720 31048 34380 -35613 -123156 -88112 -26313 -78282 -96678 -53015 -79701
828g9701O7803m4522J8599J5457l2174K7911p1279N4454M2357M4864Q686j0378
$$ -79701 -11898 -56420 -37821 -22364 -54538 -26627 -97906 -43452 -1095 43769 52455 42077
816D2077Q5923j1732o9260m9635J3215m4300O1485j7465N8523o0115K5199J5863
$$ 42077 128000 116268 47008 -2627 10588 -33712 27773 10308 68831 8716 33915 49778
804D9778j45905j2433J26499K987q7392Q4900J32864o0094j07355j6714R3098
$$ 49778 -96127 -108560 17939 20926 -66466 18434 151298 91204 -16151 -32865 60233
793F0233o0159l0384m648K3376o58K0037m4839j4619P1725p85N9574o9504J8089
$$ 60233 74 -30310 -34958 -11582 -12240 7797 -37042 -51661 20064 19279 78853 9349 27438
780B7438l246m0017n6439N3825M1776N8890L7070r0564n6424P427l7802n1734
$$ 27438 24192 -15825 -72264 -18439 23337 82227 119297 28733 -27691 -20264 -58066 -109800
768a09800k2901Q0346J5967J4402O104p00J7079L0111p1624R580O5446j8935j8747
$$ -109800 -132701 -52355 -36388 -21986 -15882 -16582 497 30608 -41016 -31436 34010 15075 -3672
755c672J4650O4102q0271K7240Q1779j4512j4040n9309k3325n4510J2330K9988
$$ -3672 10978 75080 -5191 22049 103828 89316 75276 15967 -7358 -61868 -49538 -19550
743a9550j8609R7225P5745p2933l0602n7718l1752O8668k4759k5715N4717N7116
$$ -19550 -38159 59066 134811 61878 31276 -26442 -58194 10474 -14285 -40000 14717 71833
731G1833N3441q4292k2295N9573L7281j06103K9038J9246K8550l1530p0521q189
$$ 71833 125274 40982 18687 78260 115541 9438 38476 57722 86272 54742 -15779 -23968
719b3968Q1604O36l5669o4856K723K2254l0170J5402N1934k0799O9540K2157k8931
$$ -23968 57636 58272 22603 -42253 -39530 -17276 -47446 -32044 19890 -909 68631 90788 61857
706F1857j8377N4995J1316p1666m4037M9005L8750l4015K320p3552K6481L3298
$$ 61857 43480 98475 109791 38125 -5912 43093 81843 47828 50148 -23404 3077 36375
694C6375k3432k9242R081L2996J2149m9569J24795N103n0820N3407P7619j24529
$$ 36375 12943 -16299 -7218 25778 37927 -11642 113153 118256 67436 120843 198462 73933
682G3933p8576M633J2241k5246p603k0810K2904N1211p0304m0262N0739R6576
$$ 73933 -4643 -10 12231 -13015 -20618 -41428 -18524 32687 -37617 -77879 -27140 69436
670F9436m1577m4683O8336N182J9824o015M3232J9634o2967M0105k4439o4550
$$ 69436 27859 -16824 51512 56694 76518 70503 113735 133369 70402 110507 86068 21518
658B1518q832J3963k4411k6287O8604R182L3985j4499J607n5046J17436k1692
$$ 21518 12686 26649 2238 -24049 44555 53737 87722 73223 74830 19784 137220 115528
646A15528l765L9314R308p3204n7934K5128k0480N6342j4433k8082j7583L8995
$$ 115528 111763 151077 160385 87181 29247 54375 33895 90237 75804 47722 30139 69134
634F9134k3673N3783p2669N0218Q4896n0781q485M7576M3429p1931J5573K2780
$$ 69134 45461 99244 26575 76793 161689 110908 102423 149999 193428 121497 137070 159850
622A59850j5958j978j9510j0806p703k255M06m1634l2914N556L6370r6239O71
$$ 159850 143892 141914 122404 111598 103895 101640 102046 60412 27498 33054 69424 -26815 -26144
609b6144J5216J3385k0113N1618l9766P1249M0797k5264q869K8901k1069j6363
$$ -26144 -10928 2457 -17656 33962 -5804 65445 106242 80978 72109 101010 79941 63578
597F3578J03669j5673p9061J5604j9360m1228L4892K7102O1766n1117j2335M5495
$$ 63578 167247 151574 72513 88117 68757 27529 62421 89523 151289 100172 87837 133332
585A33332l3384n1256O6735o0249J040M1038J8598n4524P839k8949q2227J1331
$$ 133332 99948 48692 115427 55178 56218 97256 115854 61330 69169 40220 -42007 -30676
573c0676M7565m5958k4193O7143M254p2603P9292N5952N7173J4929n2315q452
$$ -30676 16889 -29069 -53262 13881 18135 -54468 24824 80776 137949 152878 100563 92111
561I2111j7830k327L1110j7888O2908M1056q2449o4399N3695l9344j7304n0759
$$ 92111 74281 71954 103064 85176 148084 189140 106691 42292 95987 56643 39339 -11420
549a1420P6723p9725O0602K7634J7428j6694J1480K4897j9266M0090m9623N7188
$$ -11420 65303 -14422 46180 73814 91242 74548 86028 110925 91659 131749 82126 139314
537A39314n2838K9707l4261M6996J0192M5609q6366k9476P5479k8298m3486J2520
$$ 139314 86476 116183 81922 128918 139110 184719 98353 68877 144356 116058 72572 85092
525H5092J34276n5947p6421j8838M1890k4453n302m0623j4020Q052K2323l8592
$$ 85092 219368 163421 87000 68162 110052 85599 80297 39674 25654 33706 56029 17437
513A7437l2181O5019L4450p4630K1404J15132n3558j9874j7840o159n5129R0503
$$ 17437 -14744 50275 84725 10095 31499 146631 93073 73199 55359 49200 -5929 84574
501H4574K05m3556M658J11244m8005o5473k8470K9416R810N182J4899j3488P4867
$$ 84574 84779 41223 45881 157125 109120 43647 15177 44593 54403 59585 74484 60996 135863
488A35863k435K9342R224m5836j1352o856L0534q3743j4345N2084L0678j2526
$$ 135863 133428 162770 171994 126158 114806 107950 138484 54741 40396 92480 123158 110632
476A10632N044Q0228q739m8955l5138j5873J8380K1023J3030q542J3970K8036
$$ 110632 115676 195904 187165 138210 103072 87199 105579 126602 139632 131090 145060 173096
464A73096L4853m6849o2146l1744L0405K3016k7571M6512j1116L281j9628O5168
$$ 173096 207949 161100 98954 67210 97615 120631 93060 139572 128456 131737 112109 177277
452A77277J9759m6943O510J3827r0143Q456N0667k3148K3553l9K1257m4467M1050
$$ 177277 197036 150093 156603 170430 80287 88743 139410 116262 139815 139776 161033 116566 157616
439A57616j6212r3265K4684N6224o5089M2223j4037K7300k2548L6264M7693m9041
$$ 157616 141404 48139 72823 129047 63958 106181 92144 119444 96896 133160 180853 131812
427A31812J5559j9430r41K3646K7529K2711m0985m2512K7775K39l420r2956n90
$$ 131812 147371 127941 127000 150646 178175 200886 159901 117389 145164 145403 141983 49027 48437
414D8437Q474m4587K8228P4912m0217J0938M86O0198k1933o8661n3207k3876P8610
$$ 48437 56911 12324 40552 115464 75247 86185 86671 146869 124936 56275 3068 -20808 57802
401E7802K3597p5386N7577Q1538l8071p1870k5004N9192m8026M1951K1454o028
$$ 57802 81399 6013 63590 145128 107057 35187 10183 69375 21349 63300 84754 78726
389G8726K2969N7552o4035k1158J4152R5396p6463m2651L9752o3265P3719J1358
$$ 78726 101695 159247 95212 74054 88206 183602 107139 64488 104240 40975 114694 126052
377A26052r0860l3608K11915m9581j14236k4725N2451n8788L0469l509N9522P3856
$$ 126052 35192 1584 213499 163918 49682 24957 77408 18620 49089 45580 105102 178958
365A78958o7425L4469m4327J5664N7815l9241q2916K0046L7285o0372K1546k9454
$$ 178958 111533 146002 101675 117339 175154 135913 52997 73043 110328 49956 71502 42048
353D2048O8927k710P3594l3422k3364J0275J1826m8143j5171O2228J4271J2524
$$ 42048 110975 108265 181859 148437 125073 135348 147174 99031 83860 146088 160359 172883
341A72883m4170L9121m1935p1658J0131K1779j03416K6387M8865q2836o2153O8557
$$ 172883 128713 167834 125899 54241 64372 86151 -17265 9122 57987 -24849 -87002 -18445
329a8445J1559j3634N5305K0992K7420L9137m2340P712n5965J43033o2321J5075
$$ -18445 -6886 -20520 34785 55777 83197 122334 79994 87706 31741 174774 112453 127528
317A27528l0522K0825L1268q7156P1920J5490j01531K0789Q3120j20335M5296
$$ 127528 97006 117831 149099 61943 133863 149353 47822 68611 151731 31396 76692
306G6692M8337l9580k1970P1399m1941n980p481o0507O0122l9092j3971q334o541
$$ 76692 125029 85449 63479 134878 92937 86957 79476 18969 79091 39999 26028 17694 11153
293A1153Q565O4072k9160K8240O6122p1630K0437O178L247l8521J06100j7093
$$ 11153 19718 83790 54630 82870 148992 77362 97799 103977 107224 68703 174803 157710
281A57710q9619P2314k1100l4055p888M4136k7077j2034m4795r09n7751M3660
$$ 157710 68091 140405 119305 85250 77362 121498 94421 82387 37592 36683 -21068 22592
269B2592K0579L8068L7971m3282K2552j6740N3598k6855J629n446M0420L4732
$$ 22592 43171 81239 119210 75928 98480 81740 135338 108483 110112 104666 145086 179818
257A79818o0213L1126n0337o8609P556N5169o513K1483P914q50J6286m6040K5872
$$ 179818 119605 150731 100394 31785 39341 94510 87997 109480 117394 116544 132830 86790 112662
244A12662M5952K809n2385N8547o4070J1408N910j6431j5677N3494k0218o7497
$$ 112662 158614 161423 109038 167585 103515 114923 120833 104402 88725 142219 122001 54504
232E4504J219j8382K4385M4677K3366j2885M6608k5495K9878J7052j43405K1499
$$ 54504 55723 37341 61726 106403 129769 116884 163492 137997 167875 184927 41522 63021
220F3021O2067k5795o436K2483q818o8700k9543K6497l114M9347N6769j7806n9729
$$ 63021 125088 99293 92857 115340 106522 37822 8279 34776 31662 81009 137778 119972 60243
207F0243m4752N5605J6031m3457O2411Q8904k0996n1031l922J1927K7797r5394
$$ 60243 15491 71096 87127 43670 106081 194985 173989 122958 119036 130963 158760 63366
195F3366J9223L8900o299N1311j8972j11279O06J11697j6263l8761j5390O6926
$$ 63366 82589 121489 115190 166501 147529 36250 36856 148553 132290 93529 78139 145065
183A45065l6902k7531r339L0297J7287J27714m4364m4618J0796j02269L8559L4609
$$ 145065 108163 80632 71293 101590 118877 246591 202227 157609 168405 66136 104695 139304
171A39304k9440K7673L6716o8769J4901k813j2779L3711M6292K6499o5879k1605
$$ 139304 109864 137537 174253 105484 120385 117572 104793 138504 184796 211295 145416 123811
159A23811k977j6456J5216K2937k149K5064Q49m0204n3440k0068J3376n9259J429
$$ 123811 120834 104378 119594 142531 140382 165446 166295 126091 72651 52583 65959 6700 8129
146H129O7658Q7346n1522Q915j2714q5449R2328n313l0466P2173j6449l6273k5664
$$ 8129 75787 163133 111611 120526 107812 22363 114691 109378 78912 151085 134636 98363 72699
133G2699K7121M4699n30M706n3823o7161Q3144j4676k6320J7266Q9420K5744k0928
$$ 72699 99820 144519 143989 148695 94872 27711 110855 96179 69859 87125 176545 202289 181361
120A81361K3856n3812m2069n6808J212p763J7322K1054N2733k4796m860R799J2763
$$ 181361 205217 151405 109336 52528 53740 45977 63299 84353 137086 112290 107430 117229 129992
107A29992l7236j3558J0576L359J1428Q107q290K0O5356j060m0882n3255N5230
$$ 129992 92756 79198 89774 93133 104561 112668 104378 104398 169754 168694 127812 74557 129787
94A29787k2062p0363J6918L175J1606k400K8398k1938p871K9122k697m5002k7875
$$ 129787 107725 37362 54280 57455 69061 66661 95059 73121 65250 94372 91675 46673 18798
81A8798K3640L3220R471m0767O9593L0852n1357L147K8546o808N0570j4569n8416
$$ 18798 42438 75658 85129 44362 113955 144807 93450 96597 125143 118335 168905 154336 95920
68I5920M5680J9740K0292l1411l3483L2401K0277l4352J9565K294j4604O926j5245
$$ 95920 141600 161340 181632 150221 116738 149139 169416 135064 154629 156923 142319 149245 134000
55A34000j9297l513k4657M7921Q078m1096N0210k1058J4273j7655L801J8542l5851
$$ 134000 114703 111190 86533 134454 142532 101436 151646 130588 144861 127206 131007 149549 113698
42A13698n681L8626J498j3419L1806K4351j9622l6287j2601N2013L594k9103l5112
$$ 113698 108017 146643 148141 134722 166528 190879 171257 134970 122369 174382 177976 148873 113761
29A13761L0389Q679p622j5734N5314l7948o8473N1361j8342K4306k3856l35K8419
$$ 113761 144150 152829 145207 129473 184787 146839 78366 129727 111385 135691 111835 111500 139919
16A39919L9549n6334M915N513M8362m4955p7732P727M34K1292J3533J2466j3243
$$ 139919 179468 123134 128049 133562 181924 136969 59237 66964 67398 88690 102223 114689 101446
3A01446l1079M6773R912
$$ 101446 70367 117140 127052
0A27052
$$ 127052
$$ Imaginary data points
##PAGE= N=2
##DATA TABLE= (X++(I..I)), XYDATA
16383h64569L9697k3874k4250Q1330J6309m6641K9052L2503m487L5815N384M1425
$$ -864569 -824872 -848746 -872996 -791666 -775357 -821998 -792946 -760443 -764930 -729115 -723731 -682306
16371f82306N1338P7557J3032r690M9369j8135n5331J0111N4736J3146L6303m8091
$$ -682306 -630968 -553411 -540379 -550069 -500700 -518835 -574166 -564055 -509319 -496173 -459870 -507961
16359e07961L7233m994J3617R887P422Q2916J1350j1806r358P5116n9310N5649
$$ -507961 -470728 -475722 -462105 -452218 -444796 -361880 -350530 -362336 -371694 -296578 -355888 -300239
16347c00239j2040K9748M1749N7913m0839q1191O8696M0338K3844K7660O7441
$$ -300239 -312279 -282531 -240782 -182869 -223708 -304899 -236203 -195865 -172021 -144361 -76920
16336g6920N5782K637l8842k5379J5737q046M6879m6694R1217R778j5848m1109
$$ -76920 -21138 -18501 -57343 -82722 -66985 -75031 -28152 -74846 16371 26149 10301 -30808
16324c0808k7884M6667K1731M7911m3978L9359K3849K1365j2241L6103M0092N1955
$$ -30808 -58692 -12025 9706 57617 13639 52998 76847 98212 85971 122074 162166 214121
16312B14121k7210L2026o777J569N0021l5653J6040Q5495k4126L4115K835K7879
$$ 214121 186911 218937 212160 213729 263750 228097 244137 329632 305506 339621 342456 370335
16300C70335j9272p103P084j1635J4161P9456o0576k6040J5519k1186J1818L971
$$ 370335 351063 343960 351044 339409 353570 433026 372450 346410 361929 340743 352561 356532
16288C56532N4941K2456j3270J8482M7841k1583o3806Q7361K9113K0388k0094
$$ 356532 411473 433929 420659 439141 486982 465399 401593 488954 518067 538455 518361
16277E18361J1563P9994j4836J7047M4406j1696P5743K5055o7884R1879K9139
$$ 518361 529924 609918 595082 612129 656535 644839 720582 745637 677753 769632 798771
16266G98771n3768l6222J9461Q0819J0828m9022P5103k6378r6404O9680p273l659
$$ 798771 745003 708781 728242 809061 819889 770867 845970 819592 723188 792868 785595 781936
16254G81936M1209j244J8891k8132M4055P7463n3051m5084P6808k1379M7085L3662
$$ 781936 823145 821901 840792 812660 856715 934178 881127 836043 912851 891472 938557 972219
16242I72219m7328L0019O5525K6615r8163j7848R0660N3374j23539J0810N1313
$$ 972219 924891 954910 1020435 1047050 948887 931039 1021699 1075073 951534 962344 1013657
16231A013657J0941N2018k3873N0870L0393k3102p0251R5627l0345j1354k8460
$$ 1013657 1024598 1076616 1052743 1103613 1134006 1110904 1040653 1136280 1105935 1094581 1066121
16220A066121L6703R8768j1533k8066K7850k7492M298L8881k0151k2022P5267
$$ 1066121 1102824 1201592 1190059 1161993 1189843 1162351 1166649 1205530 1185379 1163357 1238624
16209A238624M9558k5752o46K1927l6607l0355n407J1200k7218o8296J04517Q967
$$ 1238624 1288182 1262430 1261784 1283711 1247104 1216749 1211342 1222542 1195324 1127028 1231545 1240512
16197A240512O1476j172L8574l0740l7762L8632n4406k5531L6033O4984M949L3116
$$ 1240512 1301988 1300816 1339390 1308650 1270888 1309520 1255114 1229583 1265616 1330600 1335549 1368665
16185A368665l7795q644l5502O617k4118l4067O4802J2637L5326k5089R1016l9275
$$ 1368665 1330870 1322226 1286724 1293341 1269223 1235156 1299958 1312595 1347921 1322832 1413848 1374573
16173A374573n0188J4782L4574k0165o9002q3959Q1871N7279l6404M5777M8134
$$ 1374573 1324385 1339167 1373741 1353576 1284574 1200615 1282486 1339765 1303361 1349138 1397272
16162A397272j0806J1926r828l2678l40Q03M8354q229N8L3212L9731m4381J5834
$$ 1397272 1386466 1398392 1388564 1355886 1355546 1356349 1404703 1396474 1396532 1429744 1469475 1425094 1440928
16149A440928m7300O9610m7801o726L0929K5658M5N2379l9158l6915K9729J13464
$$ 1440928 1393628 1463238 1415437 1408711 1439640 1465298 1465343 1517722 1478564 1441649 1471378 1584842
16137A584842o5761q2191O5689L9649j02851M6470R0313j38606n8062O9903J985
$$ 1584842 1519081 1436890 1502579 1542228 1439377 1485847 1576160 1437554 1379492 1449395 1451380
16126A451380q9626j5060R1944n638k0658J03947J5998r0221J05951l0927r2979
$$ 1451380 1361754 1346694 1438638 1433000 1412342 1516289 1532287 1442066 1548017 1517090 1424111
16115A424111M8206m3734J8078m0789O5638m8358J5486R710K0743q684J111K3092
$$ 1424111 1472317 1428583 1446661 1405872 1471510 1423152 1438638 1448348 1469091 1460407 1461518 1484610
$$ [...]
##END NTUPLES=NMR SPECTRUM
##END=
