##TITLE=1H_TG-2404-1
 200.13Hz, CDCl3.
 8 sc
 
 20.4.2026
##JCAMPDX= 6.0         $$ Bruker NMR JCAMP-DX V2.0
##DATA TYPE= NMR SPECTRUM
##DATA CLASS= NTUPLES
##ORIGIN= UXNMR, Bruker Analytische Messtechnik GmbH
##OWNER= pz
$$ XWIN-NMR		Version 3.5
$$ Mon Apr 20 16:15:06 2026 Russian Standard Time (UT+4h)  she@DPX200
##.OBSERVE FREQUENCY= 200.1313
##.OBSERVE NUCLEUS= ^1H
##.ACQUISITION MODE= SIMULTANEOUS
##.ACQUISITION SCHEME= undefined
##.AVERAGES= 8
##.DIGITISER RES= 18
##SPECTROMETER/DATA SYSTEM= spect
##.PULSE SEQUENCE= zg30
##.SOLVENT NAME= CDCl3
##.SHIFT REFERENCE= (INTERNAL, CDCl3, 0, 15.4395)
##AUDIT TRAIL= $$ (NUMBER, WHEN, WHO, WHERE, WHAT)
$$ ##TITLE= Audit trail, XWIN-NMR		Version 3.5
$$ ##JCAMPDX= 5.01
$$ ##ORIGIN= Bruker BioSpin GmbH
$$ ##OWNER= she
$$ F:/spectra/data/she/nmr/H-C/1/pdata/1/auditp.txt
$$ ##AUDIT TRAIL=  $$ (NUMBER, WHEN, WHO, WHERE, WHAT)
(   1,<2026-04-20 16:13:17.09 +0400>,<she>,<DPX200>,
      <created by zg, POWCHK disabled, PULCHK disabled
       configuration hash MD5:
       00 E9 B6 7A A2 85 ED C7 34 08 36 98 17 FE 4E 26
       data hash MD5: 16K
       D6 0E 2D 82 7D 44 09 32 C8 F8 FE 8C CF CE B7 FF>)
(   2,<2026-04-20 16:13:25.48 +0400>,<she>,<DPX200>,
      <Start of raw data processing
       efp BC_mod = 2 LB = 0.25 FT_mod = 6 PKNL = 1 PHC0 = -3706.251 PHC1 = 11.99229 SI = 16K 
       data hash MD5: 16K
       F2 53 CB 6B E2 A5 15 4A 08 CB A8 99 C3 22 92 A0>)
(   3,<2026-04-20 16:13:56.20 +0400>,<she>,<DPX200>,
      <pk PHC0 = 1.465838 PHC1 = -2.2 
       data hash MD5: 16K
       D6 ED CF 8B 87 BC CE F4 90 B5 26 6D 40 2F 24 12>)
(   4,<2026-04-20 16:13:59.75 +0400>,<she>,<DPX200>,
      <abs ABSG = 5 
       data hash MD5: 16K
       47 DE EF 3B 8D EE 83 64 DF 52 2D BA 8C 8A 89 2F>)
(   5,<2026-04-20 16:14:40.89 +0400>,<she>,<DPX200>,
      <abs ABSG = 5 
       data hash MD5: 16K
       76 DF 7C 21 A0 AA 2E 55 7A B8 36 84 3A 8F 0B 63>)
$$ ##END=
$$ 
$$ hash MD5
$$ 2A 1B D4 C8 FD FF B2 A4 FF AD F1 E2 59 72 94 47
##$RELAX= 
##$RELAX= 
##$RELAX= 
##$RELAX= 
##$RELAX= 
##$RELAX= 
$$ Bruker specific parameters
$$ --------------------------
##$DU= <F:/spectra>
##$EXPNO= 1
##$NAME= <H-C>
##$PROCNO= 1
##$TYPE= <nmr>
##$USER= <she>
##$AMP= (0..31)
100 100 100 100 100 100 100 100 100 100 100 100 100 100 100 100 100 100 
100 100 100 100 100 100 100 100 100 100 100 100 100 100 
##$AQSEQ= 0
##$AQ_mod= 1
##$AUNM= <au_zg>
##$AUTOPOS= <>
##$BF1= 200.13
##$BF2= 200.13
##$BF3= 200.13
##$BF4= 200.13
##$BF5= 200.13
##$BF6= 200.13
##$BF7= 200.13
##$BF8= 200.13
##$BYTORDA= 1
##$CFDGTYP= 0
##$CFRGTYP= 5
##$CHEMSTR= <none>
##$CNST= (0..31)
1 1 145 1 1 1 1 1 1 1 1 1 1 1 1 1 1 1 1 1 1 1 1 1 1 1 1 1 1 1 1 1 
##$CPDPRG= <>
##$CPDPRG1= <>
##$CPDPRG2= <>
##$CPDPRG3= <>
##$CPDPRG4= <mlev>
##$CPDPRG5= <mlev>
##$CPDPRG6= <mlev>
##$CPDPRG7= <mlev>
##$CPDPRG8= <mlev>
##$CPDPRGB= <>
##$CPDPRGT= <>
##$D= (0..31)
0 0.7 0 0 0 0 0 0 0 0 0 0.03 0 0 0 0 0 0 0 0 0 0 0 0 0 0 0 0 0 0 0 0 
##$DATE= 1776687196
##$DBL= (0..7)
$$ [...]
##$SUBNAM3= <"">
##$SUBNAM4= <"">
##$SUBNAM5= <"">
##$SUBNAM6= <"">
##$SUBNAM7= <"">
##$SUBNAM8= <"">
##$SUBNAM9= <"">
##$SW= 18.0517328524113
##$SWIBOX= (0..15)
0 0 2 0 0 0 0 0 0 0 0 0 0 0 0 0 
##$SW_h= 3612.71676300578
##$TD= 16384
##$TD0= 1
##$TE= 0
##$TE2= 300
##$TE3= 300
##$TEG= 300
##$TL= (0..7)
0 120 120 120 120 120 120 120 
##$TP= (0..7)
150 150 150 150 150 150 150 150 
##$TP07= 0
##$TPNAME0= <>
##$TPNAME1= <>
##$TPNAME2= <>
##$TPNAME3= <>
##$TPNAME4= <>
##$TPNAME5= <>
##$TPNAME6= <>
##$TPNAME7= <>
##$TPOAL= (0..7)
0.5 0.5 0.5 0.5 0.5 0.5 0.5 0.5 
##$TPOFFS= (0..7)
0 0 0 0 0 0 0 0 
##$TUNHIN= 0
##$TUNHOUT= 0
##$TUNXOUT= 0
##$USERA1= <user>
##$USERA2= <user>
##$USERA3= <user>
##$USERA4= <user>
##$USERA5= <user>
##$V9= 5
##$VALIST= <valist>
##$VCLIST= <CCCCCCCCCCCCCCC>
##$VD= 0
##$VDLIST= <DDDDDDDDDDDDDDD>
##$VPLIST= <PPPPPPPPPPPPPPP>
##$VTLIST= <TTTTTTTTTTTTTTT>
##$WBST= 1024
##$WBSW= 4
##$XGAIN= (0..3)
0 0 0 0 
##$XL= 0
##$YL= 0
##$YMAX_a= 932290
##$YMIN_a= -1052230
##$ZGOPTNS= <>
##$ZL1= 120
##$ZL2= 120
##$ZL3= 120
##$ZL4= 120
##$ABSF1= 15.43949
##$ABSF2= -2.612359
##$ABSG= 5
##$ABSL= 3
##$ALPHA= 0
##$AQORDER= 0
##$ASSFAC= 0
##$ASSFACI= 0
##$ASSFACX= 0
##$ASSWID= 0
##$AUNMP= <proc_1d>
##$AZFE= 0.1
##$AZFW= 0.1
##$BCFW= 0
##$BC_mod= 2
##$BYTORDP= 0
##$COROFFS= 0
##$CY= -3
##$DATMOD= 1
##$DC= 0
##$DFILT= <>
##$DTYPP= 0
##$F1P= 0
##$F2P= 0
##$FCOR= 1
##$FTSIZE= 16384
##$FT_mod= 6
##$GAMMA= 0
##$GB= 0
##$INTBC= 1
##$INTSCL= 3.241238e-09
##$ISEN= 128
##$LB= 0.25
##$LEV0= 0
##$LPBIN= 0
##$MAXI= 10000
##$MC2= 0
##$MEAN= 0
##$ME_mod= 0
##$MI= 1.114404
##$NCOEF= 0
##$NC_proc= -4
##$NLEV= 6
##$NOISF1= 3.799351
##$NOISF2= 2.8
##$NSP= 0
##$NTH_PI= 0
##$NZP= 0
##$OFFSET= 15.43949
##$PC= 1
##$PHC0= -3704.785
##$PHC1= 9.79229
##$PH_mod= 1
##$PKNL= yes
##$PPARMOD= 0
##$PSCAL= 0
##$PSIGN= 0
##$REVERSE= no
##$SF= 200.130016453087
##$SI= 16384
##$SIGF1= 3
##$SIGF2= 2
##$SINO= 0.751879
##$SIOLD= 32768
##$SREGLST= <19F.Aceton>
##$SSB= 0
##$STSI= 16384
##$STSR= 0
##$SW_p= 3612.71676300578
##$SYMM= 0
##$S_DEV= 0
##$TDeff= 16384
##$TDoff= 0
##$TI= <>
##$TILT= no
##$TM1= 0
##$TM2= 0
##$TOPLEV= 0
##$USERP1= <user>
##$USERP2= <user>
##$USERP3= <user>
##$USERP4= <user>
##$USERP5= <user>
##$WDW= 1
##$XDIM= 16384
##$YMAX_p= 448946711
##$YMIN_p= -337864
$$ End of Bruker specific parameters
$$ ---------------------------------
##NTUPLES= NMR SPECTRUM
##VAR_NAME=  FREQUENCY,     SPECTRUM/REAL,   SPECTRUM/IMAG
##SYMBOL=    X,             R,               I
##VAR_TYPE=  INDEPENDENT,   DEPENDENT,       DEPENDENT
##VAR_FORM=  AFFN,          ASDF,            ASDF
##VAR_DIM=   16384,         16384,           16384
##UNITS=     HZ,            ARBITRARY UNITS, ARBITRARY UNITS
##FACTOR=    0.220516191357247, 1,           1
##FIRST=     3089.90545142832, 0,            0
##LAST=      -522.811311577456, 0,           0
##MIN=       -522.811311577456, -337864,     0
##MAX=       3089.90545142832, 448946711,    0
$$ Real data points
##PAGE= N=1
##DATA TABLE= (X++(R..R)), XYDATA
$$ [...]
$$ plain form
6072 56528887 57930364 58940024 59545272 59739571 59435121 58585832 57385885 55827315 54016262
6063 54016262 52024716 49968915 48003912 46053236 44185142 42431414 40694831 38877568
6055 38877568 37251119 35880284 34424249 33080903 31736557 30417406 29148834 27909418
6047 27909418 26781629 25608990 24395611 23128960 21846477 20629579 19471260 18402472
6039 18402472 17389702 16491649 15612315 14720435 13886233 13048474 12192445 11400229 10729097
6030 10729097 10055296 9549994 8964943 8359838 7808527 7471639 7217068 6885188 6564455
6021 6564455 6272320 6013503 5784408 5548608 5372860 5271299 5154659 5123746 5021554 4992031
6011 4992031 4923948 4840498 4883441 4900070 4794932 4778699 4834914 4757269 4689312 4695653 4631053
$$ packed form
6072E6528887J401477J009660O05248J94299l04450q49289j199947j558570j811053
6063E4016262j991546k055801j965003j950676j868094j753728j736583j817263
6055C8877568j626449j370835j456035j343346j344346j319151j268572j239416
6047B7909418j127789j172639j213379j266651j282483j216898j158319j068788
6039A8402472j012770q98053q79334q91880q34202q37759q56029p92216o71132
6030A0729097o73801n05302n85051o05105n51311l36888k54571l31880l20733
6021F564455k92135k58817k29095k35800j75748j01561j16640l0913j02192k9523
6011D992031o8083q3450M2943J6629j05138j6233N6215p7645o7957O341o4600
$$ plain form
6000 4631053 4509056 4357595 4340070 4351382 4311462 4314449 4260369 4160162 4038016 3994642 4079635
5989 4079635 4132176 4006049 3980657 4059928 4113871 4215406 4343539 4375981 4467550 4483969 4480004
5978 4480004 4569524 4445303 4320488 4194089 3971184 3875331 3864254 3681988 3568037 3510320
5968 3510320 3435535 3369673 3348551 3205611 3132869 3014645 2816224 2828568 2738163 2605398 2628364
5957 2628364 2516276 2403318 2377242 2291471 2368744 2466543 2380090 2339299 2402310 2388018 2387480
5946 2387480 2492772 2552699 2648057 2710261 2553096 2486371 2647224 2742168 2797813 2868270 2981861
5935 2981861 3107410 3278846 3461649 3591688 3836906 4108325 4308506 4467084 4647482 4845421
5925 4845421 4870927 4931541 5126225 5161475 5299333 5452349 5519846 5598624 5735503 5808360 5961044
$$ packed form
6000D631053j21997j51461j7525J1312l9920K987n4080j00207j22146m3374Q4993
5989D079635N2541j26127k5392P9271N3943J01535J28133L2442R1569J6419l965
5978D480004Q9520j24221j24815j26399k22905r5853j1077j82266j13951n7717
5968C510320p4785o5862k1122j42940p2742j18224j98421J2344r0405j32765K2966
5957B628364j12088j12958k6076q5771P7273R7799q6453m0791O3011j4292n38
5946B387480J05292N9927R5358O2204j57165o6725J60853R4944N5645P0457J13591
5935B981861J25549J71436J82803J30039K45218K71419K00181J58578J80398J97939
5925D845421K5506O0614J94684L5250J37858J53016O7497P8778J36879P2857J52684
$$ plain form
5914 5961044 6165049 6413725 6774487 7082270 7263549 7619474 8024057 8409473 8714759 8982564
5904 8982564 9346938 9635395 9818164 10051779 10179238 10379849 10697133 10779737 10879333 11175290
5894 11175290 11513777 11698563 12044113 12355144 12739112 13203279 13513986 13949984 14176142
5885 14176142 14316926 14459699 14581396 14789891 14914701 14994655 15195241 15320556 15364300 15525950
5875 15525950 15808793 16032333 16288460 16599396 16746076 16965740 17175201 17396631 17719825
5866 17719825 17926098 18026704 18372705 18435823 18435254 18499048 18506224 18437382 18327660 18157144 17931459
5855 17931459 17876253 17877820 17748686 17631926 17720068 17754521 17784493 17701304 17616533 17584911 17403266
5844 17403266 17176710 17059476 16992044 16896888 16677267 16455454 16248025 16048894 15756504 15560853
$$ packed form
5914E961044K04005K48676L60762L07783J81279L55925M04583L85416L05286K67805
5904H982564L64374K88457J82769K33615J27459K00611L17284Q2604R9596K95957
5894A1175290L38487J84786L45550L11031L83968M64167L10707M35998K26158
5885A4176142J40784J42773J21697K08495J24810P9954K00586J25315M3744J61650
5875A5525950K82843K23540K56127L10936J46680K19664K09461K21430L23194
5866A7719825K06273J00606L46001O3118n69O3794P176o8842j09722j70516k25685
5855A7931459n5206J567j29134j16760Q8142L4453K9972q3189q4771l1622j81645
5844A7403266k26556j17234o7432r5156k19621k21813k07429j99131k92390j95651
$$ plain form
5834 15560853 15187204 14691876 14399529 13931615 13470989 13049343 12669866 12311092 12024285
5825 12024285 11739667 11590414 11437310 11197528 11003992 10784065 10662102 10537011 10343567
5816 10343567 10081134 9900941 9683929 9316121 8991710 8657943 8264286 7876276 7561326
5807 7561326 7196266 6767023 6483712 6078595 5787845 5439706 5252942 5076671 4711601 4439523
5797 4439523 4303153 4287633 4219630 4071814 4019099 3879731 3771091 3828163 3688315 3523618
5787 3523618 3339708 3186514 3044570 2921003 2792958 2716119 2616318 2388755 2391347 2425494
5777 2425494 2227014 2180349 2108124 2040936 2027045 2001980 1951552 1908793 1871591 1757618 1726455
5766 1726455 1696249 1768572 1740781 1612927 1579443 1517610 1588023 1496236 1491754 1535129 1513152
$$ packed form
5834A5560853l73649m95328k92347m67914m60626m21646l79477l58774k86807
5825A2024285k84618j49253j53104k39782j93536k19927j21963j25091j93444
5816A0343567k62433j80193k17012l67808l24411l33767l93657l88010l14950
5807G561326l65060m29243k83311m05117k90750l48139j86764j76271l65070k72078
5797D439523j36370j5520o8003j47816n2715j39368j08640N7072j39848j64697
5787C523618j83910j53194j41944j23567j28045p6839r9801k27563K592L4147
5777B425494j98480m6665p2225o7188j3891k5065n0428m2759l7202j13973l1163
5766A726455l0206P2323k7791j27854l3484o1833P0413r1787m482M3375k1977
$$ plain form
5755 1513152 1498357 1469207 1396409 1377670 1433389 1425887 1400435 1437581 1492320 1415894 1392186 1417499
5743 1417499 1408873 1383189 1315701 1289457 1254105 1205788 1268300 1381401 1324798 1255316 1322929
5732 1322929 1291889 1245327 1344317 1316800 1211070 1219904 1218760 1262031 1314312 1221775 1116100
5721 1116100 1147067 1191815 1218111 1228995 1261647 1297713 1249854 1201425 1272924 1272229 1299709 1355237
5709 1355237 1313474 1240577 1224479 1219474 1252715 1379728 1312339 1288379 1336145 1320134 1298939
5698 1298939 1262262 1311466 1314738 1301872 1234250 1348780 1329120 1280225 1314940 1348915 1341806 1303405
5686 1303405 1475411 1461269 1375673 1309307 1264506 1407450 1499637 1428487 1474384 1448734 1358986
5675 1358986 1529767 1528741 1417784 1508412 1569400 1469952 1494135 1586783 1553470 1627257 1552897
$$ packed form
5755A513152j4795k9150p2798j8739N5719p502k5452L7146N4739p6426k3708K5313
5743A417499q626k5684o7488k6244l5352m8317O2512J13101n6603o9482O7613
5732A322929l1040m6562R8990k7517j05730Q834j144M3271N2281r2537j05675
5721A116100L0967M4748K6296J0884L2652L6066m7859m8429P1499o95K7480N5528
5709A355237m1763p2897j6098n005L3241J27013o7389k3960M7766j6011k1195
5698A298939l6677M9204L272j2866o7622J14530j9660m8895L4715L3975p109l8401
5686A303405J72006j4142q5596o6366m4801J42944R2187p1150M5897k5650q9748
5675A358986J70781j026j10957R0628O0988r9448K4183R2648l3313P3787p4360
$$ plain form
5664 1552897 1557137 1668978 1653361 1624107 1611465 1543988 1540224 1575079 1621757 1650273 1655849 1654903
5652 1654903 1716881 1724644 1717323 1726691 1759235 1824057 1796211 1780610 1876110 1950491 1805140 1799594
5640 1799594 1830056 1837993 1778713 1905375 1927823 1862570 1964431 2007538 2022254 2066585 2083217
5629 2083217 2062916 2080858 2036859 1953689 2073316 2105952 2025295 2067806 2134923 2242928 2232432
5618 2232432 2128359 2111863 2227684 2256567 2247959 2293238 2258517 2171683 2194144 2307988 2320736
5607 2320736 2372715 2355417 2413288 2400773 2428026 2520110 2510868 2546818 2536141 2479179 2487486 2619867
5595 2619867 2611614 2644174 2559592 2538182 2725224 2765379 2755491 2744292 2806632 2769234 2762851 2812547
5583 2812547 2764515 2864253 2800684 2802405 2863588 2898829 2896127 2966936 2962812 3043511 3104815 3119631
$$ packed form
5664A552897M240J11841j5617k9254j2642o7477l764L4855M6678K8516N576r46
5652A654903O1978P763p321R368L2544O4822k7846j5601R5500P4381j45351n546
5640A799594L0462P937n9280J26662K2448o5253J01861M3107J4716M4331J6632
5629B083217k0301J7942m3999q3170J19627L2636q0657M2511O7117J08005j0496
5618B232432j04073j6496J15821K8883q608M5279l4721q6834K2461J13844J2748
5607B320736N1979j7298N7871j2515K7253R2084r242L5950j0677n6962Q307J32381
5595B619867q253L2560q4582k1410J87042M0155r888j1199O2340l7398o383M9696
5583B812547m8032R9738o3569J721O1183L5241k702P0809m124Q0699O1304J4816
$$ plain form
5571 3119631 3199718 3236453 3142465 3077413 3211364 3206940 3217699 3302854 3211397 3198626 3250754
5560 3250754 3362914 3443521 3375755 3289018 3334576 3376916 3369211 3531486 3448732 3372378 3549161
5549 3549161 3527103 3496954 3507042 3526760 3583034 3606299 3634134 3690312 3717459 3691048 3749785
5538 3749785 3733524 3720080 3835604 3901642 3757520 3845205 3811779 3851698 3950578 3915918 3835847
5527 3835847 3811271 3958230 3943204 3943898 3951656 3927241 4042566 4005207 4055433 4167706 4123973
5516 4123973 4060660 4118036 4106333 4122049 4134203 4207892 4218611 4170733 4140075 4174531 4229071
5505 4229071 4234909 4260070 4187504 4267204 4244135 4185275 4220609 4178966 4140652 4144127 4040743 3994297
5493 3994297 4103910 4131564 4119676 4225382 4143169 4135045 4222030 4222354 4334174 4304235 4138825
$$ packed form
5571C119631Q0087L6735r3988o5052J33951m424J0759Q5155r1457j2771N2128
5560C250754J12160Q0607o7766q6737M5558M2340p705J62275q2754p6354J76783
5549C549161k2058l0149J0088J9718N6274K3265K7835N6178K7147k6411N8737
5538C749785j6261j3444J15524O6038j44122Q7685l3426L9919R8880l4660q0071
5527C835847k4576J46959j5026O94P758k4415J15325l7359N0226J12273m3733
5516D123973o3313N7376j1703J5716J2154P3689J0719m7878l0658L4456N4540
5505D229071N838K5161p2566P9700k3069n8860L5334m1643l8314L475j03384m6446
5493C994297J09613K7654j1888J05706q2213q124Q6985L24J11820k9939j65410
$$ plain form
5482 4138825 4141432 4159959 4069368 4131055 4204838 4086794 3994472 4041590 4034602 4067619 4106782 3998750
5470 3998750 4061801 4118144 4080860 4096773 4010231 3882331 4045098 4094247 4040655 4064900 4098560
5459 4098560 4036701 3996555 3980744 3948928 4093583 4075010 3998190 4039339 3936868 3904950 3992463
5448 3992463 3940841 3833960 3791454 3785148 3772326 3796058 3670361 3631550 3707430 3723158 3738221
5437 3738221 3760796 3749919 3679915 3710165 3655185 3679274 3681798 3639752 3634467 3496326 3514878 3499152
5425 3499152 3476801 3487426 3432719 3391723 3384689 3416291 3349341 3385611 3330617 3267939 3307176 3250672
5413 3250672 3260757 3341682 3360994 3255061 3207661 3208768 3131092 3131626 3174784 3121754 3114515 3120975
5401 3120975 3076839 3089417 3067962 2966920 3058736 3142293 3076517 2967174 2888214 2929834 2957306
$$ packed form
5482D138825K607J8527r0591O1687P3783j18044r2322M7118o988L3017L9163j08032
5470C998750O3051N6343l7284J5913q6542j27900J62767M9149n3592K4245L3660
5459D098560o1859m0146j5811l1816J44655j8573p6820M1149j02471l1918Q7513
5448C992463n1622j06881m2506o306j2822K3732j25697l8811P5880J5728J5063
5437C738221K2575j0877p0004L0250n4980K4089K524m2046n285j38141J8552j5726
5425C499152k2351J0625n4707m0996p034L1602o6950L6270n4994o2678L9237n6504
5413C250672J0085Q0925J9312j05933m7400J107p7676N34M3158n3030p239O460
5401C120975m4136J2578k1455j01042R1816Q3557o5776j09343p8960M1620K7472
$$ plain form
5390 2957306 2892010 2893675 3011237 2910896 2789019 2789046 2744546 2704815 2715151 2714392 2731451 2625798
5378 2625798 2690687 2726765 2606896 2535082 2516166 2602044 2608420 2641663 2528287 2444377 2578269
5367 2578269 2531684 2368743 2361186 2467360 2514312 2503886 2370766 2339338 2348467 2269923 2312276
5356 2312276 2367760 2319076 2252990 2302289 2196990 2120829 2180817 2179896 2197678 2136342 2114047 2292383
5344 2292383 2259785 2092337 2045147 2108324 2033506 2084362 2288133 2176573 1961087 1929888 1977757
5333 1977757 2042390 1971863 1953375 1979061 1934761 1924669 2012505 2007810 1891515 1879145 1967029
5322 1967029 1932116 1989671 1932529 1798303 1827541 1813948 1857147 1929649 1816174 1741027 1806475
5311 1806475 1876425 1836379 1775396 1733989 1626420 1699250 1742114 1851504 1833780 1743951 1677937
$$ packed form
5390B957306o5296J665J17562j00341j21877K7m4500l9731J0336p59J7059j05653
5378B625798O4889L6078j19869p1814j8916Q5878O376L3243j13376q3910J33892
5367B578269m6585j62941p557J06174M6952j0426j33120l1428R129p8544M2353
5356B312276N5484m8684o6086M9299j05299p6161N9988r21J7782o1336k2295J78336
5344B292383l2598j67448m7190O3177p4818N0856K03771j11560k15486l1199M7869
5333A977757O4633p0527j8488K5686m4300j0092Q7836m695j16295j2370Q7884
5322A967029l4913N7555n7142j34226K9238j3593M3199P2502j13475p5147O5448
5311A806475O9950m0046o0983m1407j07569P2830M2864J09390j7724q9829o6014
$$ plain form
5300 1677937 1587225 1612515 1672203 1705887 1643314 1588083 1545323 1563436 1618335 1702701 1527178
5289 1527178 1592984 1640670 1610108 1600487 1499334 1485648 1461030 1484410 1532547 1606438 1520372
5278 1520372 1463877 1474263 1426791 1335964 1462049 1572308 1546503 1476927 1384881 1389383 1437994
5267 1437994 1423054 1478987 1487448 1425241 1343668 1367859 1349252 1345391 1407947 1389280 1396248 1443221
5255 1443221 1363186 1350760 1427423 1323178 1298661 1371658 1342375 1377178 1300009 1333841 1398075
5244 1398075 1359188 1356873 1367839 1334548 1342304 1376654 1333860 1317674 1311000 1199034 1321127 1371261
5232 1371261 1397636 1391470 1370963 1288355 1312290 1406132 1387950 1410228 1382202 1394766 1424785 1370138
5220 1370138 1327282 1389250 1373456 1320770 1347160 1297265 1220310 1200350 1179160 1221904 1183554
$$ packed form
5300A677937r0712K5290N9688L3684o2573n5231m2760J8113N4899Q4366j75523
5289A527178O5806M7686l0562r621j01153j3686k4618K3380M8137P3891q6066
5278A520372n6495J0386m7472r0827J26085J10259k5805o9576r2046M502M8611
5267A437994j4940N5933Q461o2207q1573K4191j8607l861O2556j8667O968M6973
5255A443221q0035j2426P6663j04245k4517P2997k9283L4803p7169L3832O4234
5244A398075l8887k315J0966l3291P756L4350m2794j6186o674j11966J22093N0134
5232A371261K6375o166k0507q2608K3935R3842j8182K2278k8026J2564L0019n4647
5220A370138m2856O1968j5794n2686K6390m9895p6955j9960k1190M2744l8350
$$ plain form
5209 1183554 1216797 1301053 1285625 1275425 1280938 1252022 1217955 1193025 1181283 1178129 1206839 1137992
5197 1137992 1090389 1042024 1091452 1106047 1134893 1127394 1138956 1166096 1193999 1106502 1140267 1055220
5185 1055220 1040487 1064481 1043201 1054598 1081262 951583 870827 971471 949961 1012378 1014161
5174 1014161 1087249 1026390 902930 917531 929018 953268 1028140 1045566 968494 998489 1005278
5163 1005278 922159 916662 932164 923347 951254 937713 986949 982942 906439 933195 952581 940080
5151 940080 955514 1012355 1002673 932795 921244 971246 962843 1010058 1024426 929432 850436 882758
5139 882758 938052 976089 953700 941412 887383 883138 960246 945132 1099182 1019171 972763 985072
5127 985072 861075 833721 851754 919024 872647 899916 874567 812587 854157 843661 867638
$$ packed form
5209A183554L3243Q4256j5428j0200N513k8916l4067k4930j1742l154K8710o8847
5197A137992m7603m8365M9428J4595K8846p499J1562K7140K7903q7497L3765q5047
5185A055220j4733K3994k1280J1397K6664j29679q0756J00644k1510O2417J783
5174A014161P3088o0859j23460J4601J1487K4250P4872J7426p7072K9995O789
5163A005278q3119n497J5502q817K7907j3541M9236m007p6503K6756J9386j2501
5151I40080J5434N6841r682o9878j1551N0002q403M7215J4368r4994p8996L2322
5139H82758N5294L8037k2389j2288n4029m245P7108j5114J54050q0011m6408J2309
5127I85072j23997k7354J8033O7270m6377K7269k5349o1980M1570j0496K3977
$$ plain form
5116 867638 930267 834631 742044 775217 805879 781537 870484 923581 834263 812492 870028 843215
5104 843215 860786 862168 783480 711708 656193 726102 761938 735152 718032 775237 661183 715813
5092 715813 873795 765082 770492 732609 690139 665937 701540 780646 699217 605980 642463
5081 642463 666956 660481 759201 826384 725114 618207 699592 722260 729614 764420 651905
5070 651905 740831 719464 735796 789576 684762 666637 692233 736494 743957 768539 806104 770623
5058 770623 694915 681583 782409 812548 742215 677656 678259 581319 693331 810103 735007
5047 735007 740646 700973 750355 749689 786574 766121 658152 722506 704354 776856 798394 762982
5035 762982 762866 660381 719385 800131 798720 704547 650828 622593 739461 797375 738643 665117
$$ packed form
5116H67638O2629r5636r2587L3173L0662k4342Q8947N3097q9318k1771N7536k6813
5104H43215J7571J382p8688p1772n5515O9909L5836k6786j7120N7205j14054N4630
5092G15813J57982j08713N410l7883m2470k4202L5603P9106q1429r3237L6483
5081F42463K4493o475R8720O7183j01270j06907Q1385K2668P354L4806j12515
5070F51905Q8926k1367J6332N3780j04814j8125K5596M4261P463K4582L7565l5481
5058G70623p5708j3332J00826L0139p0333o4559O03r6940J12012J16772p5096
5047G35007N639l9673M9382o66L6885k0453j07969O4354j8152P2502K1538l5412
5035G62982j16j02485N9004Q0746j411r4173n3719k8235J16868N7914n8732p3526
$$ plain form
5023 665117 668661 666245 666095 664531 677572 689509 599978 581253 495263 554497 677676 678494 577848
5010 577848 526405 672754 720343 624579 545517 578350 688862 653725 585938 593931 557279
4999 557279 700683 741861 611078 586293 578489 586701 604632 585721 658746 702595 673408 583942
4987 583942 562067 620069 668795 713317 596521 544132 675355 675158 657175 692479 741007 717493
4975 717493 763775 812269 761815 694287 715406 794402 695562 678541 606006 666572 645047 646406
4963 646406 698095 716364 732677 695905 579516 615743 699525 723636 768096 692809 580821
4952 580821 564706 563551 627060 697921 623441 618329 614556 574056 533122 648565 680664 687267
4940 687267 731248 696170 579226 519429 561412 622189 613060 614074 644778 645653 678333 619455
$$ packed form
5023F65117L544k416j50j564J3041J1937q9531j8725q5990N9234J23179Q18j00646
5010E77848n1443J46349M7589r5764p9062L2833J10512l5137o7787P993l6652
4999E57279J43404M1178j30783k4785p804Q212J7931j8911P3025M3849k9187q9466
4987E83942k1875N8002M8726M4522j16796n2389J31223j97j7983L5304M8528k3514
4975G17493M6282M8494n0454o7528K1119P8996r8840j7021p2535O0566k1525J359
4963F46406N1689J8269J6313l6772j16389L6227Q3782K4111M4460p5287j11988
4952E80821j6115j155O3509P0861p4480n112l773m0500m0934J15443L2099O603
4940F87267M3981l5078j16944n9797M1983O0777r129J014L0704Q75L2680n8878
$$ plain form
4928 619455 683941 756609 718983 719679 679953 640603 758177 759315 671921 629264 652425 780889
4916 780889 838095 794065 629471 622339 684501 652283 626265 695898 708201 745635 655092 654490
4904 654490 608314 644264 742750 742310 708693 665560 745727 718403 680254 643520 683648 790861
4892 790861 891548 824615 796226 774754 750060 734672 741879 841095 930879 889064 831689 802103
4880 802103 799877 881284 973514 945325 862470 933047 942427 880050 901116 934792 902562 959660
4868 959660 1024824 1157773 1133161 928371 938180 1020619 1042734 1008075 1140737 1147450 1094799
4857 1094799 1085992 1168750 1184569 1178325 1249047 1261093 1189895 1214897 1368337 1325390 1197556
4846 1197556 1143116 1276963 1438961 1463368 1494419 1507716 1389709 1369539 1537667 1753756
$$ packed form
4928F19455O4486P2668l7626O96l9726l9350J17574J138q7394m2657K3161J28464
4916G80889N7206m4030j64594p132O2162l2218k6018O9633J2303L7434r0543o02
4904F54490m6176L5950R8486m40l3617m3133Q0167k7324l8149l6734M0128J07213
4892G90861J00687o6933k8389k1472k4694j5388P207R9216Q9784m1815n7375k9586
4880H02103k226Q1407R2230k8189q2855P0577R380o2377K1066L3676l2230N7098
4868I59660O5164J32949k4612k04790R809Q2439K2115l4659J32662O713n2651
4857A094799q807Q2758J5819o244P0722J2046p1198K5002J53440m2947j27834
4846A197556n4440J33847J61998K4407L1051J3297j18007k0170J68128K16089
$$ plain form
4836 1753756 1803068 1902087 1852730 1811168 1873687 1980201 2171096 2251439 2252209 2350929 2517257
4825 2517257 2731475 2826023 2985307 3266040 3414821 3648123 3923995 4245105 4577946 4984691
4815 4984691 5450683 5992910 6657115 7304324 7927881 8497700 8770458 9023129 9016009 8843282
4805 8843282 8610137 8424833 8279136 7913519 7713573 7424267 7242274 7290483 7454199 7652153
4795 7652153 7976792 8138778 8359341 8848486 9206859 9341087 9441083 9253889 8977216 8781056
4785 8781056 8360101 7881315 7408070 6909478 6503227 6184631 5810656 5531378 5312920 5240864
4775 5240864 5060784 4987570 4981620 4973128 5004016 5057473 5223465 5401502 5501455 5784655 6225862
4764 6225862 6629901 7127994 7751643 8410564 9152750 10020357 10989736 12021971 12958114
$$ packed form
4836A753756M9312R9019m9357m1562O2519J06514J90895Q0343P70R8720J66328
4825B517257K14218R4548J59284K80733J48781K33302K75872L21110L32841M06745
4815D984691M65992N42227O64205O47209O23557N69819K72758K52671p120j72727
4805H843282k33145j85304j45697l65617j99946k89306j81993M8209J63716J97954
4795G652153L24639J61986K20563M89145L58373J34228R9996j87194k76673j96160
4785H781056m20955m78786m73245m98592m06251l18596l73975k79278k18458p2056
4775E240864j80080p3214n950q492L0888N3457J65992J78037R9953K83200M41207
4764F225862M04039M98093O23649O58921P42186Q67607R69379J032235R36143
$$ plain form
4755 12958114 13690518 14252832 14414815 14560472 14641042 14571196 14447861 14455096 14463036 14661103
4745 14661103 15019936 15385677 15955654 16624692 17301191 17821188 18214067 18608806 18796250
4736 18796250 18778314 18591685 18213118 17740607 17055888 16581560 16028738 15499110 15140627 14934682
4726 14934682 14644999 14261037 13773905 13162057 12493823 11712381 10935055 10207193 9362530
4717 9362530 8540373 7997335 7465693 6884557 6422767 6068235 5871521 5579130 5178678 4980091
4707 4980091 4998684 5008132 4974448 4937550 4932237 5053828 5260413 5395654 5660653 5981949 6385001
4696 6385001 6785945 7301762 7797438 8439870 9515677 10591290 11545996 12523716 13519492
4687 13519492 14286351 14696606 14777474 14626704 14284754 13806563 13364705 12943216 12529262 12270860
$$ packed form
4755A2958114P32404N62314J61983J45657Q0570o9846j23335P235P940J98067
4745A4661103L58833L65741N69977O69038O76499N19997L92879L94739J87444
4736A8796250j7936j86629l78567m72511o84719m74328n52822n29628l58483k05945
4726A4934682k89683l83962m87132o11848o68234p81442p77326p27862q44663
4717I362530q22157n43038n31642n81136m61790l54532j96714k92391m00452j98587
4707D980091J8593R448l3684l6898n313J21591K06585J35241K64999L21296M03052
4696F385001M00944N15817M95676O42432J075807J075613R54706R77720R95776
4687A3519492P66859M10255Q0868j50770l41950m78191m41858m21489m13954k58402
$$ plain form
4677 12270860 12184002 12214905 12467705 12843047 13288297 13709589 13836348 13924107 13762345 13383524
4667 13383524 12761046 11928190 11040376 10174086 9276938 8500327 7755237 6981040 6252762
4658 6252762 5757646 5299141 4839792 4546201 4262668 3937633 3678104 3575289 3390027 3182168
4648 3182168 3039817 2963536 2909586 2834735 2727570 2595249 2462143 2489756 2562830 2533468 2602928
4637 2602928 2489990 2436897 2477592 2438605 2362411 2326286 2415350 2346754 2352538 2352079 2339079 2464010
4625 2464010 2382806 2324379 2307943 2376651 2512950 2447911 2487176 2466362 2576997 2679951 2726142
4614 2726142 2709408 2766711 2839384 2891921 2869655 2874386 2983288 3016031 3140481 3287584 3364686
4603 3364686 3272269 3287175 3374918 3353529 3486848 3792629 3981236 4010768 4167450 4416424
$$ packed form
4677A2270860q6858L0903K52800L75342M45250M21292J26759Q7759j61762l78821
4667A3383524o22478q32856q87814q66290q97148p76611p45090p74197p28278
4658F252762m95116m58505m59349k93591k83533l25035k59529j02815j85262k07859
4648C182168j42351p6281n3950p4851j07165j32321j33106K7613P3074k9362O9460
4637B602928j12938n3093M0695l8987p6194l6125Q9064o8596N784m59j3000J24931
4625B464010q1204n8427j6436O8708J36299o5039L9265k0814J10635J02954M6191
4614B726142j6734N7303P2673N2537k2266M731J08902L2743J24450J47103P7102
4603C364686r2417J4906Q7743k1389J33319L05781J88607K9532J56682K48974
$$ plain form
4593 4416424 4635497 4848897 5069716 5272141 5568011 5812619 6137429 6586134 7063928 7587097
4583 7587097 8239186 8930364 9802564 10767217 11820864 13080792 14382804 15763552 17218472
4574 17218472 18724673 19996166 21209862 22010100 22390389 22508108 22314823 21908741 21363807
4565 21363807 20756420 20441196 20154010 19995768 19935383 20005024 20454220 21107882 21865917 22646296
4555 22646296 23409628 24212969 24906990 25561349 26155506 26519299 26787915 26916292 26817245 26519349
4545 26519349 26229124 26021345 25836124 25716123 25909901 26498489 27123712 27755167 28563357
4536 28563357 29334554 30105104 30860068 31711673 32442128 32947771 33335156 33460414 33187164
4527 33187164 32719489 32266938 31839847 31624221 31547545 31772144 32279008 32817117 33460776 34135524
$$ packed form
4593D416424K19073K13400K20819K02425K95870K44608L24810M48705M77794N23169
4583G587097O52089O91178Q72200R64653J053647J259928J302012J380748J454920
4574A7218472J506201J271493J213696Q00238L80289J17719j93285m06082n44934
4565B1363807o07387l15224k87186j58242o0385O9641M49196O53662P58035P80379
4555B2646296P63332Q03341O94021O54359N94157L63793K68616J28377r9047k97896
4545B6519349k90225k07779j85221j20001J93778N88588O25223O31455Q08190
4536B8563357P71197P70550P54964Q51605P30455N05643L87385J25258k73250
4527C3187164m67675m52551m27091k15626p6676K24599N06864N38109O43659O74748
$$ plain form
4517 34135524 34687462 35047141 35182349 35095965 34830594 34400863 33763695 33205431 32667223 32200144
4507 32200144 31917792 31490686 31036288 30466099 29827795 29096165 28376548 27741014 27152343
4498 27152343 26642705 26105917 25565428 25011977 24333838 23441274 22494442 21267989 20096630
4489 20096630 19014666 17915175 16996640 16339984 15835499 15431799 15203134 15206092 15432624
4480 15432624 15721370 16123445 16680899 17234775 17875425 18540296 19061286 19589878 20135527
4471 20135527 20478113 20609281 20536170 20200309 19646526 18870553 17991303 17185424 16178519
4462 16178519 15056890 13977038 12783645 11820870 10974413 10046049 9113871 8263322 7590006
4453 7590006 6998161 6519615 6052526 5527154 5182891 4830669 4518480 4287073 3992627 3801693
$$ packed form
4517C4135524N51938L59679J35208q6384k65371m29731o37168n58264n38208m67079
4507C2200144k82352m27106m54398n70189o38304p31630p19617o35534n88671
4498B7152343n09638n36788n40489n53451o78139q92564r46832j226453j171359
4489B0096630j081964j099491r18535o56656n04485m03700k28665K958K26532
4480A5432624K88746M02075N57454N53876O40650O64871N20990N28592N45649
4471B0135527L42586J31168p3111l35861n53783p75973q79250q05879j006905
4462A6178519j121629j079852j193393r62775q46457r28364r32178q50549o73316
4453G590006n91845m78546m67089n25372l44263l52222l12189k31407k94446j90934
$$ plain form
4443 3801693 3691459 3457551 3277298 3162212 3103665 2886848 2828042 2732212 2625594 2547353
4433 2547353 2420857 2310556 2309866 2223701 2197061 2168315 2066936 1953729 1994051 2077786 1981838
4422 1981838 1866273 1810594 1718574 1761350 1793887 1713594 1665426 1578941 1610913 1536420 1546930
4411 1546930 1543574 1453713 1429858 1436401 1378364 1353847 1377150 1355584 1289308 1407779 1444140 1448539
4399 1448539 1556238 1574117 1484098 1536045 1678443 1993574 2520269 3414832 4075953 3883242
4389 3883242 3312127 2716697 2335807 2006390 1849963 1673842 1398113 1239778 1136647 1035533
4379 1035533 1036451 1122805 1031765 872960 864010 871683 848926 810771 733862 676197 608508 728458
4367 728458 827089 890064 833008 824113 667012 668487 773925 718806 699728 752638 738214 619547
$$ packed form
4443C801693j10234k33908j80253j15086n8547k16817n8806r5830j06618p8241
4433B547353j26496j10301o90q6165k6640k8746j01379j13207M0322Q3735r5948
4422A981838j15565n5679r2020M2776L2537q0293m8168q6485L1972p4493J0510
4411A546930l356q9861k3855O543n8037k4517K3303k1566o6276J18471L6361M399
4399A448539J07699J7879r0019N1947J42398L15131N26695Q94563O61121j92711
4389C883242n71115n95430l80890l29417j56427j76121k75729j58335j03131j01114
4379A035533R18Q6354r1040j58805q950P673k2757l8155p6909n7665o7689J19950
4367G28458R8631O2975n7056q895j57101J475J05438n5119j9078N2910j4424j18667
$$ plain form
4355 619547 665007 607971 559566 525012 556734 551639 525579 656413 616897 567522 588811 595001
4343 595001 571976 615076 546215 511528 579611 595292 573411 512933 455920 492825 607123
4332 607123 580150 565299 589826 561264 619740 614760 514406 579263 628477 525083 436442
4321 436442 522997 486100 397823 500914 605343 432816 431433 504907 499640 538954 546372 545050
4309 545050 532182 491376 534306 534908 461818 462437 523203 421833 363550 425953 406594 507075
4297 507075 477530 296294 318913 428763 405171 413109 332334 282520 399029 469461 432807
4286 432807 375900 421752 523448 489823 388109 381785 429843 441198 436692 447783 446142 450733
4274 450733 508120 467010 432479 420378 502045 531589 491529 476429 490091 499406 568512 558757
$$ packed form
4355F19547M5460n7036m8405l4554L1722n095k6060J30834l9516m9375K1289O190
4343E95001k3025M3100o8861l4687O8083J5681k1881o0478n7013L6905J14298
4332F07123k6973j4851K4527k8562N8476m980j00354O4857M9214j03394q8641
4321D36442Q6555l6897q8277J03091J04429j72527j383P3474n267L9314P418j322
4309E45050j2868m0806M2930O02p3090O19O0766j01370n8283O2403j9359J00481
4297E07075k9545j81236K2619J09850k3592P938q0775m9814J16509P0432l6654
4286D32807n6907M5852J01696l3625j01714o324M8058J1355m506J1091j641M591
4274D50733N7387m1110l4531j2101Q1667K9544m0060j5100J3662R315O9106r755
$$ plain form
4262 558757 520324 512067 501112 483349 551701 723496 695404 735815 734840 486502 406591 534471
4250 534471 541379 622772 581879 534154 438494 376658 505245 677473 693328 646826 682583
4239 682583 604974 578949 566309 560356 645321 653811 572030 581138 627478 624655 761833 724268
4227 724268 667138 657636 642218 671722 706082 618549 652195 761598 721769 709077 687077 584539
4215 584539 557360 576324 598277 601363 587048 625045 647488 599582 592850 757235 682212 548643
4203 548643 570393 664263 646875 682515 668399 659060 699633 565840 628869 732860 755619
4192 755619 706429 748828 775011 630094 589910 537645 623380 656026 630585 732598 777589
4181 777589 657802 593373 600318 626583 686878 621395 649346 717543 667669 590681 620915 701232
$$ packed form
4262E58757l8433q257j0955j7763O8352J71795k8092M0411r75k48338p9911J27880
4250E34471O908Q1393m0893m7725r5660o1836J28587J72228J5855m6502L5757
4239F82583p7609k6025j2640n953Q4965Q490q1781R108M6340k823J37178l7565
4227G24268n7130r502j5418K9504L4360q7533L3646J09403l9829j2692k2000j02538
4215E84539k7179J8964K1953L086j4315L7997K2443m7906o732J64385p5023j33569
4203E48643K1750R3870j7388L5640j4116r339M0573j33793O3029J03991K2759
4192G55619m9190M2399K6183j44917m0184n2265Q5735L2646k5441J02013M4991
4181G77589j19787o4429O945K6265O0295o5483K7951O8197m9874p6988L0234Q0317
$$ plain form
4169 701232 692498 686826 625828 645485 675961 700530 837121 733707 583627 648406 683532
4158 683532 714157 738833 713535 648889 582310 548277 645389 761043 789331 702005 576551
4147 576551 661065 740704 743582 641101 643467 669661 732579 754221 652688 556377 560799 570276
4135 570276 565393 607476 697632 726581 601337 488693 472641 580084 655353 709829 659988
4124 659988 562069 488220 641673 613711 501823 521248 636210 726835 767562 757398 717280
4113 717280 821943 1007158 1143508 1146612 1163691 1109018 1069702 1055521 1041580 994302 1006721
4102 1006721 996031 876991 851308 906488 926019 907393 824586 696840 793616 908253 885971
4091 885971 856178 863016 860860 933514 891542 878637 955931 958853 912362 921816 943196 862217
$$ packed form
4169G01232q734n672o0998J9657L0476K4569J36591j03414j50080O4779L5126
4158F83532L0625K4676k5298o4646o6579l4033R7112J15654K8288q7326j25454
4147E76551Q4514P9639K878j02481K366K6194O2918K1642j01533r6311M422R477
4135E70276m883M2083R0156K8949j25244j12644j6052J07443P5269N4476m9841
4124F59988r7919p3849J53453k7962j11888J9425J14962R0625M0727j0164m0118
4113G17280J04663J85215J36350L104J7079n4673l9316j4181j3941m7278J2419
4102A006721j0690j19040k5683N5180J9531j8626q2807j27746R6776J14637k2282
4091H85971k9793O838k156P2654m1972j2905P7294K922m6491R454K1380q0979
$$ plain form
4079 862217 827571 848358 849974 844683 848100 871204 871151 844116 933414 924818 895488 868856 922108
4066 922108 1005015 969276 924325 928787 841904 856169 876978 870318 934026 1004437 960784 908730
4054 908730 934709 892778 921081 870626 943439 960829 906986 934729 1003560 876272 926192
4043 926192 1041306 1058737 963284 946475 1000284 976084 961569 929347 971045 837925 908801
4032 908801 1063395 1114286 1054587 1041695 985806 971353 1000438 1111743 1125250 1101679 1034212
4021 1034212 1021458 1174726 1123324 1151746 1241999 1241834 1119168 1172230 1186119 1245997 1277447
4010 1277447 1263731 1335338 1322746 1335811 1424510 1541615 1371220 1406335 1365864 1256539 1303089
3999 1303089 1455105 1542771 1579857 1528245 1428522 1369595 1399094 1489823 1591242 1613486 1606956
$$ packed form
4079H62217l4646K0787J616n291L417K3104n3k7035Q9298q596k9330k6632N3252
4066I22108Q2907l5739m4951M462q6883J4265K0809o660O3708P0411m3653n2054
4054I08730K5979m1931K8303n0455P2813J7390n3843K7743O8831j27288M9920
4043I26192J15114J7431r5453j6809N3809k4200j4515l2222M1698j33120P0876
4032I08801J54594N0891n9699j2892n5889j4453K9085J11305J3507k3571o7467
4021A034212j2754J53268n1402K8422R0253j65j22666N3062J3889N9878L1450
4010A277447j3716P1607j2592J3065Q8699J17105j70395L5115m0471j09325M6550
3999A303089J52016Q7666L7086n1612r9723n8927K9499R0729J01419K2244o530
$$ plain form
3988 1606956 1531629 1512083 1534389 1557948 1603275 1606899 1694663 1652007 1759072 1772674 1717404
3977 1717404 1817858 1912448 1931645 1935206 1863659 1861849 1992110 1980256 1964607 2044067 2027307
3966 2027307 2030245 2093173 2127366 2179716 2164332 2154692 2210394 2282693 2328323 2450607 2525666 2480938
3954 2480938 2497723 2646278 2666477 2590357 2591742 2703721 2753937 2868790 3049023 3130073 3174392
3943 3174392 3121662 3187666 3321764 3509972 3730300 3910886 3823262 3805971 3939937 4100806
3933 4100806 4323085 4503041 4679312 4782745 4938016 5041303 5265849 5463164 5578842 5736319
3923 5736319 5930949 6275526 6545493 6736095 6989587 7276419 7464947 7814135 8027454 8186982
3913 8186982 8393567 8552236 8805539 9176878 9638526 10110259 10425384 10763113 10995664 11336009
$$ packed form
3988A606956p5327j9546K2306K3559M5327L624Q7764m2656J07065J3602n5270
3977A717404J00454R4590J9197L561p1547j810J30261j1854j5649P9460j6760
3966B027307K938O2928L4193N2350j5384r640N5702P2299M5630J22284P5059m4728
3954B480938J6785J48555K0199p6120J385J11979N0216J14853J80233Q1050M4319
3943C174392n2730O6004J34098J88208K20328J80586q7624j7291J33966J60869
3933D100806K22279J79956J76271J03433J55271J03287K24546J97315J15678J57477
3923E736319J94630L44577K69967J90602K53492K86832J88528L49188K13319J59528
3913H186982K06585J58669K53303L71339M61648M71733L15125L37729K32551L40345
$$ plain form
3903 11336009 11650872 12004966 12348669 12784464 13263795 13948877 14677316 15273378 15994640
3894 15994640 16707396 17423949 17981388 18615897 19151467 19695973 20229801 20631510 21154585
3885 21154585 21748076 22430150 23251753 24280689 25450373 26617947 27859435 29164803 30345807
3876 30345807 31490489 32824302 34001714 35127707 36321262 37378598 38466464 39506829
3868 39506829 40452573 41435693 42312034 42802382 43136549 43360513 43479968 43762708 44182622
3859 44182622 44644115 45332796 46196180 47010500 47889216 48407114 48643967 48525536 48028732
3850 48028732 47276516 46018486 44595917 43275077 41885507 40629447 39570514 38832014
3842 38832014 38085644 37304965 36603728 35861427 34908470 33954089 32990737 31974156 30928320
$$ packed form
3903A1336009L14863L54094L43703M35795M79331O85082P28439N96062P21262
3894A5994640P12756P16553N57439O34509N35570N44506N33828M01709N23075
3885B1154585N93491O82074Q21603J028936J169684J167574J241488J305368J181004
3876C0345807J144682J333813J177412J125993J193555J057336J087866J040365
3868C9506829R45744R83120Q76341M90348L34167K23964J19455K82740M19914
3859D4182622M61493O88681Q63384Q14320Q78716N17898K36853j18431m96804
3850D8028732p52216j258030j422569j320840j389570j256060j058933p38500
3842C8832014p46370p80679p01237p42301r52957r54381r63352j016581j045836
$$ plain form
3833 30928320 29967184 29066471 28099944 27107438 26183262 25425348 24527133 23671505 23023711
3824 23023711 22346683 21662194 21134307 20615205 20038952 19593403 19299588 19172565 19116406 19091203
3814 19091203 19168847 19258583 19426728 19662823 19935310 20232761 20413478 20579944 20677200 20639999
3804 20639999 20438905 20149140 19697036 19201185 18636034 18080141 17461170 16807374 16229226
3795 16229226 15768713 15392442 14995481 14822679 14594581 14469618 14373442 14209352 14257075 14378535
3785 14378535 14492318 14594406 14684266 14851290 14932381 15070523 15303792 15534530 15726255 16055940
3775 16055940 16415439 16669313 17086222 17567095 17995795 18260788 18353461 18575249 18768971 18846995
3765 18846995 18978906 19141243 19276492 19517825 20036155 20787784 21885527 23433455 25106694
$$ packed form
3833C0928320r61136r00713r66527r92506r24176p57914q98215q55628o47794
3824B3023711o77028o84489n27887n19102n76253m45549k93815j27023n6159k5203
3814A9091203P7644Q9736J68145K36095K72487K97451J80717J66466R7256l7201
3804B0639999k01094k89765m52104m95851n65151n55893o18971o53796n78148
3795A6229226m60513l76271l96961j72802k28098j24963r6176j64090M7723J21460
3785A4378535J13783J02088Q9860J67024Q1091J38142K33269K30738J91725L29685
3775A6055940L59499K53874M16909M80873M28700K64993R2673K21788J93722P8024
3765A8846995J31911J62337J35249K41333N18330P51629J097743J547928J673239
$$ plain form
3756 25106694 27234454 29742027 32337356 34833692 37228772 39416660 41192512 42727558
3748 42727558 43776440 44289980 44534697 44290428 43630103 42730308 41273569 39734859 38111997
3739 38111997 36400402 34794230 33380645 32296545 31454023 31012906 30914554 31242979 32014097
3730 32014097 32945610 33903112 34788994 35616216 36321066 36973669 37884066 39003672 40374513
3721 40374513 42333541 44824672 47688828 51034640 54520231 58048365 61410741 64183543
3713 64183543 66123487 67349248 67671272 67090376 65835013 64136575 62269937 60342781
3705 60342781 58314358 56409461 54722982 52950870 51197589 49713929 48046901 46336213
3697 46336213 44852006 43446734 42351320 41355354 40695110 40226041 39805512 39413330 38837588
$$ packed form
3756B5106694K127760K507573K595329K496336K395080K187888J775852J535046
3748D2727558J048882N13540K44717k44269o60325q99795j456739j538710j622862
3739C8111997j711595j606172j413585j084100q42522m41117r8352L28425P71118
3730C2014097R31513R57502Q85882Q27222P04850O52603R10397J119606J370841
3721D0374513J959028K491131K864156L345812L485591L528134L362376K772802
3713F4183543J939944J225761L22024n80896j255363j698438j866638j927156
3705F0342781k028423j904897j686479j772112j753281j483660j667028j710688
3697D6336213j484207j405272j095414r95966o60244m69069m20529l92182n75742
$$ plain form
3688 38837588 37861612 36492883 34991707 33185005 31207765 29423403 27865440 26378821
3680 26378821 25153055 24335311 23568472 23058900 22834829 22742434 22779627 22827868 22757683 22538159
3670 22538159 22117585 21535355 20938294 20464654 19987992 19468294 18733462 18072046 17709528
3661 17709528 17252814 17048383 17175761 17223057 17498947 17731237 18009698 18225090 18148997 18194548
3651 18194548 18255986 18213227 18154323 18193189 18052743 17790183 17516221 16993255 16480440 16136502
3641 16136502 15774927 15364217 14949923 14325661 13805369 13338493 12750267 12145225 11641719
3632 11641719 11273739 10665709 10172966 9518021 8840255 8403733 7916613 7451059 7097056
3623 7097056 6818378 6620936 6539560 6287265 6139954 6188345 6144948 6086745 5942297 5726038
$$ packed form
3688C8837588r75976j368729j501176j806702j977240j784362j557963j486619
3680B6378821j225766q17744p66839n09572k24071r2395L7193M8241p0185k19524
3670B2538159m20574n82230n97061m73640m76662n19698p34832o61416l62518
3661A7709528m56714k04431J27378M7296K75890K32290K78461K15392p6093M5551
3651A8194548O1438m2759n8904L8866j40446k62560k73962n22966n12815l43938
3641A6136502l61575m10710m14294o24262n20292m66876n88226o05042n03506
3632A1641719l67980o08030m92743o54945o77766m36522m87120m65554l54003
3623G097056k78678j97442q1376k52295j47311M8391m3397n8203j44448k16259
$$ plain form
3613 5726038 5563457 5322133 5081307 5016170 4855797 4716425 4574172 4559761 4472487 4188066
3603 4188066 4107466 4174310 4142505 4043268 3977687 3914035 3815434 3854419 3766093 3675784 3773929
3592 3773929 3690459 3663180 3577149 3462379 3424128 3429415 3389681 3348601 3298473 3142384 3081275
3581 3081275 3030223 2909494 2825575 2897995 2818067 2794866 2807180 2732983 2719014 2714749 2721356 2686099
3569 2686099 2621666 2499266 2547038 2637831 2596601 2495034 2565925 2538114 2537974 2624117 2533431
3558 2533431 2618306 2659142 2634031 2589767 2531064 2587603 2597242 2649396 2637582 2593524 2659480 2677139
3546 2677139 2614185 2583212 2595206 2671165 2648606 2657971 2593557 2623590 2722323 2715278 2694837 2653275
3534 2653275 2641302 2705349 2757055 2705477 2684538 2690802 2641981 2627751 2761989 2764633 2820616 2855832
$$ packed form
3613E726038j62581k41324k40826o5137j60373j39372j42253j4411q7274k84421
3603D188066q0600O6844l1805r9237o5581o3652r8601L8985q8326r0309R8145
3592C773929q3470k7279q6031j14770l8251N287l9734m1080n0128j56089o1109
3581C081275n1052j20729q3919P2420p9928k3201J2314p4197j3969m265O607l5257
3569B686099o4433j22400M7772R0793m1230j01567P0891k7811j40Q6143r0686
3558B533431Q4875M0836k5111m4264n8703N6539R639N2154j1814m4058O5956J7659
3546B677139o2954l0973J1994P5959k2559R365o4414L0033R8733p045k0441m1562
3534B653275j1973O4047N1706n1578k0939O264m8821j4230J34238K644N5983L5216
$$ plain form
3522 2855832 2764427 2726354 2798781 2957519 3047032 3049261 3047613 3034569 3137676 3355091 3423353
3511 3423353 3428174 3441624 3515357 3568400 3683179 3683543 3707697 3825431 3738578 3815829 3833143 3962060
3499 3962060 4092832 4183241 4284783 4358674 4487625 4574094 4611778 4548417 4378565 4278227
3489 4278227 4092395 3907772 3748698 3701049 3572734 3362368 3357700 3320868 3164462 3144122
3479 3144122 3161339 3115697 3031112 2957301 2955746 2857264 2846327 2910602 3010131 3001600 2987596 3027030
3467 3027030 2998792 3034494 3097654 3129985 3237202 3299094 3188979 3224757 3424538 3464784 3471008
3456 3471008 3654979 3814850 3878280 4070406 4200048 4118723 3925743 3907115 3878707 3828122
3446 3828122 3829350 3862100 3899535 3890483 3941314 4087831 4015904 3952242 3892829 3873268 3777056 3727686
$$ packed form
3522B855832r1405l8073P2427J58738Q9513K229j648j3044J03107K17415O8262
3511C423353M821J3450P3733N3043J14779L64K4154J17734q6853P7251J7314J28917
3499C962060J30772R0409J01542P3891J28951Q6469L7684o3361j69852j00338
3489D278227j85832j84623j59074m7649j28315k10366m668l6832j56406k0340
3479C144122J7217m5642q4585p3811j555r8482j0937O4275R9529q531j4004L9434
3467C027030k8238L5702O3160L2331J07217O1892j10115L5778J99781M0246O224
3456C471008J83971J59871O3430J92126J29642q1325j92980j8628k8408n0585
3446C828122J228L2750L7435r052N0831J46517p1927o3662n9413j9561r6212m9370
$$ plain form
3434 3727686 3704076 3696853 3671611 3610523 3640032 3724266 3873936 3857167 3829880 3787244 3793103 3807301
3422 3807301 3897361 3891276 3839184 4001319 3983755 3827000 3792289 3841301 3945227 4021591 4015218
3411 4015218 4021478 4019252 3973597 4030473 4080131 4137136 4141913 4189506 4300947 4194763 4244851 4314130
3399 4314130 4391403 4407773 4381534 4525863 4617169 4647699 4580419 4572281 4625036 4770697 4855795
3388 4855795 4865552 4876349 4862329 5046607 5082867 5089207 5100018 5027870 5058113 5074622 5203860
3377 5203860 5214821 5387135 5407760 5368822 5371870 5423933 5597272 5672913 5672431 5815441 5881391
3366 5881391 5837665 6051567 6162541 6211805 6377168 6647860 6833304 6925758 7080012 7201852
3356 7201852 7503416 7836457 8091737 8520085 8866240 9220879 9709970 10101798 10363537 10369116
$$ packed form
3434C727686k3610p223k5242o1088K9509Q4234J49670j6769k7287m2636N859J4198
3422C807301R0060o085n2092J62135j7564j56755l4711M9012J03926P6364o373
3411D015218O260k226m5655N6876M9658N7005M777M7593J11441j06184N0088O9279
3399D314130P7273J6370k6239J44329R1306L0530o7280q138N2755J45661Q5098
3388D855795R757J0797j4020J84278L6260O340J0811p2148L0243J6509J29238
3377E203860J0961J72314K0625l8938L048N2063J73339P5641m82J43010O5950
3366E881391m3726K13902J10974M9264J65363K70692J85444R2454J54254J21840
3356G201852L01564L33041K55280M28348L46155L54639M89091L91828K61739N579
$$ plain form
3346 10369116 10288317 10277072 10289881 10253567 10486589 10712048 10901268 11118044 11421061 11843506
3336 11843506 12182908 12574131 12897322 13300927 13686242 14034004 14182973 14197079 14131414 14003154
3326 14003154 13909098 13833682 13887899 13904792 13986859 14209064 14319332 14340276 14425521 14479609 14425092
3315 14425092 14385181 14383978 14422526 14492824 14535794 14681223 14884586 15097063 15530886 16087189
3305 16087189 16561994 17149354 17862097 18403506 19016073 19675798 20479276 21478164 22658977
3296 22658977 24022723 25603422 27523367 29635396 32115630 34935888 38038630 41867820
3288 41867820 46093383 50513045 55030253 59058768 62311626 64433754 65293926 64901095
3280 64901095 63409991 61094148 58172978 54929282 51503395 47777680 44035136 40655300
$$ packed form
3346A0369116q0799j1245J2809l6314K33022K25459J89220K16776L03017M22445
3336A1843506L39402L91223L23191M03605L85315L47762J48969J4106o5665j28260
3326A4003154r4056p5416N4217J6893Q2067K22205J10268K0944Q5245N4088n4517
3315A4425092l9911j203L8548P0298M2970J45429K03363K12477M33823N56303
3305A6087189M74805N87360P12743N41409O12567O59725Q03478R98888J180813
3296B2658977J363746J580699J919945K112029K480234K820258L102742L829190
3288D1867820M225563M419662M517208M028515L252858K122128Q60172l92831
3280F4901095j491104k315843k921170l243696l425887l725715l742544l379836
$$ plain form
3272 40655300 37533753 34816545 32467537 30530103 29030712 27849857 27019836 26545978
3264 26545978 26269501 26209738 26341362 26630994 27104027 27894430 28926769 30371253 32105856
3255 32105856 34192916 36888691 39936986 43302055 46942137 50461402 53354041 55462608
3247 55462608 56292603 56185725 55317268 53838536 52153782 50472924 48540398 46452559 44438539
3238 44438539 42289831 39983754 37583630 35174926 32823381 30515226 28560241 26904897
3230 26904897 25210679 23703355 22518318 21442668 20497258 19720481 19104910 18789710 18506462
3221 18506462 18242879 17963411 17740598 17680666 17705497 17749187 17861605 17927758 17993358 18211690
3211 18211690 18310804 18376463 18633579 18905050 19174530 19252274 19491741 19848072 20126794 20628951
$$ packed form
3272D0655300l121547k717208k349008j937434j499391j180855q30021m73858
3264B6545978k76477n9763J31624K89632M73033P90403J032339J444484J734603
3255C2105856K087060K695775L048295L365069L640082L519265K892639K108567
3247E5462608Q29995j06878q68457j478732j684754j680858j932526k087839k014020
3238D4438539k148708k306077k400124k408704k351545k308155j954985j655344
3230B6904897j694218j507324j185037j075650r45410p76777o15571l15200k83248
3221A8506462k63583k79468k22813n9932K4831M3690J12418O6153O5600K18332
3211A8211690R9114O5659K57116K71471K69480P7744K39467L56331K78722N02157
$$ plain form
3201 20628951 21224330 21773641 22336553 23032415 23674616 24333139 24929133 25540107 26267308
3192 26267308 27067221 27833519 28583656 29431367 30559409 31922440 33500074 35617008 38090792
3183 38090792 41235224 45174297 50002240 56249997 64297333 75008563 89316323 107513752
3175 107513752 129036329 151434945 170261925 181711403 184172284 178353800 168243849
3168 168243849 158576671 152809594 153385815 160675582 172531156 184507291 191695474 190438025
3160 190438025 179656949 161619596 140062557 118655341 99535509 83631679 70929237
3153 70929237 60886265 52992736 46739655 41807815 37877877 34791109 32206593 29972488
3145 29972488 28059987 26403045 24928570 23722922 22822442 22020632 21411628 20811988 20350055
$$ packed form
3201B0628951N95379N49311N62912O95862O42201O58523N95994O10974P27201
3192B6267308P99913P66298P50137Q47711J128042J363031J577634K116934K473784
3183C8090792L144432L939073M827943O247757Q047336J0711230J4307760J8197429
3175A07513752K1522577K2398616J8826980J1449478K460881n818484j0109951
3168A68243849r667178n767077N76221P289767J1855574J1976135P188183j257449
3160A90438025j0781076j8037353k1557039k1407216j9119832j5903830j2702442
3153G0929237j0042972p893529o253081m931840l929938l086768k584516k234105
3145B9972488j912501j656942j474475j205648r00480q01810o09004n99640m61933
$$ plain form
3136 20350055 19928066 19525637 19169962 18815705 18475867 18096477 17719513 17343379 17083577
3127 17083577 16996086 16880240 16732746 16802129 16744217 16765924 16786605 16816053 16886147 16886107 16961958
3116 16961958 17271828 17583018 17823269 18055714 18347336 18480132 18765224 19194681 19484093
3107 19484093 19775893 20045350 20311934 20720386 21223750 21869801 22602340 23294977 24009371
3098 24009371 24764578 25552603 26463785 27467693 28577540 29846998 31445516 33232326 35200261
3089 35200261 37505472 40056437 42859634 46071254 49986809 54435063 59575550 65884364
3081 65884364 73313383 82008498 92495031 105344625 121263286 141672373 168710208
3074 168710208 204506082 250667527 305304425 361339252 409233207 440138755 448946711
$$ packed form
3136B0350055m21989m02429l55675l54257l39838l79390l76964l76134k59802
3127A7083577q7491j15846j47494O9383n7912K1707K0681K9448P0094m0P5851
3116A6961958L09870L11190K40251K32445K91622J32796K85092M29457K89412
3107A9484093K91800K69457K66584M08452N03364O46051P32539O92637P14394
3098B4009371P55207P88025R11182J003908J109847J269458J598518J786810J967935
3089C5200261K305211K550965K803197L211620L915555M448254N140487O308814
3081F5884364P429019Q695115J0486533J2849594J5918661K0409087K7037835
3074A68710208L5795874M6161445N4636898N6034827M7893955L0905548Q807956
$$ plain form
3067 448946711 437649859 413945565 385545879 358184291 335534339 317738367 302245354
3060 302245354 285094833 263467981 237118112 208272216 179392652 152852180 130034324
3053 130034324 111091117 95570663 83099828 73091537 64977214 58343794 52668571
3046 52668571 47837855 43728187 40300967 37555744 35050225 32673765 30637550 28825217
3038 28825217 27296407 25879905 24622190 23607280 22684366 21665136 20873321 20267132 19545475
3029 19545475 18776532 18101991 17527934 17014741 16520310 16012029 15516930 14970254 14453346
3020 14453346 13985684 13534503 13065484 12748493 12545316 12096163 11702507 11310224 10855607
3011 10855607 10659516 10390914 10270195 10322255 10291394 10098379 9968899 9803980 9596694 9435664
$$ packed form
3067D48946711j1296852k3704294k8399686k7361588k2649952j7795972j5493013
3060C02245354j7150521k1626852k6349869k8845896k8879564k6540472k2817856
3053A30034324j8943207j5520454j2470835j0008291q114323o633420n675223
3046E2668571m830716m109668l427220k745223k505519k376460k036215j812333
3038B8825217j528810j416502j257715j014910r22914j019230p91815o06189p21657
3029A9545475p68943o74541n74057n13193m94431n08281m95099n46676n16908
3020A4453346m67662m51181m69019l16991k03177m49153l93656l92283m54617
3011A0855607j96091k68602j20719N2060l0861j93015j29480j64919k07286j61030
$$ plain form
3001 9435664 9080940 8755696 8457579 8204934 8119442 7883566 7545380 7418453 7221590 7070496
2991 7070496 6871051 6609370 6353215 6091759 5857810 5693857 5684153 5656737 5570086 5537761
2981 5537761 5451571 5231003 5178925 5131772 5186718 5133619 5139172 5254677 5308126 5189032 5062270
2970 5062270 5020977 4836112 4716579 4688437 4516320 4278529 4118979 3980267 3962128 3789727
2960 3789727 3557549 3522786 3501151 3264730 3221860 3185400 2945357 2841010 2745152 2742249 2743775
2949 2743775 2717969 2723884 2640801 2505854 2528821 2689742 2561627 2561315 2571799 2438924 2339475
2938 2339475 2321051 2250262 2227657 2276798 2203766 2118655 2054451 2048855 2011677 1980658 2037190 2067529
2926 2067529 2066792 1988353 2021958 1977422 1930479 2006617 2041046 1894792 1879418 1956725 1852284
$$ packed form
3001I435664l54724l25244k98117k52645q5492k35876l38186j26927j96863j51094
2991G070496j99445k61681k56155k61456k33949j63953r704k7416q6651l2325
2981E537761q6190k20568n2078m7153N4946n3099N553J15505N3449j19094j26762
2970E062270m1293j84865j19533k8142j72117k37791j59550j38712j8139j72401
2960C789727k32178l4763k1635k36421m2870l6460k40043j04347r5858k903J526
2949B743775k5806N915q3083j34947K2967J60921j28115l12J0484j32875r9449
2938B339475j8424p0789k2605M9141p3032q5111o4204n596l7178l1019N6532L0339
2926B067529p37p8439L3605m4536m6943P6138L4429j46254j5374P7307j04441
$$ plain form
2915 1852284 1847519 1818820 1817779 1765152 1723204 1710937 1787978 1799021 1761592 1731711 1690274 1656981
2903 1656981 1690291 1756875 1812444 1819678 1708965 1573904 1670353 1695811 1759892 1873416 1946754
2892 1946754 1930650 1930095 2071092 2046979 2069810 2067725 1988953 1901474 1853203 1784125 1809112 1838359
2880 1838359 1771149 1778715 1797377 1775994 1711081 1587379 1399423 1386484 1350678 1159998 1137316
2869 1137316 1057888 985744 951121 995660 1011139 960685 906430 904625 839130 795639 877644 843999
2857 843999 778281 778004 735520 781383 785035 798369 749292 664531 574842 732614 681291 660521
2845 660521 718427 710316 742512 820033 813692 708241 745458 682578 738316 760638 722414 684087
2833 684087 637829 621833 571815 535114 639656 673433 622991 554377 615938 551093 506651
$$ packed form
2915A852284m765k8699j041n2627m1948j2267P7041J1043l7429k9881m1437l3293
2903A656981L3310O6584N5569P234j10713j35061R6449K5458O4081J13524P3338
2892A946754j6104n55J40997k4113K2831k085p8772q7479m8271o9078K4987K9247
2880A838359o7210P566J8662k1383o4913j23702j87956j2939l5806j90680k2682
2869A137316p9428p2144l4623M4539J5479n0454n4255j805o5495m3491Q2005l3645
2857H43999o5718k77m2484M5863L652J3334m9077q4761q9689J57772n1323k0770
2845F60521N7906q111L2196P7521o341j05451L7217o2880N5738K2322l8224l8327
2833F84087m6258j5996n0018l6701J04542L3777n0442o8614O1561o4845m4442
$$ plain form
2822 506651 514439 568238 562591 541645 539603 463206 495285 470199 508790 536261 478468 570846
2810 570846 564212 532586 486320 633714 641373 676634 744005 696030 709465 818410 834924 784869
2798 784869 893456 966866 958027 882552 1036654 1192162 1230951 1464254 1648400 1823440 2166192
2787 2166192 2488815 2584208 2659905 2695570 2609534 2512798 2436149 2301582 2089959 1905466 1811780
2776 1811780 1805185 1663367 1573110 1456129 1261045 1107717 1006985 884401 814249 779548
2766 779548 690362 675542 594836 526482 515890 498527 526316 568840 456631 421181 381651
2755 381651 433974 440562 385138 355754 318713 367146 333647 462327 498004 451071 479034 437856
2743 437856 353072 414761 495937 478022 323923 250916 286270 286616 289150 296891 244430 267306
$$ packed form
2822E06651P788N3799n647k0946k042p6397L2079k5086L8591K7471n7793R2378
2810E70846o634l1626m6266J47394P659L5261O7371m7975J3435J08945J6514n0055
2798G84869J08587P3410q839p5475J54102J55508L8789K33303J84146J75040L42752
2787B166192L22623R5393P5697L5665q6036r6736p6649j34567k11623j84493r3686
2776A811780o595j41818r0257j16981j95084j53328j00732j22584p0152l4701
2766G79548q9186j4820q0706o8354j0592j7363K7789M2524j12209l5450l9530
2755C81651N2323O588n5424k9384l7041M8433l3499J28680L5677m6933K7963m1178
2743D37856q4784O1689Q1176j7915j54099p3007L5354L46K534P741n2461K2876
$$ plain form
2731 267306 348812 282368 271431 292033 289505 406293 396318 248011 237259 253103 201298 232306
2719 232306 326565 366992 350321 306090 322294 281839 218212 337899 330341 262403 310879 309924
2707 309924 174185 134814 177944 141454 156820 230113 304972 285169 223655 194605 165683
2696 165683 190588 224915 266442 189417 174882 291004 214958 158713 171795 207182 162107
2685 162107 184408 176759 246002 263781 254450 188552 130094 167727 161506 230741 168076 211527
2673 211527 206341 149858 181175 130435 160012 335155 237846 193513 153823 128019 146984 273167
2661 273167 367572 323290 251079 274918 276607 329062 382688 410230 294622 148291 164487
2650 164487 234982 259798 263334 298427 321306 257986 282674 395959 424171 452417 468241 450403
$$ packed form
2731B67306Q1506o6444j0937K0602k528J16788r975j48307j0752J5844n1805L1008
2719B32306R4259M0427j6671m4231J6204m0455o3627J19687p558o7938M8476r55
2707C09924j35739l9371M3130l6490J5366P3293P4859j9803o1514k9050k8922
2696A65683K4905L4327M1527p7025j4535J16122p6046n6245J3082L5387m5075
2685A62107K2301p649O9243J7779r331o5898n8458L7633o221O9235o2665M3451
2673B11527n186n6483L1317n0740K9577J75143r7309m4333l9690k5804J8965J26183
2661B73167R4405m4282p2211K3839J689N2455N3626K7542j15608j46331J6196
2650A64487P0495K4816L536L5093K2879o3320K4688J13285K8212K8246J5824j7838
$$ plain form
2638 450403 393373 460045 366761 219080 209759 202939 179180 217778 249374 200357 225297 167392
2626 167392 169217 205074 185052 232143 286465 202147 107406 148684 159606 110867 111514 104227
2614 104227 92812 198105 162002 37214 69044 115745 19580 77380 46308 102220 78110
2603 78110 -35195 -65331 36138 92491 212064 318601 177812 105706 198005 202173 114204
2592 114204 78169 13518 104494 80307 -14643 13006 85430 88587 119990 224809 159708 177663
2580 177663 129236 56439 45449 67068 57461 -44149 -19796 30992 58432 78867 141724 119274
2568 119274 1750 17498 81244 104527 210403 154896 155521 151158 99664 102811 82612 88692
2556 88692 142525 84502 39417 40659 62558 51870 51153 196412 100143 7871 -25323 26722
$$ packed form
2638D50403n7030O6672r3284j47681r321o820k3759L8598L1596m9017K4940n7905
2626A67392J825L5857k0022M7091N4322q4318r4741M1278J0922m8739O47p287
2614A04227j1415J05293l6103j24788L1830M6701r6165N7800l1072N5912k4110
2603G8110j13305l0136J01469N6353J19573J06537j40789p2106R2299M168q7969
2592A14204l6035o4651R0976k4187r4950K7649P2424L157L1403J04819o5101J7955
2580A77663m8427p2797j0990K1619r607j01610K4353N0788K7440K0435O2857k2450
2568A19274j17524J5748O3746K3283J05876n5507O25m363n1494L147k0199O080
2556H8692N3833n8023m5085J242K1899j0688p17J45259r6269r2272l3194N2045
$$ plain form
2544 26722 25803 1106 -2172 11533 75266 90584 35189 116330 84416 -20306 27159 50330
2532 50330 -6068 43127 78030 62628 30200 73983 66739 254239 249124 39820 64241 125572
2520 125572 73366 17853 -37858 -65278 -18278 36466 -38750 6795 -24606 66210 137474 25926
2508 25926 -21283 96578 104653 19436 68425 112382 88354 132067 253494 150844 33463
2497 33463 43041 62192 75438 47923 129431 136989 146600 93509 87476 163262 28642 -8394
2485 -8394 43466 95822 32224 -79549 -29603 163988 149709 119541 29113 126496 151969 198433
2473 198433 208073 243789 117254 113818 157726 99196 50921 251294 238475 131384 95315
2462 95315 63187 92789 56946 38118 50801 42342 143230 237533 95991 -24130 96520
$$ packed form
2544B6722r19k4697l278J3705O3733J5318n5395Q1141l1914j04722M7465K3171
2532E0330n6398M9195L4903j5402l2428M3783p244J87500n115k09304K4421O1331
2520A25572n2206n5513n5711k7420M7000N4744p5216M5545l1401R0816P1264j11548
2508B5926m7209J17861Q075q5217M8989M3957k4028M3713J21427j02650j17381
2497C3463R578J9151J3246k7515Q1508P558R611n3091o033P5786j34620l7036
2485h394N1860N2356o3598j11773M9946J93591j4279l0168r0428R7383K5473M6464
2473A98433R640L5716j26535l436M3908n8530m8275K00373j2819j07091l6069
2462I5315l2128K9602l5843j8828J2683q459J00888R4303j41542j20121J20650
$$ plain form
2451 96520 160680 188893 145026 160598 82251 104994 135078 188384 161818 151488 106484 207025
2439 207025 240313 165378 121932 178152 190198 266208 236811 84914 97662 74335 24260
2428 24260 103617 84728 96588 203452 264462 220651 265871 286473 256126 185789 235585 307809
2416 307809 380233 419520 264917 253882 345771 374692 430866 502136 377329 381991 446734
2405 446734 354623 273982 414088 456084 531831 525177 469328 597311 584857 587370 685402 780788
2393 780788 798948 864946 878594 995972 1173057 1446094 1754261 2017131 2113332 2135651 2263050
2382 2263050 2311469 2497712 2721488 3087614 3638734 4550531 5792311 7709099 10860873
2373 10860873 17327010 27391847 37308950 33947585 25473667 18804379 13276478 9989241
$$ packed form
2451I6520O4160K8213m3867J5572p8347K2743L0084N3306k6566j0330m5004J00541
2439B07025L3288p4935m3446N6220J2046P6010k9397j51897J2748k3327n0075
2428B4260P9357j8889J1860J06864O1010m3811M5220K0602l0347p0337M9796P2224
2416C07809P2424L9287j54603j1035R1889K8921N6174P1270j24807M662O4743
2405D46734r2111q0641J40106M1996P5747o654n5849J27983j2454K513R8032R5386
2393G80788J8160O5998J3648J17378J77085K73037L08167K62870R6201K2319J27399
2382B263050M8419J86243K23776L66126N51120R11797J241780J916788L151774
2373A0860873O466137J0064837R917103l361365q473918o669288n527901l287237
$$ plain form
2365 9989241 7435366 5869279 4504371 3587453 3023235 2837774 2494426 2478786 2448989
2356 2448989 2506111 2323019 2021933 1678318 1599635 1436962 1342731 1176002 1069200 1016173
2346 1016173 998711 872058 880788 807769 787021 671604 646061 582377 542081 486577 605603
2335 605603 550084 480679 542787 520036 444595 484639 526497 511708 414777 434760 433948 602637
2323 602637 465919 245762 282119 345049 354570 394963 397644 324109 255358 309276 228537 241720
2311 241720 123370 146337 337638 225503 156365 342886 246179 88307 98949 99490 153900
2300 153900 159792 180928 212771 188003 207021 203930 252380 195250 152140 186531 170483 53348
2288 53348 18591 125490 135901 88957 120576 200059 117708 88046 155844 222520 181299 -29444
$$ packed form
2365I989241k553875j566087j364908r16918n64218j85461l43348j5640k9797
2356B448989N7122j83092l01086l43615p8683j62673r4231j66729j06802n3027
2346A016173j7462j26653Q730p3019k0748j15417k5543o3684m0296n5504J19026
2335F05603n5519o9405O2108k2751p5441M0044M1858j4789r6931J9983q12J68689
2323F02637j36718k20157L6357O2930R521M0393K681p3535o8751N3918q0739J3183
2311B41720j18350K2967J91301j12135o9138J86521r6707j57872J0642N41N4410
2300A53900N892K1136L1843k4768J9018l091M8450n7130m3110L4391j6048j17135
2288E3348l4757J06899J0411m6944L1619P9483q2351k9662O7798O6676m1221k10743
$$ plain form
2276 -29444 10296 26573 43944 1442 86442 86617 37514 39035 72726 18910 112427 97984
2264 97984 -9238 31896 9519 14401 108344 37598 -2681 79926 65190 59123 39909 -6481
2252 -6481 11574 29156 -95737 -58426 14864 93160 89428 90323 40834 56020 776 -43250
2240 -43250 -4353 5173 -16242 28919 -18080 -65796 -9802 67065 96992 34053 48642 73979
2228 73979 31317 77665 60024 20373 -45264 82598 94602 35716 85078 -23380 -82274
2217 -82274 17592 -30083 50448 109522 68238 -74299 -125576 -91701 106111 79316 12990
2206 12990 16791 6210 -20960 28684 90198 -29436 -34615 108278 98657 56853 -42815 -97506
2194 -97506 -82804 -84670 -23022 86713 -1877 -140500 -101166 11249 5959 27598 -33319 -114764
$$ packed form
2276b9444L9740J6277J7371m2502Q5000J75m9103J521L3691n3816R3517j4443
2264I7984j07222M1134k2377M882R3943p0746m0279Q2607j4736o067j9214m6390
2252f481J8055J7582j24893L7311P3290P8296l732Q95m9489J5186n5244m4026
2240d3250L8897R526k1415M5161m6999m7716N5994P6867K9927o2939J4589K5337
2228G3979m2662M6348j7641l9651o5637J27862J2004n8886M9362j08458n8894
2217h2274R9866m7675Q0531N9074m1284j42537n1277L3875J97812k6795o6326
2206A2990L801j0581k7170M9644O1514j19634n179J42893r621m1804r9668n4691
2194i7506J4702j866O1648J09735q8590j38623L9334J12415n290K1639o0917q1445
$$ plain form
2182 -114764 -126085 -139151 -73085 -21279 -31128 1420 20300 -12234 90653 144980 9870
2171 9870 31081 -8142 -110170 -76658 15067 18413 -113018 -41772 -2736 31821 -52677 -37142
2159 -37142 -18419 -39627 -110321 -54994 -51 -46625 -3543 -60917 -76054 46839 110977 68897
2147 68897 30120 15131 -73133 -8903 4424 8988 6662 -97740 -81910 45940 64330 5966
2135 5966 -106803 -159153 -124587 -60801 -37684 43812 17856 -66244 -99235 -36672 -28224 -35667
2123 -35667 83882 82825 -16077 -97823 -39156 -13170 -77702 -80964 19512 -18096 -17950 758
2111 758 -114983 -112741 -85785 -111458 -95357 -5282 84114 164783 130322 117682 106300 62055
2099 62055 111992 126570 44494 -71588 -80675 -54259 -16697 -4234 6585 101774 44879 22519
$$ packed form
2182a14764j1321j3066O6066N1806r849L2548J8880l2534J02887N4327j35110
2171I870K1211l9223j02028L3512R1725L346j31431P1246L9036L4557q4498J5535
2159c7142J8723k1208p0694N5327N4943m6574M3082n7374j5137J22893O4138m2080
2147F8897l8777j4989q8264O4230J3327M564k326j04402J5830J27850J8390n8364
2135E966j12769n2350L4566O3786K3117Q1496k5956q4100l2991O2563Q448p443
2123c5667J19549j057r8902q1746N8667K5986o4532l262J00476l7608J46J8708
2111G58j15741K242K6956k5673J6101R0075Q9396Q0669l4461j2640j1382m4245
2099F2055M9937J4578q2076j16082r087K6416L7562J2463J0819R5189n6895k2360
$$ plain form
2087 22519 77302 -74798 -140955 -133465 -96846 -85570 -73339 -103143 -63596 -20398 -22022 29481
2075 29481 2547 -4491 -77268 -75890 -12229 30758 -5774 -113523 -103376 -24693 19313 91217
2063 91217 48291 -81200 -161996 -52338 -57449 -39940 16797 -84074 -110214 -109549 -140803 -45764
2051 -45764 24738 -39851 -104942 -115205 -48346 9695 16031 -35764 -49263 39036 9632 -62405
2039 -62405 -101762 -19953 9567 -73803 -68917 -109807 -104814 -66048 -20658 -87916 -114697 -89071
2027 -89071 -83952 -10322 -64060 -130202 -94175 -106054 -94834 -30072 -18770 -9537 -77793 -110317
2015 -110317 -45416 -3362 -14936 -16587 95101 -21539 -148181 -55261 -28322 -23919 -45637
2004 -45637 -40950 54913 -17553 -100586 -149148 -130893 -124630 -33505 -24168 -62253 -62675 -3917 21405
$$ packed form
2087B2519N4783j52100o6157P490L6619J1276J2231k9804L9547M3198j624N1503
2075B9481k6934p038p2777J378O3661M2987l6532j07749J0147P8683M4006P1904
2063I1217m2926j29491q0796J09658n111J7509N6737j00871k6140O65l1254R5039
2051d5764P0502o4589o5091j0263O6859N8041O336n1795j3499Q8299k9404p2037
2039f2405l9357Q1809K9520q3370M886m0890M993L8766M5390o7258k6781K5626
2027h9071N119P3630n3738o6142L6027j1879J1220O4762J1302R233o8256l2524
2015a10317O4901M2054j1574j651J11688j16640j26642R2920K6939M403k1718
2004d5637M687R5863p2466q3033m8562J8255O263R1125R337l8085m22N8758K5322
$$ plain form
1991 21405 8631 -47005 -68674 -74713 -58973 4863 -54328 -25881 -31747 -116028 -132388 -2983
1979 -2983 38510 -1755 -23255 -147093 -19450 34973 -106944 -21411 -35050 -135417 -173433
1968 -173433 -150790 -124864 -12191 52917 -33298 -80193 -63141 -61234 -25159 -43962 16832 37343
1956 37343 -103661 -76287 5765 -81439 -62099 -50152 -84618 -105602 -65793 -46969 -13099 -20759
1944 -20759 -47372 -40705 -60313 -87979 -3007 -2934 -156478 -189661 -35884 -29977 -97507 -212402
1932 -212402 -194663 7071 -14379 -26530 -55735 -40127 -103104 -80723 -152110 -147056 -89081 6093
1920 6093 -38994 -113497 -124779 -4767 10645 -124344 -144939 -129962 -119311 -58691 -165520
1909 -165520 -148906 -16385 -21941 -52820 -66120 -44395 10433 38373 -108098 -146980 -73046
$$ packed form
1991B1405j2774n5636k1669o039J5740O3836n9191K8447n866q4281j6360J29405
1979b983M1493m0265k1500j23838J27643N4423j41917Q5533j3639j00367l8016
1968a73433K2643K5926J12673O5108q6215m6895J7052J907L6075j8803O0794K0511
1956C7343j41004K7374Q2052q7204J9340J1947l4466k0984L9809J8824L3870p660
1944b0759k6613O667j9608k7666Q4972P3j53544l3183J53777N907o7530j14895
1932b12402J7739K01734k1450j2151k9205J5608o2977K2381p1387N054N7975R5174
1920F093m5087p4503j1282J20012J5412j34989k0595J4977J0651O0620j06829
1909a65520J6614J32521n556l0879j3300K1725N4828K7940j46471l8882P3934
$$ plain form
1898 -73046 -49213 -108780 -68129 9209 -52343 -48481 -70077 -4117 1166 -38237 -77373 -46436
1886 -46436 -14815 -84909 -83496 -96833 -66431 9851 42715 -68879 -153429 -210593 -141581 -13955
1874 -13955 24361 -19340 -62819 -141852 -133326 -110627 -64890 -33671 -16775 -129103 -104636 -67191
1862 -67191 -93646 -59331 -19548 -563 -23651 -63856 -51285 -21903 -55159 -73748 -72087 -123704
1850 -123704 -28337 -40891 -103965 -89323 -11532 -30355 -111747 -141887 -90152 -57643 -42489 38517
1838 38517 -31622 -67665 -77523 -155145 -135042 -44332 514 -6796 -47681 -113039 -64764 59290
1826 59290 88428 23428 -27131 -85258 -99318 -106998 -67616 -11807 -62079 -90224 -167647 -126090
1814 -126090 -52837 -39004 -35981 -120346 -95317 4339 -67507 -46194 -50183 -68152 -40724 -41512
$$ packed form
1898g3046K3833n9567M0651P7338o1552L862k1596O5960N283l9403l9136L0937
1886d6436L1621p0094J413j3337L0402P6282L2864j11594q4550n7164O9012J27626
1874a3955L8316m3701m3479p9033Q526K2699M5737L1219J6896j12328K4467L7445
1862f7191k6455L4315L9783J8985k3088m0205J2571K9382l3256j8589J661n1617
1850a23704R5367j2554o3074J4642P7791j8823q1392l0140N1735L2509J5154Q1006
1838C8517p0139l6043r858p7622K0103R0710M4846p310m0885o5358M8275J24054
1826E9290K9138o5000n0559n8127j4060p680L9382N5809n0272k8145p7423M1557
1814a26090P3253J3833L023q4365K5029R9656p1846K1313l989j7969K7428p88
$$ plain form
1802 -41512 -115022 -84279 -34551 11293 -27168 -88120 -31561 -40442 -138052 -110885 -19198 -74444
1790 -74444 -178857 -208188 -159408 -105124 -66143 -45533 -37565 -121453 -72342 11412 21060 -24831
1778 -24831 10214 -29578 -111842 -130616 -65515 -2715 -100532 -112153 -138136 -112852 -17560 56295
1766 56295 77502 16907 -150763 -129344 -69389 -36663 -17586 -58458 -67723 -148715 -117483 -19806
1754 -19806 -7312 -12832 -76715 -177445 -113547 -72892 -98945 -38182 26306 -39218 -28053 17184
1742 17184 7691 -45059 -47504 -9933 20580 -28178 -114871 -82886 -137164 -115021 -52327 -39076
1730 -39076 -73714 -25007 26536 -26414 -9198 176 -22475 -78201 26632 3863 -94606 -170634
1718 -170634 -202195 -121783 -111829 -18745 53416 68428 -26010 -61814 -31481 19249 29258 -18855
$$ packed form
1802d1512p3510L0743M9728M5844l8461o0952N6559q881r7610K7167R1687n5246
1790g4444j04413k9331M8780N4284L8981K0610P968q3888M9111Q3754R648m5891
1778b4831L5045l9792q2264j8774O5101O2800r7817j1621k5983K5284R5292P3855
1766E6295K1207o0595j67670K1419N9955L2726J9077m0872r265q0992L1232R7677
1754a9806J2494n520o3883j00730O3898M0655k6053O0763O4488o5524J1165M5237
1742A7184r493n2750k445L7571L0513m8758q6693L1985n4278K2143O2694J3251
1730c9076l4638M8707N1543n2950J7216R374k2651n5726J04833k2769r8469p6028
1718a70634l1561Q0412R954R3084P2161J5012r4438l5804L0333N0730J0009m8113
$$ plain form
1706 -18855 -43584 -85330 -86658 -41201 -62502 -103700 -101901 -27121 -118292 -86634 -110212 -68814
1694 -68814 -60540 -37984 -140 -61934 26669 67049 29998 -18767 -66725 -38286 -3049 -76778
1682 -76778 -29101 19130 -22091 -70950 -102348 -156344 -202945 -172303 -55890 -1539 14552 -57820
1670 -57820 -95415 -145587 -24034 34642 58390 92909 -40851 -96015 -109683 -68054 -54245
1659 -54245 -68947 -12659 23472 20026 25966 23647 -108210 -148782 -89994 -143305 -38378 -25645
1647 -25645 -89653 -39691 -114670 -92970 17298 -20835 -81772 -64135 -42956 -14991 -49666 -130422
1635 -130422 -239444 -107792 -22509 -25731 9806 21526 42232 -67712 -144032 -58337 -21363
1624 -21363 47272 67244 -33985 -122779 -188104 -184910 -212042 -32533 -12481 15986 57542 -28080
$$ packed form
1706a8855k4729m1746j328M5457k1301m1198J799P4780r1171L1658k3578M1398
1694f8814Q274K2556L7844o1794Q8603M0380l7051m8765m7958K8439L5237p3729
1682g6778M7677M8231m1221m8859l1398n3996m6601L0642J16413N4351J6091p2372
1670e7820l7595n0172J21553N8676K3748L4519j33760n5164j3668M1629J3809
1659e4245j4702N6288L6131l446N940k319j31857m0572N8788n3311J04927J2733
1647b5645o4008M9962p4979K1700J10268l8133o0937J7637K1179K7965l4675q0756
1635a30422j09022J31652Q5283l222L5537J1720K0706j09944p6320Q5695L6974
1624b1363O8635J9972j01229q8794o5325L194k7132J79509K0052K8467M1556q5622
$$ plain form
1612 -28080 9779 22433 -5345 -58766 44912 -44110 -34554 -54690 -189514 -160053 -60196 -65070
1600 -65070 -51505 -4934 10606 31979 -55133 -25634 19664 31248 -37238 84598 45019 -64976
1588 -64976 -19212 -105812 -177235 -144050 -102784 -38503 -21219 -48295 -73229 9190 -58532 -46279
1576 -46279 23625 -77561 -39789 43683 55777 -38633 -66084 -102233 -73645 -31888 -79860 -30311
1564 -30311 -87786 -83883 -94890 -171259 -189132 -116986 -27794 -38605 -55954 -80873 -113341 -100122
1552 -100122 -96827 -119039 -26365 1827 -22650 -57208 -46426 22830 59021 20320 -49461 -91186
1540 -91186 -69786 -82490 -50896 -72926 -141408 -131523 -93314 -64694 117006 58266 -14289 -48775
1528 -48775 -109748 -87500 -62334 -77244 -95962 -87081 -133241 -1159 17109 -94897 -38592 -10903
$$ packed form
1612b8080L7859J2654k7778n3421J03678q9022R556k0136j34824K9461R9857m874
1600f5070J3565M6571J5540K1373q7112K9499M5298J1584o8486J21836l9579j09995
1588f4976M5764q6600p1423L3185M1266O4281J7284k7076k4934Q2419o7722J2253
1576d6279O9904j01186L7772Q3472J2094r4410k7451l6149K8588M1757m7972M9549
1564c0311n7475L903j1007p6369j7873P2146Q9192j0811j7349k4919l2468J3219
1552a00122L295k2212R2674K8192k4477l4558J0782O9256L6191l8701o9781m1725
1540i1186K1400j2704L1594k2030o8482R885L8209K8620J81700n8740p2555l4486
1528d8775o0973K2248K5166j4910j8718Q881m6160J32082J8268j12006N6305K7689
$$ plain form
1516 -10903 28748 53093 -52579 16111 66559 -15140 -94403 7368 -115265 -180733 -88155
1505 -88155 -104980 -82871 -102876 -114164 -97212 -103825 -120171 -52849 85530 106255 -38422 -4969
1493 -4969 -14928 -53439 17505 -11028 55830 2937 -49422 7199 26622 -43555 -51490 -2934
1481 -2934 -89125 -93669 -98740 -60559 -27316 -40581 -55595 -135620 -84280 -47845 -75754 -139217
1469 -139217 -41254 -32148 -135171 -51585 -45734 -40081 -17027 -23606 -51825 -32293 -76808 -133564
1457 -133564 -85665 -142206 -111374 -43410 -74553 -90909 -774 13543 -35199 32113 -20519 -59082
1445 -59082 8767 -48494 -113131 -86173 -83253 -69241 -110340 -150337 -70491 -9168 5712 48599
1433 48599 -12629 8409 12729 -26893 -51399 -63433 -45200 25248 -8224 -166585 -136461 -5931
$$ packed form
1516a0903L9651K4345j05672O8690N0448q1699p9263J01771j22633o5468R2578
1505h8155j6825K2109k0005j1288J6952o613j6346O7322J38379K0725j44677L3453
1493d969r959l8511P0944k8533O6858n2893n2359N6621J9423p0177p935M8556
1481b934q6191m544n071L8181L3243j3265j5014q0025N1340L6435k7909o3463
1469a39217R7963R106j03023Q3586N851N653K3054o579k8219J9532m4515n6756
1457a33564M7899n6541L0832O7964l1143j6356R0135J4317m8742O7312n2632l8563
1445e9082O7849n7261o4637K6958K920J4012m1099l9997P9846O1323J4880M2887
1433D8599o1228K1038M320l9622k4506j2034J8233P0448l3472j58361L0124J30530
$$ plain form
1421 -5931 -13921 -75300 -55056 12874 99980 -13299 -31460 5433 -42766 1429 51373 24622
1409 24622 -72526 -36188 46438 -31019 -316 29007 -25112 -26697 -19115 36909 16972 -104908
1397 -104908 -106256 -8306 -49984 -52068 43049 26513 31334 -24407 -94040 -39380 -447 -54316
1385 -54316 -26448 -424 -97383 -43456 36381 -42856 -128342 -135186 33122 -15803 -89582 -95297
1373 -95297 -99035 1781 -93902 -122835 -437 16197 9649 26798 72213 -17093 -24361 -1537
1361 -1537 50197 23181 -60632 38998 48076 38449 -50372 -54269 -81592 1151 -123375 -131856 -69967
1348 -69967 -31710 2756 -38779 -57162 -63848 3048 -15397 -2629 25250 13873 5574 -69648
1336 -69648 -161447 -70490 -16529 123859 135594 69897 -28034 -107971 -36143 -111300 -157663 -58604
$$ packed form
1421e931p990o1379K0244O7930Q7106j13279j8161L6893m8199M4195M9944k6751
1409B4622r7148L6338Q2626p7457L0703K9323n4119j585P582N6024j9937j21880
1397a04908j348R7950m1678k084R5117j6536M821n5741o9633N4660L8933n3869
1385e4316K7868K6024r6959N3927P9837p9237q5486o844J68308m8925p3779n715
1373i5297l738J00816r5683k8933J22398J6634o548J7149M5415q9306p268K2824
1361a537N1734k7016q3813R9630R078r627q8821l897k7323Q2743j24526q481O1889
1348f9967L8257L4466m1535j8383o686O6896j8445J2768K7879j1377q299p5222
1336f9648r1799R0957N3961J40388J1735o5697r7931p9937P1828p5157m6363R9059
$$ plain form
1324 -58604 -41777 -79946 -26476 -24481 84997 17809 -62648 -83099 -34647 -32690 -7178 -28778
1312 -28778 -85363 28508 -43582 -80565 53832 61429 -57085 -19948 -28992 -120016 -90726 -47483
1300 -47483 8964 17447 -65418 -37327 28874 -45347 -148145 -93308 -86154 -104721 1199 60519
1288 60519 -3412 -55781 -53038 19707 -46469 8659 22824 -10636 -1355 -53961 -75217 4872
1276 4872 36711 25512 -9138 -4831 11117 -49855 -105183 -162200 -115662 -91403 -80331 7117
1264 7117 -3793 -59292 -53116 14688 -2779 -70593 -413 14199 65492 31881 -36874 -3646
1252 -3646 -21647 -68494 -7384 41856 38881 57493 6171 -58316 -37176 -14135 52919 14634
1240 14634 -42378 -80942 -75892 -129402 -68496 -5033 -18210 -66193 -86378 -161 -28833 45076
$$ packed form
1324e8604J6827l8169N3470J995J09478o7188q0457k0451M8452J957K5512k1600
1312b8778n6585J13871p2090l6983J34397P597j18514L7137r044r1024K9290M3243
1300d7483N6447Q483q2865K8091O6201p4221j02798N4837P154j8567J05920N9320
1288F0519o3931n2369K743P2745o6176N5128J4165l3460R281n2606k1256Q0089
1276D872L1839j1199l4650M307J5948o0972n5328n7017M6538K4259J1072Q7448
1264G117j0910n5499O176O7804j7467o7814P0180J4612N1293l3611o8755L3228
1252c646j8001m6847O1110M9240k975J8612n1322o4487K1140K3041O7054l8285
1240A4634n7012l8564N050n3510O0906O3463j3177m7983k0185Q6217k8672P3909
$$ plain form
1228 45076 11739 -55174 -62524 -9659 -23959 -109355 -20643 32433 23531 -67357 -112512 -29491
1216 -29491 -39653 -32252 35377 -60148 -77272 95797 125658 -8356 -9201 7557 -18949 -80561
1204 -80561 -224414 -79806 9259 -89598 -149046 15056 -11466 -68748 48478 74066 -99738
1193 -99738 -52202 40820 11619 -62195 -46943 -66655 -86285 -40224 -36301 93930 60177 -45076
1181 -45076 -107735 -60352 35895 23068 15600 -27969 46945 59786 8723 -9864 -81666 -27132
1169 -27132 -26903 -5655 -96851 -141372 -80523 -44590 -64685 34577 136950 33338 57425 -55207
1157 -55207 -191971 -45093 84415 41218 -122705 -148521 -56198 79225 71557 40629 87591
1146 87591 12552 -38649 -55510 -70875 -91498 -56545 -10887 -178674 -133039 39639 33399 80542
$$ packed form
1228D5076l3337o6913p350N2865j4300q5396Q8712N3076q902r0888m5155Q3021
1216b9491j0162P401O7629r5525j7124J73069K9861j34014q45J6758k6506o1612
1204h0561j43853J44608Q9065r8857n9448J64102k6522n7282J17226K5588j73804
1193i9738M7536R3022k9201p3814J5252j9712j9630M6061L923J30231l3753j05253
1181d5076o2659M7383R6247j2827p468m3569P4914J2841n1063j8587p1802N4534
1169b7132K29K1248r1196m4521O0849L5933k0095R9262J02373j03612K4087j12632
1157e5207j36764J46878J29508m3197j63923k5816R2323J35423p668l0928M6962
1146H7591p5039n1201j6861j5365k0623L4953M5658j67787M5635J72678o240M7143
$$ plain form
1134 80542 74486 -10012 -46165 -32491 -11264 -36868 12039 -50962 -81210 -68377 -20412 5653
1122 5653 -59619 -32543 -13493 -21809 24773 53538 18205 -48174 -49155 15329 6486 12472 97296
1109 97296 44797 -108637 -127385 -78744 -16542 -36649 -136274 -19180 330 67708 82657
1098 82657 20748 -102243 -127483 19965 -44273 -90604 -44210 -2226 64722 -6153 -38911
1087 -38911 -5015 -10160 34856 23653 -95502 -57786 30368 -65958 -85434 -20442 1480 -1254
1075 -1254 63237 68659 18321 -49274 -114094 -84908 -124795 -144267 -82300 -117531 -79448 -18486
1063 -18486 21432 34087 125182 107398 -34927 -61293 73224 103286 124140 57698 -53367
1052 -53367 -61931 14978 -27660 -32867 -97807 -143765 22404 -58082 -9723 31137 -44656 -84673
$$ packed form
1134H0542o056q4498l6153J3674K1227k5604M8907o3001l0248J2833M7965K6065
1122E653o5272K7076J9050q316M6582K8765l5333o6379r81O4484q843N986Q4824
1109I7296n2499j53434j8748M8641O2202k0107r9625J17094J9510O7378J4949
1098H2657o1909j22991k5240J47448o4238m6331M6394M1984O6948p0875l2758
1087c8911L3896n145M5016j1203j19155L7716Q8154r6326j9476O4992K1922k734
1075a254O4491N422n0338o7595o4820K9186l9887j9472O1967l5231L8083O0962
1063a8486L9918J2655R1095j7784j42325k6366J34517L0062K0854o6442j11065
1052e3367q564P6909m2638n207o4940m5958J66169q0486M8359M0860p5793m0017
$$ plain form
1040 -84673 -41172 -17438 -9671 102377 51390 -48617 -22226 -73318 -60748 -44008 15305 116289
1028 116289 77487 23835 -5477 6990 -102120 -65489 -40554 70994 -29689 -51989 26145
1017 26145 -17198 -24228 1353 -4324 183 22055 -35923 -28735 -25959 -36387 -29465 41932 -685
1004 -685 8123 -26635 -104507 -97205 -51215 2877 4014 -55978 -152261 -123300 -10598 -66194 -50082
991 -50082 -63690 -11696 24951 -12731 -24328 6849 67971 23526 -47929 -66978 79605 90578
979 90578 -51424 -30770 560 -1614 41920 -45344 -166121 -14529 117825 37474 -15397
968 -15397 31228 -21916 -109910 -101644 7533 61124 33016 2321 21644 -58365 -19360 48492
956 48492 -9838 90415 49768 -11690 -4606 -68998 -39535 33756 16838 44025 -11948 6301
$$ packed form
1040h4673M3501K3734P767J12048n0987j00007K6391n1092J2570J6740N9313J00984
1028A16289l8802n3652k9312J2467j09110L6631K4935J11548j00683k2300P8134
1017B6145m3343p030K5581n677M507K1872n7978P188K776j0428O922P1397m2617
1004f85Q808l4758p7872P302M5990N4092J137n9992r6283K8961J12702n5596J6112
991e0082j3608N1994L6647l7682j1597L1177O1122m4445p1455j9049J46583J0973
979I0578j42002K0654L1330k174M3534q7264j20777J51592J32354q0351n2871
968a5397M6625n3144q7994Q266J09177N3591k8108l0695J9323q0009L9005O7852
956D8492n8330J00253m0647o1458P084o4392K9463P3291j6918K7187n5973J8249
$$ plain form
944 6301 12752 17706 -113160 -32891 115005 -104872 -92486 57851 -8244 -23866 9751 -1871
932 -1871 35390 108859 23848 44758 20080 -104705 -44036 67273 31576 52724 29348 -20592
920 -20592 20617 2695 -9786 -34573 -46373 -41363 77563 6993 -102276 -84243 41714 82518
908 82518 50070 52429 -10663 -95276 -49594 34856 38339 43284 33967 6547 -11407 -59205 -28618
895 -28618 -25781 71861 34357 44192 206921 111383 -5929 16482 43803 -18732 -13311 8937
883 8937 39368 -19837 -166605 13417 71682 -29762 -19640 33502 40262 47804 -50706 -141438
871 -141438 469 59152 63541 63407 -76665 -54837 8467 -44602 -52382 34085 43594 -75378
859 -75378 -51305 -44083 -71650 33877 30575 -31215 -17787 61546 181830 114512 -16528 -40591
$$ packed form
944F301O451M954j30866Q0269J47896k19877J2386J50337o6095j5622L3617j1622
932a871L7261P3469q5011K0910k4678j24785O0669J11309l5697K1148k3376m9940
920b0592M1209j7922j2481k4787j1800N010J18926p0570j09269J8033J25957M0804
908H2518l2448K359o3092q4613M5682Q4450L483M945r317k7420j7954m7798L0587
895b8618K837R7642l7504R835J62729r5538j17312K2411K7321o2535N421K2248
883H937L0431n9205j46768J80022N8265j01444J0122N3142O760P542r8510r0732
871a41438J41907N8683M389j34j40072K1828O3304n3069p780Q6467R509j18972
859g5378K4073P222k7567J05527l302o1790J3428P9333J20284o7318j31040k4063
$$ plain form
847 -40591 -21443 -71319 -40592 50715 -29462 -31221 -28885 -102671 12866 78861 54825 49918
835 49918 116734 78036 124384 99105 -80667 10403 34628 43482 -21716 -104851 -86057 -10681
823 -10681 15590 9820 64075 44005 42673 42581 51632 18002 9778 -87016 -120427 -5575 53793
810 53793 73347 -40016 -8034 -69080 -93094 29073 15453 -220 1846 14549 73145 39046
798 39046 83212 67999 -20362 -19727 42551 15763 -34053 8839 -53804 -54533 -7315 5156 -10615
785 -10615 80627 13930 8780 75219 102265 47843 48503 138985 43305 -20249 19564 27407 77862
772 77862 37223 41193 68257 98428 -24484 -15051 9137 53000 74299 58130 83861 13308
760 13308 -16791 10580 36225 40106 17471 71494 -35206 -137316 -84157 64313 70941 10249
$$ packed form
847d0591J9148m9876L0727R1307q0177j759K336p3786J15537O5995k4036m907
835D9918O6816l8698M6348k5279j79772R1070K4225Q854o5198q3135J8794P5376
823a0681K6271n770N4255k0070j332r2R051l3630q224r6794l3411J14852N9368
810E3793J9554j13363L1982o1046k4014J22167j3620j5673K066J2703N8596l4099
798C9046M4166j5213q8361O35O2278k6788m9816M2892o2643p29M7218J2471j5771
785a0615R1242o6697n150O6439K7046n4422O60R0482r5680o3554L9813P843N0455
772G7862m0639L970K7064L0171j22912R433K4188M3863K1299j6169K5731p0553
760A3308l0099K7371K5645L881k2635N4023j06700j02110N3159J48470O628o0692
$$ plain form
748 10249 51131 20468 -47546 -101334 -53847 -23986 -44582 25265 52586 28529 16749 -626
736 -626 4863 15612 42392 134347 127141 49506 8106 -57050 -33421 84708 53580 -41641 71271
723 71271 20382 23780 93294 -11724 -97284 -21707 -25893 2716 -50318 29466 102261 28136
711 28136 -4131 104729 129648 39018 6747 -1537 -77087 -50804 24846 -9023 -60207 -4627
699 -4627 70005 119651 41485 22465 47799 47469 36175 52336 -6673 -122254 -69949 -41436
687 -41436 -82330 -11037 64009 110417 138633 95005 28147 66948 37506 90638 161408 15038
675 15038 -48038 -63773 16336 99100 130059 55381 38089 104349 54448 78646 60822 -5020
663 -5020 -16477 21579 11268 -113712 36980 126085 -8446 -84735 12419 55133 13008 -22477
$$ packed form
748A0249M0882l0663o8014n3788M7487K9861k0596O9847K7321k4057j1780j7375
736f26N489J0749K6780R1955p206p7635m1400o5156K3629J18129l1128r5221J12912
723G1271n0889L398O9514j05018q5560P5577m186K8609n3034P9784P2795p4125
711B8136l2267J08860K4919r0630l2271q284p5550K6283P5650l3869n1184N5580
699d627P4632M9646p8166j9020K5334l30j1294J6161n9009j15581N2305K8513
687d1436m0894P1293P5046M6408K8216m3628o6858L8801k9442N3132P0770j46370
675A5038o3076j5735Q0109Q2764L0959p4678j7292O6260m9901K4198j7824o5842
663e020j1457L8056j0311j24980J50692Q9105j34531p6289R7154M2714m2125l5485
$$ plain form
651 -22477 43759 126455 161252 180761 89368 -77356 -126298 -19056 30995 -35188 -57607 -53241
639 -53241 -28683 5302 10400 11954 69147 62177 9848 4206 50327 68574 53808 128100 67369
626 67369 -45087 -47259 46479 13119 20444 79523 110150 86010 -21325 -32376 51385 53287
614 53287 67377 111083 40307 -68820 -44288 -68234 -36030 -30053 -132860 -13681 86533
603 86533 32121 64172 58848 10119 83309 145930 151085 76320 42159 52224 35646 -36419
591 -36419 15532 52155 34395 65377 18536 9201 40874 26118 -14882 23850 83055 113291
579 113291 119957 32062 9130 -8361 96676 121309 131978 89618 34790 4127 -28291 14783
567 14783 42646 63425 54719 77065 34579 45556 23925 -500 122882 56238 -11468 33298
$$ packed form
651b2477O6236Q2696L4797J9509r1393j66724m8942J07242N0051o6183k2419M366
639e3241K4558L3985N098J554N7193o970n2329n642M6121J8247j4766P4292o0731
626F7369j12456k172R3738l3360P325N9079L0627k4140j07335j1051Q3761J902
614E3287J4090M3706p0776j09127K4532k3946L2204N977j02807J19179J00214
603H6533n4412L2051n324m8729P3190O2621N155p4765l4161J0065j6578p2065
591c6419N1951L6623j7760L0982m6841r335L1673j4756m1000L8732N9205L0236
579A13291O666q7895k2932j7491J05037K4633J0669m2360n4828l0663l2418M3074
567A4783K7863K0779q706K2346m2486J0977k1631k4425J23382o6644o7706M4766
$$ plain form
555 33298 -51901 28471 75528 -40399 -25725 -25642 -30047 30328 135001 63872 -9298 186247
543 186247 154730 22822 111147 83639 88836 50499 40723 35340 -18914 -86359 -95902 41467
531 41467 10809 54127 159981 74846 12240 2003 50650 143354 80524 61289 120815 90760
519 90760 55995 143384 98984 24446 62148 97114 47486 46628 12143 118401 113044 49405
507 49405 88949 120224 107079 74841 92662 17801 116311 -9313 -63875 -87624 28633 89977
495 89977 77146 27823 13673 53709 61207 30703 -3747 67985 70901 88335 78853 99273 123098
482 123098 96923 7283 11191 -47563 70743 95881 54982 16938 45696 57821 70731 111491
470 111491 7190 17383 -10559 -12907 16871 34124 68213 107988 71579 94884 155712 35298
$$ packed form
555C3298q5199Q0372M7057j15927J4674Q3m405O0375J04673p1129p3170J95545
543A86247l1517j31908Q8325k7508N197l8337r776n383n4254o7445r543J37369
531D1467l0658M3318J05854q5135o2606j0237M8647R2704o2830j9235N9526l0055
519I0760l4765Q7389m4400p4538L7702L4966m9628q58l4485J06258n357o3639
507D9405L9544L1275j3145l2238J7821p4861R8510j25624n4562k3749J16257O1344
495H9977j2831m9323j4150M0036P498l0504l4450P1732K916J7434r482K0420K3825
482A23098k6175q9640L908n8754J18306K5138m0899l8044K8758J2125J2910M0760
470A11491j04301J0193k7942k348K9778J7253L4089L9775l6409K3305O0828j20414
$$ plain form
458 35298 7462 45274 146485 146242 18751 26805 64518 -37479 -73232 71970 145074 126348
446 126348 102795 -7462 -22547 -28859 -4062 46786 79156 41038 72355 119751 86774 37221
434 37221 34664 89323 70097 59727 11817 70504 163232 148660 91682 93230 145931 111081
422 111081 113970 67050 50280 -6081 -60763 5276 -57774 8393 56375 61200 136476 77351
410 77351 81772 69471 -758 6593 171395 96283 29311 61236 -3531 16186 34896 90307
398 90307 98742 97689 7840 53969 96470 36132 43266 72911 30998 -4881 54670 38626 12029
385 12029 -19234 -8125 -16718 55015 122688 75678 128524 119689 148225 139301 61761 -17724 -126559
372 -126559 -98602 51388 140570 122297 105035 105825 74226 50180 108494 126101 106802 90985
$$ packed form
458C5298k7836L7812J01211k43j27491Q054L7713j01997l5753J45202P3104j8726
446A26348k3553j10257j5085o312K4797N0848L2370l8118L1317M7396l2977m9553
434C7221k557N4659j9226j0370m7910N8687R2728j4572n6978J548N2701l4850
422A11081K889m6920j6770n6361n4682O6039o3050O6167M7982M825P5276n9125
410G7351M421j2301p0229P351J64802p5112o6972L1925o4767J9717J8710N5411
398I0307Q435j053q9849M6129M2501o0338P134K9645m1913l5879N9551j6044k6597
385A2029l1263J1109q593P1733O7673m7010N2846q835K8536q924p7540p9485j08835
372a26559K7957J49990Q9182j8273j7262P90l1599k4046N8314J7607j9299j5817
$$ plain form
360 90985 230 -10202 53910 82374 87596 92304 -1978 1626 121722 53138 7394 46659
348 46659 -12075 78889 119166 45149 -42622 49069 -2063 67220 155518 79070 44582 128505
336 128505 20467 -79310 84760 106274 110218 30127 21784 80902 146186 77712 89755 102985
324 102985 -15676 30835 76268 68410 -59644 -70964 -3031 94109 71345 5034 -66759 -12086
312 -12086 102916 32849 24304 82693 89175 38174 88592 118477 97847 72553 164983 137836
300 137836 37368 50910 149662 49948 17273 -3578 97760 119577 36714 588 94309
289 94309 145192 67959 98149 39159 12980 17079 54332 100411 96670 76713 18151 83172
277 83172 75726 113416 116335 46346 38552 62243 125465 54847 46064 45737 172330 146405 9885
$$ packed form
360I0985r0755j0432O4112K8464N222M708r4282L604J20096o8584m5744L9265
348D6659n8734R0964M0277p4017q7771R1691n1132O9283Q8298p6448l4488Q3923
336A28505j08038r9777J64070K1514L944q0091q343N9118O5284o8474J2043J3230
324A02985j18661M6511M5433p858j28054j1320O7933R7140k2764o6311p1793N4673
312a2086J15002p0067q545N8389O482n1001N0418K9885k0630k5294R2430k7147
300A37836j00468J3542R8752r9714l2675k0851J01338K1817q2863l6126R3721
289I4309N0883p7233L0190n8990k6179M099L7253M6079l741j9957n8562O5021
277H3172p446L7690K919o9989p794K3691O3222p0618q783l27J26593k5925j36520
$$ plain form
264 9885 -24164 -9610 -18847 -9280 15570 76651 80091 58023 89846 139424 105073 38498 94540
251 94540 105416 36015 30337 112911 87250 68848 131192 170123 77422 32708 124353 152737
239 152737 103739 -71944 39240 41638 26152 40387 74469 112262 60944 -4382 -57242 22713
227 22713 82510 94163 -12849 -17695 21502 236760 230453 90745 -1674 41356 198223 91701
215 91701 29570 100419 144938 184304 87172 73711 49594 112669 93599 -32648 -38266 37075
203 37075 97353 80416 -13118 -61936 11807 109951 55412 2760 -65873 -55521 74506 -9124
191 -9124 -78171 770 77295 80376 112651 117403 118232 164556 130944 75290 -20549 7167 66071
178 66071 114100 57337 85490 45400 81146 145930 53329 12067 50858 75863 44775 30783
$$ packed form
264I885l4049J4554r237R567K4850O1081L440k2068L1823M9578l4351o6575N6042
251I4540J0876o9401n678Q2574k5661j8402O2344L8931r2701m4714R1645K8384
239A52737m8998j75683J11184K398j5486J4235L4082L7793n1318o5326n2860P9955
227B2713N9797J1653j07012m846L9197K15258o307j39708r2419M3030J56867j06522
215I1701o2131P0849M4519L9366r7132j3461k4117O3075j9070j26247n618P5341
203C7075O0278j6937r3534m8818P3743R8144n4539n2652o8633J0352J30027q3630
191i124o9047P8941P6525L081L2275M752Q29M6324l3612n5654r5839K7716N8904
178F6071M8029n6763K8153m0090L5746O4784r2601m1262L8791K5005l1088j3992
$$ plain form
166 30783 48232 126002 129831 113685 19085 82329 132848 205289 106751 83081 125324 125523 87919
153 87919 91879 207347 223858 109621 106102 80053 9896 89008 96314 24936 67508 52188
141 52188 -30487 32749 -19255 -106774 53372 111601 112761 97546 136126 75455 93240 113258
129 113258 101024 121041 85232 2007 -33972 30194 77171 123595 44443 26030 99261 178597
117 178597 197267 157675 19031 -19073 39843 56939 23159 50810 17766 36509 104308 75053
105 75053 112377 189020 142987 185503 126832 113617 138181 57166 -10508 -81534 43645 99792
93 99792 121999 98173 31752 20079 22200 129618 143834 136190 169498 67046 12760 82997
81 82997 56925 61546 114850 16729 19321 -33181 43585 92733 40727 65651 88966 145237 74318
$$ packed form
166C0783J7449P7770L829j6146r4600O3244N0519P2441r8538k3670M2243J99l7604
153H7919L960J15468J6511j14237l519k6049p0157P9112P306p1378M2572j5320
141E2188q2675O3236n2004q7519J60146N8229J160j5215L8580o0671J7785K0018
129A13258j2234K0017l5809q3225l5979O4166M6977M6424p9152j8413P3231P9336
117A78597J8670l9592j38644l8104N8916J7096l3780K7651l3044J8743O7799k9255
105G5053L7324P6643m6033M2516n8671j3215K4564q1015o7674p1026J25179N6147
93I9792K2207k3826o6421j1673K121J07418J4216p644L3308j02452n4286P0237
81H2997k6072M621N3304r8121K592n2502P6766M9148n2006K4924K3315N6271p0919
$$ plain form
68 74318 82935 54666 29165 81107 67498 46191 57226 80305 95892 123282 62645 51937
56 51937 76929 44080 56344 92082 80320 119009 121604 52681 74759 73750 83530 94806 51893
43 51893 15225 41652 113203 27687 57017 96628 131019 161486 101989 135990 71989 17900
31 17900 70313 134399 132645 93588 60726 79869 94114 117935 112405 83161 52245 86524 55068
18 55068 1213 25861 108426 64181 9121 104207 114124 59542 90016 101108 136184 113634
6 113634 106809 59688 50 39151 123408 149169
0 149169
$$ packed form
68G4318Q617k8269k5501N1942j3609k1307J1035K3079J5587K7390o0637j0708
56E1937K4992l2849J2264L5738j1762L8689K595o8923K2078j009R780J1276m2913
43E1893l6668K6427P1551q5516K9330L9611L4391L0467n9497L4001o4001n4089
31A7900N2413O4086j754l9057l2862J9143J4245K3821n530k9244l0916L4279l1456
18E5068n3855K4648Q2565m4245n5060R5086R917n4582L0474J1092L5076k2550
6A13634o825m7121n9638L9101Q4257K5761
0A49169
$$ Imaginary data points
##PAGE= N=2
##DATA TABLE= (X++(I..I)), XYDATA
$$ plain form
16383 -977029 -937940 -877913 -761129 -733268 -827380 -766269 -786159 -806481 -782563 -682740 -659039
16372 -659039 -713605 -716218 -643347 -634907 -604844 -609457 -589328 -537906 -554144 -586881 -570299 -596074
16360 -596074 -587720 -556794 -530212 -535052 -492286 -414287 -456504 -410464 -391203 -300146 -305913 -359613
16348 -359613 -448150 -422487 -369273 -388585 -247912 -268746 -249741 -219418 -217322 -216799 -265792 -154993
16336 -154993 -130845 -204621 -232774 -222705 -150267 -90727 -93617 -29964 -87343 -118566 -55734 -16048
16324 -16048 -57691 -88276 38068 64947 34777 35966 33475 69336 96870 111287 102929 122297
16312 122297 170953 188260 161970 129461 134488 214479 236077 163376 213219 238404 245808 251561
16300 251561 202942 266566 328194 295593 326104 335125 315956 341073 437089 346408 376177 420424
$$ packed form
16383i77029L9089O0027J16784K7861r4112O1111j9890k0322K3918R9823K3701
16372f59039n4566k613P2871Q440L0063m613K0129N1422j6238l2737J6582k5775
16360e96074Q354L0926K6582m840M2766P7999m2217M6040J9261R1057n767n3700
16348c59613q8537K5663N3214j9312J40673k0834J9005L0323K096N23m8993J10799
16336a54993K4148p3776k8153J0069P2438N9540k890O3653n7379l1223O2832L9686
16324a6048m1643l0585J26344K6879l0170J189k491L5861K7534J4417q358J9368
16312A22297M8656J7307k6290l2509N027P9991K1598p2701M9843K5185P404N753
16300B51561m8619O3624O1628l2601L0511R021j9169K5117R6016r0681K9769M4247
$$ plain form
16288 420424 425269 505561 469117 444516 434820 518454 454575 464578 545077 554021 498286 451514
16276 451514 432336 511091 562331 532527 588068 648061 603883 542544 578025 586884 638841 668225
16264 668225 707428 708986 709426 692158 743001 711508 694019 799069 789107 784141 729302 693003
16252 693003 764579 846516 812805 772483 831710 843411 742759 780579 827431 805390 789526
16241 789526 775506 855217 820116 942131 976010 881537 872579 822964 874964 986638 1028291
16230 1028291 972987 942898 877238 880701 926973 1041067 1058257 1011157 993126 1013084 1008935
16219 1008935 1029724 1011052 1009019 1071322 1031455 1090972 1137948 1071126 1033850 1044843 1040210 1078068
16207 1078068 1159343 1087269 1043143 1047380 1043573 1142173 1194455 1159928 1151018 1121836 1102081 1096996
$$ packed form
16288D20424M845Q0292l6444k4601r696Q3634o3879J0003Q0499Q944n5735m6772
16276D51514j9178P8755N1240k9804N5541N9993m4178o1339L5481Q859N1957K9384
16264F68225L9203J558M40j7268N0843l1493j7489J05050r962m966n4839l6299
16252F93003P1576Q1937l3711m0322N9227J1701j00652L7820M6852k2041j5864
16241G89526j4020P9711l5101J22015L3879r4473q958m9615N2000J11674M1653
16230A028291n5304l0089o5660L463M6272J14094J7190m7100j8031J9958m149
16219A008935K0789j8672k033O2303l9867N9517M6976o6822l7276J0993m633L7858
16207A078068Q1275p2074m4126M237l807R8600N2282l4527q910k9182j9755n085
$$ plain form
16195 1096996 1098473 1179385 1173549 1167190 1218181 1214410 1193683 1176766 1147310 1230776 1267776 1282926
16183 1282926 1181126 1178055 1229307 1198364 1230997 1246285 1259219 1253644 1271308 1185800 1212438
16172 1212438 1296903 1239276 1221585 1271516 1321283 1356014 1353678 1254016 1291288 1283396 1248753 1276613
16160 1276613 1271098 1314024 1355747 1304119 1243553 1240445 1307797 1449144 1404403 1306810 1257845
16149 1257845 1260412 1302554 1396597 1361413 1416836 1515394 1393331 1303023 1380149 1406554 1378557
16138 1378557 1376890 1336622 1262793 1325061 1347140 1317530 1393886 1425246 1477141 1445731 1370053
16127 1370053 1408288 1412579 1394400 1350997 1406992 1297416 1281759 1367063 1350861 1498885 1509664
16116 1509664 1438584 1360934 1318618 1329452 1434515 1428000 1399801 1501229 1500811 1457166 1508246
$$ packed form
16195A096996J477Q0912n836o359N0991l771k0727j6917k9456Q3466L7000J5150
16183A282926j01800l071N1252l0943L2633J5288J2934n575J7664q5508K6638
16172A212438Q4465n7627j7691M9931M9767L4731k336r9662L7272p892l4643K7860
16160A276613n515M2926M1723n1628o0566l108O7352J41347m4741r7593m8965
16149A257845K567M2142R4043l5184N5423R8558j22063r0308P7126K6405k7997
16138A378557j667m0268p3829O2268K2079k9610P6356L1360N1895l1410p5678
16127A370053L8235M291j8179m3403N5995j09576j5657Q5304j6202J48024J0779
16116A509664p1080p7650m2316J0834J05063o515k8199J01428m18m3645N1080
$$ [...]
##END NTUPLES=NMR SPECTRUM
##END=
