##TITLE=1H_TG-2403-B1
 200.13Hz, DMSO+CCl4.
 8 sc
 
 8.4.2026
##JCAMPDX= 6.0         $$ Bruker NMR JCAMP-DX V2.0
##DATA TYPE= NMR SPECTRUM
##DATA CLASS= NTUPLES
##ORIGIN= UXNMR, Bruker Analytische Messtechnik GmbH
##OWNER= pz
$$ XWIN-NMR		Version 3.5
$$ Wed Apr  8 15:18:07 2026 Russian Standard Time (UT+4h)  she@DPX200
##.OBSERVE FREQUENCY= 200.1313
##.OBSERVE NUCLEUS= ^1H
##.ACQUISITION MODE= SIMULTANEOUS
##.ACQUISITION SCHEME= undefined
##.AVERAGES= 8
##.DIGITISER RES= 18
##SPECTROMETER/DATA SYSTEM= spect
##.PULSE SEQUENCE= zg30
##.SOLVENT NAME= DMSO
##.SHIFT REFERENCE= (INTERNAL, DMSO, 0, 15.4825)
##AUDIT TRAIL= $$ (NUMBER, WHEN, WHO, WHERE, WHAT)
$$ ##TITLE= Audit trail, XWIN-NMR		Version 3.5
$$ ##JCAMPDX= 5.01
$$ ##ORIGIN= Bruker BioSpin GmbH
$$ ##OWNER= she
$$ F:/spectra/data/she/nmr/H-C/1/pdata/1/auditp.txt
$$ ##AUDIT TRAIL=  $$ (NUMBER, WHEN, WHO, WHERE, WHAT)
(   1,<2026-04-08 15:16:20.45 +0400>,<she>,<DPX200>,
      <created by zg, POWCHK disabled, PULCHK disabled
       configuration hash MD5:
       00 E9 B6 7A A2 85 ED C7 34 08 36 98 17 FE 4E 26
       data hash MD5: 16K
       E3 BF 62 0D 68 A1 F4 98 E8 9C 0F F5 62 EF 3D A5>)
(   2,<2026-04-08 15:16:23.14 +0400>,<she>,<DPX200>,
      <Start of raw data processing
       efp BC_mod = 2 LB = 0.25 FT_mod = 6 PKNL = 1 PHC0 = -3706.628 PHC1 = 12.19231 SI = 16K 
       data hash MD5: 16K
       BB BD 82 A1 FE 6E B9 AD E6 02 F5 10 69 57 BC 69>)
(   3,<2026-04-08 15:16:41.26 +0400>,<she>,<DPX200>,
      <pk PHC0 = -3.635855 PHC1 = 5.2 
       data hash MD5: 16K
       00 A5 BD C0 47 88 47 E4 42 C2 29 85 39 FD 35 DA>)
(   4,<2026-04-08 15:16:45.28 +0400>,<she>,<DPX200>,
      <abs ABSG = 5 
       data hash MD5: 16K
       04 B5 19 24 08 D1 F9 47 A2 A4 34 AE E0 83 86 D4>)
(   5,<2026-04-08 15:17:34.15 +0400>,<she>,<DPX200>,
      <pk PHC0 = 1.959102 PHC1 = -1.599999 
       data hash MD5: 16K
       5E 1D 06 17 FC 3E 5C C2 F9 02 EC 57 1A 88 D7 B5>)
(   6,<2026-04-08 15:17:37.96 +0400>,<she>,<DPX200>,
      <abs ABSG = 5 
       data hash MD5: 16K
       40 D5 3A 74 BD 42 AB 51 49 AE 5B 34 1B 59 EF C0>)
$$ ##END=
$$ 
$$ hash MD5
$$ 7B 8A A6 6C 18 BA 4F 8C D7 DF C2 CC 11 86 07 31
##$RELAX= 
##$RELAX= 
##$RELAX= 
##$RELAX= 
##$RELAX= 
##$RELAX= 
$$ Bruker specific parameters
$$ --------------------------
##$DU= <F:/spectra>
##$EXPNO= 1
##$NAME= <H-C>
##$PROCNO= 1
##$TYPE= <nmr>
##$USER= <she>
##$AMP= (0..31)
100 100 100 100 100 100 100 100 100 100 100 100 100 100 100 100 100 100 
100 100 100 100 100 100 100 100 100 100 100 100 100 100 
##$AQSEQ= 0
##$AQ_mod= 1
##$AUNM= <au_zg>
##$AUTOPOS= <>
##$BF1= 200.13
##$BF2= 200.13
##$BF3= 200.13
##$BF4= 200.13
##$BF5= 200.13
##$BF6= 200.13
##$BF7= 200.13
##$BF8= 200.13
##$BYTORDA= 1
##$CFDGTYP= 0
##$CFRGTYP= 5
##$CHEMSTR= <none>
##$CNST= (0..31)
1 1 145 1 1 1 1 1 1 1 1 1 1 1 1 1 1 1 1 1 1 1 1 1 1 1 1 1 1 1 1 1 
##$CPDPRG= <>
##$CPDPRG1= <>
##$CPDPRG2= <>
##$CPDPRG3= <>
##$CPDPRG4= <mlev>
##$CPDPRG5= <mlev>
##$CPDPRG6= <mlev>
##$CPDPRG7= <mlev>
$$ [...]
##$SUBNAM3= <"">
##$SUBNAM4= <"">
##$SUBNAM5= <"">
##$SUBNAM6= <"">
##$SUBNAM7= <"">
##$SUBNAM8= <"">
##$SUBNAM9= <"">
##$SW= 18.0517328524113
##$SWIBOX= (0..15)
0 0 2 0 0 0 0 0 0 0 0 0 0 0 0 0 
##$SW_h= 3612.71676300578
##$TD= 16384
##$TD0= 1
##$TE= 0
##$TE2= 300
##$TE3= 300
##$TEG= 300
##$TL= (0..7)
0 120 120 120 120 120 120 120 
##$TP= (0..7)
150 150 150 150 150 150 150 150 
##$TP07= 0
##$TPNAME0= <>
##$TPNAME1= <>
##$TPNAME2= <>
##$TPNAME3= <>
##$TPNAME4= <>
##$TPNAME5= <>
##$TPNAME6= <>
##$TPNAME7= <>
##$TPOAL= (0..7)
0.5 0.5 0.5 0.5 0.5 0.5 0.5 0.5 
##$TPOFFS= (0..7)
0 0 0 0 0 0 0 0 
##$TUNHIN= 0
##$TUNHOUT= 0
##$TUNXOUT= 0
##$USERA1= <user>
##$USERA2= <user>
##$USERA3= <user>
##$USERA4= <user>
##$USERA5= <user>
##$V9= 5
##$VALIST= <valist>
##$VCLIST= <CCCCCCCCCCCCCCC>
##$VD= 0
##$VDLIST= <DDDDDDDDDDDDDDD>
##$VPLIST= <PPPPPPPPPPPPPPP>
##$VTLIST= <TTTTTTTTTTTTTTT>
##$WBST= 1024
##$WBSW= 4
##$XGAIN= (0..3)
0 0 0 0 
##$XL= 0
##$YL= 0
##$YMAX_a= 475567
##$YMIN_a= -636523
##$ZGOPTNS= <>
##$ZL1= 120
##$ZL2= 120
##$ZL3= 120
##$ZL4= 120
##$ABSF1= 15.48246
##$ABSF2= -2.569389
##$ABSG= 5
##$ABSL= 3
##$ALPHA= 0
##$AQORDER= 0
##$ASSFAC= 0
##$ASSFACI= 0
##$ASSFACX= 0
##$ASSWID= 0
##$AUNMP= <proc_1d>
##$AZFE= 0.1
##$AZFW= 0.1
##$BCFW= 0
##$BC_mod= 2
##$BYTORDP= 0
##$COROFFS= 0
##$CY= -3
##$DATMOD= 1
##$DC= 0
##$DFILT= <>
##$DTYPP= 0
##$F1P= 0
##$F2P= 0
##$FCOR= 1
##$FTSIZE= 16384
##$FT_mod= 6
##$GAMMA= 0
##$GB= 0
##$INTBC= 1
##$INTSCL= 3.241238e-09
##$ISEN= 128
##$LB= 0.25
##$LEV0= 0
##$LPBIN= 0
##$MAXI= 10000
##$MC2= 0
##$MEAN= 0
##$ME_mod= 0
##$MI= 1.114404
##$NCOEF= 0
##$NC_proc= -7
##$NLEV= 6
##$NOISF1= 3.799351
##$NOISF2= 2.8
##$NSP= 0
##$NTH_PI= 0
##$NZP= 0
##$OFFSET= 15.48246
##$PC= 1
##$PHC0= -3708.305
##$PHC1= 15.79231
##$PH_mod= 1
##$PKNL= yes
##$PPARMOD= 0
##$PSCAL= 0
##$PSIGN= 0
##$REVERSE= no
##$SF= 200.130007854895
##$SI= 16384
##$SIGF1= 3
##$SIGF2= 2
##$SINO= 0.751879
##$SIOLD= 32768
##$SREGLST= <19F.Aceton>
##$SSB= 0
##$STSI= 16384
##$STSR= 0
##$SW_p= 3612.71676300578
##$SYMM= 0
##$S_DEV= 0
##$TDeff= 16384
##$TDoff= 0
##$TI= <>
##$TILT= no
##$TM1= 0
##$TM2= 0
##$TOPLEV= 0
##$USERP1= <user>
##$USERP2= <user>
##$USERP3= <user>
##$USERP4= <user>
##$USERP5= <user>
##$WDW= 1
##$XDIM= 16384
##$YMAX_p= 499353087
##$YMIN_p= -1249220
$$ End of Bruker specific parameters
$$ ---------------------------------
##NTUPLES= NMR SPECTRUM
##VAR_NAME=  FREQUENCY,     SPECTRUM/REAL,   SPECTRUM/IMAG
##SYMBOL=    X,             R,               I
##VAR_TYPE=  INDEPENDENT,   DEPENDENT,       DEPENDENT
##VAR_FORM=  AFFN,          ASDF,            ASDF
##VAR_DIM=   16384,         16384,           16384
##UNITS=     HZ,            ARBITRARY UNITS, ARBITRARY UNITS
##FACTOR=    0.220516191357247, 1,           1
##FIRST=     3098.50484581049, 0,            0
##LAST=      -514.211917195295, 0,           0
##MIN=       -514.211917195295, -1249220,    0
##MAX=       3098.50484581049, 499353087,    0
$$ Real data points
##PAGE= N=1
##DATA TABLE= (X++(R..R)), XYDATA
$$ [...]
7208D494376j5506q3793L6528L53313k97226l11128k48735M03566K05169j626
7198D534938l52251J59206M2148k04309L83309j20889j13950n14965q4105J77587
7188C906719j35811n37042M56108K08063k00787K7088K53313j47402o3837l33388
7178C433024J44699M75717l9178m44010p1859K8716k19587J52225k42087j3879
7168C203781Q3878K03915J29689m69618l76313K87999L82361k73576k35127J03022
7158C040011K19152P4803M4832o7511j52455m50007Q789R5410k1209L11406j22626
7147B980595m53761K84944K66010m55679j2872K61059o7348P474J34171j7380
7137B927213l70653P3264j04421j92852j96639M44184K47016p10430P62K66790
$$ y = [4494376, 4478870, 4395077, 4431605, 4784918, 4487692, 4176564, 3927829, 4331395, 4536564, 4534938, 4182687, 4341893, 4384041, 4179732, 4563041, 4442152, 4328202, 3813237, 3729132, 3906719, 3770908, 3233866, 3689974, 3898037, 3697250, 3724338, 3977651, 3830249, 3766412, 3433024, 3577723, 4053440, 4014262, 3570252, 3498393, 3527109, 3307522, 3459747, 3217660, 3203781, 3287659, 3491574, 3621263, 3151645, 2775332, 3063331, 3445692, 3172116, 2936989, 3040011, 3259163, 3333966, 3378798, 3311287, 3158832, 2708825, 2717614, 2813024, 2791815, 3103221, 2980595, 2526834, 2811778, 3077788, 2622109, 2609237, 2870296, 2802948, 2810422, 2944593, 2927213, 2556560, 2629824, 2525403, 2332551, 2135912, 2580096, 2827112, 2116682, 2117444, 2384234]
7127B384234o7856o9556o9680k2395m0697l1244K90111k94104l69613j79339M46504
7116A976365l2749j9204j56165J92385j51418Q044k4509L561j75707M566M44402
7105B069571j70528K29017o0624j34973j19404O2354L85298L78103k98461K5753
7095B366106L45195K12700l53726m61605j1319K10590P6631j2870K10030j49581
7085B432151K30134Q7804R5037m36143o9561l02246J44834n5897K19355K56068
7075B601536j75491j86987k10874k6937L38960J67908j08996k57022p1241K8316
7065B099172j00146j71229q5239n843J91548k6777j75336j86824k59105L5774
7055A315995J87489j73488m61192K413J50843P0021M9603j04023K52011n2732
$$ y = [2384234, 2316378, 2246822, 2177142, 2154747, 2114050, 2082806, 2372917, 2078813, 1709200, 1529861, 1976365, 1943616, 1924412, 1768247, 1960632, 1809214, 1817258, 1792749, 1796310, 1620603, 1625169, 2069571, 1899043, 2128060, 2067436, 1932463, 1813059, 1875413, 2260711, 2638814, 2340353, 2366106, 2711301, 2924001, 2570275, 2108670, 2097351, 2307941, 2384572, 2371702, 2581732, 2432151, 2662285, 2750089, 2845126, 2408983, 2339422, 2037176, 2182010, 2126113, 2345468, 2601536, 2426045, 2239058, 2028184, 2001247, 2340207, 2508115, 2399119, 2142097, 2070856, 2099172, 1999026, 1827797, 1742558, 1736715, 1928263, 1901486, 1726150, 1539326, 1280221, 1315995, 1503484, 1329996, 868804, 871217, 1022060, 1092081, 1141684, 1037661, 1289672, 1236940]
7045A236940q1152L34290J04606n9519l95265J14676M70378k82266j77433K65064
7035A530319l32081K0099K28587K69188k73678l66221k45786J96275M5125K97628
7025A369455l13326K1898p5835K50333K74148m07245j87811r7040O6050j12929
7015G87698J64470l50792k94297L07634R228j76595M97774O2575k39542m221J27666
7004H91598k34685k14673J55358K30294q3289k71780J71387J82640k76605k50613
6994B99632Q8395M533k25356K57545M63228l17789r1339N43844l72241l27430
6984C23022M39164N23478Q0006l69185J60086p701j88965n1484K23501k80155
6974H51767M3352J84559M05991J94495J49918l72689p3768l1119l16641r4993
$$ y = [1236940, 1155788, 1490078, 1594684, 1535165, 1139900, 1254576, 1724954, 1442688, 1265255, 1530319, 1198238, 1218337, 1446924, 1716112, 1442434, 1076213, 830427, 1026702, 1071827, 1369455, 1056129, 1078027, 1002192, 1252525, 1526673, 1119428, 931617, 834577, 900627, 787698, 952168, 601376, 307079, 614713, 623941, 447346, 945120, 1007695, 768153, 763932, 891598, 656913, 442240, 597598, 827892, 744603, 472823, 644210, 826850, 550245, 299632, 388027, 392560, 167204, 424749, 887977, 570188, 478849, 1022693, 650452, 323022, 762186, 1285664, 1365670, 996485, 1156571, 1148870, 959905, 908421, 1131922, 851767, 895119, 1079678, 1485669, 1680164, 1830082, 1457393, 1383625, 1352506, 1035865, 940872]
6964I40872K58861j38993M53176k44194l24398K06494m65297n781N49457j04645
6954A125552l71995J48837L59768j2677k03312k70634n4684J70341J85143J38229
6944A214568l74529N0863M24110k9373m00567p2589L64892k13330k89152J94986
6934H69879N67829j72673l99930K26102K32317m05497l30308L37740K5273J56842
6924A107574o1135l8648L68561L2807p8612M48913n08798k17594K30825N4118
6914A338011J99465q2400l16366L65832r1147o04889J05008L59509k83926J64229
6904A153326J64136J25784p13605m21729P79947N66640p41280O7840K76205l67246
6894H90018R1745O05211j82858L3637j64806J33971K77548m26823N08697N09664
$$ y = [940872, 1199733, 1060740, 1513916, 1269722, 945324, 1151818, 686521, 680740, 1230197, 1125552, 753557, 902394, 1262162, 1249485, 1046173, 775539, 720855, 891196, 1076339, 1214568, 840039, 890902, 1315012, 1285639, 885072, 812483, 1177375, 964045, 674893, 869879, 1437708, 1265035, 865105, 1091207, 1323524, 918027, 587719, 925459, 950732, 1107574, 1046439, 1007791, 1376352, 1409159, 1330547, 1779460, 1270662, 1053068, 1283893, 1338011, 1537476, 1455076, 1138710, 1504542, 1413395, 808506, 913514, 1273023, 989097, 1153326, 1317462, 1443246, 729641, 307912, 1087859, 1654499, 913219, 981059, 1257264, 890018, 981763, 1586974, 1404116, 1437753, 1272947, 1406918, 1684466, 1257643, 1766340, 2276004]
6884B276004q75329k23456K00236J02503N90423Q4242m04320K0163j03312R376
6874A676530J75596p542L01789l6523p6894O1430n77025l30110O55198q0821l33942
6863A427686K71939o7053j24706K11247j89592L57801p6691o06121O42186r6241
6853A750455m97866K16558L72515j96475M9129J4969J20549k53157l53664L31776
6843A554789J76863k21685r1202K39898k92484J86451J34745O6349j95532m48815
6833A109377k84610L26497k18542J46874J49972j88579o1233l005j1353L81945
6823A347343k36159o32798K02292q6497l04274J45916j68090J1038L6625j96798
6813A18598J52622J28292J66659J61069j55973j49278N3062L85254j69562k24006
$$ y = [2276004, 1400675, 1177219, 1377455, 1479958, 2070381, 2154623, 1750303, 1770466, 1667154, 1676530, 1852126, 1844584, 2146373, 2109850, 2032956, 2094386, 1517361, 1187251, 1842449, 1761628, 1427686, 1699625, 1632572, 1507866, 1719113, 1529521, 1887322, 1810631, 1204510, 1846696, 1750455, 1252589, 1469147, 1841662, 1645187, 1694316, 1709285, 1829834, 1576677, 1223013, 1554789, 1731652, 1509967, 1418765, 1658663, 1366179, 1552630, 1687375, 1753724, 1558192, 1109377, 824767, 1151264, 932722, 1079596, 1229568, 1040989, 979756, 976751, 965398, 1347343, 1111184, 478386, 680678, 594181, 289907, 435823, 267733, 278771, 315396, 118598, 271220, 399512, 566171, 727240, 571267, 421989, 475051, 860305, 690743, 466737]
6803D66737m5613L38986J36504k00614J97641J04311n61375P559M7370l7185J3018
6792D67339j18390k257L67356j78078j88814J63688j02554J98532K75194j54831
6782G27185j21724j09960k64334K07569j60553k37303O65006R9732n4071N23096
6772A274643l16723l04901J71807P1589N3006m50929j66999O44710R9413m62966
6762F12650M23534N6927n91723K62444L57778j44827j37110k5527M43749k41376
6752A016519m73314K87081K55412m4258J03224R5798k04380K91799j79984J75123
6742A323020M2548j36613l2142K19818q2324L4647j31234N0560J42041J2347j75764
6731A266904L00922J00942L6240M8149j17445O55k93495M4898M56049k6635n97537
$$ y = [466737, 421124, 760110, 896614, 696000, 893641, 997952, 436577, 444136, 491506, 454321, 467339, 348949, 346692, 714048, 535970, 347156, 510844, 408290, 606822, 882016, 727185, 605461, 495501, 231167, 438736, 278183, 40880, 705886, 805618, 751547, 1274643, 957920, 653019, 824826, 896415, 949421, 498492, 331493, 976203, 1075616, 612650, 1036184, 1093111, 501388, 763832, 1121610, 976783, 839673, 814146, 1257895, 1016519, 543205, 830286, 1085698, 1041440, 1144664, 1240462, 1036082, 1327881, 1147897, 1323020, 1365568, 1228955, 1196813, 1416631, 1334307, 1368954, 1237720, 1288280, 1430321, 1442668, 1266904, 1567826, 1668768, 1705008, 1753157, 1635712, 1636367, 1342872, 1387770, 1843819, 1817184, 1219647]
6720A219647L07448K45338k14201k76548r376M16794n38314P5189O38877k78502
6710A586352k06466k9608Q0150K81506k8218L21887k39256m11676M01088j14951
6700A640808m23606j57272K08476K55022o0243j68729J16912k43255k9712K25190
6690A363591j20220L95191J8003l97249Q6669N9801j18295o3262J45412P4531
6680A444172r21q4466K87131k37394p52932O2100O40609l91549j27974N86102
6670A424878j50589J79813L48474M87112N19889p44838J50828L63237n12090N9329
6660B126043j46431l04988J63858k93144N7912J06518n03296J20302L34386l03003
6650A358157k20727M4524l93874K55538j31050l45408L54569j11709k31876r6260
$$ y = [1219647, 1527095, 1772433, 1558232, 1281684, 1272308, 1689102, 1150788, 1225977, 1864854, 1586352, 1379886, 1350278, 1430428, 1711934, 1683716, 2005603, 1766347, 1354671, 1755759, 1640808, 1217202, 1059930, 1268406, 1523428, 1463185, 1294456, 1411368, 1168113, 1138401, 1363591, 1243371, 1638562, 1656565, 1259316, 1345985, 1405786, 1287491, 1224229, 1369641, 1444172, 1443251, 1358785, 1645916, 1408522, 655590, 717690, 1358299, 966750, 838776, 1424878, 1274289, 1454102, 1802576, 2289688, 2809577, 2064739, 2215567, 2578804, 2066714, 2126043, 1979612, 1674624, 1838482, 1545338, 1603250, 1709768, 1206472, 1326774, 1661160, 1358157, 1137430, 1181954, 788080, 1043618, 912568, 567160, 921729, 810020, 578144, 481884]
6640D81884r823J13377j97983k44833K00686O7048J90525K24850m29693l34654
6630F1384n9845L44702k4116l44101P8795J60629J77583M3837J27805k35625m68889
6619a37841M20119K60962k47799j90789M27125j16294k21329j37112k4895K46221
6609B78368j22241l78956J43761J80369O51914M93892p77255J24961J05440n06959
6599A93294L5627K02916o57652O1216N25875R2315k42405l24964M70342J69282
6589E25846p03421O55379L98536j138778K678P24506M92555n6772o7744l66839
6579D65946L41894l16088J49405N41504l32095n1420K86876J7701K13641L13567
6569A630931j94074L34337j84559k60924L04129l69469m95573M55542k02427K21257
$$ y = [481884, 472061, 585438, 387455, 142622, 343308, 410356, 600881, 825731, 396038, 61384, 1539, 346241, 322125, -21976, 56819, 217448, 395031, 438868, 566673, 331048, -137841, 282278, 543240, 295441, 104652, 531777, 415483, 194154, 57042, 32147, 278368, 156127, -222829, -79068, 101301, 753215, 1247107, 469852, 594813, 700253, 193294, 228921, 431837, -225815, -164599, 361276, 453591, 211186, -113778, 356564, 525846, -177575, 477804, 876340, -262438, -259760, 464746, 957301, 900529, 832785, 465946, 807840, 491752, 641157, 1182661, 850566, 799146, 1086022, 1103723, 1317364, 1630931, 1436857, 1771194, 1586635, 1325711, 1629840, 1260371, 764798, 1220340, 1017913, 1239170]
6559A239170K69663k85825K47018J88292Q1820J65327k00189p14430n6648J50391
6549A084589r9230l4726l27232M85889j71087k85834j28539J45765j46601J27195
6539F50189L0803k0698k45015l3070L16486L88109m46279K71432M22512m48720
6529H85749J41434L5590J13384Q1855k14761K03730K59047l82657o2258O08666
6519A669779K05831K86966M1663K66683M56036j43477K44072O99560n486k34489
6509C487138J65173j63280O1880j6716J35774N1655r4729l8847O27198J15580
6499D330826N4989L73601k46339k43381o731p0709l0830l83831j87198K16119
6489C806516L64536l19316K91823K44765N1692j78809J99374K61331l28804l58944
$$ y = [1239170, 1508833, 1223008, 1470026, 1658318, 1740138, 1905465, 1705276, 990846, 934198, 1084589, 985359, 950633, 623401, 1109290, 938203, 652369, 523830, 669595, 522994, 650189, 680992, 660294, 415279, 382209, 698695, 1086804, 640525, 911957, 1334469, 885749, 1027183, 1062773, 1176157, 1258012, 1043251, 1246981, 1506028, 1123371, 1061113, 1669779, 1875610, 2162576, 2204239, 2470922, 2926958, 2783481, 3027553, 3727113, 3721627, 3487138, 3652311, 3489031, 3550911, 3534195, 3669969, 3721624, 3626895, 3588048, 4215246, 4330826, 4385815, 4759416, 4513077, 4269696, 4262965, 4192256, 4161426, 3777595, 3590397, 3806516, 4171052, 3851736, 4143559, 4388324, 4440016, 4261207, 4460581, 4721912, 4393108, 4034164]
6479D034164L06458N14111J65539M33407J078955K40276j91222m11170k69088
6470E901430k88511j077996p12027l46673r0578j09036m37940k81889J7937j95236
6460B379481L0782P9093l01207n6506J77463j06592O6451J6997l54792Q1275N8206
6449B070651j83180L95128l40586J16214L34195j53976p6687J67630l7792J67651
6439B459248O86175K8002O01049Q4676l05027j14661m29571j22866m1651k94942
6429B550432l72823l14607K47152k55992l21990L3518q1832j3467k3269M53334
6419A900456R108l29399K7099M37751j20591l09387N7134p1318N9316j09829q9780
6408A460560J26002q5627O49391k42634k43527O2187R4809P7857J93501k6350
$$ y = [4034164, 4340622, 4854733, 5020272, 5453679, 6532634, 6772910, 6581688, 6170518, 5901430, 5612919, 4534923, 3822896, 3476223, 3385645, 3276609, 2838669, 2556780, 2574717, 2379481, 2410263, 2489356, 2188149, 2131643, 2309106, 2202514, 2268965, 2285962, 1931170, 2012445, 2070651, 1887471, 2282599, 1942013, 2058227, 2392422, 2238446, 2161759, 2329389, 2291597, 2459248, 3145423, 3173425, 3774474, 3859150, 3554123, 3439462, 3009891, 2887025, 2845374, 2550432, 2177609, 1863002, 2110154, 1854162, 1532172, 1565690, 1483858, 1470391, 1447122, 1900456, 1909564, 1580165, 1607264, 2045015, 1924424, 1615037, 1672171, 1600853, 1660169, 1550340, 1460560, 1586562, 1500935, 2150326, 1907692, 1664165, 1726352, 1821161, 1899018, 2092519, 2066169]
6398B066169K25068L33363J07243Q04810N26379N52197P33479J33883o4043N45424
6388E963972l3612l16690m14945p14056m18720l92233L03048Q25151K77495L02217
6378E381627Q53448j75301l93216M10642l22325n81188m94608m72722l994l36650
6368C865713n23260P1757m88401j07371J42143j32260p6191L07661j37929J40753
6358C062615l03265L84102j044k10369n6149k6354M11414K65681m2538m67227
6348C016866M56800N09169R7722r8370J69744j02813N25360J97491Q95678O75559
6338F343206L86914Q13024O12398L35799q0485P7480J86302M3523n81851o10622
6328G525688m02082k75401N06455O97561O23472N46907J81797j98219L95128k20066
$$ y = [2066169, 2291237, 2624600, 2731843, 3536653, 4063032, 4615229, 5348708, 5482591, 5418548, 5963972, 5930360, 5613670, 5198725, 4484669, 4065949, 3673716, 3976764, 4801915, 5079410, 5381627, 6235075, 6059774, 5666558, 6077200, 5754875, 5173687, 4679079, 4206357, 4202363, 3865713, 3342453, 3414210, 2925809, 2818438, 2960581, 2828321, 2752130, 3059791, 2921862, 3062615, 2759350, 3143452, 3142408, 2932039, 2875890, 2849536, 3260950, 3526631, 3484093, 3016866, 3473666, 3982835, 4080557, 3982187, 4151931, 4049118, 4574478, 4771969, 5667647, 6343206, 6730120, 7543144, 8155542, 8491341, 8410856, 8488336, 8674638, 8718161, 8136310, 7525688, 7123606, 6848205, 7354660, 8052221, 8675693, 9222600, 9404397, 9206178, 9601306, 9381240]
6318I381240p42716r44567o96663l71880j35372l72205J09034O6480K36222M05057
6308F934630K5452K34637K6530N60594N96484Q30869Q60546R86226Q17488R66620
6298A2840076J186014n3139k08984j96219m34454o25927q2601L59551r7579Q87653
6288A3574391J283478J430112J173279J433023J063187L56726K50184n841p11743
6279A9846796k96699J11508N6530J90984L69052M20432p24722n94307k58928j5815
6269A9104831l24693n90655J86751j1604o350O18806J15850l5984m8124L45009
6259A9353837p0617j210430j182010q16064j401174j205383p09696q65090q79795
6250A1013578m05248k57096l14042N90228J7949p5716n53561J38749K13251j17214
$$ y = [9381240, 8638524, 7693957, 6997294, 6625414, 6490042, 6117837, 6226871, 6293351, 6529573, 6934630, 6960082, 7194719, 7221249, 7781843, 8378327, 9209196, 10069742, 11055968, 11873456, 12840076, 14026090, 13972951, 13763967, 13567748, 13133294, 12507367, 12424766, 12784317, 12686738, 13574391, 14857869, 16287981, 17461260, 18894283, 19957470, 20314196, 20564380, 20558539, 19846796, 19550097, 19661605, 19718135, 19909119, 20278171, 20698603, 19973881, 19379574, 19120646, 19104831, 18780138, 18189483, 18376234, 18364630, 18358280, 18977086, 19092936, 19056952, 19008828, 19353837, 19283220, 18072790, 16890780, 16074716, 14673542, 13468159, 12758463, 11893373, 11013578, 10608330, 10351234, 10037192, 10627420, 10645369, 10569653, 10016092, 10154841, 10368092, 10250878]
6240A0250878Q927M77866q6179l1837R48045K82158L51717R09699Q25798J367335
6230A5304407J270849J932134J761051L02609K54298k30606q03086j413259q23248
6221A7555149p20942k25624K17197M99397J189279J109687J718232J558223O17350
6212B3517948M2711m47378p31551l98551K24616K41080L06597Q43056Q88075K36393
6202B4722996p59873r02610j189880j303541j161138m11885k1019m05634M22238
6193A8989654P73411R37124J470900Q34739M16461l97142q55403j427637j317595
6184A9424512j981985j691594j622121j257139m90288q62138k93968r6860j89521
6175A0938898j90195J30040m07163P214j70636j15285L57089r2935m1478o5060
$$ y = [10250878, 10259805, 10737671, 10651492, 10619655, 11567700, 11849858, 12201575, 13111274, 13937072, 15304407, 16575256, 18507390, 20268441, 20571050, 20825348, 20594742, 19791656, 18378397, 17555149, 16834207, 16608583, 16825780, 17325177, 18514456, 19624143, 21342375, 22900598, 23517948, 23560659, 23113281, 22381730, 21983179, 22207795, 22448875, 22755472, 23598528, 24486603, 24722996, 23963123, 23060513, 21870633, 20567092, 19405954, 18994069, 18973050, 18567416, 18989654, 19763065, 20700189, 22171089, 23005828, 23422289, 23025147, 22169744, 20742107, 19424512, 17442527, 15750933, 14128812, 12871673, 12381385, 11519247, 11225279, 11128419, 10938898, 10748703, 10878743, 10471580, 10478794, 10308158, 10192873, 10549962, 10457027, 10415549, 10350489]
6165A0350489m11855L8228p4013k79674n18215L01139J65544M51833J55014j87395
6155I991095k96182l13876j24801j03776j38300L07382R5779N05701M42368L60470
6145A0725860M7129l29478r8891k5575M20734L5393Q46488Q74199N71215K22652
6135A3289726J61143L53215k58701j57924j32313J52560J63154L1028J4984N83819
6125A4200691K57377l58929k13301o63493m23325k60141M20395J76363r7833j10029
6115A2927775k32022o7429j57741k93027R0764l06531l18400M96312M07684r6054
6105A2451331m2980J5552K39171Q7709J4111N2333K31230N30115J70625N01323
6095A4250520K16044m50978k15661J46323l04427p21530M708L4482j48122K61080
$$ y = [10350489, 9938634, 9976862, 9902849, 9623175, 9104960, 9406099, 9571643, 10023476, 10178490, 9991095, 9694913, 9381037, 9256236, 9152460, 9014160, 9321542, 9417321, 9923022, 10365390, 10725860, 10772989, 10443511, 10344620, 10319045, 10739779, 10775172, 11621660, 12495859, 13067074, 13289726, 13450869, 13804084, 13545383, 13387459, 13255146, 13407706, 13570860, 13601888, 13616872, 14200691, 14458068, 14099139, 13885838, 13222345, 12799020, 12538879, 12959274, 13135637, 13037804, 12927775, 12695753, 12628324, 12470583, 12177556, 12268320, 11961789, 11643389, 12139701, 12547385, 12451331, 12408351, 12423903, 12663074, 12750783, 12764894, 12817227, 13048457, 13578572, 13749197, 14250520, 14466564, 14015586, 13799925, 13946248, 13641821, 12920291, 12924999, 12959481, 12811359, 13072439]
6085A3072439L76763l8670j02690K24739n6441J5021k55448j60680m0844k87094
6075A2747095m3952J62129L26504J929M78309M69177R2721J09640K62611O0464
6065A4666627K81j04278J39321L75096L24357M82155N21886J87482O8091L5972
6055A6696990K00753K08049j01047O29216O63829O29802N52790P30479Q58260
6046B1069121J077170Q18029J077338J138221J028414J631538R86486m9618o16695
6037B8160004j318247j855776j855450j791170j434390j413133j407948j79648
6029A6904242q669k66426K46214R05830P45011R93148K009326K739849K847497
6020B7116022K839392K871275K188523P07016j038582j766972k746074k889494
$$ y = [13072439, 13449202, 13410532, 13307842, 13532581, 13476140, 13491161, 13235713, 13075033, 13034189, 12747095, 12703143, 12865272, 13191776, 13193705, 13672014, 14141191, 14233912, 14343552, 14606163, 14666627, 14666908, 14562630, 14701951, 15077047, 15401404, 15883559, 16405445, 16592927, 16661018, 16696990, 16897743, 17105792, 17004745, 17633961, 18297790, 18927592, 19480382, 20210861, 21069121, 22146291, 22964320, 24041658, 25179879, 26208293, 27839831, 28826317, 28776699, 28160004, 26841757, 24985981, 23130531, 21339361, 19904971, 18491838, 17083890, 16904242, 16895573, 16629147, 16875361, 17781191, 18526202, 19519350, 21528676, 24268525, 27116022, 29955414, 32826689, 35015212, 35722228, 34683646, 32916674, 30170600, 27281106]
6012B7281106k765265k523959j839028j716488j179751r49701o50279m35312j85691
6003A5035632p8106M20982R03478J241955J516278J239277J089794R62554N08433
5994B2840277l76488j134612j308027j415929j438224j190004q18386q38326j265362
5985A3054919o03486m61020l37934j59931K04538J353L20294L90559K01697M12200
5975A3023189N42030N89528J194958R30350J310765R78246N43482r8779m34581
5966A8579188n77404n70969o99321n78412p6051k53221r1707L39186J25600J8516
5956A6215405N56844M89794J027923J252757J388772J740562K166089K377219
5948B7215365J966133J312067O08619R7860p70048j340095j253624j475835j034922
$$ y = [27281106, 24515841, 21991882, 20152854, 18436366, 17256615, 16306914, 15656635, 15221323, 15035632, 14957526, 15378508, 16281986, 17523941, 19040219, 20279496, 21369290, 22331844, 22840277, 22463789, 21329177, 20021150, 18605221, 17166997, 15976993, 15158607, 14320281, 13054919, 12451433, 11990413, 11652479, 11492548, 11697086, 11698439, 12018733, 12409292, 12610989, 13023189, 13565219, 14154747, 15349705, 16280055, 17590820, 18569066, 19112548, 19013769, 18579188, 18001784, 17430815, 16731494, 16153082, 16077031, 15823810, 15732103, 16071289, 16196889, 16215405, 16772249, 17262043, 18289966, 19542723, 20931495, 22672057, 24838146, 27215365, 29181498, 30493565, 31102184, 31200044, 30429996, 29089901, 27836277, 26360442, 25325520]
5939B5325520m59322j03043r9231k2874O23171Q57773N94737P98266M90358K97769
5929B8303124L35276R10505J226836J807870J648457J326890N75294m18005l17569
5920C5398678o70034j168563j453513k020721j463748j136224j236557j352479
5912B4896839j132668j222912r30176l48357m42432m66022m85951l92402K53706
5903A9729625K1791J61793J51005L87221K12649l39780L09524O55870R2041M07724
5893B1789463M89859k33591l41952j50209J44213p3263m52622n18224o1718o27279
5883A9964677j007272p08310q14001q89668j018247l64656r4231o05016O9451
5874A4532727K40426m042K78361M95391Q13707K23826j94787l02344N3650l81495
$$ y = [25325520, 24866198, 24763155, 24663924, 24641050, 25264221, 26121994, 26716731, 27514997, 28005355, 28303124, 28638400, 29548905, 30775741, 32583611, 34232068, 35558958, 36134252, 35716247, 35398678, 34728644, 33560081, 32106568, 30085847, 28622099, 27485875, 26249318, 24896839, 23764171, 22541259, 21611083, 21262726, 20820294, 20354272, 19868321, 19475919, 19729625, 19751416, 19913209, 20064214, 20451435, 20664084, 20324304, 20633828, 21289698, 21381739, 21789463, 22279322, 22045731, 21703779, 21553570, 21697783, 21624520, 21171898, 20653674, 20591956, 19964677, 18957405, 18249095, 17435094, 16545426, 15527179, 15162523, 15068292, 14463276, 14532727, 14773153, 14769111, 15047472, 15542863, 16356570, 16580396, 16385609, 16083265, 16136915, 15755420]
5864A5755420r22410n69669p94010p93081p51429k82340j80858l02695k67680
5855A0891248L63677K18267j09631k57614M67k78109o32404j60878j6873l20856
5845I697294j56349K88468M49982K65648N79595R14890J021301N84536M15460
5836A4060825N58916o1211n69002o27606p86227j060618r07092l50597m80804
5827I776584p42894K0827K09k91052P6649L01840Q1682L8573m3794j15616j87229
5816H915779k10044m53075k78388j37894m13881j89811M1893j82397n8848Q300
5806G041634k6632l8360q7812o876j3748k99135j44655K39369k21811m503L00356
5795F737827K64918j4492N08262j46282k03570J39675K02951J35473n2435k9705
$$ y = [15755420, 14833010, 14263341, 13469331, 12676250, 11924821, 11642481, 11461623, 11158928, 10891248, 11254925, 11473192, 11363561, 11105947, 11106414, 10828305, 10195901, 10035023, 10018150, 9697294, 9540945, 9829413, 10279395, 10545043, 11124638, 12039528, 13060829, 13645365, 14060825, 14619741, 14558530, 13989528, 13361922, 12575695, 11515077, 10607985, 10257388, 9776584, 9033690, 9054517, 9054726, 8763674, 8840323, 9142163, 9223845, 9262418, 9218624, 9103008, 8915779, 8705735, 8252660, 7974272, 7836378, 7422497, 7232686, 7274579, 7092182, 7033334, 7041634, 7015002, 6976642, 6888830, 6881954, 6868206, 6569071, 6424416, 6663785, 6441974, 6437471, 6737827, 7002745, 6988253, 7496515, 7350233, 7146663, 7286338, 7489289, 7624762, 7572327, 7542622]
5785G542622n9328M67437o39J52972O16825K52012N7994M78632N93295K75236
5775A0377058N74369N63590M04650M71221Q33085R24073J036153J021782J147547
5766A7353528J697715K303054K737972K778586N045363Q562982J2956082J8425988
5758G1861270K5427315K1466913L321461j4465189k1906044j8902810j4319332
5751E2483584j0036074o905622n055007l819200l338287k718818j851764j489776
5743A7269036r39394p34587p32196j37594j17901o37689j43399L47129n40308
5734A3633097m61927j47279j49734j83702k7474j09221M8327m0057J28276q8946
5724A2601360m54455j76819J38752K01398q2484N7139k43273l04113m61175K4976
$$ y = [7542622, 7483294, 7950731, 7950092, 8103064, 8719889, 8971901, 9029895, 9508527, 10101822, 10377058, 10951427, 11515017, 11919667, 12390888, 13223973, 14148046, 15184199, 16205981, 17353528, 19051243, 21354297, 24092269, 26870855, 31916218, 40479200, 53435282, 71861270, 97288585, 118755498, 122076959, 107611770, 85705726, 66802916, 52483584, 42447510, 35541888, 30486881, 26667681, 23329394, 20610576, 18758812, 17269036, 16329642, 15595055, 14862859, 14725265, 14607364, 13969675, 13826276, 14173405, 13633097, 13171170, 13023891, 12874157, 12690455, 12662981, 12553760, 12602087, 12562030, 12690306, 12601360, 12146905, 11970086, 12108838, 12310236, 12227752, 12284891, 12041618, 11737505, 11276330, 11301306]
5714A1301306p1591j38239k02629j2375n10694k01656J97562j33956n84721J2604
5704I655611J10023k16959K99173n25091J60849J79317J23981R7956n4402P6721
5694I907179m1816k99032k23612k62272j03060j71554m62253N489m7833q2135
5684H219101J96414k38114l46322j53029L71724l2426k63419p0337L7507J55057
5674G876156N8161J56803O9235j00227m64377k24778j09049k69821l61244l68497
5664F262362M21713j00398l15239j3451N7557k97835r8944J90805J57181j1808
5654F251943L0994Q9j28032J01408j2761j32936J87084K87462R1330r7566l18071
5643F260944m4578J28229K79173j59454P7667n2137K973M37359k5686n1515J45026
$$ y = [11301306, 11229715, 11091476, 10888847, 10876472, 10365778, 10164122, 10361684, 10227728, 9643007, 9655611, 9765634, 9548675, 9847848, 9322757, 9483606, 9662923, 9786904, 9884860, 9830458, 9907179, 9865363, 9566331, 9342719, 9080447, 8977387, 8805833, 8343580, 8349069, 8301236, 8219101, 8415515, 8177401, 7831079, 7678050, 8049774, 8017348, 7753929, 7683592, 7721099, 7876156, 7934317, 8091120, 8160355, 8060128, 7595751, 7370973, 7261924, 6992103, 6630859, 6262362, 6684075, 6583677, 6268438, 6254987, 6312544, 6014709, 5915765, 6106570, 6263751, 6251943, 6282937, 6283026, 6154994, 6256402, 6243641, 6110705, 6297789, 6585251, 6676581, 6579015, 6260944, 6216366, 6344595, 6623768, 6464314, 6541981, 6489844, 6492817, 6930176, 6904490, 6852975, 6998001]
5632F998001M3209n5745P8336p4457n10779q4057K05932j1310l63127O3504M86401
5621F775908j66026K11337L82977K71350K15613N5591K03114K47337K68048m07966
5611H057283N02434N0981j48051J01286K15403Q6789K59713j269N39719L26716
5601I991004k87097O3870Q6820N45190n73005j15803K70403j48685m66426l10240
5591I056031J22394J13379l97853J95590J1818J92531O12879P33971M61911j4587
5581A1088064m1814K51773n16642m57852L3798j65217n0241q2062L12557M37995
5571A0810359N09853R45150J059162R03924J057862L22673j1476p14973n62551
5562A4319983l00543n70310L69134L47986L26729J005594R26532L22094l69250
$$ y = [6998001, 7041210, 6985465, 7063801, 6989344, 6478565, 6394508, 6600440, 6589130, 6226003, 6289507, 6775908, 6609882, 6821219, 7204196, 7475546, 7691159, 7746750, 7949864, 8197201, 8465249, 8057283, 8559717, 8610698, 8462647, 8563933, 8779336, 8866125, 9125838, 9124569, 9664288, 9991004, 9703907, 9767777, 9854597, 10399787, 9826782, 9710979, 9981382, 9832697, 9366271, 9056031, 9178425, 9291804, 8893951, 9089541, 9101359, 9293890, 9906769, 10640740, 11102651, 11088064, 11046250, 11298023, 10781381, 10323529, 10357327, 10192110, 10141869, 10059807, 10372364, 10810359, 11320212, 12265362, 13324524, 14228448, 15286310, 15608983, 15597507, 14882534, 14319983, 14019440, 13449130, 13818264, 14166250, 14492979, 15498573, 16425105, 16747199, 16377949]
5553A6377949j44173l36259n17800l60630p0081N1652l18808m52655n27722p46889
5543A2954584j33949k36851K9218P9152o9686j84690p9870K30818J51914j43398
5533A2597242k45452L7846K09188j0031M60918P01519K08814N62906P74835P2699
5523A5370484n3658j64615j46360M32516Q7210J75442J89964O5507R7899P07926
5513A6762315Q37909M78707J331694J455532J323376J953656K120887J408129
5505B7672205P27609L17011J38830n4997k05435N56917K20525K82535O01329k51091
5495C0005438j70892k93420k76998l76064n74705J74274P36850M25477M03429
5486C0053389O4419k22047j38471l45928r54934r87473l94722m26211J27128N3582
$$ y = [16377949, 16233776, 15897517, 15379717, 15019087, 14949006, 15000658, 14681850, 14229195, 13701473, 12954584, 12820635, 12583784, 12613002, 12692154, 12622468, 12437778, 12357908, 12588726, 12740640, 12597242, 12351790, 12389636, 12598824, 12588793, 13049711, 13751230, 13960044, 14522950, 15297785, 15370484, 15316826, 15152211, 15005851, 15438367, 15525577, 15701019, 15890983, 15956490, 16054389, 16762315, 17600224, 18078931, 19410625, 20866157, 22189533, 24143189, 26264076, 27672205, 28399814, 28716825, 28855655, 28800658, 28595223, 29152140, 29372665, 29655200, 30256529, 30005438, 29834546, 29541126, 29264128, 28888064, 28313359, 28487633, 29224483, 29649960, 30053389, 30117808, 29895761, 29757290, 29411362, 28456428, 27468955, 27074233, 26648022, 26775150, 26828732]
5476B6828732m66686j63565m65291q96958j346119k282268j495692j264952j383550
5467A7063651l40790k34792m60210j96846J62200J54646p576J69376J09813k56301
5457A6163171L91971M95895o1260m64962q38470k79694o23495l4717o92535n84914
5447A3470990m9369j35005j28539j26911l57731L08680p8814q6578L41786R8568
5437A3257077k25760J17266M37241L50953J42566Q3641O48385K01307K18775J76130
5427A5407581J19080J20406L32539q4245o90738O5232J19533m86527m97520l72830
5417A4032511J92522K3603p8573N12434J96932l37428L33456N53331L54137K35382
5407A6018307M52980L24643L11618K35916J95015j14534r272N16326k06396m45651
$$ y = [26828732, 26362046, 26198481, 25733190, 24836232, 23490113, 21207845, 19712153, 18447201, 17063651, 16722861, 16488069, 16027859, 15831013, 15993213, 16147859, 16140283, 16309659, 16419472, 16163171, 16555142, 17051037, 16989777, 16524815, 15686345, 15406651, 14783156, 14748439, 14055904, 13470990, 13421621, 13286616, 13158077, 13031166, 12673435, 12982115, 12903301, 12816723, 13158509, 13257077, 13031317, 13148583, 13585824, 13936777, 14079343, 14162984, 14811369, 15012676, 15231451, 15407581, 15526661, 15647067, 15979606, 15895361, 15204623, 15269855, 15389388, 14902861, 14405341, 14032511, 14225033, 14248636, 14170063, 14682497, 14879429, 14542001, 14875457, 15428788, 15782925, 16018307, 16471287, 16795930, 17107548, 17343464, 17538479, 17423945, 17414673, 17930999, 17724603, 17278952]
5397A7278952N1468J90755k30749k60773L24828L56302l6347j1986L02932J26873
5387A8092255j32103J33933K76401K1088K42367L07093j02382Q57512P94248j73170
5377B0317242K42424J20159m86215L18991m0831j05575N49608k45809N05390J69629
5367B1345013q5077K97287M87029K92242O47989N03392N10524P95662P03303J217793
5357B6715157P37985O17123R23154J54270l15785J00852j39774J83846P91733
5348B9768561L14425K92715L73221J258699J255378Q76921J520115K474179K781463
5339D0915677L268307M874015M672497L461148J435960r22226k125755l078746
5331E2500877l100286k339947j790377j274662n63504q03648n49997J01666N00325
$$ y = [17278952, 17330420, 17521175, 17290426, 17029653, 17354481, 17710783, 17674436, 17662450, 17965382, 18092255, 17960152, 18094085, 18370486, 18391574, 18633941, 18941034, 18838652, 19696164, 20490412, 20317242, 20559666, 20679825, 20193610, 20512601, 20471770, 20366195, 20915803, 20669994, 21175384, 21345013, 21259936, 21557223, 22044252, 22336494, 22984483, 23487875, 23998399, 24794061, 25497364, 26715157, 27453142, 28070265, 28993419, 29147689, 28831904, 28932756, 28792982, 28976828, 29768561, 30082986, 30375701, 30748922, 32007621, 33262999, 34139920, 35660035, 38134214, 40915677, 44183984, 49057999, 53730496, 57191644, 58627604, 57705378, 55579623, 52500877, 49400591, 47060644, 45270267, 43995605, 43432101, 42628453, 42078456, 42180122, 42680447]
5322D2680447Q45642J199098J593592J796630J941690K723700K405683J821784
5314E7008266J263193N86297j26711j11816l03631k86953l74296j3082P37118
5305E8378385J98081M01735Q98681J091510N47811J108639R18034R35137J054056
5296F5532069J289148J832451J612835J574932K120321J445275J058480J664938
5288G8130449J599718J603579J646782J866620K294187K361290K320640K657686
5280I4480951K381348K598362K810740K775723L442963L345735K847326L921525
5272A18604673L447543L478935L479261K946120L757084L938977L947449M243697
5264A47843739M425019L869669M842227N610847N479239N207630O282755O083173
$$ y = [42680447, 43526089, 44725187, 46318779, 48115409, 50057099, 52780799, 55186482, 57008266, 58271459, 58857756, 58731045, 58619229, 58315598, 58028645, 57654349, 57641267, 58378385, 58576466, 58978201, 59876882, 60968392, 61516203, 62624842, 63542876, 64478013, 65532069, 66821217, 68653668, 70266503, 71841435, 73961756, 75407031, 76465511, 78130449, 79730167, 81333746, 82980528, 84847148, 87141335, 89502625, 91823265, 94480951, 96862299, 99460661, 102271401, 105047124, 108490087, 111835822, 114683148, 118604673, 122052216, 125531151, 129010412, 131956532, 135713616, 139652593, 143600042, 147843739, 152268758, 156138427, 160980654, 166591501, 172070740, 177278370, 183561125, 189644298]
5256A89644298N585797N281680N596423M597423L617254M391811M499464L922797
5248B27136947M477682L874596L261456K742901J704504J234411N04808O39157
5240B45576462J040736O83468Q02979Q55687P64455O64596M21789l38501l13023
5231B50158648r36989j613900k136205l085341k815355k366435l040120l100094
5223B31064209k611554l412878m291732n337620n321955n830476n696805n302854
5215A93258335n174892n765924n494975m440846m527383m864862m746353m286759
5207A53956341m194959l573857l523892m225532l837190m185896l587485l307928
5199A23519602l402390k914602k067109j919712j403684j305200j575107k185683
$$ y = [189644298, 195230095, 200511775, 206108198, 210705621, 214322875, 218714686, 223214150, 227136947, 231614629, 235489225, 238750681, 241493582, 243198086, 244432497, 244937305, 245576462, 246617198, 247300666, 248103645, 248959332, 249723787, 250388383, 250810172, 250471671, 250158648, 249221659, 247607759, 245471554, 242386213, 239570858, 237204423, 234164303, 231064209, 228452655, 225039777, 220748045, 215410425, 210088470, 204257994, 198561189, 193258335, 188083443, 182317519, 176822544, 172381698, 167854315, 162989453, 158243100, 153956341, 149761382, 146187525, 142663633, 138438101, 134600911, 130415015, 126827530, 123519602, 120117212, 117202610, 115135501, 113215789, 111812105, 110506905, 108931798, 106746115]
5191A06746115k542378k708113k335865j704065k196671j620651j496802j438297
5183I0703273m86685m4599j69817n06035j018972j105367r18154p40528p92434
5174H4920682r76697j734825j114261q86116o46882p33905r51504r9833o15215
5165G7161444n90162l35517j56362R1331n07660r05339o77155j469123k031434
5156G0580023j439010j165466j292245q10931o09888j063678j255075j572399
5148F1371331j310579j400026j631953j068746k94197q02816o32165k70040p89254
5139E3171555r74862j593582j992001k107340k261404k107909j208972r58775
5131C9966710j135363n08473k58914n7977l19591p65658q69811j295124j415707
$$ y = [106746115, 104203737, 101495624, 99159759, 97455694, 95259023, 93638372, 92141570, 90703273, 90216588, 90171989, 90002172, 89496137, 88477165, 87371798, 86453644, 85713116, 84920682, 83943985, 82209160, 81094899, 80208783, 79561901, 78827996, 77876492, 77776659, 77161444, 76571282, 76235765, 76079403, 76170734, 75663074, 74757735, 74080580, 72611457, 70580023, 69141013, 67975547, 66683302, 65872371, 65262483, 64198805, 62943730, 61371331, 60060752, 58660726, 57028773, 55960027, 55665830, 54863014, 54230849, 53960809, 53171555, 52196693, 50603111, 48611110, 46503770, 44242366, 42134457, 40925485, 39966710, 38831347, 38322874, 38063960, 38005983, 37686392, 36920734, 36050923, 34755799, 33340092]
5122C3340092j248363m58319r87208p36148q51643o05598m65352m11838k19809
5113B7355814m67499n45177k26226j49500l24794n18107l63340J10704l21923
5104B4549952m85463k81964j07939k54902o0930O1851J63313o802j51746p03681
5094B2721689K02656M2405p09295Q4011l583l17340j61538j51855o7029j86065
5084B1454056j79863j3821j7409o1285k12625k83869l19316j83163j0866l9284
5074B0132555n1565l56242j24049R4589j64175j04251K56256k92159o0811J16729
5064A9446877l42954M86223j38402m62795j09709k61375K551j71958O4514M50297
5054A8963269J41438p7798M20397M89274J0729Q94145J086590O25653K00335N18212
$$ y = [33340092, 32091729, 31633410, 30646202, 29910054, 29058411, 28452813, 27987461, 27575623, 27355814, 26888315, 26343138, 26116912, 25967412, 25642618, 25124511, 24761171, 24871875, 24549952, 24064489, 23782525, 23674586, 23419684, 23358754, 23420605, 23583918, 23577116, 23425370, 22721689, 22924345, 22966750, 22257455, 22341466, 22337883, 22020543, 21859005, 21707150, 21640121, 21454056, 21274193, 21260372, 21242963, 21181678, 20969053, 20685184, 20365868, 20182705, 20171839, 20132555, 20080990, 19724748, 19600699, 19695288, 19531113, 19426862, 19683118, 19390959, 19330148, 19446877, 19103923, 19590146, 19451744, 18988949, 18879240, 18617865, 18620416, 18448458, 18512972, 18963269, 19104707, 19026909, 19447306, 19936580, 19947309, 20841454, 21928044, 22553697, 22754032, 23272244]
5044B3272244l97777o37285j81048n81258j345k43401R6206O26221p0088N1900
5034B1934369P10018N45888L20680N18885Q1497j006261n96218o83758q94209
5025B0930891k30145k97791M0659J89757k5743j47772n14306l00559q2426q6237
5015A9476328J24735K83891k16874m8922M7419J13701L70690m16494p415M75602
5005B0202661j64690O0224j9359j09964K04534K07277J14894M51535n5750L6773
4995B0928135L38594N6999J75401M62278l8042J82972K4532K69371M55940N94363
4985B3450543L87669O18357P00678o2173K5613k22838j19974o65738p88494J73165
4975B3496808k11910o3568m4354L6258j66360m72401J97724K95529j35401J32869
$$ y = [23272244, 22874467, 22237182, 22056134, 21474876, 21473531, 21230130, 21326336, 21952557, 21882469, 21934369, 22644387, 23190275, 23510955, 24029840, 24111337, 23105076, 22508858, 21825100, 20930891, 20700746, 20402955, 20443614, 20633371, 20607628, 20459856, 19945550, 19644991, 19562565, 19476328, 19601063, 19884954, 19668080, 19619158, 19666577, 19780278, 20150968, 19734474, 19727059, 20202661, 20037971, 20098195, 20078836, 19968872, 20173406, 20380683, 20495577, 20947112, 20891362, 20928135, 21266729, 21323728, 21499129, 21961407, 21923365, 22106337, 22130869, 22400240, 22856180, 23450543, 23838212, 24456569, 25157247, 25095074, 25120687, 24897849, 24777875, 24112137, 23323643, 23496808, 23284898, 23221330, 23176976, 23213234, 23046874, 22574473, 22772197, 23067726, 22932325, 23065194]
4965B3065194L02582J51253P2464k95231j1309J67607M68719J3576N7730K22955
4955B4215540N25503M0640K73183P19270m25860l28066N24112L95259K40060J46825
4945B6326466J92246J6960k15917j60208O82621K2930j08806L83606L41008K921
4935B7483827J01255L02301L38383k26194J46189O00381k52967n30725L38668
4926B8301118J88535L31829N61333l16651n9507M32457j05506K49281Q2852l3690
4916B9632051k3196L7485K61335L38488M7090K0454N93296l42556r2331N68568
4906C1040684M25796m7861l05135K87410J40355l56743M46414O55007j39373k4367
4896C2122187P87542L74922j61883P43021P89071L07564L52386O47166J073465
$$ y = [23065194, 23367776, 23519029, 23591493, 23296262, 23284953, 23452560, 23921279, 23934855, 23992585, 24215540, 24741043, 24781683, 25054866, 25774136, 25348276, 25020210, 25544322, 25939581, 26179641, 26326466, 26518712, 26535672, 26319755, 26159547, 26842168, 26865098, 26756292, 27139898, 27480906, 27483827, 27585082, 27887383, 28225766, 27999572, 28145761, 28746142, 28493175, 27962450, 28301118, 28489653, 28821482, 29382815, 29066164, 29006657, 29439114, 29333608, 29582889, 29665741, 29632051, 29608855, 29646340, 29907675, 30246163, 30293253, 30313707, 30907003, 30564447, 30472116, 31040684, 31466480, 31418619, 31113484, 31400894, 31541249, 31184506, 31630920, 32285927, 32146554, 32122187, 32909729, 33284651, 33122768, 33865789, 34654860, 34962424, 35314810, 35961976, 37035441]
4887C7035441J441230J420269J557654J165432J048055J715787J842781J666982
4879D8893631J653264K075693J722493J901455J179715J203593O45592R98897
4871F0274333P91527k53907K14093O05343l78291J07952P79712J017992Q27294
4862F3986048O86744O3863m3482J0881Q49268J419811J079888J755520K276792
4853G2085333J322215J544328J356206O39548P37708O36263J272721R42115R23414
4844H1459851J381703J179968L74994N17502P50155J25164r66863p65755k73963
4835H3782756J97677R0225M08790J131808K187261K903568N015878Q204262J2312111
4826A16234336J6886617J9143042J1032749k342527j3766146j3828410j0435636
$$ y = [37035441, 38476671, 39896940, 41454594, 42620026, 43668081, 45383868, 47226649, 48893631, 50546895, 52622588, 54345081, 56246536, 57426251, 58629844, 59275436, 60274333, 61065860, 60811953, 61026046, 61631389, 61253098, 61361050, 62140762, 63158754, 63986048, 64672792, 64736655, 64693173, 64704054, 65553322, 66973133, 68053021, 69808541, 72085333, 73407548, 74951876, 76308082, 76947630, 77685338, 78321601, 79594322, 80536437, 81459851, 82841554, 84021522, 84396516, 84914018, 85664173, 85789337, 84822474, 84056719, 83782756, 83980433, 84070658, 84479448, 85611256, 87798517, 90702085, 95717963, 103922225, 116234336, 133120953, 152263995, 163296744, 160954217, 147188071, 133359661, 122924025]
4819A22924025q426088n844125m272109k633764j854097j234887j71905N73279
4811I9060329J8275O90345J232994N74601M33872M19427J77578K30370n26413
4802A02311378K3402k1354n14547j461210j357973j688833j883521j589772j460901
4793I2356669j192023r53479j124977l38283k52707k91921J40961N27000J94559
4784H9065799L67204R1410j60618q02601j377387j222907j746777k670224k526901
4775G9016998k481799k848697l073798k510191k044650j176213p56431N92851
4767F4718070J749590J809457K487081J724239R90046Q53465p0927l18750j408734
4758G2533537k854851l164508l134764k670646j770801q17525n22536K0437O78564
$$ y = [122924025, 114497937, 108653812, 104381703, 101747939, 99893842, 98658955, 98487050, 99060329, 99078604, 99768949, 101001943, 101576544, 102010416, 102429843, 102607421, 102837791, 102311378, 102334780, 102313426, 101798879, 100337669, 98979696, 97290863, 95407342, 93817570, 92356669, 91164646, 90211167, 89086190, 88747907, 88495200, 88203279, 88344240, 88871240, 89065799, 89433003, 89524413, 89363795, 88561194, 87183807, 85960900, 84214123, 81543899, 79016998, 76535199, 73686502, 70612704, 68102513, 66057863, 64881650, 64125219, 64718070, 66467660, 68277117, 70764198, 72488437, 73478483, 74331948, 74261021, 73942271, 72533537, 69678686, 66514178, 63379414, 60708768, 58937967, 58120442, 57597906, 57618343, 58296907]
4749E8296907J450754K315268K940496K485764K429770K311313K462170K584722
4741G7277164Q24418j774349l092581k857009l185687m104904n027165m637913
4733E3421974l519282k923741j799092j030440N80405Q77160J976359L086697
4725E0670040K345147J454832Q30557o69633r88486o79219j413059j941773k425248
4716D7183158k704941j603047j666639k366400k356652k094409j693731j713930
4708C0983409r90524O0044L27288L67382Q09101Q43853L318j026345j206142p83073
4698B9388311o12757o41540j94730M44607M71808M41763N68826J26357p66727
4689B9225918r43450p56084n36158q56165m27533J92536j91918j87429K53821
$$ y = [58296907, 59747661, 62062929, 65003425, 67489189, 69918959, 72230272, 74692442, 77277164, 78101582, 76327233, 73234652, 70377643, 67191956, 63087052, 58059887, 53421974, 49902692, 46978951, 45179859, 44149419, 44729824, 45606984, 47583343, 50670040, 53015187, 54470019, 55300576, 54630943, 53642457, 52963238, 51550179, 49608406, 47183158, 44478217, 42875170, 41208531, 38842131, 36485479, 34391070, 32697339, 30983409, 29992885, 30052929, 30380217, 30747599, 31556700, 32400553, 32403871, 31377526, 30171384, 29388311, 28775554, 28134014, 27939284, 28383891, 28855699, 29297462, 29866288, 29992645, 29225918, 28282468, 27526384, 26990226, 26134061, 25706528, 25899064, 25707146, 25519717, 25773538]
4680B5773538M44276L28055k58724Q6293O12271j90948k61015q6245M3364k82714
4670B6208151j15272n2093l08871J24849L7398j01700J70691K16992Q5656r6862
4660B6168939k8920J63028K28306K66557q7868J47805o5634J33485j17947R9095
4650B6906846M37545l6691j44380m39710O2009M09651M09219L91860P28167J25538
4640B8850054O10482P21583M12245M12766O18800R93916O76426Q88002R59952
4631C5144226J639712J695087K548614M426632N576930N360371K641945j563982
4623E7469535m101790m281116l175376j274903q53289P8448N92094P27338J507058
4614D6687999J961131K387466K969666L618641L772632L482589L552973L764919
$$ y = [25773538, 26217814, 26545869, 26287145, 26373438, 26985709, 26794761, 26533746, 26447501, 26490865, 26208151, 26092879, 26040786, 25731915, 25856764, 25894162, 25792462, 25963153, 26180145, 26265801, 26168939, 26140019, 26303047, 26531353, 26797910, 26710042, 26857847, 26792213, 26925698, 26807751, 26906846, 27344391, 27307700, 27163320, 26723610, 26785619, 27195270, 27604489, 27996349, 28724516, 28850054, 29460536, 30182119, 30594364, 31007130, 31625930, 32619846, 33296272, 34184274, 35144226, 36783938, 38479025, 41027639, 45454271, 51031201, 56391572, 59033517, 57469535, 53367745, 49086629, 45911253, 44636350, 43783061, 43861509, 44453603, 45180941, 46687999, 48649130, 51036596, 54006262, 57624903, 61397535, 64880124, 68433097, 72198016]
4606G2198016L874512M618138O675489R553691J1441879J1942177J0613287O642587
4598A37559776K110065o59107k334184k442788j495878r35664n43083k707788
4590A28551349m919105o354028o713003n021901k958056k179698r25121j337634
4582I8142803l259905m743270n180061m282354l568493k441704j272831j659163
4574G1735022k615281k780248k976898k986554k113948j637994j429462n51742
4566E4642895l28037j82169l8955n05900K11629N21671L07903R21014J039365
4557E6589416J191268J000019J228701Q74369J019097Q84460R21973O80610N60076
4548F4949989J065890Q23978J700427K354080K237762K802868L427081L197646
$$ y = [72198016, 76072528, 80690666, 87366155, 96919846, 108361725, 120303902, 130917189, 137559776, 139669841, 139010734, 136676550, 134233762, 132737884, 131802220, 131259137, 128551349, 123632244, 117278216, 110565213, 105543312, 102585256, 100405558, 99480437, 98142803, 94882898, 90139628, 84959567, 80677213, 77108720, 74667016, 73394185, 71735022, 69119741, 66339493, 63362595, 60376041, 58262093, 56624099, 55194637, 54642895, 54314858, 54132689, 54093734, 53587834, 53799463, 54321134, 54629037, 55550051, 56589416, 57780684, 58780703, 60009404, 60883773, 61902870, 62787330, 63709303, 64389913, 64949989, 66015879, 66839857, 68540284, 70894364, 73132126, 75934994, 79362075, 82559721]
4540H2559721K776600K545436K234028K004650J147243R13337R38322Q00972J351564
4531I7271873J828591K189256K290374K326518L177625L565690M918339O460384
4523A24028650P296941Q077488Q055996O301799M650816J744306p85968k184345
4515A57185683l048836k275580q95716Q02948L902445N918063P069129R091616
4507A77749752J0816750J1992732J3400914J5676683J9408008K4877979L1007168
4500C04929986L7587628M1522808M0567431L5845739K6739737J2159758l932869
4493D95420218j9334003l1106096l8647942m1204225l8684010l4794344l0031509
4486B61618089k4294554j8966864j4514122j0626885r223867p457760n829100
$$ y = [82559721, 85336321, 87881757, 90115785, 92120435, 93267678, 94181015, 95119337, 95920309, 97271873, 99100464, 101289720, 103580094, 105906612, 109084237, 112649927, 117568266, 124028650, 131325591, 139403079, 147459075, 153760874, 158411690, 160155996, 159370028, 157185683, 154136847, 151861267, 150965551, 151768499, 155670944, 161589007, 168658136, 177749752, 188566502, 200559234, 213960148, 229636831, 249044839, 273922818, 304929986, 342517614, 384040422, 424607853, 460453592, 487193329, 499353087, 495420218, 476086215, 444980119, 406332177, 365127952, 326443942, 291649598, 261618089, 237323535, 218356671, 203842549, 193215664, 183991797, 176534037, 170704937]
4479A70704937n787142n262119n122744o173369p053054o576511o022857n112385
4471A23594756n627701n624074m616549l330254j964856r83440j549435k086595
4463I7811852k022004j980902j778610k472405k955440k339606j662817j077021
4455H1523047l76123L72298M44242m04571j347462j094914j751921l071455l449030
4446G0844111l561243l440253k638403k190968j141814j129607j234695n83595
4438E4923533m32146l90308M1271k4932j26035n03587l53366K41668k62124p92803
4428E2321171k10183m38941l95115j60388j12988k10467l84619l43379j70848
4419D9894243K9649k47725P29020J02722N21031N09738P88776O30449J375546
$$ y = [170704937, 164917795, 159655676, 154532932, 148359563, 141306509, 134729998, 128707141, 123594756, 117967055, 112342981, 107726432, 104396178, 102431322, 101447882, 99898447, 97811852, 95789848, 93808946, 92030336, 89557931, 86602491, 84262885, 82600068, 81523047, 81146924, 81519222, 81963464, 81558893, 80211431, 79116517, 77364596, 74293141, 70844111, 67282868, 63842615, 61204212, 59013244, 57871430, 56741823, 55507128, 54923533, 54491387, 54101079, 54142350, 54117418, 53991383, 53487796, 53134430, 53376098, 53113974, 52321171, 52110988, 51672047, 51276932, 51116544, 51003556, 50793089, 50408470, 50065091, 49894243, 49923892, 49676167, 50405187, 50507909, 51028940, 51538678, 52327454, 52957903, 54333449]
4410E4333449R27041J153334K153216K115884K419511K887767L230980L357731
4402G2578913K266554J764980J705987O82473R2266q43814p77387r04901j673586
4393G4891485p90309j16250j20P50139R80493J153920J671685J960383K231913
4384H2733339K161299K287832K636607K400072L051627L352507L444629L409651
4376A05477563L453108M484209N120662O721945R688134J2302214J5587272J6892619
4368A79727726J6504838J3511615Q311960K569132l983187j0748307j5106889
4361A90786888j6810756j5892157j3548314j1493707r954712j0070155r764016
4354A03253071q505538o712793n178981m060666k829443k118123j493531q98994
$$ y = [54333449, 55260490, 56413824, 58567040, 60682924, 63102435, 65990202, 69221182, 72578913, 74845467, 76610447, 78316434, 78998907, 79091173, 78247359, 77469972, 76565071, 74891485, 74101176, 73984926, 73984806, 74734945, 75715438, 76869358, 78541043, 80501426, 82733339, 84894638, 87182470, 89819077, 92219149, 95270776, 98623283, 102067912, 105477563, 108930671, 113414880, 118535542, 125257487, 134945621, 147247835, 162835107, 179727726, 196232564, 209744179, 218056139, 220625271, 216642084, 205893777, 190786888, 173976132, 158083975, 144535661, 133041954, 123087242, 113017087, 103253071, 94747533, 88034740, 82855759, 78795093, 75965650, 73847527, 72353996, 71455002]
4346G1455002n56326p10675k74114J65319K8573M00004R7595N55173N96709Q91943
4336G2649203N65348k53307l6946L95473n50478q01273l85173q45077j073888
4327F9663882j191656n86840o95809j356178j145917q85381j323437j694782r94336
4318E9789546p63168j073706n40466j88486j26068l27685o00940M2936R981k47500
4308E5974444J81966l22743o81324n11517m84940m07686j32351o60771n42469
4299E2412609k9474l70622p01456m43651j80472k39860o29794j91727K62030O25389
4289E0512972N70157J295687J515512J172113J550980J862146J813223N40612
4281F0833402P48303O14537o87174m93924j27616j154955j053560m29287m74156
$$ y = [71455002, 70898676, 70188001, 69913887, 70079206, 70107779, 70507783, 70605378, 71160551, 71757260, 72649203, 73214551, 72961244, 72924298, 73319771, 72769293, 71968020, 71582847, 70737770, 69663882, 68472226, 67885386, 67189577, 65833399, 64687482, 63802101, 62478664, 60783882, 59789546, 59026378, 57952672, 57412206, 57223720, 57097652, 56769967, 56169027, 56211963, 56221944, 55974444, 56156410, 55833667, 55152343, 54640826, 54155886, 53748200, 53615849, 52955078, 52412609, 52383135, 52012513, 51311057, 50867406, 50686934, 50447074, 49817280, 49625553, 49887583, 50512972, 51083129, 52378816, 53894328, 55066441, 56617421, 58479567, 60292790, 60833402, 61581705, 62196242, 61509068, 61015144, 60887528, 59732573, 58679013, 58249726, 57775570]
4272E7775570n2339k24440R1792N46079K7345m1201K70157k47464k57019p71547
4262E7116933q54814j124011j343420j073726j022663j121272q43743j035386
4254D8697898r93679p44722j086146j333540r15473q84384o47984k04782j21619
4245D1765569K04658L63323N96484J074842J054822O11080N27467N89869k14488
4236D6573626m39236m25412j272353j845406j628927j161499j176046n98741p03614
4227C7322392l56740k40186l71964j58088k09387j72948j21100K83361L29998
4218C6305338J93804M36581K87813L59344N80548P72639N22581R85446M85916
4209D0930010O23825P56182O08180O85638O67752K89427N76717M10609O7693L3299
$$ y = [57775570, 57723231, 57498791, 57590583, 58136662, 58164007, 58122806, 58392963, 58145499, 57888480, 57116933, 56262119, 55138108, 53794688, 52720962, 51698299, 50577027, 49733284, 48697898, 47704219, 46959497, 45873351, 44539811, 43624338, 42739954, 42091970, 41887188, 41765569, 41970227, 42333550, 42930034, 44004876, 45059698, 45670778, 46198245, 46788114, 46573626, 46134390, 45708978, 44436625, 42591219, 40962292, 39800793, 38624747, 38026006, 37322392, 36965652, 36725466, 36353502, 36195414, 35986027, 35813079, 35691979, 35975340, 36305338, 36499142, 36935723, 37223536, 37582880, 38163428, 38936067, 39458648, 40444094, 40930010, 41553835, 42310017, 42918197, 43603835, 44271587, 44561014, 45137731, 45548340, 45616033, 45649332]
4199D5649332L497k69345J71442l93128j073736q15560p58471p26059K28178j30217
4189D1885933m6047Q12953J057240J166541J791188J839653K070693K375716J971598
4180E4925468K333465J281960L06451l73637r22764o45218m59020j077774l8816
4171E5330115n60901p2651l5568j32726l25356K49362K4270k16152M47128R4320
4161E4801841M9322n5185j0462J192213R38396N87552J173920O50223J161014
4152F0488834J435089J119924R98710J199106N71469M92415J050753P38585J190244
4143F9285129J128187O04813P77960m57887r62169j263911j742904j816046j505035
4134F4048137j147246r06135r43550o73413K92559r960K92404R33160Q76818Q86839
$$ y = [45649332, 45652829, 45383484, 45554926, 45161798, 44088062, 43272502, 42514031, 41787972, 42016150, 41885933, 41839886, 42652839, 43710079, 44876620, 46667808, 48507461, 50578154, 52953870, 54925468, 57258933, 58540893, 58847344, 58473707, 57550943, 56905725, 56446705, 55368931, 55330115, 54769214, 54696563, 54660995, 54528269, 54202913, 54452275, 54476545, 54260393, 54707521, 54801841, 54851163, 54795978, 54785516, 55977729, 56916125, 57503677, 58677597, 59327820, 60488834, 61923923, 63043847, 64042557, 65241663, 65813132, 66305547, 67356300, 68094885, 69285129, 70413316, 71018129, 71796089, 71338202, 70376033, 69112122, 67369218, 65553172, 64048137, 62900891, 61994756, 61051206, 60377793, 60670352, 60660392, 60952796, 61885956, 62762774, 63649613]
4124F3649613R74535N52871L2583L31953J03204O98317L20604J98219K85366J46431
4114F7293696k95413J68501N52705K17643R36982M41301K74441J131668J134766
4105G1856290K83402O78357R75210J127026O71251N86833J383015Q72850J74868
4096G8609102J010880P43869O8451M48656N8187K25808o2779o10840r48925j212970
4086G8329439j066631q20540r47017j073868n90400k74516L43209O81136N14851
4077G5095663M22440J88127Q30866J168895j06234L31953Q29904Q43171N68103
4068H0172888J073380J816994J407637N13278j788393m143074m813984l945792
4060G0292934l070971k691398k490404p27871o22067j196895p25205k77806n0660
$$ y = [63649613, 64624148, 65177019, 65209602, 65541555, 65644759, 66343076, 66663680, 66861899, 67147265, 67293696, 66998283, 67166784, 67719489, 67937132, 68874114, 69315415, 69589856, 70721524, 71856290, 72139692, 72818049, 73793259, 74920285, 75591536, 76178369, 77561384, 78434234, 78609102, 79619982, 80363851, 80432302, 80880958, 80939145, 81164953, 81102174, 80491334, 79542409, 78329439, 77262808, 76442268, 75495251, 74421383, 73830983, 73556467, 73899676, 74580812, 75095663, 75518103, 75706230, 76537096, 77705991, 77599757, 77931710, 78761614, 79604785, 80172888, 81246268, 83063262, 84470899, 84984177, 83195784, 79052710, 74238726, 70292934, 67221963, 64530565, 62040161, 61312290, 60690223, 59493328, 58768123, 58490317, 58439657]
4051E8439657r67534j77031l29288m18835m11477m22612m54230l65115l50724
4042E4542811m81741p83990m09129o39499q64242J17837K22676j37845P098P43732
4032E2317708O18595j8728r0056M700n64500q25429J58043M37399m6629N06462
4022E2497565P27641k49634p89227j122251r81618j312073j651816j266798j146893
4013D4704896q37752r77619k86634n70039j233851n55443k79155n53776l59788
4004C9050839k23611K53152M4763q2131M05146m9250r16921l25101l46422j64715
3994C7645749m6957l43307k03131P7176m43978n21697p55046q46206q62856o22134
3984C3077613j04624l84558m92379o8934R4709j32417O41844P27153R00990J217042
$$ y = [58439657, 57472123, 57295092, 56965804, 56546969, 56135492, 55712880, 55258650, 54893535, 54542811, 54061070, 53277080, 52867951, 52228452, 51364210, 51482047, 51704723, 51566878, 51573976, 52317708, 52936303, 52917575, 52827519, 52832219, 52267719, 51442290, 51600333, 52037732, 51991103, 52497565, 53225206, 52975572, 52186345, 51064094, 50082476, 48770403, 47118587, 45851789, 44704896, 43867144, 42889525, 42602891, 42032852, 40799001, 40243558, 39964403, 39410627, 39050839, 38827228, 39080380, 39125143, 39043012, 39448158, 39398908, 38481987, 38156886, 37810464, 37645749, 37598792, 37255485, 37052354, 37129530, 36685552, 36163855, 35408809, 34562603, 33699747, 33077613, 32972989, 32588431, 32096052, 32027118, 32121827, 31989410, 32631254, 33358407, 34259397, 35476439]
3974C5476439P18206K17364r39865j348985j437848j151513j014685j708173j162314
3965B7648626r95028p99067n60422n41214m27586l89457m54759l6499N1354K95493
3955B3791441M17139q817K44795P24165J566000K108417K818014K668132J637179
3946C5966465N9242j659174j598221r06091j097962j013200j108911j156197r86522
3937B6499429j268935p48032p80563q29757m48071l66157l44980j43434m35390
3928B1134110k39674J63634l62310k55910L34360p7918J87371J072201J119495
3919B3075359J318436K023530K829819K049163l18987k299068j808527j621260
3911B5248465j526644p93666l05797k63674j39584J31891N45482J13923Q0441
$$ y = [35476439, 36194645, 36412009, 35472144, 34123159, 32685311, 31533798, 30519113, 28810940, 27648626, 26653598, 25854531, 25294109, 24752895, 24325309, 23935852, 23481093, 23444594, 23495948, 23791441, 24208580, 24199763, 24444558, 25168723, 26734723, 28843140, 31661154, 34329286, 35966465, 36025707, 34366533, 32768312, 31862221, 30764259, 29751059, 28642148, 27485951, 26499429, 25230494, 24482462, 23701899, 22872142, 22424071, 22057914, 21712934, 21569500, 21134110, 20894436, 21058070, 20695760, 20439850, 20774210, 20696292, 20883663, 21955864, 23075359, 24393795, 26417325, 29247144, 31296307, 30977320, 28678252, 26869725, 25248465, 23721821, 22928155, 22622358, 22358684, 22219100, 22350991, 22896473, 23010396, 23090837]
3902B3090837Q78181O22754L25386N86905N29303L57483O3648k82565l29574k21422
3892B5620936o74581l17317n92556r47513m81500l49275j40314n2160J51047L62661
3882B2579428L92337K88232O82958O41703P73247J002032N62739K09179L39197
3873B7471052k83718r4306j48003l94026o59129q2140j88826L78426N84414N65696
3863B7149440N57592O984K68173J75726k67734r05002m77872k28130L19602p29120
3853B5869659k28633J15422k95473l31487k00450K09932p89631p18633l31779
3844B3298927p1464m12063j84135j94519J14790k54642P656n7267L41597k28110
3834B2360770r2978P0947j51801L7978M0410L43211L11415J05519N0879K50301
$$ y = [23090837, 23969018, 24591772, 24917158, 25504063, 26033366, 26390849, 26454497, 26171932, 25842358, 25620936, 24946355, 24629038, 24036482, 23088969, 22607469, 22258194, 22117880, 22065720, 22216767, 22579428, 22971765, 23259997, 23942955, 24584658, 25357905, 26359937, 26922676, 27131855, 27471052, 27187334, 27093028, 26945025, 26550999, 25891870, 25809730, 25620904, 25999330, 26583744, 27149440, 27707032, 27714016, 27982189, 28157915, 27890181, 26985179, 26507307, 26279177, 26598779, 25869659, 25641026, 25756448, 25460975, 25129488, 24929038, 25138970, 24349339, 23630706, 23298927, 23227463, 22815400, 22631265, 22436746, 22551536, 22296894, 22304550, 22247283, 22588880, 22360770, 22267792, 22338739, 22186938, 22224916, 22265326, 22608537, 22919952, 23025471, 23076350, 23326651]
3824B3326651K87697l58082N26097R02806K75948M08010L69374N65025M57614
3815B6761140k5612K93924J73014m74596J74602P24430M92429M4013L03604O92335
3805B9159283J50005K35021K38853j43994m64580n36209L057m76883j08613M9243
3795B8105183J09666j16550l35637m52339m54273m49666j47129Q9895J67355j56156
3785B6360349J98169k77945J11908M0286J24085L14478K54710N27298O91244J77453
3775B8522035N00864K53314L59661J006009M29089J78348L79681J026473O08899
3766C3264373L37087M96487N67960K03988L33362R69089L50989j73153L48937
3757C6699119O05326J81726m8043M14897L26409L13054N59638L72483K91005o9287
$$ y = [23326651, 23614348, 23256266, 23782363, 24685169, 24961117, 25369127, 25738501, 26303526, 26761140, 26735528, 27029452, 27202466, 26727870, 26902472, 27626902, 28119331, 28163344, 28466948, 29159283, 29309288, 29544309, 29783162, 29639168, 29174588, 28638379, 28641436, 28164553, 28055940, 28105183, 28214849, 28098299, 27762662, 27310323, 26856050, 26406384, 26259255, 26349150, 26516505, 26360349, 26558518, 26280573, 26392481, 26432767, 26556852, 26871330, 27126040, 27653338, 28344582, 28522035, 29022899, 29276213, 29635874, 30641883, 31070972, 31249320, 31629001, 32655474, 33264373, 33601460, 34097947, 34665907, 34869895, 35203257, 36172346, 36523335, 36350182, 36699119, 37304445, 37486171, 37438128, 37853025, 38179434, 38492488, 39052126, 39424609, 39715614, 39646327]
3747C9646327K13048L17832l10252m94914j94965l84340N6751K01268m2089J8797
3737C9027463j99123J05391n41948j53144L00169N14096L86746Q8975N58070K76989
3727D0363684O71054J112806O02763Q95979Q00419O73074Q83333P35914O48410
3718D7387436O99192M0745J41083J18678o08160k67351o48777r35864j37985L23799
3708D6112796m78032l45505m67940q3687r6350l15423k37521l81626j014926n13525
3698D2178261k47267k82195m94400L6651j64598j82385j21498k30578L19203j61132
3688D0650062J56049K42659J3748P6690K71047q2207J55117N08667L94766L57581
3678D2744179O21198O68793N18066K51913P98689N91110M35469j76760l71497
$$ y = [39646327, 39859375, 40177207, 39866955, 39372041, 39177076, 38792736, 38849487, 39050755, 39008666, 39027463, 38828340, 38933731, 38391783, 38238639, 38538808, 39052904, 39439650, 39528625, 40086695, 40363684, 41034738, 42147544, 42750307, 43646286, 44446705, 45119779, 46003112, 46739026, 47387436, 48086628, 48127373, 48268456, 48387134, 47778974, 47511623, 46862846, 45926982, 45788997, 46112796, 45634764, 45289259, 44821319, 44737632, 44641282, 44325859, 44088338, 43706712, 42691786, 42178261, 41930994, 41648799, 41154399, 41191050, 41026452, 40844067, 40722569, 40491991, 40811194, 40650062, 40806111, 41048770, 41062518, 41139208, 41410255, 41328048, 41483165, 41991832, 42386598, 42744179, 43365377, 44034170, 44552236, 44804149, 45602838, 46193948, 46629417, 46452657, 46081160]
3669D6081160l43974o77313o66212p38386j392419j099280o38693m90096o00092
3660C9434695p11485l83995m30150r78881j73129j069267o14161m14839p60864
3651C3897924k12160l21356m05526m62253k84796P5238K59793L09479P76042N21928
3641C4154313O3715L50654P02283R791K09692J14287j05116l33126k09029j62560
3631C4794904q220O14365J03076R2582j61486N4030J33856o71814n93189q08402
3621C3549702j025363r85991m77109p91034m57300l74491n57546m00780k26877
3612B8253211K18489l66176j54524N7551l57332n61787L52867K12190j86700j62579
3602B7305210K92975M17141O35744M10694P96566J118254K77914K39593P49691
$$ y = [46081160, 45737186, 45059873, 44393661, 43655275, 42262856, 41163576, 40524883, 40034787, 39434695, 38723210, 38339215, 37909065, 36930184, 36757055, 35687788, 35073627, 34658788, 33897924, 33685764, 33364408, 32958882, 32496629, 32211833, 32287071, 32546864, 32856343, 33632385, 34154313, 34218028, 34568682, 35270965, 35280756, 35490448, 35604735, 35499619, 35166493, 34957464, 34794904, 34786684, 35401049, 35504125, 35596707, 35435221, 35489251, 35623107, 34951293, 34358104, 33549702, 32524339, 31538348, 31061239, 30270205, 29812905, 29438414, 28880868, 28480088, 28253211, 28471700, 28105524, 27951000, 28008551, 27651219, 27089432, 27442299, 27654489, 27467789, 27305210, 27598185, 28015326, 28651070, 29061764, 29858330, 30976584, 31254498, 31494091, 32243782]
3593C2243782k0979n97432l23498n77779m8114K19511O52172M39914Q92802J383108
3583C4263487J495372R74638L32750L41119k07142m93577j223295j568869j297462
3574C2617021j296773j496051o92456n24798q88976j40942k67479k98098q9569
3565B6921879J81039M92307Q1486K31687M10830K25362L55432L45176M47057K84266
3555B9976521K19022j64973M58978P09908O47489R44872Q12297J062658J528662
3546C6195434J205683J231989N42614M26468O15475K25545o73362r37201j116788
3537C7715857o42765o81601l22928K82856K67873P1647J74775R55216N07263J020179
3527C9348372Q50654J001727J238238J407419J455583R75295L49681Q8399M1461
$$ y = [32243782, 32222803, 31625371, 31301873, 30724094, 30675980, 30895491, 31547663, 31987577, 32880379, 34263487, 35758859, 36733497, 37066247, 37407366, 37200224, 36706647, 35483352, 33914483, 32617021, 31320248, 29824197, 29131741, 28606943, 27717967, 27577025, 27309546, 27011448, 26921879, 27102918, 27595225, 27676711, 27908398, 28319228, 28544590, 28900022, 29245198, 29692255, 29976521, 30195543, 30030570, 30489548, 31199456, 31846945, 32791817, 33604114, 34666772, 36195434, 37401117, 38633106, 39175720, 39602188, 40217663, 40443208, 39769846, 38832645, 37715857, 37073092, 36391491, 36068563, 36351419, 36619292, 36690939, 36865714, 37820930, 38328193, 39348372, 40199026, 41200753, 42438991, 43846410, 45301993, 46277288, 46626969, 46715368, 46756829]
3518D6756829n72437o15717p61236p94229r38381j55835j8527j02251J40735K76377
3508D3215328O01999J017147K75782N02075J213851P67476O65000R70005R92007
3499E0220670Q03669P05006O31417J85238L19656O32056R82973R77882J227070
3490E6685637J464541K085279K788310K558340K346061K593292J745878J783318
3482G4050656K263579J152428P75269O91209R74451O33742J075012J429845J361109
3473H4407300J381006J728188K441821K509125K450287K690591K651554K864004
3465A03123876K178144K877886L475390K554129K873971K503432J981389J386726
3457A22954943J82615j494632l413226m524604n268542m659931n337434m736686
$$ y = [46756829, 46184392, 45568675, 44807439, 44013210, 43074829, 42918994, 42900467, 42798216, 42938951, 43215328, 43817327, 44834474, 45110256, 45612331, 46826182, 47593658, 48258658, 49228663, 50220670, 51024339, 51729345, 52360762, 52546000, 52865656, 53497712, 54480685, 55458567, 56685637, 58150178, 60235457, 63023767, 65582107, 67928168, 70521460, 72267338, 74050656, 76314235, 77466663, 78241932, 78933141, 79907592, 80541334, 81616346, 83046191, 84407300, 85788306, 87516494, 89958315, 92467440, 94917727, 97608318, 100259872, 103123876, 105302020, 108179906, 111655296, 114209425, 117083396, 119586828, 121568217, 122954943, 123137558, 121642926, 118229700, 113705096, 108436554, 103776623, 98439189, 93702503]
3449I3702503l774146l479337k762805k506611j921588j283987j589325q94064
3441G5490640m55738m99011j66367k622j47865O8860O2242j44083l00228k91578
3431G3614250m38101q6419J33965k52103K73009L571O924J108028J019669J320138
3421G6702931P04161k82684k95414K24872L20064K97067J54135K14774P43741
3412G8783647J04591M62853J019905K87406M38301P5511J99516j4135n26495K6387
3402H0857487M80212K91691L82536O38632N32798O81361J045904J353045J543861
3393H7807527J980361K634705L039412L632637K208711O51912J263401J812826
3385A05031492L119558L023881M379837N232050N383388O757705P669104Q551602
$$ y = [93702503, 89928357, 86449020, 83686215, 81179604, 79258016, 77974029, 76384704, 75490640, 75034902, 74535891, 74369524, 74366902, 74219037, 74287897, 74350139, 74206056, 73905828, 73614250, 73176149, 73089730, 73223695, 72971592, 73244601, 73248172, 73255096, 74363124, 75382793, 76702931, 77407092, 77124408, 76828994, 77053866, 77373930, 77670997, 77825132, 78039906, 78783647, 78888238, 79351091, 80370996, 80658402, 81096703, 81172214, 81371730, 81357595, 80831100, 80857487, 81337699, 81629390, 82011926, 82650558, 83183356, 83864717, 84910621, 86263666, 87807527, 89787888, 92422593, 95462005, 99094642, 101303353, 101955265, 103218666, 105031492, 108151050, 111174931, 115554768, 120786818, 126170206, 132927911, 140597015, 149148617]
3377A49148617J0840343J2753256J4577564J7179723J8990040K0563635K1449154
3370B65502332J9759246J6150220Q591907j973233j0785091j6208576j9259704
3363B61777101j9683240j7960508j4881101j2078361r594935p291319n350887
3356A74936750l943688j718341K76332J816074K897575M513398P039210R334565
3348A95151875J2440627J6597352K0768268K3748650K5209234K3673825J7575086
3341C35164917J0299805K535349m607055j1562543j9759746k5126628k6775685
3334B60168414k6245196k3678820k0392579j7395003j4412114j1684955j0033265
3327A36326482q033632n751775m062575k631081j389221r73789j404319p64450
$$ y = [149148617, 159988960, 172742216, 187319780, 204499503, 223489543, 244053178, 265502332, 285261578, 301411798, 310003705, 308030472, 297245381, 281036805, 261777101, 242093861, 224133353, 209252252, 197173891, 187578956, 180287637, 174936750, 170993062, 169274721, 169551053, 171367127, 174264702, 178778100, 185817310, 195151875, 207592502, 224189854, 244958122, 268706772, 293916006, 317589831, 335164917, 345464722, 348000071, 343393016, 331830473, 312070727, 286944099, 260168414, 233923218, 210244398, 189851819, 172456816, 158044702, 146359747, 136326482, 128292850, 122541075, 118478500, 115847419, 114458198, 113484409, 112080090, 111315640]
3319A11315640J014791L351356N024753O776553Q498807P419290M446492p76326
3311A47071356p331308j1427087j2853941j1424773q982183p834203o480756m764556
3303G5972549m365152l466474k761359k514683k284525j823447j952250j185994
3295E5618665q97426j194173o56974p86270n97472l28814m43050j145291j016213
3286D8552982r29118r16977l61303n94530l83292m98789j161900q20631m27133
3277D2459309r36991n79131n34714p33751l44927n65011o80632m90356n52916
3268C7040880K55371P8887k59652L25902J07131K95513N16260L81516j75230M0727
3258C8607305j75583J78660M97540k94707J55461K9891l52040m62873k86100k96499
$$ y = [111315640, 112330431, 115681787, 120706540, 127483093, 135981900, 143401190, 147847682, 147071356, 139740048, 128312961, 115459020, 104034247, 95052064, 87217861, 80737105, 75972549, 71607397, 68140923, 65379564, 62864881, 60580356, 58756909, 56804659, 55618665, 54721239, 53527066, 52870092, 52083822, 51486350, 51157536, 50714486, 49569195, 48552982, 47623864, 46706887, 46345584, 45751054, 45367762, 44868973, 43707073, 42886442, 42459309, 41522318, 40943187, 40408473, 39674722, 39329795, 38764784, 38084152, 37593796, 37040880, 37296251, 37375138, 37115486, 37441388, 37548519, 37844032, 38360292, 38741808, 38566578, 38607305, 38431722, 38610382, 39107922, 38813215, 38968676, 38998567, 38646527, 38183654, 37897554, 37601055]
3248C7601055l41590k70962P8635k55250n78134j51184J00697j35028l7373k13747
3238C5797119K99724K63649J22395k7988K96428M66192o67646m35863o14563o83103
3228C4816344k34421k91006P2795l90065o63443l5960j61026K06471o55913l75392
3218C2288384R8656k3222J2047N69013R3765l45915M38824N92828j8151j24034
3208C3582195M00920L4120o38606j70116r0719k91640m10744m85190O72K40751
3198C2171643k78117l78466l8877j52663j30240M9494N47799L25493k25292P4381
3188C1965155M58564J30724N57486K62387J27537L36605L30611J31911L98429
3179C4699409M53925M74848O42035K96248M01968O3400j11383M82660O14570N02255
$$ y = [37601055, 37259465, 36988503, 37067138, 36811888, 36233754, 36082570, 36183267, 36048239, 36010866, 35797119, 36096843, 36360492, 36482887, 36454899, 36751327, 37217519, 36549873, 36114010, 35499447, 34816344, 34581923, 34290917, 34363712, 33973647, 33310204, 33274244, 33113218, 33319689, 32663776, 32288384, 32387040, 32363818, 32375865, 32944878, 33038643, 32692728, 33131552, 33724380, 33706229, 33582195, 33983115, 34017235, 33378629, 33208513, 33117794, 32826154, 32415410, 31930220, 31930892, 32171643, 31893526, 31515060, 31476183, 31323520, 31193280, 31242774, 31790573, 32116066, 31890774, 31965155, 32423719, 32554443, 33111929, 33374316, 33501853, 33838458, 34169069, 34300980, 34699409, 35153334, 35628182, 36270217, 36566465, 36968433, 37031833, 36920450, 37403110, 38017680, 38519935]
3169C8519935L43169O10697O10697R76245O51811N19810J022537O72605P05965
3160D4633471L06220K78758O17960O60446O74421Q59792L3329k97080k08007n3246
3150D7506064K85092l91780L48969K9290l04166J58019M10346K69893N19699J033154
3140D9864580J457711J801941K172717L142563K695513K561641K434684J402829
3132F7534179M56278J98452m89166j377400k079509j798803k085000k357360k328919
3123E5672752k354590j456349j740082p29350p68015r78330k98520m02409l50685
3114D6594422L41270O20469J54697O35457R05158J596545J423067J405277J657055
3105E5333417J153086J367499J500052P53212m3645p58268j409896j389226j882672
$$ y = [38519935, 38863104, 39473801, 40084498, 41060743, 41712554, 42232364, 43254901, 43927506, 44633471, 44939691, 45218449, 45836409, 46496855, 47171276, 48031068, 48064397, 47767317, 47559310, 47506064, 47791156, 47399376, 47748345, 47777635, 47473469, 47631488, 48041834, 48311727, 48831426, 49864580, 51322291, 53124232, 55296949, 58439512, 61135025, 63696666, 66131350, 67534179, 67990457, 68188909, 67699743, 66322343, 64242834, 62444031, 60359031, 58001671, 55672752, 53318162, 51861813, 50121731, 49392381, 48624366, 47646036, 47347516, 46945107, 46594422, 46935692, 47556161, 47710858, 48346315, 49251473, 50848018, 52271085, 53676362, 55333417, 56486503, 57854002, 59354054, 60107266, 60063621, 59305353, 57895457, 56506231, 54623559]
3096E4623559k209152k280804j812598j864625j521305j764617j946266r72921
3088D0251271n05207q47652p06337r159n94306o07407m6847N65664k890n69454
3078C6927676K71885Q2107o98006J3166p2768p45107q89477n68484p09319j039429
3068C2572244j203245p91869o03255r62045j022947l89459n68741o75673k16889
3059B6138121m41685m79505m65966m63269o62851m22791l9274k27623k98417o56458
3049B1980282n60622k65252m978j29025j88798k30727j61242o82412m84719O0825
3039A9333332n10264p32624o08946j53805Q6984n86809L8749l39246o1617l90599
3029A6075155l17271k54863m64836L28060J45483j33220o08762m37008m56970
$$ y = [54623559, 52414407, 50133603, 48321005, 46456380, 44935075, 43170458, 41224192, 40251271, 39746064, 38898412, 38192075, 38182916, 37588610, 36981203, 36934356, 37500020, 37497130, 36927676, 37199561, 37281668, 36583662, 36596828, 36524060, 35778953, 34889476, 34320992, 33611673, 32572244, 31368999, 30577130, 29973875, 29011830, 27988883, 27599424, 27030683, 26355010, 26138121, 25696436, 25216931, 24750965, 24287696, 23624845, 23202054, 23162780, 22935157, 22636740, 21980282, 21419660, 21154408, 21149430, 21020405, 20831607, 20600880, 20439638, 19757226, 19272507, 19333332, 18823068, 18090444, 17481498, 17327693, 17414677, 16827868, 16866617, 16527371, 16465754, 16075155, 15757884, 15503021, 15038185, 15366245, 15511728, 15378508, 14769746, 14332738, 13875768]
3020A3875768k15304l60225j18290K06821k52354j29084r9995Q3557k65831k78113
3010A2446950j42909K21720k52046l29457K6916J30560j84619j33617N04558m82289
3000A1805767m64111l04105j87575K06070l19668j32662J50181o44589j59563
2991I949745O9605N7887j12021k29257o58635K60957j81464k42906L84487m35268
2981H863130k85392O5894l30674L47355n03288J6784K97221j25927n32426l60422
2971G452255Q361j37884q0851o1157L16356j12082m49224L51449k65459m73574
2961F548190J01678K22408K4144m66423j18037Q5248n33546l54890L78676J44359
2951F031807j26827J06l7974K31842q7059l2656m6794o63537k37201K69578j61714
$$ y = [13875768, 13660464, 13300239, 13181949, 13388770, 13136416, 13007332, 12907337, 12990894, 12725063, 12446950, 12304041, 12525761, 12273715, 11944258, 11971174, 12101734, 11917115, 11783498, 12288056, 11805767, 11341656, 11037551, 10849976, 11056046, 10736378, 10603716, 10753897, 10109308, 9949745, 10019350, 10077237, 9965216, 9735959, 9077324, 9338281, 9156817, 8913911, 9298398, 8863130, 8577738, 8643632, 8312958, 8660313, 8157025, 8173809, 8471030, 8345103, 7812677, 7452255, 7460616, 7322732, 7241881, 7180724, 7497080, 7384998, 6935774, 7287223, 7021764, 6548190, 6649868, 6872276, 6896420, 6429997, 6311960, 6397208, 5863662, 5508772, 5887448, 6031807, 5904980, 5905086, 5867112, 6098954, 6011895, 5979239, 5932445, 5268908, 5031707, 5301285, 5139571]
2940E139571J58845K17506j66750k0574P0120l1615l14032K07761J79439j87512
2930E252759M5381R3391l39791j55316K06387M85810l76184k67154K73614J71545
2920E390442k33925L28665K99539k18364m45928J22742J44150L54228m29729j25799
2910E186021Q8266m89101J56667K32995l11441r0402J1338q9409J84090k71978
2900D607046o5881L5820N218J36084N46745k93887M4688j77109m5917K88332k63576
2889D817563j31110K76520m0759m95106j76071J29875L69220j10906p4705J94497
2879D759018l81408n91815K43023J04211q0987L8140k4749m50924J4781P321K4192
2868C660803L4748j16416j55692j08850n7271N6461j16812m56945J94898J04210
$$ y = [5139571, 5298416, 5515922, 5349172, 5328598, 5398718, 5367103, 5053071, 5260832, 5440271, 5252759, 5298140, 5391531, 5051740, 4896424, 5102811, 5588621, 5212437, 4945283, 5218897, 5390442, 5156517, 5485182, 5784721, 5566357, 5120429, 5243171, 5387321, 5741549, 5311820, 5186021, 5274287, 4785186, 4941853, 5174848, 4863407, 4773005, 4784343, 4694934, 4879024, 4607046, 4541165, 4576985, 4582203, 4718287, 5265032, 4971145, 5015833, 4838724, 4792807, 5081139, 4817563, 4686453, 4962973, 4922214, 4427108, 4251037, 4380912, 4750132, 4639226, 4564521, 4759018, 4377610, 3785795, 4028818, 4133029, 4052042, 4090182, 4065433, 3614509, 3629290, 3636611, 3660803, 3695551, 3579135, 3423443, 3314593, 3257322, 3313783, 3196971, 2740026, 2934924, 3039134]
2858C039134J75400J30674k24456o3655k2577J95774K43604J26790o9879k05403
2848C325406k49927K13376j88468l66889L5411J82853N7610j28389k81857k0582
2838B578544L1741k31588n4984L91717l48091l6744K31904j15802j29991q7499
2828B229207K59224M4621j42877p4122r9234M7138N32243j7147m79733m75882
2818A823438L43025L26045l04638Q4924K30120j98694l7751J87352j57476J7489
2808B313834k09110J23149j27922k48638l2093k85335K77459N59805j78002k4771
2798B168376m12526P4757K15940l96486J97809K5098m0275L00348N90914N0312
2788B774267n29123m52458q269p3169K06086j04967j10296l06765L22017k53986
$$ y = [3039134, 3214534, 3345208, 3120752, 3057097, 3034520, 3230294, 3473898, 3600688, 3530809, 3325406, 3075479, 3288855, 3100387, 2733498, 2768909, 2951762, 3009372, 2880983, 2599126, 2578544, 2610285, 2378697, 2323713, 2715430, 2367339, 2330595, 2562499, 2446697, 2316706, 2229207, 2488431, 2533052, 2390175, 2316053, 2216819, 2263957, 2796200, 2779053, 2299320, 1823438, 2166463, 2492508, 2187870, 2272794, 2502914, 2304220, 2266469, 2453821, 2296345, 2313834, 2104724, 2227873, 2099951, 1851313, 1819220, 1533885, 1811344, 2371149, 2193147, 2168376, 1755850, 1830607, 2046547, 1650061, 1847870, 1872968, 1832693, 2133041, 2723955, 2774267, 2245144, 1792686, 1784417, 1711248, 1917334, 1812367, 1702071, 1395306, 1717323, 1463337]
2778A463337j52166j459J94019l099j41940L61662l45832k98359j2152N30643
2768A594654j96315k58913J86763k21011l20440J69502L32846k05099j92976J32186
2758A021197K67081m36417m4690L72466j82554l27395K95558M12335m6249k93157
2748A038175p2354J71376j55116l22675L03981K56985j8433o6406J02736n9002
2738A179267j93893J2991Q1801j0838q5458j96745j12943J23761k85900q770J36204
2727F39477N3149J32571J00006J10827p3444P6233o6323n094k42964J24090j0262
2716H38266j21388k48384o673k4660k53104L01370K17857l81656m1208L78352
2706F58772L67399l40382l12063l8291N9466K53699j4393k30637L4636O431m22022
$$ y = [1463337, 1311171, 1309712, 1503731, 1500632, 1358692, 1720354, 1374522, 1076163, 1064011, 1594654, 1398339, 1139426, 1326189, 1105178, 784738, 954240, 1287086, 1081987, 889011, 1021197, 1288278, 851861, 807171, 1179637, 997083, 669688, 965246, 1377581, 1331332, 1038175, 965821, 1137197, 982081, 659406, 963387, 1220372, 1201939, 1135533, 1238269, 1179267, 985374, 998365, 1080166, 1069328, 983870, 787125, 674182, 797943, 512043, 503273, 639477, 692626, 825197, 925203, 1036030, 962586, 1038819, 972496, 967402, 724438, 848528, 838266, 716878, 468494, 461821, 437161, 184057, 485427, 703284, 321628, 280420, 658772, 1026171, 685789, 373726, 335435, 394901, 648600, 634207, 403570, 438206, 444637, 22615]
2695B2615q402L89396J51182k12541K00023J44206l56146L2317L35678l69309
2685C29019k47640j6583K33938j26011L9104M73300k042l35488K17597K8252j88401
2674D05045J55452K89739l58092l06908K23071L14250m7145k62987J14873M07538
2664I34836n26886k55898K47935L48161O5999K6795m61143R4034J92501k84655
2654C81679k15039L50860k6913o1017j15661l0326K18700j04566K25014j14056
2644E08675l49934J66339K13358n51128O481O42386j74119L6046M0005L10139
2634H48248J56552p01164Q8576J06063k52029J4740M29472J10311k08348j34161
2624D58260O6400J3608P5506j62579J52032j0850L20749k18286k66027L01487
$$ y = [22615, 14213, 403609, 554791, 342250, 542273, 686479, 330333, 362650, 698328, 329019, 81379, 64796, 298734, 172723, 211827, 685127, 683085, 347597, 565194, 593446, 405045, 560497, 850236, 492144, 185236, 408307, 722557, 675412, 412425, 527298, 934836, 407950, 152052, 399987, 748148, 814147, 840942, 379799, 473833, 666334, 381679, 166640, 517500, 490587, 429570, 313909, 283583, 502283, 397717, 622731, 508675, 158741, 325080, 538438, -12690, -6209, 636177, 462058, 498104, 538109, 848248, 1004800, 303636, 392212, 498275, 246246, 260986, 690458, 800769, 592421, 458260, 524660, 538268, 613774, 451195, 603227, 592377, 913126, 694840, 428813, 730300]
2614G30300j0025p2489J17776O144k9128O6673r0167M00431j43757l25991J66658
2603H16425K51299J87316O02812Q49145j11748j41685j19496o20291k09229n25623
2593I78925j21186K38869n2738j34696k51875j17030n4700j12883K04708J27816
2583G05210k32981k25896M34026J38343m17847O876N81634l95953k40006j9419
2573C33987K22907M977p14605M32323K59569j55771k15881M57547k46831j09873
2563B68349K75842p5827r1769j08569l6586n086k3007J77194n3590J06796M44401
2552H78148j57712k49295L41336l34443j43934L64112j30508L0083k92975M5106
2542C49918K62243k35564k2789K86841P4886o28359p9229M2940K1936K11380K2143
$$ y = [730300, 720275, 647786, 765562, 771706, 742578, 809251, 719084, 1119515, 975758, 649767, 816425, 1067724, 1255040, 1857852, 2706997, 2595249, 2453564, 2334068, 1713777, 1504548, 978925, 857739, 1096608, 1043870, 909174, 657299, 540269, 485569, 372686, 577394, 705210, 472229, 246333, 680359, 818702, 400855, 407731, 989365, 593412, 353406, 333987, 556894, 561871, -152734, 279589, 539158, 383387, 167506, 625053, 378222, 268349, 544191, 468364, 376595, 268026, 231440, 226354, 203347, 380541, 326951, 433747, 878148, 720436, 471141, 812477, 478034, 334100, 698212, 567704, 597787, 304812, 349918, 612161, 376597, 353808, 640649, 715535, 87176, 7947, 50887, 72823, 284203, 306346]
2531C06346p7380L64078J01607J7898j7586l15738k39788K52051P8614l70266
2521I9836O0408K6224m1938k56802J92971J49763O6715J37110J28189k60207j59940
2510A42329j3618K06306K87557k10074K3230K58097k78183m13719K27436k52834
2500b3473K19790J59874j55231J92941N5404k59039M59371q0451r1381k42119
2490B35686J11762k3376J17485j39389K04533N7834m60896L71006M5131O1302
2480E81078q6408J99484o18579l2795o5113J55663L69647l03746L9999j96317
2470D2913l07101K18610N7590j62933n0381K87110M76377L21313j49591r7249
2460F36658J01620k2507L8176m9698j13337j81958k8118K483L34852K99941k26883
$$ y = [306346, 228966, 593044, 694651, 712549, 694963, 379225, 139437, 391488, 470102, 99836, 160244, 186468, 144530, -112272, 80699, 230462, 297177, 434287, 562476, 302269, 142329, 128711, 335017, 622574, 412500, 435730, 693827, 415644, 1925, 229361, -23473, 196317, 356191, 200960, 393901, 449305, 190266, 649637, 569186, 477805, 235686, 347448, 324072, 441557, 302168, 506701, 564535, 103639, 474645, 519776, 581078, 494670, 694154, 75575, 42780, -22333, 133330, 502977, 199231, 239230, 42913, -264188, -45578, 12012, -150921, -201302, 85808, 562185, 883498, 733907, 636658, 738278, 715771, 753947, 704249, 590912, 408954, 380836, 383319, 718171, 1018112, 791229]
2449G91229J73026n4223k85398j51941Q5150j22233o2986J82998M6515L39191
2439I41328L16814O0808p1526j88357Q3627M61761j49778n45598n7740J42284
2429I93623j68433M8748k24654N03748j03528k81416M62115L4329l58030l0548
2419H75954L32868J2982Q4440j16604R6487o5550j38641L07628n886j98745N29248
2408A714181J1665j31133Q3319L34187J90662M20968o2444r8817m5711m86923
2398A929954M63943K96538j35629L43981k22427m8997L90929J17409l83153J80018
2388B932566J29051P65065L32076L58561J67128k97533j00198N34919m1045K8507
2378D809097J48810J99211L01504o0763J25227N11233m12039Q8546K86491O44669
$$ y = [791229, 964255, 910032, 624634, 472693, 557843, 435610, 372624, 555622, 602137, 941328, 1258142, 1318950, 1247424, 1059067, 1142694, 1604455, 1454677, 909079, 851339, 993623, 825190, 873938, 649284, 1153032, 1049504, 768088, 1230203, 1264532, 906502, 875954, 1208822, 1221804, 1306244, 1189640, 1286127, 1220577, 1081936, 1389564, 1383678, 1184933, 1714181, 1725846, 1594713, 1678032, 2012219, 2202881, 2623849, 2561405, 2462588, 2416877, 1929954, 2393897, 2690435, 2554806, 2898787, 2676360, 2627363, 3018292, 3135701, 2752548, 2932566, 3061617, 3826682, 4158758, 4517319, 4684447, 4386914, 4286716, 4821635, 4780590, 4809097, 4957907, 5157118, 5458622, 5397859, 5523086, 6034319, 5622280, 5710826, 5997317, 6641986]
2368F641986j27565J73098Q5612J80930J12997N75345M24709N18659L2644N27362
2358I145777Q48544M73772O88890Q62084R42153J491872J611473K256623L015883
2349B1337071L688442M234562M120556J383547J479053J904738K924202M174058
2341D5246229N548803Q023712J1900551J6589437K6470486M2962642O9420012
2334B26161872R7081639R1553561M1491333n2335981q2986966p4751004o1111083
2327A85103371m2147581l0043685k0788511j5792058j2439792j0693668p701261
2320D5496815m105352q15293p73590p09783l076227l648868l346648k747042k550556
2311B3723456j493695j239934p39481j255849j508382q15343n28987r38982o89095
$$ y = [6641986, 6514421, 6687519, 6773131, 6954061, 7067058, 7642403, 8067112, 8585771, 8618415, 9145777, 9994321, 10468093, 11156983, 12019067, 12961220, 14453092, 16064565, 18321188, 21337071, 25025513, 29260075, 33380631, 34764178, 36243231, 38147969, 41072171, 45246229, 50795032, 58818744, 70719295, 87308732, 113779218, 156741860, 226161872, 323243511, 414797072, 456288405, 403952424, 320965458, 246214454, 185103371, 142955790, 112912105, 92123594, 76331536, 63891744, 53198076, 45496815, 41391463, 40576170, 39802580, 39092797, 36016570, 32367702, 29021054, 26274012, 23723456, 22229761, 20989827, 20250346, 18994497, 17486115, 16670772, 16141785, 15202803, 14513708]
2302A4513708j010170j45853o73073r90245n23035j40124r06941l15518j79820
2293I628929l86266j06763m03620n88216j75309k14487j16130o41418j55293j4849
2283F826578k13478k07014l48645o14647q0706m3683L5492j00370k88168k40732
2273D724627J75744L9005j85810n27265Q5581k49084j07681J92502k30756j65729
2263C751134K89723n49750j63854j91324j29875J84350K75692J37120k1416k04319
2253C377481J09339k5997l20006K07144J7062o88759L22209R4628n82720j64838
2243B345543L96990j14279j4404n35326K90256P6786j63870R7027K34566q8645
2233B524644j78649l31985P493J74092j91401k02657m47991j40325J65375J28674
$$ y = [14513708, 13503538, 13357685, 12684612, 11694367, 11171332, 11031208, 10124267, 9808749, 9628929, 9242663, 9135900, 8732280, 8144064, 7968755, 7754268, 7638138, 6996720, 6841427, 6826578, 6613100, 6406086, 6057441, 5442794, 5362088, 5318405, 5353897, 5253527, 4965359, 4724627, 4900371, 4939376, 4753566, 4226301, 4311882, 4062798, 3955117, 4147619, 3916863, 3751134, 4040857, 3491107, 3327253, 3135929, 3006054, 3190404, 3466096, 3603216, 3581800, 3377481, 3486820, 3460823, 3140817, 3347961, 3365023, 2676264, 2998473, 3093101, 2510381, 2345543, 2742533, 2628254, 2613850, 2078524, 2368780, 2445566, 2281696, 2378723, 2613289, 2524644, 2345995, 2014010, 2021503, 2195595, 2004194, 1801537, 1353546, 1213221, 1378596, 1507270]
2223A507270l37466M35449l1260l45239K50484Q9768j98281n7513L05649L91130
2213B009991l09535j71770l9758J03216k51458P3242j57464j46925J41760r9009
2203A152290J00693j01833J21062K86271k85544j44472R686J66441j73519n0441
2193A080634k05880k91141M12453J56010l05335J35361J7533l48825j33618L59562
2183H76754K68734j94062l52432J66144L906j99512M05902J16659n08909K35443
2173H18627Q3622l97025J25871M1782J41743j88779j75478J76306q7676q5962
2163D53031J29562J36976j12974J67561n58993m08606K25859P856j29714j6843
2153a06285J90588L08871N2733J62171K58360o15390l81117N63017j09951j26266
$$ y = [1507270, 1169804, 1605253, 1573993, 1228754, 1479238, 1569006, 1370725, 1313212, 1618861, 2009991, 1700456, 1528686, 1488928, 1592144, 1340686, 1413928, 1256464, 1109539, 1251299, 1152290, 1252983, 1151150, 1272212, 1558483, 1272939, 1128467, 1138153, 1304594, 1131075, 1080634, 874754, 583613, 996066, 1152076, 846741, 982102, 999635, 650810, 517192, 876754, 1145488, 951426, 598994, 765138, 769044, 569532, 975434, 1092093, 583184, 818627, 902249, 505224, 631095, 672877, 814620, 625841, 450363, 626669, 538993, 453031, 582593, 719569, 606595, 774156, 215163, -193443, 32416, 40272, -89442, -106285, 84303, 393174, 445907, 608078, 866438, 251048, -130069, 432948, 322997, 196731]
2143A96731M3219j1859p1556J21059Q3953J02920n05304K32072J49006n3750J13176
2132C99667Q3586m5399k03913J57711J72159k09518l26485l76640M66904q3735
2122C4337P442K36932k11873O7734j11179K1126j01246K0516J22251J31267k58503
2111d1196O0815Q1888k16379J06474m576j75792K52039L73907J12702l76808j13259
2100E9815J37034p017k73260j69660R6558m5766o9028M17831j6147r6501M31737
2089D65596p0256m60774j82228M75668J3820j36201K79371j01530m58028j04338
2079b78900K02251K62053L19960j32388l90477n11081J14198L13151J76071L81226
2069D56064Q0244J47808K2377K69082N67270J87233L02293j26663m18429l89187
$$ y = [196731, 239950, 228091, 156535, 277594, 361547, 464467, -40837, 191235, 340241, 286491, 399667, 483253, 437854, 233941, 391652, 563811, 354293, 27808, -348832, 118072, 34337, 41779, 278711, 66838, 134572, 23393, 44519, -56727, -36211, 86040, 217307, -41196, 19619, 101507, -114872, -8398, -12974, -188766, 63273, 437180, 549882, 173074, 59815, 196849, 189832, -83428, -253088, -156530, -202296, -271324, 146507, 130360, 33859, 465596, 395340, -65434, -247662, 228006, 241826, 105625, 384996, 283466, -174562, -278900, -76649, 185404, 505364, 372976, -17501, -528582, -414384, -101233, 74838, 456064, 536308, 684116, 706493, 975575, 1542845, 1730078, 2032371, 1905708, 1487279, 1098092]
2059A098092k15709j54983l16561k45264M87371P0933j85403m34288P0664J02832
2049B77684m69402o2019N16235J09281l56292K72123K03160j91432j53975k66129
2039a20766J22173m1609J29072J33909m54234j00154M19365K18946l33755j32376
2029a59429J1129r5106L43905J78905j19700r3851k20724J31019K87972j13575
2019A50545k42697k71282K71340Q766J2866j20455J85585R5097j55241q9013j96135
2008c50624K7892l9955L81988L11202l60871l71567L94199K42434p70752J49802
1998c86252P29704m55645k06704J97128K07097q220m51864R9346M199p6138N4745
1987b92604L68555k56522l7063l5163j35939K70026N6847J55589J57411K13162
$$ y = [1098092, 882383, 727400, 410839, 165575, 652946, 723879, 538476, 104188, 174852, 277684, -191718, -253737, 262498, 371779, 15487, 287610, 490770, 299338, 145363, -120766, 1407, -40202, 88870, 222779, -231455, -331609, 87756, 306702, -27053, -159429, -148300, -243406, 100499, 279404, 159704, 65853, -154871, -23852, 264120, 150545, -92152, -363434, -92094, -83328, -70462, -190917, -5332, 89765, -65476, -154489, -350624, -322732, -362687, 19301, 330503, -30368, -401935, -7736, 234698, -536054, -386252, 343452, -112193, -318897, -121769, 85328, 77108, -374756, -275410, -271211, -347349, -292604, 75951, -180571, -217634, -252797, -388736, -118710, -61863, 93726, 251137, 464299]
1977D64299j20525m32373j99185J74488N472j16849K80062l51832k13027K42572
1967b66898L92132R1865l44372k11914K63513J1028m17038Q1787K5622J70045
1957b04230l4844K64581n6432m04255L26225P3696n37354P6703r0546M18723j8270
1946a86003L21249n539k50478L1241j40284j28972Q7173o2277L4759N3827J45788
1935i9516K01796r9604l23885L46750m16509j32208J73438J51276k21825J5821
1925d04466O9875j8146J46178n7633L59060l8690l29579J64581j2360p073J83631
1914E5378k88760j52975J16288j94761l73218K70131m2026R4669M38455p4630
1904a51449O748k27596k01279L02022K24828L52919M6569r9096k50514m81463
$$ y = [464299, 343774, -88599, -287784, -113296, -107824, -224673, 55389, -296443, -509470, -266898, 125234, 217099, -127273, -339187, -75674, -64646, -481684, -399897, -374275, -204230, -239074, 25507, -30925, -435180, -108955, -35259, -572613, -495910, -586456, -167733, -186003, 135246, 129707, -120771, -89530, -229814, -358786, -271613, -333890, -299131, -245304, -99516, 102280, 2676, -321209, 25541, -390968, -523176, -349738, -198462, -420287, -404466, -334591, -352737, -206559, -264192, 94868, 56178, -273401, -108820, -121180, -128253, 55378, -233382, -386357, -270069, -464830, -838048, -567917, -609943, -515274, -76819, -151449, -144701, -372297, -573576, -271554, -46726, 306193, 352762, 253666, 3152, -478311]
1894d78311M0508K62206K11194O711K35282k46386j95101K89752J74858m02136
1884a01423j38406k3923o6162M6421J07211K81088l22210N24129j57925l07738
1874a58938j09586l2615k3800M18454r4963j3617K945J8846N2450k12180N8985
1863i4019n5982J64953k43107M9688M23751k16488m09633N1547o2000k87748o9674
1852g48712k6096L65522J54056N18893J65889q04052l29025M0665M95370K04032
1842C6542r5004J14112q2535O6159j13219l38314k12949K39314O1242K73871M0869
1831i912k88455N6150R5603j35021J37510J2541k72800q968J57915j21338K5705
1820c51070K60174n7199k02569M07503j04363k89957J25529K43281k59570K8275
$$ y = [-478311, -437803, -175597, 35597, 42308, 277590, 31204, -163897, 125855, 300713, -101423, -239829, -263752, -329914, -283493, -176282, 104806, -217404, 306725, 148800, -158938, -268524, -301139, -324939, 93515, -1448, -15065, -12120, 6726, 59176, -153004, -94019, -150001, 14952, -228155, -178467, 245284, 28796, -380837, -329290, -391290, -679038, -748712, -774808, -409286, -255230, 263663, 429552, -374500, -703525, -662860, -167490, 36542, -58462, 55650, -26885, 39274, -73945, -412259, -625208, -385894, -324652, -50781, -9912, -298367, -242217, -146614, -281635, -144125, -131584, -404384, -413352, -255437, -376775, -351070, -90896, -148095, -350664, 56839, -47524, -337481, -211952, 31329, -228241, -199966]
1810a99966J43664j42051N5643k6667k90575K66750J32443J08128j08978k56120
1800c17729R8773n0700j92092J79320K45231l54859j49701J07162L28844k44007
1790c49758j68931J81857K7118K2642J50557J06673L11765j00155l29888j70097
1780c18217p3161K2047j52323N01337k31820j98649m4389J11881k30013J88681
1770d24626L82274k90612r2297k48881J73297L4658j113P4868J02576m97991M67846
1759c20001L06611J17505l01366R0583K12384m12927r0465O2039L50982j78264
$$ y = [-199966, -56302, -198353, -142710, -169377, -459952, -193202, -60759, 47369, -61609, -317729, -218956, -269656, -461748, -282428, -37197, -392056, -541757, -434595, -105751, -349758, -518689, -336832, -309714, -287072, -136515, -29842, 281923, 181768, -148120, -318217, -391378, -369331, -521654, -20317, -252137, -450786, -495175, -383294, -613307, -424626, -42352, -332964, -425261, -674142, -500845, -466187, -467300, -392432, -289856, -787847, -320001, -13390, 104115, -197251, -106668, 105716, -307211, -397676, -335637, 15345, -162919]
$$ [...]
##END NTUPLES=NMR SPECTRUM
##END=
