##TITLE=1H_TG-2403-B
 200.13Hz, DMSO+CCl4.
 8 sc
 
 8.4.2026
##JCAMPDX= 6.0         $$ Bruker NMR JCAMP-DX V2.0
##DATA TYPE= NMR SPECTRUM
##DATA CLASS= NTUPLES
##ORIGIN= UXNMR, Bruker Analytische Messtechnik GmbH
##OWNER= pz
$$ XWIN-NMR		Version 3.5
$$ Wed Apr  8 14:06:01 2026 Russian Standard Time (UT+4h)  she@DPX200
##.OBSERVE FREQUENCY= 200.1313
##.OBSERVE NUCLEUS= ^1H
##.ACQUISITION MODE= SIMULTANEOUS
##.ACQUISITION SCHEME= undefined
##.AVERAGES= 8
##.DIGITISER RES= 18
##SPECTROMETER/DATA SYSTEM= spect
##.PULSE SEQUENCE= zg30
##.SOLVENT NAME= CDCl3
##.SHIFT REFERENCE= (INTERNAL, CDCl3, 0, 15.4571)
##AUDIT TRAIL= $$ (NUMBER, WHEN, WHO, WHERE, WHAT)
$$ ##TITLE= Audit trail, XWIN-NMR		Version 3.5
$$ ##JCAMPDX= 5.01
$$ ##ORIGIN= Bruker BioSpin GmbH
$$ ##OWNER= she
$$ F:/spectra/data/she/nmr/H-C/1/pdata/1/auditp.txt
$$ ##AUDIT TRAIL=  $$ (NUMBER, WHEN, WHO, WHERE, WHAT)
(   1,<2026-04-08 14:03:49.32 +0400>,<she>,<DPX200>,
      <created by zg, POWCHK disabled, PULCHK disabled
       configuration hash MD5:
       00 E9 B6 7A A2 85 ED C7 34 08 36 98 17 FE 4E 26
       data hash MD5: 16K
       FE 23 48 0A 07 8C 36 F1 3B 63 13 05 86 03 EE 6A>)
(   2,<2026-04-08 14:03:52.35 +0400>,<she>,<DPX200>,
      <Start of raw data processing
       efp BC_mod = 2 LB = 0.25 FT_mod = 6 PKNL = 1 PHC0 = -3709.322 PHC1 = 23.1923 SI = 16K 
       data hash MD5: 16K
       1C 70 7A A8 92 25 39 F9 6C 1B D3 48 38 00 1B 4C>)
(   3,<2026-04-08 14:04:27.25 +0400>,<she>,<DPX200>,
      <pk PHC0 = 2.69402 PHC1 = -11 
       data hash MD5: 16K
       27 15 AA B0 90 69 73 CE F7 DC 0E E3 60 6D 77 C9>)
(   4,<2026-04-08 14:04:31.57 +0400>,<she>,<DPX200>,
      <abs ABSG = 5 
       data hash MD5: 16K
       8F A4 DC 6C 23 C0 F6 86 FE 55 B7 8D 36 56 D7 19>)
$$ ##END=
$$ 
$$ hash MD5
$$ 5E C0 BD 0C B6 BF 92 5E E6 1E C4 A0 4C B5 96 4F
##$RELAX= 
##$RELAX= 
##$RELAX= 
##$RELAX= 
##$RELAX= 
##$RELAX= 
$$ Bruker specific parameters
$$ --------------------------
##$DU= <F:/spectra>
##$EXPNO= 1
##$NAME= <H-C>
##$PROCNO= 1
##$TYPE= <nmr>
##$USER= <she>
##$AMP= (0..31)
100 100 100 100 100 100 100 100 100 100 100 100 100 100 100 100 100 100 
100 100 100 100 100 100 100 100 100 100 100 100 100 100 
##$AQSEQ= 0
##$AQ_mod= 1
##$AUNM= <au_zg>
##$AUTOPOS= <>
##$BF1= 200.13
##$BF2= 200.13
##$BF3= 200.13
##$BF4= 200.13
##$BF5= 200.13
##$BF6= 200.13
##$BF7= 200.13
##$BF8= 200.13
##$BYTORDA= 1
##$CFDGTYP= 0
##$CFRGTYP= 5
##$CHEMSTR= <none>
##$CNST= (0..31)
1 1 145 1 1 1 1 1 1 1 1 1 1 1 1 1 1 1 1 1 1 1 1 1 1 1 1 1 1 1 1 1 
##$CPDPRG= <>
##$CPDPRG1= <>
##$CPDPRG2= <>
##$CPDPRG3= <>
##$CPDPRG4= <mlev>
##$CPDPRG5= <mlev>
##$CPDPRG6= <mlev>
##$CPDPRG7= <mlev>
##$CPDPRG8= <mlev>
##$CPDPRGB= <>
##$CPDPRGT= <>
##$D= (0..31)
0 0.7 0 0 0 0 0 0 0 0 0 0.03 0 0 0 0 0 0 0 0 0 0 0 0 0 0 0 0 0 0 0 0 
##$DATE= 1775642628
##$DBL= (0..7)
120 120 120 120 120 120 120 120 
##$DBP= (0..7)
150 150 150 150 150 150 150 150 
##$DBP07= 0
##$DBPNAM0= <>
##$DBPNAM1= <>
##$DBPNAM2= <>
##$DBPNAM3= <>
##$DBPNAM4= <>
$$ [...]
##$SUBNAM3= <"">
##$SUBNAM4= <"">
##$SUBNAM5= <"">
##$SUBNAM6= <"">
##$SUBNAM7= <"">
##$SUBNAM8= <"">
##$SUBNAM9= <"">
##$SW= 18.0517328524113
##$SWIBOX= (0..15)
0 0 2 0 0 0 0 0 0 0 0 0 0 0 0 0 
##$SW_h= 3612.71676300578
##$TD= 16384
##$TD0= 1
##$TE= 0
##$TE2= 300
##$TE3= 300
##$TEG= 300
##$TL= (0..7)
0 120 120 120 120 120 120 120 
##$TP= (0..7)
150 150 150 150 150 150 150 150 
##$TP07= 0
##$TPNAME0= <>
##$TPNAME1= <>
##$TPNAME2= <>
##$TPNAME3= <>
##$TPNAME4= <>
##$TPNAME5= <>
##$TPNAME6= <>
##$TPNAME7= <>
##$TPOAL= (0..7)
0.5 0.5 0.5 0.5 0.5 0.5 0.5 0.5 
##$TPOFFS= (0..7)
0 0 0 0 0 0 0 0 
##$TUNHIN= 0
##$TUNHOUT= 0
##$TUNXOUT= 0
##$USERA1= <user>
##$USERA2= <user>
##$USERA3= <user>
##$USERA4= <user>
##$USERA5= <user>
##$V9= 5
##$VALIST= <valist>
##$VCLIST= <CCCCCCCCCCCCCCC>
##$VD= 0
##$VDLIST= <DDDDDDDDDDDDDDD>
##$VPLIST= <PPPPPPPPPPPPPPP>
##$VTLIST= <TTTTTTTTTTTTTTT>
##$WBST= 1024
##$WBSW= 4
##$XGAIN= (0..3)
0 0 0 0 
##$XL= 0
##$YL= 0
##$YMAX_a= 520623
##$YMIN_a= -627212
##$ZGOPTNS= <>
##$ZL1= 120
##$ZL2= 120
##$ZL3= 120
##$ZL4= 120
##$ABSF1= 17.83374
##$ABSF2= -0.2181511
##$ABSG= 5
##$ABSL= 3
##$ALPHA= 0
##$AQORDER= 0
##$ASSFAC= 0
##$ASSFACI= 0
##$ASSFACX= 0
##$ASSWID= 0
##$AUNMP= <proc_1d>
##$AZFE= 0.1
##$AZFW= 0.1
##$BCFW= 0
##$BC_mod= 2
##$BYTORDP= 0
##$COROFFS= 0
##$CY= -3
##$DATMOD= 1
##$DC= 0
##$DFILT= <>
##$DTYPP= 0
##$F1P= 0
##$F2P= 0
##$FCOR= 1
##$FTSIZE= 16384
##$FT_mod= 6
##$GAMMA= 0
##$GB= 0
##$INTBC= 1
##$INTSCL= 3.241238e-09
##$ISEN= 128
##$LB= 0.25
##$LEV0= 0
##$LPBIN= 0
##$MAXI= 10000
##$MC2= 0
##$MEAN= 0
##$ME_mod= 0
##$MI= 1.114404
##$NCOEF= 0
##$NC_proc= -6
##$NLEV= 6
##$NOISF1= 3.799351
##$NOISF2= 2.8
##$NSP= 0
##$NTH_PI= 0
##$NZP= 0
##$OFFSET= 15.45712
##$PC= 1
##$PHC0= -3706.628
##$PHC1= 12.1923
##$PH_mod= 1
##$PKNL= yes
##$PPARMOD= 0
##$PSCAL= 0
##$PSIGN= 0
##$REVERSE= no
##$SF= 200.130012925673
##$SI= 16384
##$SIGF1= 3
##$SIGF2= 2
##$SINO= 0.751879
##$SIOLD= 32768
##$SREGLST= <19F.Aceton>
##$SSB= 0
##$STSI= 16384
##$STSR= 0
##$SW_p= 3612.71676300578
##$SYMM= 0
##$S_DEV= 0
##$TDeff= 16384
##$TDoff= 0
##$TI= <>
##$TILT= no
##$TM1= 0
##$TM2= 0
##$TOPLEV= 0
##$USERP1= <user>
##$USERP2= <user>
##$USERP3= <user>
##$USERP4= <user>
##$USERP5= <user>
##$WDW= 1
##$XDIM= 16384
##$YMAX_p= 473885303
##$YMIN_p= -541826
$$ End of Bruker specific parameters
$$ ---------------------------------
##NTUPLES= NMR SPECTRUM
##VAR_NAME=  FREQUENCY,     SPECTRUM/REAL,   SPECTRUM/IMAG
##SYMBOL=    X,             R,               I
##VAR_TYPE=  INDEPENDENT,   DEPENDENT,       DEPENDENT
##VAR_FORM=  AFFN,          ASDF,            ASDF
##VAR_DIM=   16384,         16384,           16384
##UNITS=     HZ,            ARBITRARY UNITS, ARBITRARY UNITS
##FACTOR=    0.220516191357247, 1,           1
##FIRST=     3093.43361372839, 0,            0
##LAST=      -519.283149277395, 0,           0
##MIN=       -519.283149277395, -541826,     0
##MAX=       3093.43361372839, 473885303,    0
$$ Real data points
##PAGE= N=1
##DATA TABLE= (X++(R..R)), XYDATA
$$ [...]
7457B88944k45813k99484K14508N6842K6107j2380m3536j17275K9867N5885j01901
$$ 288944 43131 -256353 -41845 14997 41104 28724 -14812 -132087 -102220 -46335 -148236
7446a48236N3121O4114j51335o410J10973j09579j39586J65726J08182J3598j57587
$$ -148236 -95115 -31001 -182336 -188746 -77773 -187352 -326938 -161212 -53030 -39432 -197019
7435a97019r6364l9690K80129M9877p4034K5555K422n132Q7059l6867Q47R4352
$$ -197019 -293383 -333073 -52944 -3067 -77101 -51546 -49124 -54256 32803 -4064 -3217 91135
7423I1135j08795O6404M3794j6384J7175K1984l4140n3021n2643J34569j0571
$$ 91135 -17660 48744 92538 76154 93329 115313 81173 28152 -24491 110078 99507
7412I9507r9680k7845m383R6969K5962o215P5013J02684o7120k18840K5462L8866
$$ 99507 -173 -28018 -32401 64568 90530 84315 159328 262012 194892 -23948 1514 40380
7400D0380m7682K15914Q6593r9859k5945K6874O3836k13210R0255J8909M1813
$$ 40380 -7302 208612 295205 195346 169401 196275 260111 46901 137156 156065 197878
7389A97878J09064q2776m7630N5718O0381m2541j02489j38607r1298K7324J86195
$$ 197878 306942 224166 176536 232254 292635 250094 147605 8998 -82300 -54976 131219
7378A31219R9887r9143J03643M4826j99776J9627J88218j04515r8523P7678R9095
$$ 131219 231106 131963 235606 280432 80656 100283 288501 183986 85463 163141 262236
7367B62236P476l6459L099k11450j71934K07650J06029R9903l267j35255o3013
$$ 262236 269712 233253 236352 24902 -147032 60618 166647 266550 263283 128028 65015
7356F5015P5266m7455m6876j49044N6308P0518Q7006m5428L4676M6818n5424k38271
$$ 65015 140281 92826 45950 -103094 -46786 23732 110738 65310 99986 146804 91380 -146891
7344a46891J29720K58365p7432k00659J70020k0439k13768J67717J19474K7217
$$ -146891 -17171 241194 163762 -36897 133123 112684 -101084 66633 186107 213324
7334B13324j79359J43262l2958j38625Q6042K52442J39139K78842Q3050m1067
$$ 213324 33965 177227 144269 5644 91686 344128 483267 762109 845159 804092
7324H04092k5678j46425n3480l6108k75671j65649L1332J7647p1663P4542O3564
$$ 804092 778414 631989 578509 542401 266730 101081 132413 150060 78397 152939 216503
7313B16503l9598M6605J2764j31625L6786q5321j6455J12264j00092j56535j6792
$$ 216503 176905 223510 236274 104649 141435 56114 39659 151923 51831 -104704 -121496
7302a21496o7601P4199K55513K1414r7344l1061l5751J09216k14559k04786J51350
$$ -121496 -189097 -114898 140615 162029 64685 33624 -2127 107089 -107470 -312256 -160906
7291a60906L6699j48005N4406N9882J6848j19853J06158M1413P5260L4683O2363
$$ -160906 -124207 -272212 -217806 -157924 -141076 -260929 -154771 -113358 -38098 -3415 58948
7280E8948P4591j07331N2996j03804j4304k51670l6743J47680l784O7646M0843
$$ 58948 133539 26208 79204 -24600 -38904 -290574 -327317 -179637 -183421 -115775 -74932
7269g4932Q1733l1177j9009J63260p832J57769J30403j08339j47349o7017J61081
$$ -74932 6801 -24376 -43385 119875 112043 269812 400215 291876 144527 77510 238591
7258B38591j4304k0730J78373k4840q1772j09705P6206K33284j67741q1862J72581
$$ 238591 224287 203557 381930 357090 275318 165613 241819 475103 307362 225500 398081
7247C98081K17939Q9942j42784J05934j29274q6075O8008K32430O2714m9796o59
$$ 398081 616020 705962 563178 669112 539838 453763 521771 754201 816915 767119 766460
7236G66460o3639L9991J7194p3461p1679p1369j48104O501R7095k31603j39348
$$ 766460 702821 742812 760006 686545 614866 543497 395393 401894 498989 267386 128038
7225A28038Q9828K0091j09846J80590N4855j52218J8435j525j05093j92991J28288
$$ 128038 217866 237957 128111 308701 363556 211338 229773 228248 123155 -69836 58452
7214E8452J46336L4322q9627P3889l5551k15130j04826R3057J6572k0649j0714
$$ 58452 204788 239110 149483 223372 187821 -27309 -132135 -39078 -22506 -43155 -53869
7203e3869J96583q724j41515M3540M1455P4584p806J76512M8985j07793j96056
$$ -53869 142714 133990 -7525 36015 77470 152054 144248 320760 369745 261952 65896
7192F5896m4012Q9350n1693O8371k2311J7012j3365j48208K6728J21562J32363
$$ 65896 21884 111234 59541 127912 105601 122613 109248 -38960 -12232 109330 241693
7181B41693K4173m8992p7436P4363J9674j56292k4768n4532j9945Q1764N2961
$$ 241693 265866 216874 139438 213801 233475 77183 52415 -2117 -22062 59702 112663
7170A12663M6288j04855j31025M3318J50381m4564k44706K82939o310j50563l4720
$$ 112663 158951 54096 -76929 -33611 116770 72206 -172500 110439 104129 -46434 -81154
7159h1154J25589Q9760j28168R4542R4379p2090m3709L6417L7104J25527n3627
$$ -81154 44435 134195 6027 100569 194948 122858 79149 115566 152670 278197 224570
7148B24570m0081k5953j6048j65016K21725m2261J3210k6810K5426j73412j06024
$$ 224570 184489 158536 142488 -22528 199197 156936 170146 143336 168762 -4650 -110674
7137a10674K93694J14679j48458j84152J6445L3465l0198m6800J48412L7857j41168
$$ -110674 183020 297699 149241 -34911 -18466 14999 -15199 -61999 86413 124270 -16898
7126a6898P9924q37r742q7478o6787J53316j11400k5388J14321N2654j97484J53726
$$ -16898 63026 62189 52447 -35031 -101818 51498 -59902 -85290 29031 81685 -115799 37927
7114C7927j6034K2157j05676J58085J53187k77065j14056l3070J72817R3567P722
$$ 37927 21893 44050 -61626 96459 249646 -27419 -141475 -174545 -1728 91839 99561
7103I9561k1329k3164j03497M1549O7553j14589O1911r625o7848l5826L3009J5477
$$ 99561 78232 55068 -48429 -6880 60673 -53916 7995 -1630 -69478 -105304 -72295 -56818
7091e6818p9772N1293r0870r160j8380N3714J01264K35629o8994k87200K6476
$$ -56818 -136590 -85297 -176167 -185327 -203707 -149993 -48729 186900 117906 -169294 -142818
7080a42818L8430j032j4900M9619m0328q9286p1352L03499J535p0123m6974n3650
$$ -142818 -104388 -105420 -120320 -70701 -111029 -200315 -271667 31832 33367 -36756 -83730 -137380
7068a37380k2905O9539M7877j12426Q0731P452Q855o4645l6765j09820J14136
$$ -137380 -160285 -90746 -42869 -155295 -74564 -67112 -58257 -122902 -159667 -269487 -155351
7057a55351J18413K2027P4243n9149r2596q6355J35687j24607O4122R6214j75927
$$ -155351 -36938 -14911 59332 183 -92413 -178768 -43081 -167688 -103566 -7352 -183279
7046a83279j72708Q736K71216l0707K485J55984K60851j09777k40851L1962p0162
$$ -183279 -355987 -347251 -76035 -106742 -104257 51727 312578 202801 -38050 -6088 -76250
7035g6250j05915o84k1822J28708r886j07770J43686R1595r0520O1291J05059
$$ -76250 -182165 -182849 -204671 -75963 -85849 -193619 -49933 41662 -48858 12433 117492
7024A17492q6868n9422k7624J8797n7521M011j3509M6472J3968j02252R2028k13079
$$ 117492 30624 -28798 -56422 -37625 -95146 -91135 -104644 -58172 -44204 -146456 -54428 -267507
7012b67507M2979K02763j16701L2319K9943o3411m8291j2659j0447L4637P6469
$$ -267507 -224528 -21765 -138466 -106147 -76204 -139615 -187906 -200565 -211012 -176375 -99906
7001i9906j40323J08088K23472p9440j07616J9374P0342k9490L6296J41648l1125
$$ -99906 -240229 -132141 91331 11891 -95725 -76351 -6009 -35499 797 142445 111320
6990A11320j91369p2989J3488j1093J5447K01595j9623R0498Q463O9292p7432
$$ 111320 -80049 -153038 -139550 -150643 -135196 66399 46776 137274 145737 215029 137597
6979A37597j76143l7836Q2218M5497q7656K17907J37937p9244m2208j10026p7818
$$ 137597 -38546 -76382 5836 51333 -36323 181584 319521 240277 198069 88043 10225
6968A0225P59J45132K1947K1250j40380m691J58601l7697q3371o1985J04726l7569
$$ 10225 10984 156116 178063 199313 58933 54242 212843 175146 91775 29790 134516 96947
6956I6947N1543j07347j15569j23700K04181J44903j32628p2767J20993J28884
$$ 96947 148490 41143 -74426 -198126 6055 150958 18330 -54437 66556 195440
6946A95440p2015J53020l052l9320n7529p1935M3372m5694j4748J02922K8363
$$ 195440 123425 276445 273393 234073 176544 104609 147981 102287 87539 190461 218824
6935B18824j15977Q8727P366j61492j42661N7365K63040R2524j86268L1888O8378
$$ 218824 102847 191574 198940 37448 -105213 -47848 215192 307716 121448 153336 221714
6924B21714j88320j11329Q8993j59707j88534J02327J91136L8928q902P5697m1161
$$ 221714 33394 -77935 11058 -148649 -337183 -234856 -43720 -4792 -13694 62003 20842
6913B0842p3148N6943o9076j13547j0713R6631M6791Q9550O9792j41778Q4378
$$ 20842 -52306 4637 -64439 -177986 -188699 -92068 -45277 44273 114065 -27713 56665
6902E6665p4057o6885J36554Q231n9409j84178j697l4329Q0513K59797q5506m2237
$$ 56665 -17392 -84277 52277 60508 1099 -183079 -184776 -219105 -138592 121205 35699 -6538
6890f538J19494r5345L1751l19445j348J71285R148r767J25372j26099l631J14547
$$ -6538 112956 17611 49362 -270083 -271431 -100146 -90998 -100765 24607 -101492 -105123 9424
6878I424R1225N2373j70456R4409n383M3987j45513n0739M7020M3003j01299K03094
$$ 9424 100649 153022 -17434 76975 71592 115579 -29934 -80673 -33653 9350 -91949 111145
6866A11145M9417K423N2719J6511j51200j10179O2752Q2909m4911r3178M3303
$$ 111145 160562 162985 215704 232215 81015 -29164 33588 116497 71586 -21592 21711
6855B1711J49035j97421p8246m9044L0342J09658M6096n1002j59432Q7944J2204
$$ 21711 170746 -26675 -104921 -153965 -123623 -13965 32131 -18871 -178303 -90359 -78155
6844g8155r9255O4707O307n2516N544l0270J77750K7711k20393j06184Q8519o3593
$$ -78155 -177410 -112703 -106396 -158912 -153368 -183638 -5888 21823 -198570 -304754 -216235 -279828
6832b79828r2811O8681J90701J02494l8725j9798J37993r5903k04999N1474l3867
$$ -279828 -372639 -303958 -113257 -10763 -49488 -69286 68707 -27196 -232195 -180721 -214588
6821b14588O6239j312m5304j2356M0567k6205j3599L625q7669P0035J89902K8123
$$ -214588 -148349 -149661 -194965 -207321 -166754 -192959 -206558 -202933 -290602 -220567 -30665 -2542
6809b542p3925k0014q036J33559r2709K46980J10277j95066K173l0225j69889
$$ -2542 -76467 -96481 -104517 29042 -63667 183313 293590 98524 100697 70472 -99417
6798i9417j07200J05732J66134l2633J0881J51621m1299j36126j69021o0231P9773
$$ -99417 -206617 -100885 65249 32616 43497 195118 153819 17693 -151328 -211559 -131786
6787a31786P548J19934o1154j89201J14014K6010K17613J28356j11657M1530j15011
$$ -131786 -124238 -4304 -65458 -254659 -140645 -114635 102978 231334 119677 161207 46196
6776D6196j59842N0419k1221o9151j60682L2852J26343q1495K0385N3610K19398
$$ 46196 -113646 -63227 -84448 -153599 -314281 -281429 -155086 -236581 -216196 -162586 56812
6765E6812j84857l2525K10437q4290N3501N5119l6844j71037j32204K83105J68056
$$ 56812 -128045 -160570 49867 -34423 19078 74197 37353 -133684 -265888 17217 185273
6754A85273m8292K8756j1926q5395J3611N1612m5476l1930J2227j76997m9369
$$ 185273 136981 165737 153811 68416 82027 133639 88163 56233 68460 -108537 -157906
6743a57906K7527P2549P3815J17388J11813J5690j72741k76203J21620Q4999k2239
$$ -157906 -130379 -57830 15985 133373 245186 260876 88135 -188068 -66448 18551 -3688
6732c688j74182J61046Q5002m8525j02430M0937J08486j38706R046O2864j49065
$$ -3688 -177870 -16824 68178 19653 -82777 -41840 66646 -72060 -63014 -150 -149215
6721a49215R2426j05111J45073J28483j48234J55311K2921n6171k4543J05817
$$ -149215 -56789 -161900 -16827 111656 -36578 118733 141654 85483 60940 166757
6711A66757k13034q8528J27671r2035j47601J48854J8274O1595j6912j3609L2861
$$ 166757 -46277 -134805 -7134 -99169 -246770 -97916 -79642 -18047 -34959 -48568 -15707
6700a5707l0589p8827k4875J30706J912N0171J26161j20175j11984N6794k4051
$$ -15707 -46296 -125123 -149998 -19292 -17380 32791 158952 38777 -73207 -16413 -40464
6689d0464m257J575l6886P9848M5020q1155J85084j56018l1649J99370J2706O9638
$$ -40464 -44721 -43146 -80032 -184 44836 -36319 148765 -7253 -38902 160468 173174 242812
6677B42812j65631j47567L8627L5772J7940j09499O9511L6801n3035p2570J67196
$$ 242812 77181 -70386 -31759 4013 21953 -87546 -18035 18766 -34269 -106839 60357
6666F0357J56205j02390l97j71313M9785j8769J16462O5995N9161p7407p5945
$$ 60357 216562 114172 113775 -57538 -7753 -26522 89940 155935 215096 137689 61744
6655F1744k25219q5345K99500r2365j15936m8683J23062J3135j54540k5872K14203
$$ 61744 -163475 -248820 50680 -41685 -157621 -206304 -83242 -70107 -224647 -250519 -36316
6644c6316J69638k46843j6221P3492n9068R2071R8170J0481P044j03348m9535
$$ -36316 133322 -113521 -129742 -56250 -115318 -23247 74923 85404 92448 -10900 -60435
6633f0435l9256M9254P240O3450q338j42114K27261M9556j54603R6662R866m5985
$$ -60435 -99691 -50437 -43197 20253 11915 -130199 97062 146618 -7985 88677 98543 52558
6621E2558P5893J6493j18442j10169P4490P2603J1063o3295L3137L5401n6468
$$ 52558 128451 144944 26502 -83667 -9177 63426 74489 11194 44331 79732 23264
6610B3264j86842J29383J89928M9791o9683J3352Q5937r2154k17077J69647N8964
$$ 23264 -163578 -34195 155733 205524 135841 149193 235130 142976 -74101 95546 154510
6599A54510j33968p9731N3206P2960n2705n3032J54170q3428q9078J60082q193
$$ 154510 20542 -59189 -5983 66977 14272 -38760 115410 31982 -57096 102986 94793
6588I4793m1893O2057k8348O8462j64764L0960J65704M0427m7508J5538Q1501
$$ 94793 52900 114957 86609 155071 -9693 21267 186971 227398 179890 195428 276929
6577B76929j17993j16174k800J23730L9102m4991k09482J77450J17406Q5017m2801
$$ 276929 158936 42762 39962 163692 202794 157803 -51679 125771 243177 328194 285393
6566B85393k8498p5911J95757j28092q8621o963N30l5521k2217P2028r1755k789
$$ 285393 256895 180984 376741 248649 160028 153065 153595 118074 95857 167885 76130 73341
6554G3341l4085J92079J3378r6624j89842O6736Q8401R4831j58836J63830J73370
$$ 73341 39256 231335 244713 148089 -41753 24983 113384 208215 49379 213209 386579
6543C86579p5310L2504j14659j32772n2795M4430O4834N2391Q8436L8301R9238
$$ 386579 311269 343773 229114 96342 43547 87977 152811 205202 293638 331939 431177
6532D31177l9153j74618N3989J6296n6833K8641R9501j5419o6213k15307P6727
$$ 431177 392024 217406 271395 287691 230858 259499 359000 343581 277368 62061 138788
6521A38788m1248M451J07846J27406J02152j06101j1639j26890n2928Q0783K25195
$$ 138788 97540 101991 209837 337243 439395 333294 321655 194765 141837 222620 447815
6510D47815L18k00327K8627m0084k5551J999O4207O0633q819j27457P8193N9227
$$ 447815 448133 247806 276433 236349 210798 212797 277004 337637 328818 201361 279554 338781
6498C38781j4474J7360J61514l8499N4189j00899j25518j37484m5217J17889O0558
$$ 338781 324307 341667 503181 464682 518871 417972 292454 154970 109753 227642 288200
6487B88200P4167m8048P0135m7382k3477J5869k0548m0786K9788M3701L4558J06468
$$ 288200 362367 314319 384454 337072 313595 329464 308916 268130 297918 341619 376177 482645
6475D82645O9634o6767n4507o5434r8532N6122j08520K9313R9168j00685k5928
$$ 482645 552279 485512 431005 365571 267039 323161 214641 243954 343122 242437 216509
6464B16509L7973P9900K2925j05842O7216k0827n5741R8590J10111J57737p8732
$$ 216509 254482 334382 357307 251465 318681 297854 242113 340703 450814 608551 529819
6453E29819j54457K3930L065l9160q96k1809J35817N3445k7360L8794K0042j70188
$$ 529819 375362 399292 402357 363197 362301 340492 476309 529754 502394 541188 561230 391042
6441C91042j1900Q1326l6500l0216j14900r9629L9108J9329o1280k6946J67370
$$ 391042 379142 460468 423968 393752 278852 179223 218331 237660 176380 149434 316804
6430C16804J79952k0683j95144J16500j9852J324o330J2376J439N1535J52191
$$ 316804 496756 476073 280929 397429 377577 378901 372571 384947 386386 437921 590112
6419E90112P943K7715J04609J246K03983Q4769l9099m8970L9717J33161K9498
$$ 590112 598055 625770 730379 731625 935608 1020377 981278 932308 972025 1105186 1134684
6408A134684k15653l0809m4787j56881j71524j2074j01132l2518J21626m9432
$$ 1134684 919031 888222 843435 686554 515030 502956 401824 369306 490932 441500
6398D41500N6597J33536j27506o3915j13792p2439Q4796J2449J44919r2870J5338
$$ 441500 498097 631633 504127 440212 326420 253981 338777 351226 496145 403275 418613
6387D18613j18556k1547J39298J6645N3798R5926n4304j4392j56439K8897K70769
$$ 418613 300057 278510 417808 434453 488251 584177 529873 515481 359042 387939 658708
6376F58708L2300k38939l8147Q0669N6356O176j53286j99032P2593N0538j7272
$$ 658708 691008 452069 413922 494591 550947 557123 403837 204805 277398 327936 310664
6365C10664q0803Q6654J61148P5572R960J4020J00488l574j8144j1305J08205
$$ 310664 229861 316515 477663 553235 563195 577215 677703 674129 655985 644680 752885
6354G52885J98959l1150l8048J7917m1977K2130N6535j6226j80504N8178Q3195
$$ 752885 951844 920694 882646 900563 858586 880716 937251 921025 740521 798699 881894
6343H81894P6053K142k05715P7328J11168O2597j24728J84622J44108j3154k9436
$$ 881894 957947 960089 754374 831702 942870 1005467 880739 1065361 1209469 1196315 1166879
6332A166879n2697m9655J12766n55N1903L6137o68O6359k3570K57607J55992j07520
$$ 1166879 1114182 1064527 1177293 1176738 1228641 1264778 1264110 1330469 1306899 1564506 1720498 1612978
6320A612978L6049p2049m784K79206K12539r732L6135K15118J81328J42459J81369
$$ 1612978 1649027 1576978 1572194 1851400 2063939 2054207 2090342 2305460 2486788 2629247 2810616
6309B810616K89569L03569P2732M02115O62620O51882J012070R80916J210497
$$ 2810616 3100185 3403754 3476486 3878601 4541221 5193103 6205173 7186089 8396586
6300H396586J399155J218127P50913K90689k37588p15679q47738n66094m30384
$$ 8396586 9795741 11013868 11764781 12055470 11817882 11102203 10254465 9688371 9257987
6291I257987k61847J12359O27673P95630J012415J187685J096238M61186Q9012
$$ 9257987 8996140 9108499 9736172 10531802 11544217 12731902 13828140 14289326 14378338
6282A4378338m96461r43412n42024j33703J30229L74582M77760M14276j1618l06758
$$ 14378338 13881877 12938465 12396441 12262738 12392967 12767549 13245309 13659585 13647967 13341209
6272A3341209o01397q51119j231026q26368m33780k45034k28590J30033P65872
$$ 13341209 12739812 11888693 10657667 9831299 9397519 9152485 8923895 9053928 9819800
6263I819800Q86180P45652P55436M91965j95974p02714j016251j208631j086654
$$ 9819800 10705980 11451632 12207068 12699033 12503059 11800345 10784094 9575463 8488809
6254H488809r03988q51998m74012n78892m03174l15680j25934j76572o8855r8575
$$ 8488809 7584821 6732823 6258811 5679919 5276745 4961065 4835131 4658559 4589704 4491129
6244D491129P5484J99864J62360J71769J90000L77714J24702L23726M43547O21483
$$ 4491129 4566613 4766477 4928837 5100606 5290606 5668320 5793022 6116748 6560295 7181778
6234G181778O29430J083303J590367J761718K175206K194748K006694J180769
$$ 7181778 7811208 8894511 10484878 12246596 14421802 16616550 18623244 19804013
6226A9804013L98421m53101j074286j240172j214550p37696m28782J62066R61883
$$ 19804013 20202434 19749333 18675047 17434875 16220325 15482629 15053847 15215913 16177796
6217A6177796J245615J611060J640933J265500Q27781L3644o62211p39621n84791
$$ 16177796 17423411 19034471 20675404 21940904 22768685 22802329 22140118 21400497 20815706
6208B0815706j63575L02364J000177J148070P22948J20587r60931j498855j592106
$$ 20815706 20652131 20954495 21954672 23102742 23825690 23946277 22985346 21486491 19894385
6199A9894385j721594j340863j087374p49700j58157M50124J021248J233352J309715
$$ 19894385 18172791 16831928 15744554 14994854 14836697 15286821 16308069 17541421 18851136
6190A8851136J161351M03617o26325j422376j715075k127713j933542j537233
$$ 18851136 20012487 20416104 19789779 18367403 16652328 14524615 12591073 11053840
6182A1053840j296876j270805r65118q14771p52739n24646l99213n46660k90869
$$ 11053840 9756964 8486159 7521041 6706270 5953531 5428885 5029672 4483012 4192143
6173D192143j37774j95299k78798j07394k03723l64796k34432K28j23695j54870
$$ 4192143 4054369 3859070 3580272 3472878 3269155 2904359 2669927 2670155 2546460 2391590
6163B391590M2901j34160k4188k8187J4508j47402k6748j1529P4481q1735j57985
$$ 2391590 2434491 2300331 2276143 2247956 2262464 2115062 2088314 2076785 2151266 2069531 1911546
6152A911546J29554k9633j45275K7753q3690j00290j3142J66149k20946J6953
$$ 1911546 2041100 2011467 1866192 1893945 1810255 1709965 1696823 1862972 1642026 1658979
6142A658979J52498n2366l8704J00521J1855J4326k23434o7415J64785n9662j13687
$$ 1658979 1811477 1759111 1720407 1820928 1832783 1847109 1623675 1556260 1721045 1661383 1547696
6131A547696K2714k0314K27583o6119j5213j3668r1164N250Q9562j6750N1708
$$ 1547696 1570410 1550096 1777679 1711560 1696347 1682679 1591515 1596765 1686327 1669577 1721285
6120A721285K9575O8400K74985J99576j49580K0715J4001j96096J9392O0228k8181
$$ 1721285 1750860 1819260 2094245 2293821 2144241 2164956 2178957 1982861 2002253 2062481 2034300
6109B034300j59542l1795O330m7834o99J1814j74468R2065J48935o8414j32388
$$ 2034300 1874758 1842963 1849293 1801459 1800760 1812574 1638106 1730171 1879106 1810692 1678304
6098A678304K8398J12093m0657J4399J00414j04438J07496L8080N0045l1551J69009
$$ 1678304 1706702 1818795 1778138 1792537 1892951 1788513 1896009 1934089 1984134 1952583 2121592
6087B121592J74208J39567M32716J62385L6818q6530j46964J016Q8399m3025j75372
$$ 2121592 2295800 2435367 2868083 3030468 3067286 2980756 2833792 2834808 2923207 2880182 2704810
6076B704810j45506n3026K3397J1792Q0470j45804L7153m9087K10023J09599k03857
$$ 2704810 2559304 2506278 2529675 2541467 2621937 2476133 2513286 2464199 2674222 2783821 2579964
6065B579964J64077K85253K3967J26285O9502R7322K62581K05709J95042L74499
$$ 2579964 2744041 3029294 3053261 3179546 3249048 3346370 3608951 3814660 4009702 4384201
6055D384201M17900N53859M29742O31657O04710K24827O66708P25898J168950
$$ 4384201 4802101 5355960 5785702 6417359 7022069 7246896 7913604 8639502 9808452
6046I808452J420520J990127K107613J831089J558223N55282m21362j294063j457215
$$ 9808452 11228972 13219099 15326712 17157801 18716024 19271306 18849944 17555881 16098666
6037A6098666j567622j162059j049894r52921n91924l40583k21326O0540M75296
$$ 16098666 14531044 13368985 12319091 11366170 10774246 10433663 10212337 10272877 10748173
6028A0748173P35961R67379J257383J895887K862305L415734L951078M092442
$$ 10748173 11484134 12451513 13708896 15604783 18467088 21882822 25833900 29926342
6020B9926342L405569J652673m41027k150868l129126l456000l135197k901721
$$ 29926342 33331911 34984584 34543557 32392689 29263563 25807563 22672366 19770645
6012A9770645k353656j930196j760793j438841r83946o58267l04916J68365K30015
$$ 19770645 17416989 15486793 13726000 12287159 11303213 10644946 10340030 10508395 10738410
6003A0738410L73938Q56171J360468J723588J968812J701297R76448J9909r66854
$$ 10738410 11112348 11968519 13328987 15052575 17021387 18722684 19699132 19719041 18752187
5994A8752187j677441j620192j794546j555185j325056j295892j042121o58015
$$ 18752187 17074746 15454554 13660008 12104823 10779767 9483875 8441754 7783739
5986G783739o59675m22110l28996l33604j21324l4482J49541R7570J09889L77947
$$ 7783739 7124064 6701954 6372958 6039354 5918030 5883548 6033089 6130659 6240548 6618495
5976F618495N61855P71265J051853J211383J248110Q71724R5527l19697p68623
$$ 6618495 7180350 7951615 9003468 10214851 11462961 12334685 12430212 12110515 11341892
5967A1341892p99778r16336o17333o84876o99916m54262j6385j08274j2079J45930
$$ 11341892 10542114 9625778 9008445 8323569 7623653 7169391 7153006 7044732 7032653 7178583
5957G178583L78690N50334O45250J230469J401739J866137K557906K479751K074554
$$ 7178583 7557273 8107607 8752857 9983326 11385065 13251202 15809108 18288859 20363413
5948B0363413P97285m85060j201552j822802k194855j896402j826031j379958
$$ 20363413 21160698 20675638 19474086 17651284 15456429 13560027 11733996 10354038
5940A0354038j172337q72322r23629o51750k60249l9891j6974J4837L53279L82922
$$ 10354038 9181701 8309379 7385750 6734000 6473751 6433860 6416886 6431723 6785002 7167924
5930G167924P02965J138418J223926J089870P01488o22m59879j220907j143436
$$ 7167924 7870889 9009307 10233233 11323103 12024591 12023969 11564090 10343183 9199747
5921I199747j111145r49352j087826n82644o13452n12193l97909n14364j98222
$$ 9199747 8088602 7139250 6051424 5468780 4855328 4343135 3945226 3430862 3232640
5912C232640p2801k22148k37696k54002j33186J8536p7723k65017k47174l261
$$ 3232640 3159839 2937691 2699995 2445993 2312807 2331343 2253620 1988603 1741429 1738168
5902A738168R7358N9854o7329k36124L6849J61436n2021j76261M441M1554J31805
$$ 1738168 1835526 1895380 1828051 1591927 1628776 1790212 1738191 1561930 1566371 1607925 1739730
5891A739730Q8328q9355j37419L113K3657j83856j97814J42135k9441o7840J35935
$$ 1739730 1828058 1738703 1601284 1604397 1628054 1444198 1246384 1388519 1359078 1291238 1427173
5880A427173l5117J16440Q1542l7050q1522j63715j29126p4387P9110l3208r1983
$$ 1427173 1392056 1508496 1590038 1552988 1471466 1307751 1178625 1104238 1183348 1150140 1058157
5869A058157P7472J9269L9874k06545k5610J00514j32610j6030R4877o9309j05460
$$ 1058157 1135629 1154898 1194772 988227 962617 1063131 930521 914491 1009368 940059 834599
5858H34599L1523j416J44355n3903j54008K8864J54123j00936J5842J8619q9715
$$ 834599 866122 864706 1009061 955158 801150 830014 984137 883201 899043 917662 827947
5847H27947m2808n0209M8259J78067r4448k7556J54173l5173Q826k6514l2256
$$ 827947 785139 734930 783189 961256 866808 839252 993425 958252 967078 940564 908308
5836I08308N1214k51475Q297J73240O7726J1160j71976j19748L8483K41001J90979
$$ 908308 959522 708047 716344 889584 957310 968470 796494 676746 715229 956230 1147209
5825A147209j50866k682J43832o3916r1280q115o8657M394N5180k8995m5893N7029
$$ 1147209 996343 993661 1137493 1073577 982297 974182 905525 909919 965099 936104 890211 947240
5813I47240J31237j52976R0731m783O1910m9892J04181O2542P1944j33139L5266
$$ 947240 1078477 925501 1016232 1011449 1073359 1023467 1127648 1190190 1262134 1128995 1164261
5802A164261J96831K3126p5396q5412m0113P4332J53408k0320k5545K1646J79024
$$ 1164261 1361092 1384218 1308822 1223410 1183297 1257629 1411037 1390717 1365172 1386818 1565842
5791A565842K53176J41314r8762j06454l1269P2068J88901Q2130R6196L42407
$$ 1565842 1819018 1960332 1861570 1755116 1723847 1795915 1984816 2066946 2163142 2505549
5781B505549J76788L7507K17369L76147K55558K54162J88246K09031K28402K72767
$$ 2505549 2682337 2719844 2937213 3313360 3568918 3823080 4011326 4220357 4448759 4721526
5771D721526M30318M44116O19916N98807J011619J469444K048998L643160O271312
$$ 4721526 5151844 5595960 6215876 6814683 7826302 9295746 11344744 14987904 21259216
5762B1259216R963352J3348189J0234177M462150m930837j1032614r364452p216945
$$ 21259216 31222568 44570757 54804934 59267084 54336247 43303633 33939181 26722236
5754B6722236n359033m387388l228790k581698j996857j597838j005375r36872
$$ 26722236 21363203 16975815 13747025 11165327 9168470 7570632 6565257 5628385
5746E628385m59103n80393n86936n40530m17405k18050m7240n3708r5518n6168
$$ 5628385 5169282 4588889 4001953 3461423 3044018 2825968 2778728 2725020 2629502 2573334
5736B573334N8426j46165k15674O7337j66028r8477k06518m2841l6731Q3998k17288
$$ 2573334 2631760 2485595 2269921 2337258 2171230 2072753 1866235 1823394 1786663 1870661 1653373
5725A653373n2447J4671j6479J61195r2325q8630k18961O8052J5239j90025Q5124
$$ 1653373 1600926 1615597 1599118 1760313 1667988 1579358 1360397 1428449 1443688 1253663 1338787
5714A338787J90738j14611k04233O5717J58289M6734k87917o7474J41166O8079
$$ 1338787 1529525 1414914 1210681 1276398 1434687 1481421 1193504 1126030 1267196 1335275
5704A335275m7585J5513m4383m6942J42563m4631Q1109k52272L7858m9491j96240
$$ 1335275 1287690 1303203 1258820 1211878 1354441 1309810 1390919 1138647 1176505 1127014 930774
5693I30774j44794L0795M5284k60054J25076K38009j2866k1322p1887M3409K9606
$$ 930774 785980 816775 862059 602005 727081 965090 952224 930902 859015 902424 932030
5682I32030r2844n8332r783m8938J9422R35o2741l2280O1277K34942p3780k20601
$$ 932030 839186 780854 771071 722133 741555 742490 679749 647469 708746 943688 869908 649307
5670F49307n5470N026j22530K64759K14867j61162r389J05072j5354j16414j54060
$$ 649307 593837 598863 476333 741092 955959 794797 785408 890480 875126 758712 604652
5659F04652J288J36958j6588r8823q1709J30889L0006J8463m4153J28523j29318
$$ 604652 605940 742898 726310 627487 545778 676667 706673 725136 680983 809506 680188
5648F80188n529K2721l2664J8298J45242P896k38436j6877R9995J28963j63884
$$ 680188 674659 697380 664716 683014 828256 836152 597716 580839 680834 809797 645913
5637F45913J09595o7390j30755n2177K28073J71161q8462k0038L6485j7157j76133
$$ 645913 755508 688118 557363 505186 733259 904420 815958 795920 832405 815248 639115
5626F39115j08072J35094j50623q4038J69161l0613K5483k9548R3576N4617J66644
$$ 639115 531043 666137 515514 431476 600637 570024 595507 565959 659535 714152 880796
5615H80796l7416K4251K7592j31254K6949J46643q3520j6911j46189n8023m8752
$$ 880796 843380 867631 895223 763969 790918 937561 854041 837130 690941 632918 584166
5604E84166J19543K34970j36303j20017j3048Q3365j59243n6799N8596J42956
$$ 584166 703709 938679 802376 682359 669311 752676 593433 536634 595230 738186
5594G38186q3620N0477K10882q2699k00607J6567J42831L4242l7760j1567J66533
$$ 738186 654566 705043 915925 833226 632619 649186 792017 826259 788499 776932 943465
5583I43465J55138k46064P3127M3765k20376j361L6839p7628J33839j05777J26859
$$ 943465 1098603 852539 925666 969431 749055 747694 784533 706905 840744 734967 861826
5572H61826J02459p5828p5617J56424k1411K2175Q2003m4254Q4513j18931p9822
$$ 861826 964285 888457 812840 969264 947853 970028 1052031 1007777 1092290 973359 893537
5561H93537J20503j79226j13282J5616M0681J0854O2033M7192k19269R2559N2680
$$ 893537 1014040 834814 721532 737148 777829 788683 850716 897908 678639 771198 823878
5550H23878q823l9640Q2704j7073O8688j46056j32471J81691o3032Q3754J22827
$$ 823878 815055 775415 858119 841046 909734 763678 631207 812898 749866 833620 956447
5539I56447j38576R6807m8985P5497J42227j12606p4353J07761Q244o729j11546
$$ 956447 817871 914678 865693 941190 1083417 970811 896458 1004219 1012463 1005734 894188
5528H94188j32634n0718L735N5532p8003R7407q6885J35179J43287j5515k0791
$$ 894188 761554 710836 714571 770103 692100 789507 702622 837801 981088 965573 944782
5517I44782J75326P2329j65376j05238J11576M8773k02479K6679J47101p2921
$$ 944782 1120108 1192437 1027061 921823 1033399 1082172 879693 906372 1053473 980552
5507I80552J4987Q9017j03242j7037N6060N8838j32671q101j200N5615L6585J02115
$$ 980552 995539 1084556 981314 964277 1020337 1079175 946504 938403 937203 992818 1029403 1131518
5495A131518j21606p7408L7451N126j14648p4545J81109J47560m0555j61344O2879
$$ 1131518 1009912 932504 969955 975081 860433 785888 966997 1114557 1074002 912658 975537
5484I75537k0883r6668M5741J731K0781j13963O5212J82414J61634q3474r2379
$$ 975537 954654 857986 903727 905458 926239 812276 877488 1059902 1221536 1138062 1045683
5473A045683Q4025o2988L9682j1570K8938p8120N7942J65988J16864j9420n953
$$ 1045683 1129708 1066720 1106402 1094832 1123770 1045650 1103592 1269580 1386444 1367024 1361071
5462A361071N0198q8629l0962J09736o639j6908n6775J31371K01081j94295R4256
$$ 1361071 1411269 1322640 1291678 1401414 1394775 1377867 1321092 1452463 1653544 1459249 1553505
5451A553505k1326o6942K34513M5303j99398L107k2001J9191J40587q3802p1302
$$ 1553505 1532179 1465237 1699750 1745053 1545655 1548762 1526761 1545952 1686539 1602737 1531435
5440A531435N6877j74139R0468L8976M9395J31736Q9126n1655J14430M0509r6580
$$ 1531435 1588312 1414173 1504641 1543617 1593012 1724748 1813874 1762219 1876649 1917158 1820578
5429A820578j10076o3332m7479j03698q874K4763o8812K22083j00587k28133J07635
$$ 1820578 1710502 1647170 1599691 1495993 1487119 1511882 1443070 1665153 1564566 1336433 1444068
5418A444068J01824M1327j75581N1701K1785Q9693M861P2617o5634m6108j51025
$$ 1444068 1545892 1587219 1411638 1463339 1485124 1574817 1579678 1652295 1586661 1540553 1389528
5407A389528K12841R7991j57754L5921N0125j17130j7922J3056l8551K7588L0243
$$ 1389528 1602369 1700360 1542606 1578527 1628652 1511522 1493600 1506656 1468105 1495693 1525936
5396A525936j17802j1254n7175K09432J0103N4924r789N2088J1741r5085j06777
$$ 1525936 1408134 1396880 1339705 1549137 1559240 1614164 1604375 1656463 1668204 1573119 1466342
5385A466342Q8678J26468r451n3637l5393O2187n3768K04412l1135j8340J19974
$$ 1466342 1555020 1681488 1672037 1618400 1583007 1645194 1591426 1795838 1764703 1746363 1866337
5374A866337J10363k81213K0428J58771J84659j32339j45034R1977l8673k0570
$$ 1866337 1976700 1695487 1715915 1874686 2059345 1927006 1781972 1873949 1835276 1814706
5364A814706O3028J14760l0521K0868J03630R2933n9910j25274Q4004j18925m9973
$$ 1814706 1877734 1992494 1961973 1982841 2086471 2179404 2119494 1994220 2078224 1959299 1909326
5353A909326J82198K9120o8988q1638J79897K11636q1895j84943P1433L1932p6655
$$ 1909326 2091524 2120644 2051656 1970018 2149915 2361551 2279656 2094713 2166146 2198078 2121423
5342B121423P6211J34615j08621j85951M5440Q7118p2840j50236K48285L48700
$$ 2121423 2197634 2332249 2223628 2037677 2083117 2170235 2097395 1947159 2195444 2544144
5332B544144j14935R28m4766n6356l1299J44173O6938q4854J3505J09947L9766
$$ 2544144 2429209 2430137 2385371 2329015 2297716 2441889 2508827 2423973 2437478 2547425 2587191
5321B587191m526j30580O2033J50518o7913J33099J68097K2608K1758O8761J19520
$$ 2587191 2582665 2452085 2514118 2664636 2596723 2729822 2897919 2920527 2942285 3011046 3130566
5310C130566N9135j80557P7956Q8201l9150k9639K55817P6115j47874n0266J41235
$$ 3130566 3189701 3009144 3087100 3175301 3136151 3106512 3362329 3438444 3290570 3240304 3381539
5299C381539R34R4259J43286J31264r2121r7547J28748K04499R7702l7695J11909
$$ 3381539 3382473 3476732 3620018 3751282 3659161 3561614 3690362 3894861 3992563 3954868 4066777
5288D066777N4831j10776M1604J13808K4972J58716K23856p103j49193J97419
$$ 4066777 4121608 4010832 4052436 4166244 4191216 4349932 4573788 4566685 4417492 4614911
5278D614911J97138n6004J07815K33739K01606J29320R9427K02385J60240J72301
$$ 4614911 4812049 4756045 4863860 5097599 5299205 5428525 5527952 5730337 5890577 6062878
5268F062878J59830J91404R7426J23806L78150J65908n873J00127o6981J76141
$$ 6062878 6222708 6414112 6511538 6635344 7013494 7179402 7173529 7273656 7206675 7382816
5258G382816M3351m5096K79911Q7763r078l011O0477K46312l6699J09223K05100
$$ 7382816 7426167 7381071 7660982 7748745 7739667 7736656 7797133 8043445 8006746 8115969 8321069
5247H321069K57837J46023J60015N21839J17952J32964L37917L67303k474M13022
$$ 8321069 8578906 8724929 8884944 9406783 9524735 9657699 9995616 10362919 10360445 10773467
5237A0773467M59051N02704L74715O18041R86084Q38921J141583J076776Q18241
$$ 10773467 11232518 11735222 12109937 12727978 13714062 14552983 15694566 16771342 17589583
5228A7589583O54915R68239R71593P60686N49594O37600P04213P62639P63136
$$ 17589583 18244498 19212737 20184330 20945016 21494610 22132210 22836423 23599062 24362198
5219B4362198O08137L79596M19501K87340O51088M00426J71045L35373K74464
$$ 24362198 24970335 25349931 25769432 26056772 26707860 27108286 27279331 27614704 27889168
5210B7889168L69579J89011P15283O61334N82670J015637J406231J646464J764298
$$ 27889168 28258747 28447758 29163041 29824375 30407045 31422682 32828913 34475377 36239675
5201C6239675K062590K324492K715099K675796K236160K251767K124284K004440
$$ 36239675 38302265 40626757 43341856 46017652 48253812 50505579 52629863 54634303
5193E4634303K538259K839759L008382L744911M330450N074363N367566N305074
$$ 54634303 57172562 60012321 63020703 66765614 71096064 76170427 81537993 86843067
5185H6843067N069836M559470M170422M149663L986314L361573L150035K814721
$$ 86843067 91912903 96472373 100642795 104792458 108778772 112140345 115290380 118105101
5177A18105101K455298K172320J816075J060652j26382j048783j570675k059189
$$ 118105101 120560399 122732719 124548794 125609446 125483064 124434281 122863606 120804417
5169A20804417k411604k317734k396343k757969l302765l356164l663532m172298
$$ 120804417 118392813 116075079 113678736 110920767 107618002 104261838 100598306 96426008
5161I6426008m129784l975763l366460k961884k909047k785072k927667l250156
$$ 96426008 92296224 88320461 84954001 81992117 79083070 76297998 73370331 70120175
5153G0120175l181003l027784k675220k267573j890185j758895j248805j210540
$$ 70120175 66939172 63911388 61236168 58968595 57078410 55319515 54070710 52860170
5145E2860170j325397j871279k340792k711089l063255k847331k396971j876857
$$ 52860170 51534773 49663494 47322702 44611613 41548358 38701027 36304056 34427199
5137C4427199j523755j381563j144481n53281m32699p20068p94255j204865j397589
$$ 34427199 32903444 31521881 30377400 29824119 29391420 28671352 27877097 26672232 25274643
5128B5274643j491171j401881j171566j092464j095853p07415p37661q63705p49064
$$ 25274643 23783472 22381591 21210025 20117561 19021708 18314293 17576632 16712927 15963863
5119A5963863m52255k37134m65742m27533k09422m07414n22465k77686l65839
$$ 15963863 15511608 15274474 14808732 14381199 14171777 13764363 13241898 12964212 12598373
5110A2598373m63082k46159k832k03282j86536j72520j81387k93514k85313j72671
$$ 12598373 12135291 11889132 11886300 11683018 11496482 11323962 11142575 10849061 10563748 10391077
5100A0391077j06504k05860r9841j62826n6137k57719k40539k40234n3993l20874
$$ 10391077 10284573 10078713 9978872 9816046 9759909 9502190 9261651 9021417 8967424 8646550
5090H646550j45153L6111j41675k62541j21839J6633o6983r9600j23827q7276
$$ 8646550 8501397 8537508 8395833 8133292 8011453 8028086 7961103 7861503 7737676 7650400
5080G650400j01755r178o7863j61809j27872r6286j14829j48616j67809M1236
$$ 7650400 7548645 7539467 7471604 7309795 7181923 7085637 6970808 6822192 6654383 6695619
5070F695619L7238R7062j61250j34022j24045k00515j01582m7346J40883K9380
$$ 6695619 6732857 6829919 6668669 6534647 6410602 6210087 6108505 6061159 6202042 6231422
5060F231422j85299j37931r7998p7738O9687k6053n6524n7966J19574j12643j25062
$$ 6231422 6046123 5908192 5810194 5732456 5802143 5776090 5719566 5661600 5781174 5668531 5543469
5049E543469j3807J0322j51100j88512J57383j14814l4736J1837j07685N0742
$$ 5543469 5529662 5539984 5388884 5200372 5357755 5242941 5208205 5220042 5112357 5163099
5039E163099J37908L656M6329k01689k3590J23769j32778l3137N2618j9501j73010
$$ 5163099 5301007 5304663 5350992 5149303 5125713 5249482 5116704 5083567 5136185 5116684 4943674
5028D943674m0612O557Q1222j5935L4200n7909M1040L0136q5969O0582J220J0134
$$ 4943674 4903062 4909619 4990841 4974906 5009106 4951197 4992237 5022373 4936404 4996986 4998206 5008340
5016E008340J5315J49859j5079J15364K54126j523r335J9524J0876j3089k16773
$$ 5008340 5023655 5173514 5158435 5273799 5527925 5526402 5517067 5536591 5547467 5534378 5317605
5005E317605j15847l1204l9743O9868J51415j32382Q9960K29300P9525l2436j18674
$$ 5317605 5201758 5170554 5130811 5200679 5352094 5219712 5309672 5538972 5618497 5586061 5467387
4994E467387J00674P8273M6807K40888L13335K70627K45165M84257P41885R48032
$$ 5467387 5568061 5646334 5693141 5934029 6247364 6517991 6763156 7247413 7989298 8937330
4984H937330J211593J649934J555601Q29168J67602m89756j319008j231616j121498
$$ 8937330 10148923 11798857 13354458 14183626 14351228 13861472 12542464 11310848 10189350
4975A0189350o32100l00530l90305l30205j26420j25577k40901o8688k9670K226
$$ 10189350 9557250 9256720 8866415 8536210 8409790 8284213 8043312 7974624 7944954 7947180
4965G947180o5526K09777n3868L1440K7839J53365K05752J70074N6801O9714J9145
$$ 7947180 7881654 8091431 8037563 8069003 8096842 8250207 8455959 8626033 8682834 8752548 8771693
4954H771693q6133N3084J98339R6731L2874k25005j97469o102M7129R6738J54590
$$ 8771693 8685560 8738644 8936983 9033714 9066588 8841583 8644114 8638012 8685141 8781879 8936469
4943H936469J44719J96365K68547L15651J21817m657P7711m0635j11707j5612
$$ 8936469 9081188 9277553 9546100 9861751 9983568 9978911 10056622 10015987 9904280 9888668
4933I888668R9782N9251J34295J12591J32002J80725L49455K07109K24397R8355
$$ 9888668 9988450 10047701 10181996 10294587 10426589 10607314 10956769 11163878 11388275 11486630
4923A1486630M02909L73198r5213J72159L15335K59472K31836L60479M35201M78367
$$ 11486630 11889539 12262737 12167524 12339683 12655018 12914490 13146326 13506805 13942006 14420373
4913A4420373M03006M44202O86642L63787O09410Q02916J055192P57316R39273
$$ 14420373 14823379 15267581 15954223 16318010 16927420 17730336 18785528 19542844 20482117
4904B0482117J090945J279962J284498J594897J852776J619432J843317J876206
$$ 20482117 21573062 22853024 24137522 25732419 27585195 29204627 31047944 32924150
4896C2924150K006216J918149J536931J766270J705681J530796J476537J489055
$$ 32924150 34930366 36848515 38385446 40151716 41857397 43388193 44864730 46353785
4888D6353785J168923R13073J011649O49445N63260M56837M75390O06100M45735
$$ 46353785 47522708 48435781 49447430 50096875 50660135 51116972 51592362 52198462 52644197
4879E2644197M23099M73808M68360O90534Q19231P71337P34161J047256J078335
$$ 52644197 53067296 53541104 54009464 54699998 55519229 56290566 57024727 58071983 59150318
4870E9150318J194888J154566J758720K352964K735846K987484L120862K573817
$$ 59150318 60345206 61499772 63258492 65611456 68347302 71334786 74455648 77029465
4862G7029465K170831J989598J352792Q17977J080225J015494J205756J194418
$$ 77029465 79200296 81189894 82542686 83360663 84440888 85456382 86662138 87856556
4854H7856556J217690J280064J070097J130889J282077J166901J000160Q87846
$$ 87856556 89074246 90354310 91424407 92555296 93837373 95004274 96004434 96892280
4846I6892280Q86368R93505J770689J849835K657596L624530N619479Q738145
$$ 96892280 97778648 98772153 100542842 102392677 105050273 108674803 114294282 123032427
4838A23032427J2250988J1902314P195957Q83931l980402l896586l296077k133906
$$ 123032427 135283415 147185729 154381686 155265617 151285215 147388629 144092552 141958646
4830A41958646j448328q49257n27464k30077K49852O10346J198329J921824K694294
$$ 141958646 140510318 139661061 139133597 138903520 139153372 139763718 140962047 142883871 145578165
4821A45578165L342713L487276L171242K297055J120282J96391o00350j064290
$$ 145578165 148920878 152408154 155579396 157876451 158996733 159193124 158592774 157528484
4813A57528484j481265j907127k071237k507913k651501k237431k049890j905163
$$ 157528484 156047219 154140092 152068855 149560942 146909441 144672010 142622120 140716957
4805A40716957j425118q47410l20602j9576K47369M04954K91224k38032n34281
$$ 140716957 139291839 138444429 138123827 138104251 138351620 138756574 139047798 138809766 138275485
4796A38275485j450828k042018k707450l570938m386497n013968n302923n787843
$$ 138275485 136824657 134782639 132075189 128504251 124117754 119103786 113800863 108013020
4788A08013020o119524o028328n996487n769087n633742n422690m923238m161012
$$ 108013020 101893496 95865168 89868681 84099594 78465852 73043162 68119924 63958912
4780F3958912l659430k994776k301984j503274n44758P71817J998719K217931
$$ 63958912 60299482 57304706 55002722 53499448 52954690 53726507 55725226 57943157
4772E7943157K011786J485074O95211K59214k72954j648937k726998l460143l302827
$$ 57943157 59954943 61440017 62135228 62394442 62121488 60472551 57745553 54285410 50982583
4763E0982583k839991k282013j625980r17992m19207L79685J283073K155151K732721
$$ 50982583 48142592 45860579 44234599 43316607 42897400 43277085 44560158 46715309 49448030
4754D9448030K649693K527142K743443L204272K861426J444901p34695k158673
$$ 49448030 52097723 54624865 57368308 60572580 63434006 64878907 64144212 61985539
4746F1985539k397276k782112l699774m803620m983660m332828l567007k769628
$$ 61985539 59588263 56806151 53106377 48302757 43319097 38986269 35419262 32649634
4738C2649634k088866j184514j20712P56874J721207K751860K817830K547682
$$ 32649634 30560768 29376254 29255542 30012416 31733623 34485483 37303313 39850995
4730C9850995J255048M30798J11308o95707j751081l045804l698199l480486k860930
$$ 39850995 41106043 41536841 41648149 40952442 39201361 36155557 32457358 28976872 26115942
4721B6115942k513557j933045j628266j254032j056460q09299o55885m38811m42687
$$ 26115942 23602385 21669340 20041074 18787042 17730582 16921283 16265398 15826587 15383900
4712A5383900m43643k97522q8637j11008J1676J93751J11391p8511j35041r7874
$$ 15383900 14940257 14642735 14554098 14443090 14454766 14648517 14759908 14681397 14546356 14448482
4702A4448482j64149R6919K63068q4915j00872k92260l67023m18894m23933n8666
$$ 14448482 14284333 14381252 14644320 14559405 14458533 14166273 13799250 13380356 12956423 12897757
4692A2897757j91514k23016q7694l3914k37885m438L6832J06943J98033K6114
$$ 12897757 12706243 12483227 12395533 12361619 12123734 12119296 12156128 12263071 12461104 12487218
4682A2487218n7069k15524k72497m62716k03086r3245r0520l3398n9647j78012
$$ 12487218 12430149 12214625 11942128 11479412 11276326 11183081 11092561 11059163 10999516 10821504
4672A0821504l45305m03510l94769j61561j09021j14070L8352K39033L04275J92915
$$ 10821504 10476199 10072689 9677920 9516359 9407338 9293268 9331620 9570653 9874928 10067843
4662A0067843J15777K17449L62428K79311K54195L8320j59002j57459n9530j81257
$$ 10067843 10183620 10401069 10763497 11042808 11297003 11335323 11176321 11018862 10959332 10778075
4652A0778075l15580l29191k28777l4670k17491q164J68888k7265k4084M4582
$$ 10778075 10462495 10133304 9904527 9869857 9652366 9644202 9813090 9785825 9761741 9806323
4642I806323j07836K4091J72907K05281L2752N4270O4957Q0616K14228L86873
$$ 9806323 9698487 9722578 9895485 10100766 10133518 10187788 10252745 10333361 10547589 10934462
4632A0934462N97820N97628Q34968J464999K422731K718022K388211J134973o84963
$$ 10934462 11532282 12129910 12964878 14429877 16852608 19570630 21958841 23093814 22408851
4623B2408851j646525j145875q44782n46604k54759j18625J40770m3601j03014
$$ 22408851 20762326 19616451 18771669 18225065 17970306 17851681 17992451 17948850 17845836
4614A7845836J71157O39032R23530J521121J430805J552924J474083R24567R04311
$$ 17845836 18016993 18656025 19579555 21100676 22531481 24084405 25558488 26483055 27387366
4605B7387366J005772J293847J781846J985241J644281R99252J80135m34255o65456
$$ 27387366 28393138 29686985 31468831 33454072 35098353 36097605 36277740 35843485 35178029
4596C5178029J13999J152922J932823K177002J332159L43290q68071j524997j477547
$$ 35178029 35292028 36444950 38377773 40554775 41886934 42230224 41362153 39837156 38359609
4587C8359609r16653j96520L41560J35342m33821j173912j698196j676539j458768
$$ 38359609 37442956 37246436 37587996 37723338 37289517 36115605 34417409 32740870 31282102
4578C1282102r93689l69201k4897k21193p17556o92961p53608p70376n79994m40901
$$ 31282102 30288413 29919212 29894315 29673122 28955566 28262605 27508997 26738621 26158627 25717726
4568B5717726k09336r4760P4653l269J8911J98468M65240M32727L82412M48366
$$ 25717726 25508390 25413630 25488283 25485014 25503925 25702393 26167633 26600360 26982772 27431138
4558B7431138N48799N12084N39761N30291O63430P56022O06641O78702Q43908
$$ 27431138 27979937 28492021 29031782 29562073 30225503 30981525 31588166 32266868 33110776
4549C3110776N77139O80755N51380Q31822O26655Q87701J119447J248584J463886
$$ 33110776 33687915 34368670 34920050 35751872 36378527 37266228 38385675 39634259 41098145
4540D1098145J653828J895303J971979K039152K405803K643656K754820L139190
$$ 41098145 42751973 44647276 46619255 48658407 51064210 53707866 56462686 59601876
4532E9601876L637651M021816M371783N680736O735176Q627111J1279154J5328574
$$ 59601876 63239527 67261343 71633126 77313862 84049038 92676149 103955303 119283877
4524A19283877K1266351K8660624L5865399M0482853L9965950L4515408K4733487
$$ 119283877 140550228 169210852 205076251 245559104 285525054 320040462 344773949
4517C44773949J1783900k418719j4763220k3614129k7714391k6652879k0831541
$$ 344773949 356557849 354139130 339375910 315761781 288047390 261394511 240562970
4510B40562970j2692733l211955P840640K0271835L3857594M5075788M9859457
$$ 240562970 227870237 224658282 232498922 252770757 286628351 331704139 381563596
4503C81563596M5479938L2528614J4313155o117126k3291609l5938301m4160299
$$ 381563596 427043534 459572148 473885303 467768177 444476568 408538267 364377968
4496C64377968m5644586m2318258l6542837l0467605k4927003j9703038j6272068
$$ 364377968 318733382 276415124 239872287 209404682 184477679 164774641 148502573
4489A48502573j4300301j2046981r648387p212107m853652l050771k614293k788029
$$ 148502573 134202272 122155291 112506904 105294797 100441145 97390374 94776081 91988052
4481I1988052k885714k672080k885545l395925m087615m141047l162796j830962
$$ 91988052 89102338 86430258 83544713 80148788 76061173 71920126 68757330 66926368
4473F6926368q38220l25986p41641j246117j396409j062924j523368k607660k919728
$$ 66926368 66088148 65762162 65020521 63774404 62377995 61315071 59791703 57184043 54264315
4464E4264315k209998j382122k53420N41695J98899k06311q48160j001174j456729
$$ 54264315 52054317 50672195 50418775 50960470 51159369 50953058 50104898 49103724 47646995
4455D7646995k197709l092485l805669l500780l029905k554633k006547j740581
$$ 47646995 45449286 42356801 38551132 35050352 32020447 29465814 27459267 25718686
4447B5718686j404194j174456q28839o14889p25162m27438l95521m61168l39270
$$ 25718686 24314492 23140036 22311197 21696308 20971146 20543708 20148187 19687019 19347749
4438A9347749j82250k52583k05440k24862j57734k9462j08730J39731r7214J36008
$$ 19347749 19165499 18912916 18707476 18482614 18324880 18295418 18186688 18326419 18229205 18365213
4428A8365213L43779J10842J45042K39164J61595N9096K11485L07414K35214N3472
$$ 18365213 18708992 18819834 18964876 19204040 19365635 19424731 19636216 19943630 20178844 20232316
4418B0232316J95447K33991K15278K83159L78414M67554N11197N73322Q50694
$$ 20232316 20427763 20661754 20877032 21160191 21538605 22006159 22517356 23090678 23941372
4409B3941372R21263Q02050J065502J010511J064277J156882R71589J222193J259317
$$ 23941372 24862635 25664685 26730187 27740698 28804975 29961857 30933446 32155639 33414956
4400C3414956J359772J549061J449405J167128J145125Q62366Q18358N06930L46341
$$ 33414956 34774728 36323789 37773194 38940322 40085447 40947813 41766171 42273101 42619442
4391D2619442Q31237P28823O33515M60760J41165m83958j045874j162486j655111
$$ 42619442 43450679 44179502 44813017 45273777 45414942 44930984 43885110 42722624 41067513
4382D1067513j243713p95233j005970n13830j86684j21555q20145j074899j639223
$$ 41067513 39823800 39028567 38022597 37508767 37322083 37200528 36380383 35305484 33666261
4373C3666261j808275j485151j008400p63716k33340J14068L8455M62189O92099
$$ 33666261 31857986 30372835 29364435 28600719 28367379 28481447 28519902 28982091 29674190
4364B9674190Q54350Q81865P43167Q88706J090278J435253J384361J672009J628115
$$ 29674190 30528540 31410405 32153572 33042278 34132556 35567809 36952170 38624179 40252294
4355D0252294J541127J406397J391249J070342N22739Q02775P63693R24748R17606
$$ 40252294 41793421 43199818 44591067 45661409 46184148 46986923 47750616 48675364 49592970
4346D9592970Q13949L40354k68215q37752j180049j523746j269453q88263r75910
$$ 49592970 50406919 50747273 50479058 49641306 48461257 46937511 45668058 44779795 43803885
4337D3803885r25408p21473p77583r12365j077549r42447q68729o08046m09264
$$ 43803885 42878477 42157004 41379421 40467056 39389507 38447060 37578331 36970285 36561021
4328C6561021l00351l42635m71342n11600l32257n03359k82221l1506n3730m18576
$$ 36561021 36260670 35918035 35446693 34935093 34602836 34099477 33817256 33785750 33732020 33313444
4318C3313444n84665q92561j045355j285650j137474r85851j000476r11400r66870
$$ 33313444 32728779 31836218 30790863 29505213 28367739 27381888 26381412 25470012 24503142
4309B4503142p45823j012951q45886o97280n64464l40273j48161j45997p3335
$$ 24503142 23757319 22744368 21898482 21201202 20636738 20296465 20148304 20002307 19928972
4300A9928972M26574M53703K97173P30879O27287P87375R13309P30329R50299
$$ 19928972 20355546 20809249 21106422 21837301 22464588 23251963 24165272 24895601 25845900
4291B5845900J172464J028263J460498J368885J477583J416210J441963R40539
$$ 25845900 27018364 28046627 29507125 30876010 32353593 33769803 35211766 36152305
4283C6152305N49480M19638J07759M20078M73832M30084M52729J85228p22941
$$ 36152305 36701785 37121423 37229182 37649260 38123092 38553176 39005905 39191133 38468192
4274C8468192j260379j767177j912806j813818j801314j545964j352218j377995
$$ 38468192 37207813 35440636 33527830 31714012 29912698 28366734 27014516 25636521
4266B5636521j479430j428108j451601j537316j349113j141960j137500r12108
$$ 25636521 24157091 22728983 21277382 19740066 18390953 17248993 16111493 15199385
4258A5199385q33765p00364o59056o38526m69655m02076k06673n12099m15959
$$ 15199385 14365620 13665256 13006200 12367674 11898019 11495943 11289270 10777171 10361212
4249A0361212l02645k23704j42408j66390j47755m6148J5819j85384j28599o4968
$$ 10361212 10058567 9834863 9692455 9526065 9378310 9332162 9347981 9162597 9033998 8969030
4239H969030J41469J81073J98873K43942J51804K7862J89968K07136R8352m0233
$$ 8969030 9110499 9291572 9490445 9734387 9886191 9914053 10104021 10311157 10409509 10369276
4229A0369276m486j05516J349J59195q0477k1751o0447P7296J47315J40247K44835
$$ 10369276 10364790 10259274 10260623 10419818 10339341 10317590 10257143 10334439 10481754 10622001 10866836
4218A0866836K28964K06539J55694K2734M6643k05421k29974j56623j07146j02613
$$ 10866836 11095800 11302339 11458033 11480767 11527410 11321989 11092015 10935392 10828246 10725633
4208A0725633j9376O9025J67375M1067Q1604K76364M10974J89459K82944M74851
$$ 10725633 10706257 10775282 10942657 10983724 11065328 11341692 11752666 11942125 12225069 12699920
4198A2699920M37546N25677M59790L51122N12290J77544K29928M99992M13041
$$ 12699920 13137466 13663143 14122933 14474055 14986345 15163889 15393817 15893809 16306850
4189A6306850J78715M01263O58664N84230N38855N59507O24615N47638K87867
$$ 16306850 16485565 16886828 17545492 18129722 18668577 19228084 19852699 20400337 20688204
4180B0688204K85540N78915L80026J99149M07412N64829L78866L58537K78532
$$ 20688204 20973744 21552659 21932685 22131834 22539246 23104075 23482941 23841478 24120010
4171B4120010L10855K36861L56597K96908K54115J71382O584k9141L71795L18901
$$ 24120010 24430865 24667726 25024323 25321231 25575346 25746728 25753312 25724171 26095966 26414867
4161B6414867M21019L83070L53829L41405N70487P20651Q56776P67994P27621
$$ 26414867 26835886 27218956 27572785 27914190 28484677 29205328 30062104 30830098 31557719
4152C1557719N94821L50492M24522M67070M74572O30351Q81078Q47208J012476
$$ 31557719 32152540 32503032 32927554 33394624 33869196 34499547 35380625 36227833 37240309
4143C7240309J184757J318724J349315J158799Q93887Q43577R78450R26294Q30039
$$ 37240309 38425066 39743790 41093105 42251904 43145791 43989368 44967818 45894112 46724151
4134D6724151R90961R82655J193338R75644Q03919P62613P07310P07116J044702
$$ 46724151 47715112 48697767 49891105 50866749 51670668 52433281 53140591 53847707 54892409
4125E4892409R85364O23908R19348J105489J191114J292770R72890Q18377Q02579
$$ 54892409 55877773 56501681 57421029 58526518 59717632 61010402 61983292 62801669 63604248
4116F3604248P49318M97190Q14005N77851K67759N0395l91706l60541l87527n24336
$$ 63604248 64353566 64850756 65664761 66242612 66510371 66560766 66169060 65808519 65420992 64896656
4106F4896656m64994j36792k34172k11692K90983K36615K01712M1151J2059j57343
$$ 64896656 64431662 64294870 64060698 63849006 64139989 64376604 64578316 64619467 64631526 64474183
4096F4474183k31923K02927L16753J34335L06744M18439K24075M7400j2358j4345
$$ 64474183 64242260 64445187 64761940 64896275 65203019 65621458 65845533 65892933 65880575 65866230
4086F5866230K68654N03384J024808J507996J169934M6436r30397p07364q89725
$$ 65866230 66134884 66638268 67663076 69171072 70341006 70387442 69457045 68749681 67859956
4077F7859956n44344m1740L59324M85902P19772O80655N51558J79629j63750m03951
$$ 67859956 67315612 67273872 67633196 68119098 68838870 69519525 70071083 70250712 70086962 69683011
4067F9683011l03486n23264o39066q17731r21942p75337p19624p95056p75066
$$ 69683011 69379525 68856261 68217195 67399464 66477522 65702185 64982561 64187505 63412439
4058F3412439j212314j011114p92046p02086n27810o08925m14341n76781p30487
$$ 63412439 62200125 61189011 60396965 59694879 59167069 58558144 58143803 57567022 56836535
4049E6836535j074242j171448j123181j236991j374506j414001j260394j243134
$$ 56836535 55762293 54590845 53467664 52230673 50856167 49442166 48181772 46938638
4041D6938638j187929r40264r06106p61129r43788j170886j011798r40617p65445
$$ 46938638 45750709 44810445 43904339 43143210 42199422 41028536 40016738 39076121 38310676
4032C8310676r28988q90056p73041j082221q99065q09990o65422r17831q59842
$$ 38310676 37381688 36491632 35718591 34636370 33737305 32927315 32261893 31344062 30484220
4023C0484220q70034p03492p33314p41942m53193o97386o63510p10608o57547
$$ 30484220 29614186 28910694 28177380 27435438 26982245 26284859 25621349 24910741 24253194
4014B4253194p76338o04876l61894m70101m69885m34858l30682k62164l60279
$$ 24253194 23476856 22871980 22510086 22039985 21570100 21135242 20804560 20542396 20182117
4005B0182117l90770l23454k91987n81401n46202k06363m94720k29867k58622
$$ 20182117 19791347 19467893 19175906 18594505 18048303 17841940 17347220 17117353 16858731
3996A6858731k72438l37169l04275l35077m20601n07936n39456l65590m75075
$$ 16858731 16586293 16249124 15944849 15609772 15189171 14681235 14141779 13776189 13301114
3987A3301114m66285l04970n80643m64295n36801j84375m11644k45460k24702
$$ 13301114 12834829 12529859 11949216 11484921 10948120 10763745 10352101 10106641 9881939
3978I881939l00661l28196k67389p7863k03537K3136j69445j85224n0990k2391
$$ 9881939 9581278 9253082 8985693 8907830 8704293 8727429 8557984 8372760 8321770 8299379
3968H299379J54020Q7204j23235K43641L52592R69063J363150J094396L53645
$$ 8299379 8453399 8540603 8417368 8661009 9013601 9982664 11345814 12440210 12793855
3959A2793855o33578j219105j271577j169230o85741p46604m94211l24565m48440
$$ 12793855 12160277 10941172 9669595 8500365 7814624 7068020 6573809 6249244 5800804
3950E800804j86131k88957q3014o8174j35404j70349o0994j05374j74021P2569
$$ 5800804 5614673 5325716 5242702 5174528 5039124 4868775 4807781 4702407 4528386 4600955
3940D600955q1151R1782N2438n5748K56179J31062J17971N71364J024933J330065
$$ 4600955 4519804 4611586 4664024 4608276 4864455 4995517 5113488 5684852 6709785 8039850
3930H039850J109434Q57395k20202j047355j061223q63255p79730o56730l97838
$$ 8039850 9149284 10006679 9786477 8739122 7677899 6814644 6034914 5378184 4980346
3921D980346j37385k57034l17134k04590j28416J2657r3993P76n5295k32299L4488
$$ 4980346 4842961 4585927 4268793 4064203 3935787 3948444 3854451 3855227 3799932 3567633 3602121
3910C602121L3561n6305j1583k8834j9538k03137J34956j5869K4090p6334j81499
$$ 3602121 3635682 3579377 3567794 3538960 3519422 3316285 3451241 3435372 3459462 3383128 3201629
3899C201629J23617N7142o0970J14334J42789l6998q3763J91833p9420j25577
$$ 3201629 3325246 3382388 3321418 3435752 3578541 3541543 3457780 3649613 3570193 3444616
3889C444616J5635Q7767q3856n9022L02843N888j20623j88258O5414Q541j01481
$$ 3444616 3460251 3548018 3464162 3405140 3707983 3713871 3593248 3404990 3470404 3478945 3377464
3878C377464L4102R9929p725J7215o5705K0126K02572q6287k41Q0985q4954J86996
$$ 3377464 3411566 3511495 3503770 3520985 3455280 3475406 3677978 3591691 3591450 3672435 3587481 3774477
3866C774477P1911R0280l407j5913N3215R5623j04808Q4038N2827R9553R7565
$$ 3774477 3846388 3936668 3933261 3917348 3970563 4066186 3961378 4045416 4098243 4197796 4295361
3855D295361j5108O9233Q497m8044J08777P1984K64547J25284j611J98876j25129
$$ 4295361 4280253 4349486 4357983 4309939 4418716 4490700 4755247 4880531 4878920 5077796 4952667
3844D952667j12035J53066J79915J99369O523O3529P9693K60701K21211J5369
$$ 4952667 4840632 4993698 5173613 5372982 5379505 5443034 5522727 5783428 6004639 6020008
3834F020008K04444R8284L97608M27539K91399M00336N01769L39147K72317O30945
$$ 6020008 6224452 6322736 6720344 7147883 7439282 7839618 8341387 8680534 8952851 9583796
3824I583796O64281M28703N37272M24360M60751M47395O30268P15062M43207O04389
$$ 9583796 10248077 10676780 11214052 11638412 12099163 12546558 13176826 13891888 14335095 14939484
3814A4939484P68911M44471M12720L40586K00528O5767n1317j20936k05739m74556
$$ 14939484 15708395 16152866 16565586 16906172 17106700 17172467 17121150 17000214 16794475 16319919
3804A6319919l99101k51024l68056l00447k09797P7504k8057r0108L80889L59935
$$ 16319919 15920818 15669794 15301738 15001291 14791494 14868998 14840941 14750833 15131722 15491657
3794A5491657K55110K83608N24533K57737J88781L69526L78955M09516N63238
$$ 15491657 15746767 16030375 16554908 16812645 17001426 17370952 17749907 18159423 18722661
3785A8722661O30055P64294P67895O41158Q94009J162560J308311J300623J512403
$$ 18722661 19352716 20117010 20884905 21526063 22420072 23582632 24890943 26191566 27703969
3776B7703969J529931J335865J314340J127233Q02031L91568N5231l81378m92970
$$ 27703969 29233900 30569765 31884105 33011338 33813369 34204937 34260168 33878790 33385820
3767C3385820o32992o14203o19383m55274m41323j70520Q6817J66835J27041K08337
$$ 33385820 32752828 32138625 31519242 31063968 30622645 30452125 30538942 30705777 30832818 31041155
3757C1041155K8595k03229j19865j39401j38049O8951J6445m2186l62477n07611
$$ 31041155 31069750 30866521 30746656 30607255 30469206 30538157 30554602 30512416 30149939 29642328
3747B9642328l79821l12209l59189k77006J5251m7303K8885O35751O19596M81115
$$ 29642328 29262507 28950298 28591109 28314103 28329354 28282051 28310936 28946687 29566283 30047398
3737C0047398M62524M47394N51140q7325n876N1860k28107o3884L18014N97252
$$ 30047398 30509922 30957316 31508456 31421131 31415255 31467115 31239008 31175124 31493138 32090390
3727C2090390P51064J033312J509096J818102J616814J196093Q12752R6856l00377
$$ 32090390 32841454 33874766 35383862 37201964 38818778 40014871 40827623 40924479 40624102
3718D0624102l99293l20984l10787j20220n01412r95804j310413j563129j917351
$$ 40624102 40224809 39903825 39593038 39472818 38971406 37975602 36665189 35102060 33184709
3709C3184709j820977j723288j525297j384792r44883p44670o04632l44431j77483
$$ 33184709 31363732 29640444 28115147 26730355 25785472 25040802 24436170 24091739 23914256
3700B3914256k60431l52392j40688j89830k94061r8129P0170K12354M76212M80914
$$ 23914256 23653825 23301433 23160745 22970915 22676854 22578725 22648895 22861249 23337461 23818375
3690B3818375L34198L81006M50266L88938J50584J99815j01479j75117k57298
$$ 23818375 24152573 24533579 24983845 25372783 25523367 25723182 25621703 25446586 25189288
3681B5189288l34731j08195k816k24616m92744k74967n01902p34877p12762n17724
$$ 25189288 24854557 24746362 24743546 24518930 24026186 23751219 23249317 22514440 21801678 21283954
3671B1283954l74728l75840k34393j0143M1691n3571Q1834J43798n1096m41429
$$ 21283954 20909226 20533386 20298993 20288850 20330541 20276970 20358804 20502602 20451506 20010077
3661B0010077n56680r23540j010351r67364r86110j048260r38327o54029o74458
$$ 20010077 19453397 18529857 17519506 16552142 15566032 14517772 13579445 12925416 12250958
3652A2250958o31700m81365k65252k85427j69551p3933N4076K4222j52106k12233
$$ 12250958 11619258 11137893 10872641 10587214 10417663 10343730 10397806 10422028 10269922 10057689
3642A0057689J60243J99734o0374J14949J09245n4890q1585J09117k60878k36368
$$ 10057689 10217932 10417666 10357292 10472241 10581486 10526596 10445011 10554128 10293250 10056882
3632A0056882J7428J17731J46265J49993K23521M9736J4854j81391l10687l81263
$$ 10056882 10074310 10192041 10338306 10488299 10711820 10761556 10776410 10595019 10284332 9903069
3622I903069n31871o28207n18583m28975l77828l15333k95067k94424k29307j82874
$$ 9903069 9371198 8742991 8224408 7795433 7417605 7102272 6807205 6512781 6283474 6100600
3612F100600p8253j84148k20345k97111J50653o6525k40100J24139L3124L5273
$$ 6100600 6022347 5838199 5617854 5320743 5471396 5404871 5164771 5288910 5322034 5357307
3602E357307q126j39921k79971o7731K51800o937k7749k9104J25652Q7818O8440
$$ 5357307 5349181 5209260 4929289 4861558 5113358 5106421 5078672 5049568 5175220 5263038 5331478
3591E331478M8432J05251M2173p5535K9133J52172J71566L13797p2237J9337M1868
$$ 5331478 5379910 5485161 5527334 5451799 5480932 5633104 5804670 6118467 6046230 6065567 6107435
3580F107435j83526M6715K90288J98613l774J33727n9023P5749R6354J82441j22010
$$ 6107435 5923909 5970624 6260912 6459525 6455751 6589478 6530455 6606204 6702558 6884999 6762989
3569F762989j1777N4327n229Q9229l2167O5398M6640K44676J91504J58143J78208
$$ 6762989 6751212 6805539 6800310 6889539 6857372 6922770 6969410 7214086 7405590 7563733 7741941
3558G741941J73249J32622L48569K93169J55955K52751L00145O2969J96688L14177
$$ 7741941 7915190 8047812 8396381 8689550 8845505 9098256 9398401 9461370 9658058 9972235
3548I972235J79812k5367J94357J66476K13054K66308L10529J00992m8265K82516
$$ 9972235 10152047 10126680 10321037 10487513 10700567 10966875 11277404 11378396 11330131 11612647
3538A1612647R7694J34304K01134J39915K18006L78698L75134L61049N15123J43629
$$ 11612647 11710341 11844645 12045779 12185694 12403700 12782398 13157532 13518581 14033704 14177333
3528A4177333K62826K80524K11603L13584M47682M14524L11867K58746J52535
$$ 14177333 14440159 14720683 14932286 15245870 15693552 16108076 16419943 16678689 16831224
3519A6831224K43343M22098O37563J75259M60542P45678P44605P57593J079120
$$ 16831224 17074567 17496665 18134228 18309487 18770029 19515707 20260312 21017905 22097025
3510B2097025J430898J499117J513136J690836J905646J947332J689907J810379
$$ 22097025 23527923 25027040 26540176 28231012 30136658 32083990 33773897 35584276
3502C5584276J555848J522655J223710Q01034K30905m00050j153450j529756j713790
$$ 35584276 37140124 38662779 39886489 40687523 40918428 40518378 39364928 37835172 36121382
3493C6121382j400341j036727r11620n91286o10358l72355j26511k31323j70037
$$ 36121382 34721041 33684314 32772694 32181408 31571050 31198695 31072184 30840861 30670824
3484C0670824n6574j71443j36946j54977l41466n97409o60987j165448j344713
$$ 30670824 30614250 30442807 30305861 30150884 29809418 29212009 28551022 27385574 26040861
3475B6040861j331423j225479j188866j038790q62927p68149n25329n24292j45970
$$ 26040861 24709438 23483959 22295093 21256303 20393376 19625227 19099898 18575606 18429636
3466A8429636j68938k38087l34903k53298n38164j19465j71928k47771p6200k73189
$$ 18429636 18260698 18022611 17687708 17434410 16896246 16776781 16604853 16357082 16280882 16007693
3456A6007693K5208L0538m3981n7931O059J73227J00111k6524O1462K58875J06445
$$ 16007693 16032901 16063439 16019458 15961527 15967586 16140813 16240924 16214400 16275862 16534737 16641182
3445A6641182J18504K53529L93139K49199L22861M27715M46761N05380M00668
$$ 16641182 16759686 17013215 17406354 17655553 17978414 18406129 18852890 19358270 19758938
3436A9758938N07714L72994M66964L90598K80391M31997K08275M11890M47448
$$ 19758938 20266652 20639646 21106610 21497208 21777599 22209596 22417871 22829761 23277209
3427B3277209L31687L75685M73111M72987O89544Q23854P68762Q14174O90006
$$ 23277209 23608896 23984581 24457692 24930679 25620223 26444077 27212839 28027013 28717019
3418B8717019O28414P98197P71983P48657J197085J565113J473706J657809J995237
$$ 28717019 29345433 30143630 30915613 31664270 32861355 34426468 35900174 37557983 39553220
3409C9553220K086393K497988K672177L140954L301853L800231M118272M609404
$$ 39553220 41639613 44137601 46809778 49950732 53252585 57052816 61171088 65780492
3401F5780492N267206O242842P246765Q379095J0037810J2485154J5651757J9862389
$$ 65780492 71047698 77290540 84537305 92916400 102954210 115439364 131091121 150953510
3393A50953510K5293410L1677001L7259971M0098977L6506216K4756533P805111
$$ 150953510 176246920 207923921 245183892 285282869 321789085 346545618 354350729
3386C54350729q902595k1468245k8418567l0179309k8518814k5210645k1387690
$$ 354350729 345448134 323979889 295561322 265382013 236863199 211652554 190264864
3379A90264864j7708724j4193095j1450820q900939o657279m727661l063159j905404
$$ 190264864 172556140 158363045 146912225 138011286 131354007 126626346 123563187 121657783
3371A21657783k46453J484831K810876M900063P387550J0535895J4071958J9059565
$$ 121657783 121411330 122896161 125707037 130607100 137994650 148530545 162602503 181662068
3363A81662068K4685557L0344349L4007211L2300381K3913024Q403316r064934
$$ 181662068 206347625 236691974 270699185 302999566 326912590 335315906 326250972
3356C26250972k2836220l0583222l2538860l0899040k7390474k3477700j9897790
$$ 326250972 303414752 272831530 240292670 209393630 182003156 158525456 138627666
3349A38627666j6384733j3784851j1739527r800775q200247p174135o251428n630981
$$ 138627666 122242933 108458082 96718555 86917780 78717533 71543398 65291970 59660989
3341E9660989m791802m069829l487030k840233k408264k165625j933049j775414
$$ 59660989 54869187 50799358 47312328 44472095 42063831 39898206 37965157 36189743
3333C6189743j415814j250764j346181j365464j451693j076484j076904r73415
$$ 36189743 34773929 33523165 32176984 30811520 29359827 28283343 27206439 26233024
3325B6233024j060883r15551p41399p84655o45793p52398n54301n18297n25425
$$ 26233024 25172141 24256590 23515191 22730536 22084743 21332345 20778044 20259747 19734322
3316A9734322m43870m79182m97110j83091l40934m83805l81383l95885m75495
$$ 19734322 19290452 18811270 18314160 18131069 17790135 17306330 16924947 16529062 16053567
3307A6053567l39811m21273m30817l20315k20024l84114k02639k57765m49341
$$ 16053567 15713756 15292483 14861666 14541351 14321327 13937213 13734574 13476809 13027468
3298A3027468k97388k70246k85101l74185j99846k53267j80044j15807m24839
$$ 13027468 12730080 12459834 12174733 11800548 11600702 11347435 11167391 11051584 10626745
3289A0626745l5002j53628k47355k22685j02214r5237k91387n8986l6417r6775
$$ 10626745 10591743 10438115 10190760 9968075 9865861 9770624 9479237 9420251 9383834 9287059
3279I287059j31543j07687n1737j2599O856j10115m0874r4257j46554m6273j42078
$$ 9287059 9155516 9047829 8996092 8983493 8990349 8880234 8839360 8745103 8598549 8552276 8410198
3268H410198k84995j96040J45593j86035k06272r8093k80779J215J7159M4088
$$ 8410198 8125203 7929163 8074756 7888721 7682449 7584356 7303577 7304792 7321951 7366039
3258G366039M4811j5938Q2318J0643m2274N7341J07629k0910j63263o1451R6477
$$ 7366039 7410850 7394912 7477230 7487873 7445599 7502940 7610569 7589659 7426396 7364945 7461422
3247G461422O7937J4914R6582k56889o2543q1823o7603J8032j4047l4006Q7255
$$ 7461422 7529359 7544273 7640855 7383966 7321423 7239600 7171997 7190029 7175982 7141976 7229231
3236G229231j86823j11149J08033j8741r219j85810K7565R4106l1238m2668J84988
$$ 7229231 7042408 6931259 7039292 7020551 7011332 6825522 6853087 6947193 6915955 6873287 7058275
3225G058275K4548M9276J8496J42453K43953p900J19593O6498R816j00845J20105
$$ 7058275 7082823 7132099 7150595 7293048 7537001 7529101 7648694 7715192 7725008 7624163 7744268
3214G744268K96783N5827J27130M09831L12635M28356M34708K29769P5684O6736
$$ 7744268 8041051 8096878 8224008 8633839 8946474 9374830 9809538 10039307 10114991 10181727
3204A0181727J26113J56097K28881K27111L11247L69143K41942J28983l5289r2441
$$ 10181727 10307840 10463937 10692818 10919929 11231176 11600319 11842261 11971244 11935955 11843514
3194A1843514J13835M01400N77448M29820O40684P11090P16969P54315N73306
$$ 11843514 11957349 12358749 12936197 13366017 14006701 14717791 15434760 16189075 16762381
3185A6762381L32294K37977P2998K84798J88084M45058J77332J15180M1918R030
$$ 16762381 17094675 17332652 17405650 17690448 17878532 18323590 18500922 18616102 18658020 18667050
3175A8667050K0065p040j54750j51542j04432J1978j07595l7902j1535j34998
$$ 18667050 18687115 18680075 18525325 18373783 18269351 18281329 18173734 18135832 18124297 17989299
3165A7989299M077J60119N68673J078928J585445K248805L228235K907810J618525
$$ 17989299 17993376 18153495 18722168 19801096 21386541 23635346 26863581 29771391 31389916
3156C1389916k52554j516156k146750k380159k296155k159461j658567j313982
$$ 31389916 31137362 29621206 27474456 25094297 22798142 20638681 18980114 17666132
3148A7666132j190399q91936o65020o36957o25398n73930l75778k91513k26847
$$ 17666132 16475733 15583797 14918777 14281820 13656422 13082492 12706714 12415201 12188354
3139A2188354j75023n7494j371O3676m2763J95607M40098M68005N26272M00661
$$ 12188354 12013331 11955837 11954466 12018142 11975379 12170986 12611084 13079089 13605361 14006022
3129A4006022N73482P85586L66595J04900j49097m33691p21104o35462p42075
$$ 14006022 14579504 15365090 15731685 15836585 15687488 15253797 14532693 13897231 13155156
3120A3155156o82230o56303o79618n23193n53679l56072m25728m81037k05766
$$ 13155156 12472926 11816623 11137005 10613812 10060133 9704061 9278333 8797296 8591530
3111H591530j15585k64045j57719l63126n8203J0183j6459m2135k08860j98977
$$ 8591530 8475945 8211900 8054181 7691055 7632852 7643035 7626576 7584441 7375581 7176604
3101G176604k65429j26105j48462j87570j04032p0922j81821k66189l37208j47026
$$ 7176604 6911175 6785070 6636608 6449038 6345006 6274084 6092263 5826074 5488866 5341840
3091E341840k73726l66271l6765j32366k03804j55841J30838j74794l1816J72482
$$ 5341840 5068114 4701843 4665078 4532712 4328908 4173067 4303905 4129111 4097295 4269777
3081D269777j49404M7169J41057P4944m0605K25715n6265O1509O4344k02892j50447
$$ 4269777 4120373 4167542 4308599 4383543 4342938 4568653 4512388 4573897 4638241 4435349 4284902
3070D284902j74939k14697K737j98822r8173j61991l60814j4115l4618m7301k10557
$$ 4284902 4109963 3895266 3898003 3699181 3601008 3439017 3078203 3064088 3029470 2982169 2771612
3059B771612j20135j9356j7170k56243p2409k8801j53825J8717P6923k23453P2213
$$ 2771612 2651477 2632121 2614951 2358708 2286299 2257498 2103673 2122390 2199313 1975860 2048073
3048B048073O1027j04798o4574p2614j5093m7906j60529K289K6553p9114m2879
$$ 2048073 2109100 2004302 1939728 1867114 1852021 1804115 1643586 1645875 1672428 1593314 1550435
3037A550435P7885j12296J9582O3101N7465j30185p2163O749j5517k27381J66520
$$ 1550435 1628320 1516024 1535606 1598707 1656172 1525987 1453824 1460573 1445056 1217675 1384195
3026A384195P0527n6481r8984J26707k203n7589o230L2521P6543j67739k2541
$$ 1384195 1454722 1398241 1299257 1425964 1423761 1366172 1359942 1392463 1469006 1301267 1278726
3015A278726N187P8380j33705j07944P9040l9020o2592R2644Q8544j25936p6047
$$ 1278726 1283913 1362293 1228588 1120644 1199684 1160664 1098072 1190716 1279260 1153324 1077277
3004A077277J97236M195j84274j06799j8110M2771j30920q4138J92486R1254j66251
$$ 1077277 1274513 1278708 1094434 987635 969525 1012296 881376 797238 989724 1080978 914727
2993I14727L2599o1861j6905p608J12832O14j43982k9258N0565k6128r3763n2695
$$ 914727 947326 885465 868560 860952 973784 974398 830416 801158 851723 825595 731832 679137
2981F79137r0935R8275j08101k1611O761m9390J74293K17507j45829L1666o4259
$$ 679137 588202 686477 578376 556765 563526 514136 688429 905936 760107 791773 727514
2970G27514j25793K3389N9924j13877M3326p1334j05542j01450J361j28606M5278
$$ 727514 601721 625110 685034 571157 614483 543149 437607 336157 337518 208912 254190
2959B54190J16491J03209l6704J23245p2607r1326K2074J41586l2322j50240O1054
$$ 254190 370681 473890 437186 560431 487824 396498 418572 560158 527836 377596 438650
2948D38650j2895k6801L6111k23052J75732J10856n6967q8300m8344j16048M4170
$$ 438650 425755 398954 435065 212013 387745 498601 441634 353334 304990 188942 233112
2937B33112K18227m1596j27400l0320J46293l2548k25797P4730O2268J71053O4467
$$ 233112 451339 409743 282343 252023 398316 365768 139971 214701 276969 448022 512489
2926E12489k9541j58219k33208J32565J88391j30247k7790Q2736K0682m7808P4448
$$ 512489 482948 324729 91521 224086 412477 282230 254440 337176 357858 310050 384498
2915C84498M9073j17297O2082n4837q4632Q5504o4492o3061M1920p3729N6217
$$ 384498 433571 316274 378356 323519 238887 324391 259899 196838 238758 165029 221246
2904B21246L7086M9444l9105J16469K1254j63203l13818R8000K16002j01639O0939
$$ 221246 258332 307776 268671 385140 406394 243191 -70627 27373 243375 141736 202675
2893B02675R7477O6939j3689m2792J75405j31561p1724q3068K7110N9806J23200
$$ 202675 300152 367091 353402 310610 486015 354454 282730 199662 226772 286578 409778
2882D09778N6608j17094K3060J05097k4463k02641J2090J19613l3662K4113M3342
$$ 409778 466386 349292 372352 477449 452986 250345 262435 382048 348386 372499 415841
2871D15841K1801q0665J02343m9293j86409m1147O1262J196Q3579n8946r5861
$$ 415841 437642 356977 459320 410027 223618 182471 243733 244929 328508 269562 173701
2860A73701J41352M1659k7295l0763p3552O4808k01735J04193K6992p7593J5628
$$ 173701 315053 356712 329417 298654 225102 289910 88175 192368 219360 141767 157395
2849A57395j0029o4873J32819O1198Q1425n2655n1086K36949p2695j69095j77575
$$ 157395 147366 82493 215312 276510 357935 305280 254194 491143 418448 249353 71778
2838G1778J72090R1315j39426N9650l7152n0332l1801O1105J87672N0155j3126
$$ 71778 243868 335183 195757 255407 218255 167923 136122 197227 384899 435054 421928
2827D21928j7246j96053K7384j19905J63681R7673k7939n5311n2955J27696k5011
$$ 421928 404682 208629 236013 116108 279789 377462 349523 294212 241257 368953 343942
2816C43942j81490q2109K76590M9539j02053L5336R9818k03271J09091r9725m7922
$$ 343942 162452 80343 356933 406472 304419 339755 439573 236302 345393 245668 197746
2805A97746l8761L7589j645k1556J0206O7600p4179k14372M1112J81381K0017
$$ 197746 158985 196574 194929 173373 183579 251179 177000 -37372 3740 185121 205138
2794B05138j96698J10039O5815O6648L0054o8078r2264R514n4655J02442K1616
$$ 205138 8440 118479 184294 250942 280996 212918 120654 130168 75513 177955 199571
2783A99571j2872j15908k5625R2923O2305o8101j762J20061r3457J08633J2693
$$ 199571 186699 70791 45166 138089 200394 132293 130531 250592 157135 265768 278461
2772B78461P7747k44049j57536m7956Q0715K00615m5554q7141O2050M8520j10628
$$ 278461 356208 112159 -45377 -93333 -12618 187997 142443 55302 117352 165872 55244
2761E5244K2358J60941o3105R6185J15545k75487j65439K78333k6815k72099k7539
$$ 55244 77602 238543 175438 271623 387168 111681 -53758 224575 197760 -74339 -101878
2750a01878m6481K3179J58197P2472j38253p3257P8498q899q3149R490P4180J75628
$$ -101878 -148359 -125180 33017 105489 -32764 -106021 -27523 -36422 -119571 -110081 -35901 139727
2738A39727p0672n338o8220N7048n6911j11369K22078l8234o7885j17826K39562
$$ 139727 69055 63717 -4503 52545 -4366 -115735 106343 68109 224 -117602 121960
2727A21960L7415j50773J1218M8980O193j96159j27394j27661J43599P0070l0914
$$ 121960 159375 8602 19820 68800 74993 -121166 -248560 -376221 -232622 -162552 -193466
2716a93466K25899m1866o5181L5173K4389r7077L8065L3300m9390n1728J36463
$$ -193466 32433 -9433 -74614 -39441 -15052 -112129 -74064 -40764 -90154 -141882 -5419
2705e419k1322j95280j06782J33891K9942P7503J43967k3762p1199m7969j04016
$$ -5419 -26741 -222021 -328803 -194912 -164970 -87467 56500 32738 -38461 -86430 -190446
2694a90446J73144r4781J03827k4933j44210k39028M8670L19300n1335J11320
$$ -190446 -17302 -112083 -8256 -33189 -177399 -416427 -367757 -48457 -99792 11528
2684A1528n8857m8253j10919J74165N4708L5749n7664Q4136k3333j674K4265j48589
$$ 11528 -47329 -95582 -206501 -32336 22372 58121 457 84593 61260 59586 83851 -64738
2672f4738L8451m4858Q9532M1146l8873J13319j44194l806K3101k6023P2942j34671
$$ -64738 -26287 -71145 18387 59533 20660 133979 -10215 -14021 9080 -16943 55999 -78672
2660g8672j33943J58255J84937P7225j36244m4958J05528J53973k0685j10486
$$ -78672 -212615 -54360 130577 207802 71558 26600 132128 286101 265416 154930
2650A54930J09343j93794p1230Q2532N7727N7606m3518P4484k8931j8354M2214
$$ 154930 264273 70479 -751 81781 139508 197114 153596 228080 199149 180795 223009
2639B23009j87345J39087j31868Q360N7854P4649Q1211q3188K2353p2507J9685
$$ 223009 35664 174751 42883 51243 109097 183746 264957 181769 204122 131615 151300
2628A51300J27794o0686O603K21481L06898K63942J30872O047j76607O9052k81792
$$ 151300 279094 218408 225011 446492 753390 1017332 1148204 1154251 977644 1046696 764904
2617G64904j96093m0689k99500r3536L55589j03858j02982L3826j23620o1732
$$ 764904 568811 528122 228622 135086 490675 386817 283835 317661 194041 132309
2607A32309J1723r140R1706k28579M8531J08381Q9769J13097j26758j94814j2534
$$ 132309 144032 134892 226598 -1981 46550 154931 244700 357797 231039 36225 23691
2596B3691M8288L5522j33793o7505P7915o6214O437N9646k2933K0898o7027l3192
$$ 23691 71979 107501 -26292 -93797 -15882 -82096 -75659 -16013 -38946 -18048 -85075 -118267
2584a18267J4708N4118o0076J15121K175J5992R6002r8279j84308J05858J57238
$$ -118267 -103559 -49441 -109517 5604 7779 23771 119773 21494 -162814 -56956 100282
2573A00282j4592j0173r2408j55287J25405J17483j9519J137K7288L2366K8510
$$ 100282 85690 75517 -16891 -172178 -46773 70710 51191 52328 79616 111982 140492
2562A40492j64350j17881P2622J54201N6331O7491j14888r9129J36307Q0365J07173
$$ 140492 -23858 -141739 -69117 85084 141415 208906 94018 -5111 131196 211561 318734
2551C18734J31269j03466k47343N6827p0691N2874J09800M5252N5742J1066q7149
$$ 318734 450003 346537 99194 156021 85330 138204 248004 293256 348998 360064 272915
2540B72915j73704J4185M6932J06318J00701M303L2354j02204M4879p4469j6009
$$ 272915 99211 113396 160328 266646 367347 371650 404004 301800 346679 272210 256201
2529B56201j80314J32133J38328q5022j03975L2057N6793k6116m1232J5573L3045
$$ 256201 75887 208020 346348 261326 157351 189408 246201 220085 178853 194426 227471
2518B27471r8359q0255l8810J06260J22640k08096j8127J18502K1763n2178M2558
$$ 227471 129112 48857 10047 116307 238947 30851 12724 131226 152989 100811 143369
2507A43369p5381o0937q823J30500q9774K46402k1093j84908N8330j1984q5069
$$ 143369 67988 7051 -1772 128728 38954 285356 264263 79355 137685 125701 40632
2496D0632l3610J00780N0558o5076j08322J59913Q706n5439l5432n4748P3845
$$ 40632 7022 107802 158360 93284 -15038 144875 153581 98142 62710 7962 81807
2485H1807j2003J04962N1275n1759O5003J11039p3839j3257j04342K10736O2445
$$ 81807 69804 174766 226041 174282 239285 350324 276485 263228 158886 369622 432067
2474D32067m4136k1358r4117m8135K35626j80138J8403o3492L385j06181O3379
$$ 432067 387931 366573 272456 224321 459947 279809 298212 234720 238105 131924 195303
2463A95303J07294n3184J14236P3660j5624Q8738N7323n2367N361J77031j3314
$$ 195303 302597 249413 363649 437309 421685 510423 567746 515379 520740 697771 684457
2452F84457n0626J34449J58777K9806j01666K3629j27416j40014P9703J74650
$$ 684457 633831 768280 927057 956863 855197 878826 751410 611396 691099 865749
2442H65749j13207N6132L1545J72461Q3313l4776q5934j0647j55118o2381J42585
$$ 865749 752542 808674 840219 1012680 1095993 1061217 975283 964636 809518 747137 889722
2431H89722J7314M8704J05216K27101q150m9463K8972k7015K1258M9868P9039
$$ 889722 907036 955740 1060956 1288057 1279907 1230444 1259416 1232401 1253659 1303527 1382566
2420A382566q720L2791J3005J24378l9279Q5417K2948m3879j30745J76880J08492
$$ 1382566 1373846 1406637 1419642 1544020 1504741 1590158 1613106 1569227 1438482 1615362 1723854
2409A723854R6891M4593M9973O9479J14954P9916J16557R2980O1857O1725J47287
$$ 1723854 1820745 1865338 1915311 1984790 2099744 2179660 2296217 2389197 2451054 2512779 2660066
2398B660066r749r4700J92969K48155j03954L26912J10334K06522J08387K81681
$$ 2660066 2650317 2555617 2748586 2996741 2892787 3219699 3330033 3536555 3644942 3926623
2388C926623M88589L00626r3521J76599J03962J63424K26856K16888J37660N55561
$$ 3926623 4415212 4715838 4622317 4798916 4902878 5066302 5293158 5510046 5647706 6203267
2378F203267O26485O07647N26681R51113J076724J516720J520529K130823K064529
$$ 6203267 6829752 7437399 7964080 8915193 9991917 11508637 13029166 15159989 17224518
2369A7224518J728115K71068P37313N15001J683577K021500L487283M561727P281892
$$ 17224518 18952633 19223701 19961014 20476015 22159592 24181092 27668375 32230102 39511994
2360C9511994R768649J6442830K5577127M4248097N3396711M1397947M55625l5642135
$$ 39511994 49280643 65723473 91300600 135548697 188945408 230343355 230798980 195156845
2352A95156845l4833693l4875119k6648369k0942603j6043979j1787979q557446
$$ 195156845 160323152 125448033 98799664 77857061 61813082 50025103 41467657
2345D1467657o925435n322015m113989j968565j182048q93853j572900k192373
$$ 41467657 34542222 29220207 25106218 23137653 21955605 21061752 19488852 17296479
2337A7296479k173852j770930j468309j126428p62986o91803n48490l23159l72250
$$ 17296479 15122627 13351697 11883388 10756960 9993974 9302171 8753681 8430522 8058272
2328H058272l50297o70731m28554l94409j85231n40731m58975j63474j72977k36116
$$ 8058272 7707975 7037244 6608690 6214281 6029050 5488319 5029344 4865870 4692893 4456777
2318D456777Q6105k13510k12324j00249m0488p7140k53649O7834j26021l53886
$$ 4456777 4542882 4329372 4117048 4016799 3976311 3899171 3645522 3713356 3587335 3233449
2308C233449n6284q7911j04996m5419J2102l7426k2406k19045J0480j6627j40512
$$ 3233449 3177165 3089254 2984258 2938839 2950941 2913515 2891109 2672064 2682544 2665917 2525405
2297B525405N0226j78311n8047j40546j38853K5411j54849L7548K8657j09481
$$ 2525405 2575631 2397320 2339273 2198727 2059874 2085285 1930436 1967984 1996641 1887160
2287A887160j22235o3845j4032r6729n2201k18996J15342j0902P5381j50678J18532
$$ 1887160 1764925 1701080 1687048 1590319 1538118 1319122 1434464 1423562 1498943 1348265 1466797
2276A466797k3539j56279l2676Q7824q9359l5318m5703K13714k33181R4508J7585
$$ 1466797 1443258 1286979 1254303 1342127 1252768 1217450 1171747 1385461 1152280 1246788 1264373
2265A264373N9131k20773j94315m4966m4903r678m1391O5958J32509j28399Q3236
$$ 1264373 1323504 1102731 908416 863450 818547 808869 767478 833436 965945 837546 920782
2254I20782M1731j50453l3167J89380k864K1952n8432j9103p5708j14770p9347
$$ 920782 962513 812060 778893 968273 965409 987361 928929 909826 834118 719348 640001
2243F40001J32087J6178p2554j08308O545k6488k4410l0446Q1292j8155q2512
$$ 640001 772088 788266 715712 607404 613949 587461 563051 532605 613897 595742 513230
2232E13230r4194J7408n3770j7545j25672J16735J04667J07163m7981n4466J85084
$$ 513230 419036 436444 382674 365129 239457 356192 460859 568022 520041 465575 650659
2221F50659o3735J1724n8938r4436J5455L6672k9418R0879n1085l8513j13019
$$ 650659 586924 598648 539710 445274 460729 497401 467983 558862 507777 469264 356245
2210C56245n7978P1082n7510o2542l8178j07466Q1859J4924l7953J44808P8838
$$ 356245 298267 369349 311839 249297 211119 103653 185512 200436 162483 307291 386129
2199C86129j02628j64980k279O0758N4324J64446n1737m0914j5099J6681j0252
$$ 386129 283501 118521 116242 177000 231324 395770 344033 303119 288020 304701 294449
2188B94449P5985J06095Q575j23091j06363q3136l1040k3969J6478o5774j04190
$$ 294449 370434 476529 485104 362013 255650 172514 141474 117505 133983 68209 -35981
2177c5981L3267p4986P0418j66224O7151j6135P1692n4574O3666r332r2645J78332
$$ -35981 -2714 -77700 -7282 -173506 -106355 -122490 -50798 -105372 -41706 -51038 -143683 34649
2165C4649J13993j78845m9269R0352N4760j17322k27541K5004J61223J06474J67137
$$ 34649 148642 -30203 -79472 10880 65640 -51682 -279223 -254219 -92996 13478 180615
2154A80615k736j58112J16784M6960J29146r2998L209j19194p3455N1003J65580
$$ 180615 177879 19767 136551 183511 312657 219659 222868 103674 30219 81222 246802
2143B46802J30625Q4688j16620q9920j39492p2825l1184J52816n9663l5856L9498
$$ 246802 377427 462115 345495 255575 116083 43258 12074 164890 105227 69371 108869
2132A08869r6654p0671J59373o3354m3446O8616r0067K1162n8977o3489J9691
$$ 108869 12215 -58456 100917 37563 -5883 62733 -27334 -6172 -65149 -128638 -108947
2121a08947L5803J06554J7097K3744j14804J14771L7722r759N6668k348k13046
$$ -108947 -73144 33410 50507 74251 -40553 74218 111940 102181 158849 156501 -56545
2110e6545j15957P1823K86674m7509k7624l2988J63383j49995j23466Q972l4426
$$ -56545 -172502 -100679 185995 138486 110862 77874 241257 91262 -32204 -23232 -57658
2099e7658J12912n9064N9456R7604k8536N9656m8033j36173K12029J76012J15135
$$ -57658 55254 -3810 55646 153250 124714 184370 136337 164 212193 388205 503340
2088E03340K65725K08888K31780j5970m933r8112j96854l16440j47966o66j38034
$$ 503340 769065 977953 1209733 1193763 1188830 1090718 893864 577424 429458 428792 290758
2077B90758o5308m8395N5686j82798K6340J17743j50041L645r9311q2125J44754
$$ 290758 225450 177055 232741 49943 76283 194026 43985 47630 -51681 -133806 10948
2066A0948j34220J19580L3693o3315Q8777r9673j13832m9774O144J04380J26995
$$ 10948 -123272 -3692 30001 -33314 55463 -44210 -158042 -207816 -201672 -97292 29703
2055B9703m8452K5808r7473l3485J03567J8654J06698k40705n15N8085p6283O5141
$$ 29703 -18749 7059 -90414 -123899 -20332 -1678 105020 -135685 -136200 -78115 -154398 -89257
2043h9257O7472j06096O6949j08549R9680j23030L4177L551Q08J0180J10875M0005
$$ -89257 -21785 -127881 -60932 -169481 -69801 -192831 -158654 -155103 -154295 -144115 -33240 6765
2031F765k06758M6632J21441m5302J48899r9393l0359l4667N086j5536m6548r9112
$$ 6765 -199993 -153361 -31920 -77222 71677 -27716 -58075 -92742 -87656 -103192 -149740 -248852
2019b48852J03517n1O318K4482P177L1718n8323M7175q0771k5955J6440j07697
$$ -248852 -145335 -145386 -139068 -114586 -107409 -75691 -134014 -86839 -167610 -193565 -177125 -284822
2007b84822L495p1556J41275O3616R9344m2593l9524L5816j0276p4245l2451O4472
$$ -284822 -281327 -352883 -211608 -147992 -48648 -91241 -130765 -94949 -105225 -179470 -211921 -147449
1995a47449J29377K10643k3190K6865p0991j06293P8104j13329o4173r76p0303
$$ -147449 -18072 192571 169381 196246 125255 18962 97066 -16263 -80436 -81412 -151715
1984a51715K6329L377J40007l2978N5596j57901N1562J77840r2154p2338k9176
$$ -151715 -125386 -122009 17998 -14980 40616 -117285 -65723 112117 19963 -52375 -81551
1973h1551n9596l5448J25487o1402j05181O6915O011J65850k23064J56837J57513
$$ -81551 -141147 -176595 -51108 -112510 -217691 -150776 -144765 21085 -201979 -45142 112371
1962A12371k07304j73377J93672l4985j4920j19487J65229r32j43553j01800J88916
$$ 112371 -94933 -268310 -74638 -109623 -124543 -244030 -78801 -79733 -223286 -325086 -136170
1951a36170Q6902p9236J21402j95505j13952J29122N8617K751m3680K8291m5198
$$ -136170 -49268 -128504 -7102 -202607 -316559 -187437 -128820 -126069 -169749 -141458 -186656
1940a86656N0380o2319l035J09320L0682M9328p0395j8965L812K02365j48388
$$ -186656 -136276 -198595 -201630 -92310 -61628 -12300 -82695 -101660 -97848 104517 -43871
1929d3871Q365K7m1436K9246p9010L8464K6453K6652P9375r9176m5952O5927R8717
$$ -43871 -35506 -35479 -76915 -47669 -126679 -88215 -61762 -35110 44265 -54911 -100863 -34936 63781
1916F3781o0879j1152p2146j39292j9371R0853P7832j03882k8350q9398J20797
$$ 63781 2902 -8250 -80396 -219688 -239059 -148206 -70374 -174256 -202606 -292004 -171207
1905a71207P3709q2457Q3303K6154k2117K8946J8850j88124L4428j9266N4262
$$ -171207 -97498 -179955 -96652 -70498 -92615 -63669 -44819 -232943 -198515 -217781 -163519
1894a63519n4106j2426N7582L2102P3588o9397n4658M7542J94792j21573O6764
$$ -163519 -217625 -230051 -172469 -140367 -66779 -136176 -190834 -143292 51500 -70073 -3309
1883c309Q4427j54658J02400K3307j3424j19392O3658n5209o6832K02518N5152
$$ -3309 81118 -73540 28860 52167 38743 -80649 -16991 -72200 -139032 63486 118638
1872A18638j62815q9609o6268K6275J20598j47845M7962K34093K00529j07759
$$ 118638 -44177 -133786 -200054 -173779 -53181 -201026 -153064 81029 281558 173799
1862A73799j70634o6723l5492N1555N4506q7262O959L7530l9850l2432J24930
$$ 173799 3165 -63558 -99050 -47495 7011 -80251 -73292 -35762 -75612 -108044 16886
1851A6886n1182j44535J30411M612j9715o280k3640J84011r3994O535m3257O7387
$$ 16886 -34296 -178831 -48420 -43808 -63523 -69803 -93443 90568 -3426 3109 -40148 27239
1839B7239j46143j42415K14257l8713j06497L8269K22421M9930r7965N2982n6919
$$ 27239 -118904 -261319 -47062 -85775 -192272 -154003 68418 118348 20383 73365 16446
1828A6446p5987n5411J8352M7440o8875p1512J0499J21008j87800P7604J79700
$$ 16446 -59541 -114952 -96600 -49160 -118035 -189547 -179048 -58040 -245840 -168236 11464
1817A1464N7271p5254r807J27155j93180j17609R0459Q787J22716o5064l88R8750
$$ 11464 68735 -6519 -16326 110829 -82351 -199960 -109501 -100714 22002 -43062 -43450 55300
1805E5300j04914k35037J17019P6091j1164K2314L5045J7511p6815M4784J5918
$$ 55300 -49614 -284651 -167632 -91541 -102705 -80391 -45346 -27835 -104650 -59866 -43948
1794d3948k08498J65287J16159q8228J06300o2445J6635O1842m8938N6382K3995
$$ -43948 -252446 -87159 29000 -59228 47072 -15373 1262 63104 14166 70548 94543
1783I4543k3466j09442q6731J98058K7653j15317P4601J98201k21659j09197J36200
$$ 94543 71077 -38365 -125096 72962 100615 -14702 59899 258100 36441 -72756 63444
1772F3444n1639q4135n2933O1702Q4079L725P7086j26545K6754Q4112K3177m8445
$$ 63444 11805 -72330 -125263 -63561 20518 24243 101329 -25216 1538 85650 108827 60382
1760F0382k7432k7227L4263O5655l0186j88008L7295l172J07106M1487M561L3615
$$ 60382 32950 5723 39986 105641 75455 -112553 -75258 -78430 28676 70163 74724 108339
1748A08339q2373Q0619p8455p6723K9128O6027Q916j87203J45656M6048j04733
$$ 108339 25966 106585 28130 -48593 -19465 46562 55478 -131725 13931 59979 -44754
1737d4754r0493L8644J30755m4697K4176P1149J97102j77512n0656j15864l5435
$$ -44754 -135247 -96603 34152 -10545 13631 84780 281882 104370 53714 -62150 -97585
1726i7585j52785l1639m0502P3559J15667N9897Q2510R7048j05338J8320J4956
$$ -97585 -250370 -282009 -322511 -248952 -133285 -73388 9122 106170 832 19152 34108
1715C4108j07509n5510J16352K1406o9406J00627m2698M9126l0846O3647p3590
$$ 34108 -73401 -128911 -12559 8847 -60559 40068 -2630 46496 15650 79297 5707
1704E707q5708j20085J16956J72254j91988o3737o8578O5181J29423k3434q0475
$$ 5707 -80001 -200086 -83130 89124 -102864 -166601 -235179 -169998 -40575 -64009 -144484
1693a44484l0453k1908K3057p4392L6693J15890J8161j83791O892L1321Q8532
$$ -144484 -174937 -196845 -173788 -248180 -211487 -95597 -77436 -261227 -254335 -223014 -134482
1682a34482R7109j36920J2309J66462j62554M7903J36357l8825j09495j101J14396
$$ -134482 -37373 -174293 -161984 4478 -158076 -110173 26184 -12641 -122136 -123237 -8841
1671h841j25482M7112n0869L6160j5061L1428J27256r863m1585j16507Q2744O83
$$ -8841 -134323 -87211 -138080 -101920 -116981 -85553 41703 31840 -9745 -126252 -43508 -42825
1659d2825O8628J30506R8563o3198k70771j05991J83467O2764L4945m6443O1571
$$ -42825 25803 156309 254872 191674 -79097 -185088 -1621 61143 96088 49645 111216
1648A11216P3159j48146J91902j26185j60743J26380J07953r1597j3126o8410
$$ 111216 184375 36229 228131 101946 -58797 67583 175536 83939 70813 2403
1638B403l6258j56913O1791J2516l9814k02157K605P6198J78427M2025m8387J63342
$$ 2403 -33855 -190768 -128977 -116461 -156275 -358432 -355827 -279629 -101202 -59177 -107564 55778
1626E5778R2793k34856J36326M2287j07375j2970J30756j11686j43632j1330J0773
$$ 55778 148571 -86285 50041 92328 -15047 -28017 102739 -8947 -152579 -163909 -153136
1615a53136P7891m7511J02455M7911n5829N6472L5431l8201l7069K2964j4041
$$ -153136 -75245 -122756 -20301 27610 -28219 28253 63684 25483 -11586 11378 -2663
1604b663o8947j13474O0387K81971l0488j29361L9374l6463j75568K6879N1728
$$ -2663 -71610 -185084 -124697 157274 126786 -2575 36799 336 -175232 -148353 -96625
1593i6625Q3990L0465K8207k1471k6055o0049J35793J1582j07567O1940J13822
$$ -96625 -12635 17830 46037 24566 -1489 -61538 74255 85837 -21730 40210 154032
1582A54032n6622l5025L4229j14145Q522J5110L19133j50056o7459n5813o2931
$$ 154032 97410 62385 96614 -17531 -9009 6101 325234 175178 107719 51906 -11025
$$ [...]
##END NTUPLES=NMR SPECTRUM
##END=
