##TITLE=1H_TG-2403-2
 200.13Hz,DMSO_CCl4 .
 8 sc
 
1.1.2026
##JCAMPDX= 6.0         $$ Bruker NMR JCAMP-DX V2.0
##DATA TYPE= NMR SPECTRUM
##DATA CLASS= NTUPLES
##ORIGIN= UXNMR, Bruker Analytische Messtechnik GmbH
##OWNER= pz
$$ XWIN-NMR		Version 3.5
$$ Wed Apr  1 14:36:57 2026 Russian Standard Time (UT+4h)  she@DPX200
##.OBSERVE FREQUENCY= 200.1313
##.OBSERVE NUCLEUS= ^1H
##.ACQUISITION MODE= SIMULTANEOUS
##.ACQUISITION SCHEME= undefined
##.AVERAGES= 8
##.DIGITISER RES= 18
##SPECTROMETER/DATA SYSTEM= spect
##.PULSE SEQUENCE= zg30
##.SOLVENT NAME= DMSO
##.SHIFT REFERENCE= (INTERNAL, DMSO, 0, 15.4472)
##AUDIT TRAIL= $$ (NUMBER, WHEN, WHO, WHERE, WHAT)
$$ ##TITLE= Audit trail, XWIN-NMR		Version 3.5
$$ ##JCAMPDX= 5.01
$$ ##ORIGIN= Bruker BioSpin GmbH
$$ ##OWNER= she
$$ F:/spectra/data/she/nmr/H-C/1/pdata/1/auditp.txt
$$ ##AUDIT TRAIL=  $$ (NUMBER, WHEN, WHO, WHERE, WHAT)
(   1,<2026-04-01 14:35:34.20 +0400>,<she>,<DPX200>,
      <created by zg, POWCHK disabled, PULCHK disabled
       configuration hash MD5:
       00 E9 B6 7A A2 85 ED C7 34 08 36 98 17 FE 4E 26
       data hash MD5: 16K
       A4 19 D1 01 83 1A A1 04 3C 08 BC 8F B3 CE 0A C8>)
(   2,<2026-04-01 14:35:36.45 +0400>,<she>,<DPX200>,
      <Start of raw data processing
       efp BC_mod = 2 LB = 0.25 FT_mod = 6 PKNL = 1 PHC0 = -3789.683 PHC1 = 9.59231 SI = 16K 
       data hash MD5: 16K
       CF DC BD 9A 66 2E 8A B4 44 28 98 B5 14 3E 3F 5C>)
(   3,<2026-04-01 14:36:03.48 +0400>,<she>,<DPX200>,
      <pk PHC0 = 83.02779 PHC1 = -4.799999 
       data hash MD5: 16K
       D9 0F 84 FC 3D BA E3 47 40 43 99 C5 C5 59 C3 D2>)
(   4,<2026-04-01 14:36:08.79 +0400>,<she>,<DPX200>,
      <abs ABSG = 5 
       data hash MD5: 16K
       DD 40 90 D2 76 49 27 79 A6 CA D8 79 D3 CA D8 C7>)
(   5,<2026-04-01 14:36:33.76 +0400>,<she>,<DPX200>,
      <abs ABSG = 5 
       data hash MD5: 16K
       AB D1 6E DC EC 2D 87 9E 4C 89 04 DA 42 24 0E 9F>)
$$ ##END=
$$ 
$$ hash MD5
$$ 45 33 AE E9 98 F4 65 24 77 83 8E DE BA C1 C2 E8
##$RELAX= 
##$RELAX= 
##$RELAX= 
##$RELAX= 
##$RELAX= 
##$RELAX= 
$$ Bruker specific parameters
$$ --------------------------
##$DU= <F:/spectra>
##$EXPNO= 1
##$NAME= <H-C>
##$PROCNO= 1
##$TYPE= <nmr>
##$USER= <she>
##$AMP= (0..31)
100 100 100 100 100 100 100 100 100 100 100 100 100 100 100 100 100 100 
100 100 100 100 100 100 100 100 100 100 100 100 100 100 
##$AQSEQ= 0
##$AQ_mod= 1
##$AUNM= <au_zg>
##$AUTOPOS= <>
##$BF1= 200.13
##$BF2= 200.13
##$BF3= 200.13
##$BF4= 200.13
##$BF5= 200.13
##$BF6= 200.13
##$BF7= 200.13
##$BF8= 200.13
##$BYTORDA= 1
##$CFDGTYP= 0
##$CFRGTYP= 5
##$CHEMSTR= <none>
##$CNST= (0..31)
1 1 145 1 1 1 1 1 1 1 1 1 1 1 1 1 1 1 1 1 1 1 1 1 1 1 1 1 1 1 1 1 
##$CPDPRG= <>
##$CPDPRG1= <>
##$CPDPRG2= <>
##$CPDPRG3= <>
##$CPDPRG4= <mlev>
##$CPDPRG5= <mlev>
##$CPDPRG6= <mlev>
##$CPDPRG7= <mlev>
##$CPDPRG8= <mlev>
##$CPDPRGB= <>
##$CPDPRGT= <>
##$D= (0..31)
0 0.7 0 0 0 0 0 0 0 0 0 0.03 0 0 0 0 0 0 0 0 0 0 0 0 0 0 0 0 0 0 0 0 
##$DATE= 1775039733
##$DBL= (0..7)
$$ [...]
##$SUBNAM3= <"">
##$SUBNAM4= <"">
##$SUBNAM5= <"">
##$SUBNAM6= <"">
##$SUBNAM7= <"">
##$SUBNAM8= <"">
##$SUBNAM9= <"">
##$SW= 18.0517328524113
##$SWIBOX= (0..15)
0 0 2 0 0 0 0 0 0 0 0 0 0 0 0 0 
##$SW_h= 3612.71676300578
##$TD= 16384
##$TD0= 1
##$TE= 0
##$TE2= 300
##$TE3= 300
##$TEG= 300
##$TL= (0..7)
0 120 120 120 120 120 120 120 
##$TP= (0..7)
150 150 150 150 150 150 150 150 
##$TP07= 0
##$TPNAME0= <>
##$TPNAME1= <>
##$TPNAME2= <>
##$TPNAME3= <>
##$TPNAME4= <>
##$TPNAME5= <>
##$TPNAME6= <>
##$TPNAME7= <>
##$TPOAL= (0..7)
0.5 0.5 0.5 0.5 0.5 0.5 0.5 0.5 
##$TPOFFS= (0..7)
0 0 0 0 0 0 0 0 
##$TUNHIN= 0
##$TUNHOUT= 0
##$TUNXOUT= 0
##$USERA1= <user>
##$USERA2= <user>
##$USERA3= <user>
##$USERA4= <user>
##$USERA5= <user>
##$V9= 5
##$VALIST= <valist>
##$VCLIST= <CCCCCCCCCCCCCCC>
##$VD= 0
##$VDLIST= <DDDDDDDDDDDDDDD>
##$VPLIST= <PPPPPPPPPPPPPPP>
##$VTLIST= <TTTTTTTTTTTTTTT>
##$WBST= 1024
##$WBSW= 4
##$XGAIN= (0..3)
0 0 0 0 
##$XL= 0
##$YL= 0
##$YMAX_a= 901831
##$YMIN_a= -1131419
##$ZGOPTNS= <>
##$ZL1= 120
##$ZL2= 120
##$ZL3= 120
##$ZL4= 120
##$ABSF1= 15.4472
##$ABSF2= -2.60465
##$ABSG= 5
##$ABSL= 3
##$ALPHA= 0
##$AQORDER= 0
##$ASSFAC= 0
##$ASSFACI= 0
##$ASSFACX= 0
##$ASSWID= 0
##$AUNMP= <proc_1d>
##$AZFE= 0.1
##$AZFW= 0.1
##$BCFW= 0
##$BC_mod= 2
##$BYTORDP= 0
##$COROFFS= 0
##$CY= -3
##$DATMOD= 1
##$DC= 0
##$DFILT= <>
##$DTYPP= 0
##$F1P= 0
##$F2P= 0
##$FCOR= 1
##$FTSIZE= 16384
##$FT_mod= 6
##$GAMMA= 0
##$GB= 0
##$INTBC= 1
##$INTSCL= 3.241238e-09
##$ISEN= 128
##$LB= 0.25
##$LEV0= 0
##$LPBIN= 0
##$MAXI= 10000
##$MC2= 0
##$MEAN= 0
##$ME_mod= 0
##$MI= 1.114404
##$NCOEF= 0
##$NC_proc= -6
##$NLEV= 6
##$NOISF1= 3.799351
##$NOISF2= 2.8
##$NSP= 0
##$NTH_PI= 0
##$NZP= 0
##$OFFSET= 15.4472
##$PC= 1
##$PHC0= -3706.655
##$PHC1= 4.792311
##$PH_mod= 1
##$PKNL= yes
##$PPARMOD= 0
##$PSCAL= 0
##$PSIGN= 0
##$REVERSE= no
##$SF= 200.130014909823
##$SI= 16384
##$SIGF1= 3
##$SIGF2= 2
##$SINO= 0.751879
##$SIOLD= 32768
##$SREGLST= <19F.Aceton>
##$SSB= 0
##$STSI= 16384
##$STSR= 0
##$SW_p= 3612.71676300578
##$SYMM= 0
##$S_DEV= 0
##$TDeff= 16384
##$TDoff= 0
##$TI= <>
##$TILT= no
##$TM1= 0
##$TM2= 0
##$TOPLEV= 0
##$USERP1= <user>
##$USERP2= <user>
##$USERP3= <user>
##$USERP4= <user>
##$USERP5= <user>
##$WDW= 1
##$XDIM= 16384
##$YMAX_p= 316347974
##$YMIN_p= -1717310
$$ End of Bruker specific parameters
$$ ---------------------------------
##NTUPLES= NMR SPECTRUM
##VAR_NAME=  FREQUENCY,     SPECTRUM/REAL,   SPECTRUM/IMAG
##SYMBOL=    X,             R,               I
##VAR_TYPE=  INDEPENDENT,   DEPENDENT,       DEPENDENT
##VAR_FORM=  AFFN,          ASDF,            ASDF
##VAR_DIM=   16384,         16384,           16384
##UNITS=     HZ,            ARBITRARY UNITS, ARBITRARY UNITS
##FACTOR=    0.220516191357247, 1,           1
##FIRST=     3091.44833058624, 0,            0
##LAST=      -521.26843241954, 0,            0
##MIN=       -521.26843241954, -1717310,     0
##MAX=       3091.44833058624, 316347974,    0
$$ Real data points
##PAGE= N=1
##DATA TABLE= (X++(R..R)), XYDATA
$$ [...]
$$ plain form
12822 206629 198877 207819 291296 240516 146214 157783 210015 232828 179481 147701 122492 95294
12810 95294 37803 121688 119548 235756 146114 151237 75659 17081 108554 162015 167102 133669
12798 133669 224598 157945 177201 234540 189576 255177 119857 89419 244179 272896 197700
12787 197700 191935 226046 188350 169223 85850 139373 180822 195324 209661 310416 125387
12776 125387 145723 261728 238549 292702 293323 230799 308136 264012 227953 207213 161107 129469
12764 129469 133704 162297 156731 288944 378826 275275 320717 262843 202532 343267 258698
12753 258698 225540 236689 256885 213459 251037 235091 145863 186184 99302 38293 151547
12742 151547 61653 149721 217787 193875 40338 20428 180680 199910 366780 276968 152267
$$ packed form
12822B06629p752Q942Q3477n0780r4302J1569N2232K2813n3347l1780k5209k7198
12810I5294n7491Q3885k140J16208q9642N123p5578n8578R1473N3461N087l3433
12798A33669R0929o6653J9256N7339m4964O5601j35320l0438J54760K8717p5196
12787A97700n765L4111l7696j9127q3373N3523M1449J4502J4337J00755j85029
12776A25387K0336J16005k3179N4153O21o2524P7337m4124l6059k0740m6106l1638
12764A29469M235K8593n566J32213Q9882j03551M5442n7874o0311J40735q4569
12753B58698l3158J1149K0196m3426L7578j5946q9228M0321q6882o1009J13254
12742A51547q9894Q8068O8066k3912j53537j9910J60252J9230J66870q9812j24701
$$ plain form
12731 152267 186165 150948 150956 83793 -3042 90855 218850 206938 148112 158578 254644 256161
12719 256161 145412 136309 200553 168442 240529 281421 100386 185234 189042 170353 164970 85180
12707 85180 165647 179017 100765 89977 151365 213137 194167 290520 341167 303344 264404 236299
12695 236299 244728 236923 330171 260854 131789 19287 -11832 4235 79146 106701 85284
12684 85284 274194 260525 253464 357342 239511 165060 124828 189505 281668 284107 347488
12673 347488 329100 336098 362254 265278 155854 157296 122302 248086 204331 243011 208243
12662 208243 154490 212638 205121 217701 235151 284890 258930 399682 366649 381960 420586
12651 420586 362840 313607 385790 548203 290747 239349 308802 326961 274142 292068 410542
$$ packed form
12731A52267L3898l5217Qo7163q6835R3897J27995j1912n8826J0466R6066J517
12719B56161j10749r103O4244l2111P2087M0892j81035Q4848L808j8689n383p9790
12707H5180Q0467J3370p8252j0788O1388O1772j8970R6353N0647l7823l8940k8105
12695B36299Q429p805R3248o9317j29065j12502l1119J6067P4911K7555k1417
12684H5284J88910j3669p061J03878j17831p4451m0232O4677R2163K439O3381
12673C47488j8388O998K6156r6976j09424J442l4994J25784m3755L8680l4768
12662B08243n3753N8148p517J2580J7450M9739k5960J40752l3033J5311L8626
12651D20586n7746m9233P2183J62413k57456n1398O9453J8159n2819J7926J18474
$$ plain form
12640 410542 561316 560241 539990 550030 628773 716331 650193 645228 712105 740783 701826 622602
12628 622602 621165 662518 701049 806810 590612 522998 402114 351894 453406 438344 340810
12617 340810 371434 339079 330198 300423 279658 417105 481327 445653 421786 258618 244936
12606 244936 186507 189929 180094 289959 351536 291242 310967 273168 320633 284463 174571
12595 174571 147165 202052 226770 152473 193197 259380 215882 199307 133353 249406 371873
12584 371873 175072 185008 304044 245768 243618 240762 289068 216184 337438 333651 209595
12573 209595 129973 51187 -11391 47328 -12834 -14729 41509 118541 99066 53667 -20771 19749
12561 19749 76050 70814 33837 67603 124541 63831 145628 179431 239645 191849 198747 71140
$$ packed form
12640D10542J50774j075k0251J0040P8743Q7558o6138m965O6877K8678l8957p9224
12628F22602j437M1353L8531J05761k16198o7614j20884n0220J01512j5062r7534
12617C40810L0624l2355q881k9775k0765J37447O4222l5674k3867j63168j3682
12606B44936n8429L422r835J09865O1577o0294J9725l7799M7465l6170j09892
12595A74571k7406N4887K4718p4297M0724O6183m3498j6575o5954J16053J22467
12584C71873j96801R936J19036n8276k150k856M8306p2884J21254l787j24056
12573B09595p9622p8786o2578N8719o0162j895N6238P7032j9475m5399p4438M0520
12561A9749N6301n236l6977L3766N6938o0710Q1797L3803O0214m7796O898j27607
$$ plain form
12549 71140 70062 153632 143921 136446 66228 120635 88832 68453 126208 247626 287655 345739
12537 345739 116909 19567 233806 208585 164624 162843 119042 89415 203783 225672 187775
12526 187775 309545 373343 346806 303903 67586 120810 153463 220050 205050 69355 46973
12515 46973 108188 112898 148842 130930 104793 157422 132960 77702 132079 153209 116844 97028
12503 97028 6385 -70674 163176 205908 109622 258620 257733 152643 25972 106341 189070
12492 189070 183038 178329 320090 205367 91554 122694 233191 142706 -43257 100191 225758
12481 225758 421591 288231 195903 277727 206914 110358 78630 -8530 12216 121366 160061
12470 160061 166677 121038 206917 232541 214517 279057 193342 124492 171757 258241 125678
$$ packed form
12549G1140j078Q3570r711p475p0218N4407l1803k0379N7755J21418M0029N8084
12537C45739k28830r7342K14239k5221m3961j781m3801k9627J14368K1889l7897
12526A87775J21770O3798k6537m2903k36317N3224L2653O6587j5000j35695k2382
12515D6973O1215M710L5944j7912k6137N2629k4462n5258N4377K1130l6365j9816
12503I7028r0643p7059K33850M2732r6286J48998q87j05090j26671Q0369Q2729
12492A89070o032m709J41761j14723j13813L1140J10497r0485j85963J43448J25567
12481B25758J95833j33360r2328Q1824p0813r6556l1728q7160K0746J09150L8695
12470A60061O616m5639Q5879K5624j8024O4540q5715o8850M7265Q6484j32563
$$ plain form
12459 125678 111359 145034 145455 250558 133125 124118 246472 227718 181729 178206 101764 71859
12447 71859 132573 234837 194899 235496 265183 313978 203094 115115 171313 221847 162504
12436 162504 142673 154583 225355 270402 242882 195017 194551 194467 157588 144129 169228 263102
12424 263102 238088 221773 224293 128809 218141 88555 63575 41121 13373 117884 73817
12413 73817 18402 25496 146679 23001 7340 37413 -32406 72528 -19896 1921 116785
12402 116785 46562 39093 54725 74204 122043 372512 378824 223495 225019 203072 85214
12391 85214 61384 192935 247005 121075 55151 113140 111468 83256 77034 66936 49811 73406
12379 73406 2413 135915 199761 169657 166832 149663 277163 144901 170983 200011 146239
$$ packed form
12459A25678j4319L3675M21J05103j17433r007J22354j8754m5989l523p6442k9905
12447G1859O0714J02264l9938M0597K9687M8795j10884q7979N6198N0534n9343
12436A62504j9831J1910P0772M5047k7520m7865m66q4l6879j3459K5099R3874
12424B63102k5014j6315K520r5484Q9332j29586k4980k2454k7748J04511m4067
12413G3817n5415P094J21183j23678j5661L0073o9819J04934r2424K1817J14864
12402A16785p0223p469J5632J9479M7839K50469O312j55329J524k1947j17858
12391H5214k3830J31551N4070j25930o5924N7989j672k8212o222j0098j7125K3595
12379G3406p0993J33502O3846l0104k825j7169J27500j32262K6082K9028n3772
$$ plain form
12368 146239 105765 167830 170999 136929 116061 156848 241991 137814 193253 153328 77614
12357 77614 131690 121968 104556 9989 42257 84003 8595 34301 178616 177967 94003 63013
12345 63013 -14799 104230 153290 148052 196609 220552 280014 216384 97878 -5067 53159
12334 53159 141540 94354 1273 132644 168048 232628 216489 76822 15947 86583 60948
12323 60948 126543 34693 32414 -33516 -56176 66671 191938 300540 230797 154469 148686
12312 148686 208482 144851 171012 92319 98962 94862 131660 214408 174241 -2998 -110049
12301 -110049 -89175 24384 -5404 31304 158029 240060 136305 107354 151355 100513 -102650
12290 -102650 18810 134702 125885 80858 -43719 55351 132309 174007 145477 36844 86574
$$ packed form
12368A46239m0474O2065L169l4070k0868M0787Q5143j04177N5439l9925p5714
12357G7614N4076r722j7412r4567L2268M1746p5408K5706J44315o49q3964l0990
12345F3013p7812J19029M9060n238M8557K3943N9462o3630j18506j02945N8226
12334E3159Q8381m7186r3081J31371L5404O4580j6139j39667o0875P0636k5635
12323F0948O5595r1850k279o5930k2660J22847J25267J08602o9743p6328n783
12312A48686N9796o3631K6161p8693O643m100L6798Q2748m0167j77239j07051
12301a10049K0874J13559k9788L6708J26725Q2031j03755k8951M4001n0842k03163
12290a02650J21460J15892q817m5027j24577R9070P6958M1698k8530j08633M9730
$$ plain form
12279 86574 124624 24138 -86964 74 89015 15405 -32265 81293 129997 125860 160454
12268 160454 21363 36506 236040 222185 83337 83999 144333 201242 84638 4203 -24218
12257 -24218 17777 83490 123548 135235 136657 151510 90477 74542 159852 78769 124434 234035
12245 234035 109453 72955 36486 15418 122649 76250 228451 220723 236921 110912 83967
12234 83967 174273 92492 96805 189420 117496 116396 49487 -7466 72243 211312 317616 283443
12222 283443 227976 275582 249999 132244 68414 -76007 64270 46995 -14759 36263 27369
12211 27369 -48491 -12810 54583 108003 111443 -152 26536 98535 77686 95415 54366 66308
12199 66308 130690 120897 21029 105038 214601 277405 158725 184200 171977 94034 5387
$$ packed form
12279H6574L8050j00486j11102Q7038Q8941p3610m7670J13558M8704m137L4594
12268A60454j39091J5143J99534j3855j38848O62O0334N6909j16604q0435k8421
12257b4218M1995O5713M0058J1687J422J4853o1033j5935Q5310q1083M5665J09601
12245B34035j24582l6498l6469k1068J07231m6399J52201p728J6198j26009k6945
12234H3967R0306q1781M313R2615p1924j100o6909n6953P9709J39069J06304l4173
12222B83443n5467M7606k5583j17755o3830j44421J40277j7275o1754N1022q894
12211B7369p5860L5681O7393N3420L440j11595K6688P1999k0849J7729m1049J1942
12199F6308O4382r793r9868Q4009J09563O2804j18680K5475j2223p7943q8647
$$ plain form
12188 5387 64784 187014 397087 325745 195550 188579 290911 260167 45074 41894 77395
12177 77395 1841 -26342 -113794 32719 168093 288739 285573 201983 173292 63731 147759
12166 147759 171204 183287 132570 3592 73992 33762 179991 182456 138677 115154 8487
12155 8487 167901 135755 101719 59646 99307 50322 -30153 15574 228454 249023 204656
12144 204656 134588 111028 123460 81363 152797 96417 -11341 96254 132150 267968 208302
12133 208302 91293 107068 184280 179972 130950 144643 250253 240547 207879 198972 116412 141257
12121 141257 114221 13634 22827 -43421 -85062 -72820 -7325 110100 159329 2063 55661
12110 55661 179648 201225 162621 171396 78642 98852 218891 189573 95699 156945 -21881
$$ packed form
12188E387N9397J22230K10073p1342j30195o971J02332l0744k15093l180L5501
12177G7395p5554k8183q7452J46513J35374J20646l166q3590k8691j09561Q4028
12166A47759K3445J2083n0717j28978P0400m0230J46229K465m3779k3523j06667
12155H487J59414l2146l4036m2073L9661m8985q0475M5727K12880K0569m4367
12144B04656p0068k3560J2432m2097P1434n6380j07758J07595L5896J35818n9666
12133B08302j17009J5775P7212m308m9022J3693J05610r706l2668q907q2560K4845
12121A41257k7036j00587R193o6248m1641J2242O5495J17425M9229j57266N3598
12110E5661J23987K1577l8604Q775r2754K0210J20039k9318r3874O1246j78826
$$ plain form
12099 -21881 -73532 98378 189963 243549 232372 203131 73590 89453 180268 199874 162109
12088 162109 189440 181450 73085 181909 132495 80295 -1570 -84217 3449 -91195 109283
12077 109283 64407 34161 46355 37708 84942 251130 232021 117787 134442 202516 175804
12066 175804 98982 145341 139518 168205 46920 93761 43118 -22166 12755 153886 242433
12055 242433 165837 119301 114686 248505 236188 4629 35941 43201 24665 159312 219487
12044 219487 230620 227336 254814 224809 222927 127179 52882 38711 120154 162750 265192 142481
12032 142481 86882 177084 112567 11065 104771 89013 118531 179765 222206 190861 218932
12021 218932 119701 21576 49597 104117 167269 72959 165475 209934 204238 254068 280935 476441
$$ packed form
12099b1881n1651J71910R1585N3586j1177k9241j29541J5863R0815J9606l7765
12088A62109K7331p990j08365J08824m9414n2200q1865q2647Q7666r4644K00478
12077A09283m4876l0246J2194q647M7234J66188j9109j14234J6655O8074k6712
12066A75804p6822M6359n823K8687j21285M6841n0643o5284L4921J41131Q8547
12055B42433p6596m6536m615J33819j2317k31559L1312P260j8536J34647O0175
12044B19487J1133l284K7478l0005j882r5748p4297j4171Q1443M2596J02442j22711
12032A42481n5599R0202o4517j01502R3706j5758K9518O1234M2441l1345K8071
12021B18932r9231r8125K8021N4520O3152r4310R2516M4459n696M9830K6867J95506
$$ plain form
12009 476441 393012 274947 303869 392385 422000 368907 327530 265075 346940 399960 356217
11998 356217 294743 244885 141170 64884 172116 374976 432140 338491 386291 393515 275588
11987 275588 348748 368581 252677 160293 296728 370921 509373 390430 370401 359660 165399
11976 165399 218734 281990 341201 384576 427118 397941 314542 321453 282810 397387 429586
11965 429586 298918 281283 313916 208616 131789 242640 223335 337931 294993 308778 226994
11954 226994 258093 124162 78679 249287 268168 224503 391552 323740 63821 227913
11944 227913 318373 311200 490491 433809 323828 297224 292878 364186 375968 382415 359014 490919
11932 490919 476062 411380 291650 350712 465937 509248 514882 372222 455367 485445 423715
$$ packed form
12009D76441q3429j18065K8922Q8516K9615n3093m1377o2455Q1865N3020m3743
11998C56217o1474m9858j03715p6286J07232K02860N7164r3649M7800P224j17927
11987B75588P3160J9833j15904r2384J36435P4193J38452j18943k0029j0741j94261
11976A65399N3335O3256N9211M3375M2542k9177q3399O911l8643J14577L2199
11965D29586j30668j7635L2633j05300p6827J10851j9305J14596m2938J3785q1784
11954B26994L1099j33931m5483J70608J8881m3665J67049o7812k59919J64092
11944B27913R0460p173J79291n6682j09981k6604m346P1308J1782O447k3401J31905
11932D90919j4857o4682j19730N9062J15225M3311N634j42660Q3145L0078o1730
$$ plain form
11921 423715 512281 393324 422693 430742 365315 319577 387479 523183 525146 470061 426990
11910 426990 333068 384370 384691 513517 421343 387214 429640 412242 382255 333866 316092 299990
11898 299990 391302 306927 267494 313997 319062 314734 370849 377776 333859 453804 529377 429660
11886 429660 364971 411051 484326 446644 427976 479697 455055 502155 637734 744879 654940
11875 654940 563074 426493 525845 670677 797741 759639 654697 625903 669447 683082 659137
11864 659137 575032 596338 669772 767059 748084 726746 744733 746053 944333 920010 848706
11853 848706 792285 975582 1069952 1107880 1170625 1143782 1064230 1179506 1211926 1248097 1378541
11842 1378541 1400474 1543336 1565086 1486359 1664709 1738420 1724726 1720765 1755320 1859968 1908381
$$ packed form
11921D23715Q8566j18957K9369Q049o5427m5738O7902J35704J963n5085m3071
11910D26990r3922N1302L21J28826r2174l4129M2426j7398k9987m8389j7774j6102
11898B99990R1312q4375l9433M6503N065m328N6115O927m3917J19945P5573r9717
11886D29660o4689M6080P3275l7682j8668N1721k4642M7100J35579J07145q9939
11875F54940r1866j36581R9352J44832J27064l8102j04942k8794M3544J3635k3945
11864F59137q4105K1306P3434R7287j8975k1338J7987J320J98280k4323p1304
11853H48706n6421J83297R4370L7928O2745k6843p9552J15276L2420L6171J30444
11842A378541K1933J42862K1750p8727J78350P3711j3694l961L4555J04648M8413
$$ plain form
11831 1908381 1888001 1884675 1936091 1903976 1826966 1851253 1827857 1870277 1819101 1853126 1870006
11820 1870006 1911140 2073580 2119802 2098596 2048965 1925618 2016392 2160562 2164512 2296271 2260100
11809 2260100 2130105 2082527 2100286 1913078 1779797 1868068 1740861 1604224 1550525 1503545
11799 1503545 1426805 1378388 1405901 1366482 1234788 1260626 1156356 1140440 1021379 955894 953834
11788 953834 1007368 993481 841770 745560 787874 749676 813451 858524 904728 913940 871662
11777 871662 893316 801717 791156 721494 711649 589938 642854 684561 683031 640809 634703 646484
11765 646484 560600 514291 561306 587155 536858 476110 480507 464899 530104 581314 659698 781285
11753 781285 706600 682095 600695 645289 663365 692695 683503 776814 800907 912360 995748
$$ packed form
11831A908381k0380l326N1416l2115p7010K4287k3396M2420n1176L4025J6880
11820A870006M1134J62440M6222k1206m9631j23347R0774J44170L950J31759l6171
11809B260100j29995m7578J7759j87208j33281Q8271j27207j36637n3699m6980
11799A503545p6740m8417K7513l9419j31694K5838j04270j5916j19061o5485k060
11788I53834N3534j3887j51711r6210M2314l8198O3775M5073M6204R212m2278
11777H71662K1654r1599j0561o9662r845j21711N2916M1707j530m2222o106J1781
11765F46484q5884m6309M7015K5849n0297o0748M397j5608O5205N1210P8384J21587
11753G81285p4685k4505q1400M4594J8076K9330r192R3311K4093J11453Q3388
$$ plain form
11742 995748 964321 842614 921617 1073652 971130 1049644 1043788 1027583 991984 1086115 1058966
11731 1058966 1027555 945450 903435 865309 732512 709110 710768 655812 516331 631323 590495
11720 590495 631189 506385 462158 458059 440245 443981 389753 484288 437215 347868 314806 491694
11708 491694 420211 470592 386546 496041 375308 414332 549798 487862 464478 529079 424767
11697 424767 312369 323600 355805 344834 362224 304556 221377 275006 289817 223730 420588
11686 420588 324551 294582 288345 347856 483855 459615 525881 528945 506560 526374 424680
11675 424680 261264 301883 370914 262569 340917 264965 110933 176964 260868 380390 324431
11664 324431 282646 294857 330971 268845 364411 386212 326236 319816 299899 147741 170023
$$ packed form
11742I95748l1427j21707P9003J52035j02522P8514n856j6205l5599R4131k7149
11731A058966l1411q2105m2015l8126j32797k3402J658n4956j39481J14992m0828
11720E90495M0694j24804m4227m099j7814L736n4228R4535m7073q9347l3062J76888
11708D91694p1483N0381q4046J09495j20733L9024J35466o1936k3384O4601j04312
11697D24767j12398J1231L2205j0971J7390n7668q3179N3629J4811o6087J96858
11686D20588r6037k9969o237N9511J35999k4240O6266L064k2385J9814j01694
11675D24680j63416M0619O9031j08345P8348p5952j54032O6031Q3904J19522n5959
11664C24431m1785J2211L6114o2126R5566K1801n9976o420j9917j52158K2282
$$ plain form
11653 170023 176485 295635 318415 210024 205682 242545 296765 277387 264096 309440 331212
11642 331212 323126 184769 224903 340398 501448 512318 362542 391055 403182 379674 425120
11631 425120 346919 402329 473931 463424 448214 502400 478444 372561 446156 527269 457507
11620 457507 437252 414025 486834 464501 488103 393833 413800 417224 347060 405047 410858 256781
11608 256781 185678 276693 332413 385833 390972 344342 236587 366781 415933 345201 345542 249450
11596 249450 307823 263404 320698 266008 179845 261225 329286 315474 238987 191013 227865
11585 227865 254659 164546 216795 306402 235521 214698 309374 380238 424000 415223 451585 300932
11573 300932 357330 298665 269571 364039 367504 392389 550924 447098 434304 536834 602389
$$ packed form
11653A70023O462J19150K2780j08391m342L6863N4220j9378j3291M5344K1772
11642C31212q086j38357M0134J15495J61050J0870j49776K8513J2127k3508M5446
11631D25120p8201N5410P1602j0507j5210N4186k3956j05883P3595Q1113o9762
11620D57507k0255k3227P2809k2333K3602r4270J9967L424p0164N7987N811j54077
11608B56781p1103R1015N5720N3420N139m6630j07755J30194M9152p0732L41r6092
11596B49450N8373m4419N7294n4690q6163Q1380O8061j3812p6487m7974L6852
11585B27865K6794r0113N2249Q9607p0881k0823R4676P0864M3762q777L6362j50653
11573C00932N6398n8665k9094R4468L465K4885J58535j03826j2794J02530O5555
$$ plain form
11562 602389 706093 632501 696521 796259 943572 998243 990388 1026243 1081466 1095468 1092007
11551 1092007 1186875 1263952 1207794 1208788 1378358 1279663 1148727 1150436 1108789 1038630 912999
11540 912999 876574 971078 862721 807896 737429 759874 743699 572488 540043 485373 475933
11529 475933 469539 460349 448945 378974 435623 516964 559468 498436 545820 538395 413008 437937
11517 437937 424645 251356 290533 418356 379247 345744 346473 347320 228797 256626 233258 275623
11505 275623 184200 132585 117566 163124 247229 229814 307901 249426 409860 353235 253597
11494 253597 346235 388092 473808 473451 482799 498222 537725 470591 377560 401704 342565 452351
11482 452351 552766 415864 411357 478624 611978 617014 616029 634509 622847 821732 722411
$$ packed form
11562F02389J03704p3592O4020R9738J47313N4671p855L5855N5223J4002l461
11551A092007R4868P7077n6158R94J69570r8695j30936J709m1647p0159j25631
11540I12999l6425R4504j08357n4825p0467K2445j6175j71211l2445n4670r440
11529D75933o394r190j1404o9971N6649Q1341M2504o1032M7384p425j25387K4929
11517D37937j3292j73289L9177J27823l9109l3503P29Q47j18523K7829k3368M2365
11505B75623r1423n1615j5019M5558Q4105j7415P8087n8475J60434n6625r9638
11494B53597R2638M1857Q5716l57R348J5423L9503o7134r3031K4144n9139J09786
11482D52351J00415j36902m507O7267J33354N036r85J8480j1662J98885r9321
$$ plain form
11471 722411 694356 644501 789107 896556 917798 972793 1178329 1313824 1362293 1541707
11461 1541707 1549489 1654216 1900617 2088764 2201776 2171581 2204512 2333159 2376474 2471221
11451 2471221 2557767 2578063 2539247 2565666 2318033 2089065 2093992 2057860 2063820 2064782 1927652
11440 1927652 1807364 1575796 1476618 1326547 1123874 1105565 1035221 945711 902031 876154
11430 876154 983373 965686 902617 858365 929101 911724 976549 1025191 980568 831996 730327
11419 730327 1035480 1095045 992194 1156171 1238394 1249876 1279015 1456940 1542463 1585366 1612343
11408 1612343 1697608 1794714 1918934 1990927 2007141 2070985 2063575 1946266 1804987 1744546 1781871
11397 1781871 1680327 1500247 1431384 1326442 1265166 1213358 1092265 1067339 1101267 1100684 872718
$$ packed form
11471G22411k8055m9855J44606J07449K1242N4995K05536J35495M8469J79414
11461A541707P782J04727K46401J88147J13012l0195L2931J28647M3315R4747
11451B471221Q6546K0296l8816K6419k47633k28968M927l6132N960R62j37130
11440A927652j20288k31568r9178j50071k02673j8309p0344q9510m3680k5877
11430H76154J07219j7687o3069m4252P0736j7377O4825M8642m4623j48572j01669
11419G30327L05153N9565j02851J63977Q2223J1482K9139J77925Q5523M2903K6977
11408A612343Q5265R7106J24220P1993J6214O3844p410j17309j41279o0441L7325
11397A781871j01544j80080o8863j04942o1276n1808j21093k4926L3928n83k27966
$$ plain form
11386 872718 780706 727786 703518 553055 478845 526833 378242 350936 345566 420281 446170
11375 446170 351506 311739 455996 307081 195437 126007 117377 176685 162309 159557 261178
11364 261178 374739 97386 49569 87107 60444 9434 77498 121409 45206 125002 -84055
11353 -84055 -58116 -89855 -19057 62261 153049 34233 63662 152236 118667 104537 152893
11342 152893 160654 46437 -814 42197 53065 44730 17737 87991 -84757 -144032 -71802
11331 -71802 -145918 -145265 -121593 -67334 -133246 -72188 -67813 115585 149423 -96871 -89588 -114497
11319 -114497 -281127 -318743 -142372 -87180 -126123 -228377 -224458 -98169 -118328 -177456 -123842
11308 -123842 -197163 -178341 -104386 -159605 -146837 -126901 -173572 -94209 -126777 -241730 -259282
$$ packed form
11386H72718r2012n2920k4268j50463p4210M7988j48591k7306n370P4715K5889
11375D46170r4664l9767J44257j48915j11644o9430q630N9308j4376k752J01621
11364B61178J13561k77353m7817L7538k6663n1010O8064M3911p6203P9796k09057
11353h4055K5939l1739P0798Q1318R0788j18816K9429Q8574l3569j4130M8356
11342A52893P761j14217m7251M3011J0868q335k6993P0254j72748n9275P2230
11331g1802p4116O53K3672N4259o5912O1058M375J83398L3838k46294P283k4909
11319a14497j66630l7616J76371N5192l8943j02254L919J26289k0159n9128N3614
11308a23842p3321J8822P3955n5219J2768J9936m6671P9363l2568j14953j7552
$$ plain form
11297 -259282 -137671 -114927 -220248 -168841 -97852 -163007 -236676 -178600 -213725 -213360 -289585
11286 -289585 -366716 -303140 -142152 -176473 -174395 -193506 -170309 -79063 -93489 -223987 -222517
11275 -222517 -151618 -132970 -322949 -290297 -258248 -295360 -346226 -216290 -165466 -262701 -280433
11264 -280433 -327438 -242943 -141312 -210095 -236961 -176565 -145664 -258120 -275842 -285572 -304098
11253 -304098 -210095 -198035 -282658 -203881 -248920 -194584 -188251 -173798 -127383 -237783 -282898
11242 -282898 -292946 -331818 -230746 -180360 -140483 -54070 -86171 -144017 -164629 -94875 -4284
11231 -4284 -108710 -204059 -192571 -168158 -316684 -419913 -310075 -283264 -267654 -260090 -228864
11220 -228864 -271528 -216729 -88466 -158485 -300382 -463631 -428258 -317391 -393317 -340652 -330796
$$ packed form
11297b59282J21611K2744j05321N1407P0989o5155p3669N8076l5125L65p6225
11286b89585p7131O3576J60988l4321K078j9111K3197R1246j4426j30498J470
11275b22517P0899J8648j89979L2652L2049l7112n0866J29936N0824r7235j7732
11264b80433m7005Q4495J01631o8783k6866O0396L0901j12456j7722r730j8526
11253c04098R4003J2060q4623P8777m5039N4336O333J4453M6415j10400m5115
11242b82898j0048l8872J01072N0386L9877Q6413l2101n7846k0612O9754R0591
11231d284j04426r5349J1488K4413j48526j03229J09838K6811J5610P564L1226
11220b28864m2664N4799J28263p0019j41897j63249L5373J10867p5926N2665R856
$$ plain form
11209 -330796 -300284 -394733 -367427 -348615 -298338 -342790 -443995 -499613 -465898 -421693 -359272
11198 -359272 -478086 -421524 -321789 -255642 -339182 -351869 -404419 -348798 -289205 -252661 -228090
11187 -228090 -186270 -241083 -242378 -197730 -227223 -187899 -170344 -173089 -268973 -152143 -223623 -141829
11175 -141829 -160857 -45217 23591 -90933 -131409 -66591 6676 -15489 -78160 -190427 -136118
11164 -136118 -145885 -232386 -147499 -24774 46982 3964 -165235 -142892 -73667 40652 34086
11153 34086 55335 41245 15632 7331 62051 47514 148751 136116 130950 87695 -26670 -124556
11141 -124556 -168920 -137337 -68365 -187415 -198737 -164622 -93434 -109436 -300759 -262378 -127072
11130 -127072 -123354 -157247 -171975 -233749 -316010 -196312 -253699 -319022 -259276 -266534 -169444 -295709
$$ packed form
11209c30796L0512r4449K7306J8812N0277m4452j01205n5618L3715M4205O2421
11198c59272j18814N6562R9735O6147q3540j2687n2550N5621N9593L6544K4571
11187b28090M1820n4813j295M4648k9493L9324J7555k745r5884J16830p1480Q1794
11175a41829j9028J15640O8808j14524m0476O4818P3267k2165o2671j12267N4309
11164a36118r767q6501Q4887J22725P1756m3018j69199K2343O9225J14319o566
11153C4086K1249j4090k5613q301N4720j4537J01237j2635n166m3255j14365r7886
11141a24556m4364L1583O8972j19050j1322L4115P1188j6002j91323L8381J35306
11130a27072L718l3893j4728o1774q2261J19698n7387o5323N9746p258R7090j26265
$$ plain form
11118 -295709 -232780 -188964 -217814 -262758 -255544 -367150 -270373 -257457 -332438 -267437 -267841 -396898
11106 -396898 -382718 -328233 -202986 -209978 -218652 -206837 -311200 -224854 -272441 -263121 -124137
11095 -124137 -314572 -390915 -380332 -364001 -324968 -377705 -506274 -391014 -349241 -389524 -434415
11084 -434415 -392798 -473258 -354527 -356051 -333450 -275513 -413851 -322357 -444962 -452411 -311666
11073 -311666 -345512 -352862 -397884 -394434 -336635 -284509 -340992 -392189 -400665 -448069 -442144 -302555
11061 -302555 -386780 -314495 -338237 -298251 -229446 -393669 -451427 -468819 -392683 -328427 -300713
11050 -300713 -393745 -496637 -483493 -382573 -274829 -406611 -493750 -364787 -329768 -396906
11040 -396906 -467818 -379010 -412202 -425702 -394008 -519278 -454685 -430955 -467665 -445733 -410503
$$ packed form
11118b95709O2929M3816k8850m4944P214j11606R6777J2916p4981O5001m04j29057
11106c96898J4180N4485J25247o992q674J1815j04363Q6346m7587R320J38984
11095a24137j90435p6343J0583J6331L9033n2737j28569J15260M1773m0283m4891
11084d34415M1617q0460J18731j524K2601N7937j38338R1494j22605p449J40745
11073c11666l3846p350m5022L450N7799N2126n6483n1197q476m7404N925J39589
11061c02555q4225P2285k3742L9986O8805j64223n7758j7392P6136O4256K7714
11050c00713r3032j02892J3144J00920J07744j31782q7139J28963L5019o7138
11040c96906p0912Q8808l3192j3500L1694j25270O4593K3730l6710K1932L5230
$$ plain form
11029 -410503 -365305 -388030 -408244 -463464 -478310 -470148 -390935 -433223 -450270 -500396 -434537 -429601
11017 -429601 -383053 -408870 -437797 -453515 -426056 -360516 -362305 -325740 -331169 -352736 -412422 -425635
11005 -425635 -460308 -623231 -544207 -591307 -538075 -461701 -431224 -437821 -494760 -423971 -392194
10994 -392194 -436834 -503553 -503294 -511500 -484625 -420642 -465056 -297823 -403618 -582374 -552312
10983 -552312 -490858 -408937 -394606 -354082 -347160 -363220 -361221 -571839 -626267 -513715 -460179
10972 -460179 -547265 -484126 -476992 -452036 -449819 -380214 -383807 -386815 -255283 -284308 -502856 -491437
10960 -491437 -393894 -521638 -617072 -604220 -509369 -429224 -414937 -494665 -539782 -467381 -422553
10949 -422553 -510671 -565834 -458753 -411511 -476911 -390911 -487247 -459820 -447638 -410581 -337511
$$ packed form
11029d10503M5198k2725k0214n5220j4846Q162P9213m2288j7047n0126O5859M936
11017d29601M6548k5817k8927j5718K7459O5540j789L6565n429k1567n9686j3213
11005d25635l4673j62923P9024m7100N3232P6374L0477o597n6939P0789L1777
10994c92194m4640o6719K59q206K6875O3983m4414J67233j05795j78756L0062
10983e52312O1454Q1921J4331M0524O922j6060J999k10618n4428J12552N3536
10972d60179q7086O3139P134K4956K217O9605l593l008J31532k9025k18548J1419
10960d91437R7543j27744r5434J2852R4851Q0145J4287p9728m5117P2401M4828
10949d22553q8118n5163J07081M7242o5400Q6000r6336K7427J2182L7057P3070
$$ plain form
10938 -337511 -303048 -363350 -426465 -339048 -406917 -406032 -310531 -286408 -270044 -291574 -249135 -384435
10926 -384435 -505202 -438851 -352203 -435392 -431958 -456042 -526089 -552212 -406127 -290785 -222489
10915 -222489 -251646 -251053 -325368 -293893 -472477 -506584 -481703 -480129 -416900 -500670 -516498 -517833
10903 -517833 -535364 -558119 -355830 -319658 -308276 -413246 -539931 -580889 -557168 -527132 -467212
10892 -467212 -458764 -385467 -268348 -373705 -402141 -384415 -409861 -420281 -469174 -505077 -461705
10881 -461705 -462557 -448956 -610421 -687292 -613013 -496951 -354703 -425300 -447291 -534492 -514383
10870 -514383 -462930 -470675 -331110 -483071 -468673 -466537 -490818 -534843 -492350 -566186 -633241
10859 -633241 -557283 -538460 -528760 -562885 -592188 -663282 -698881 -649283 -586514 -661148 -648744 -511731
$$ packed form
10938c37511L4463o0302o3115Q7417o7869Q85R5501K4123J6364k1530M2439j35300
10926c84435j20767O6351Q6648q3189L434k4084p0047k6123J46085J15342O8296
10915b22489k9157N93p4315L1475j78584l4107K4881J574O3229q3770j5828j335
10903e17833j7531k2755K02289L6172J1382j04970j26685m0958K3721L0036N9920
10892d67212Q448P3297J17119j05357k8436J7726k5446j0420m8893l5903M3372
10881d61705q52J3601j61465p6871P4279J16062J42248p0597k1991q7201K0109
10870e14383N1453p745J39565j51961J4398K136k4281m4025M2493p3836o7055
10859f33241P5958J8823R700l4125k9303p1094l5599M9598O2769p4634J2404J37013
$$ plain form
10847 -511731 -563497 -459856 -494667 -563629 -674368 -664318 -528414 -601171 -624442 -641071 -537783
10836 -537783 -544446 -537374 -381177 -611362 -666604 -589405 -551366 -656380 -640399 -598615 -699227
10825 -699227 -658955 -556220 -555999 -664377 -766643 -662015 -531644 -534134 -535750 -615716 -528700
10814 -528700 -551456 -514578 -532092 -557462 -620427 -622493 -681573 -559192 -621696 -660480 -680725
10803 -680725 -720027 -819082 -710699 -618820 -537995 -502031 -630974 -713748 -617646 -576037 -633035
10792 -633035 -699419 -764839 -704362 -575919 -579103 -629365 -689006 -557158 -489505 -483817 -597413
10781 -597413 -669565 -593452 -599690 -646659 -703093 -682449 -715473 -740380 -615484 -560795 -607704
10770 -607704 -626137 -567988 -604857 -677262 -750894 -682872 -575695 -475578 -514312 -490860 -541659
$$ packed form
10847e11731n1766J03641l4811o8962j10739J0050J35904p2757k3271j6629J03288
10836e37783o663P072J56197k30185n5242P7199L8039j05014J5981M1784j00612
10825f99227M0272J02735K21j08378j02266J04628J30371k490j616p9966Q7016
10814e28700k2756L6878j7514k5370o2965k066n9080J22381o2504l8784k0245
10803f80725l9302r9055J08383R1879Q0825L5964j28943q2774R6102M1609n6998
10792f33035o6384o5420O0477J28443l184n0262n9641J31848O7653N688j13596
10781e97413p2152P6113o238m6969n6434K0644l3024k4907J24896N4689m6909
10770f07704j8433N8149l6869p2405p3632O8022J07177J00117l8734K3452n0799
$$ plain form
10759 -541659 -613562 -597070 -554865 -633287 -723696 -753274 -609937 -586683 -637830 -639821 -559444
10748 -559444 -551395 -691307 -637420 -672453 -565018 -675568 -739061 -856446 -831967 -829779 -812232
10737 -812232 -746651 -700381 -588565 -516843 -575757 -732010 -754381 -672011 -700320 -625823 -705402
10726 -705402 -850550 -725960 -612414 -584563 -609433 -702513 -754430 -704843 -688004 -662171 -728282
10715 -728282 -617080 -671488 -832123 -638739 -707351 -575554 -584689 -616956 -570703 -619573 -711491
10704 -711491 -686407 -665840 -706102 -754465 -661821 -663566 -624673 -573316 -535299 -637129 -708060
10693 -708060 -708440 -658888 -635526 -793250 -735775 -710727 -678572 -572224 -476035 -423863 -479790
10682 -479790 -567704 -679277 -722704 -700114 -568450 -537582 -599013 -586425 -657783 -665364 -704548
$$ packed form
10759e41659p1903J6492M2205p8422r0409k9578J43337K3254n1147j991Q0377
10748e59444Q049j39912N3887l5033J07435j10550o3493j17385K4479K188J7547
10737h12232O5581M6270J11816P1722n8914j56253k2371Q2370k8309P4497p9579
10726g05402j45148J24590J13546K7851k4870r3080n1917M9587J6839K5833o6111
10715g28282J11202n4408j60635J93384o8612J31797r135l2267M6253m8870r1918
10704g11491K5084K0567m0262m8363R2644j745L8893N1357L8017j01830p0931
10693g08060l80M9552K3362j57724N7475K5048L2155J06348R6189N2172n5927
10682d79790q7914j11573m3427K2590J31664L0868o1431J2588p1358p581l9184
$$ plain form
10671 -704548 -653392 -637113 -650778 -663406 -725351 -725686 -728453 -671485 -633126 -770239 -764798 -746420
10659 -746420 -795757 -874069 -665340 -505879 -557525 -504767 -645679 -529823 -605520 -742619
10649 -742619 -597168 -536554 -662517 -749404 -720610 -731006 -714400 -679248 -605949 -658519 -779005
10638 -779005 -673789 -712935 -736539 -707221 -613813 -606781 -627811 -669345 -663345 -716392 -810343 -684701
10626 -684701 -628396 -813439 -797204 -668821 -769071 -702205 -705800 -748903 -787303 -753577 -669692
10615 -669692 -632816 -596761 -558148 -511260 -638441 -740449 -647485 -578292 -589966 -738269 -716134
10604 -716134 -720859 -692663 -798045 -782876 -749801 -672502 -682215 -599581 -613521 -649452 -646713 -702827
10592 -702827 -772029 -752579 -696244 -700694 -591438 -639928 -716090 -716572 -738403 -643725 -606772 -575669
$$ packed form
10671g04548N1156J6279j3665j2628o1945l35k767N6968L8359j37113N441J8378
10659g46420m9337p8312K08729J59461n1646N2758j40912J15856p5697j37099
10649g42619J45451O0614j25963q6887K8794j0396J6606L5152P3299n2570j20486
10638g79005J05216l9146k3604K9318R3408P032k1030m1534O000n3047r3951J25642
10626f84701N6305j85043J6235J28383j00250O6866l595m3103l8400L3726Q3885
10615f69692L6876L6055L8613M6888j27181j02008R2964O9193j1674j48303K2135
10604g16134m725K8196j05382J5169L3075P7299r713Q2634j3940l5931K739n6114
10592g02827o9202J9450N6335m450J09256m8490p6162m82k1831R4678L6953L1103
$$ plain form
10580 -575669 -655764 -674749 -672904 -604328 -596272 -567498 -519147 -586944 -667938 -742934 -656523 -623458
10568 -623458 -573179 -489849 -505149 -680771 -660204 -497573 -465177 -514699 -565499 -554302 -555626
10557 -555626 -658291 -635339 -606419 -626906 -667183 -789671 -692850 -678567 -719252 -702155 -721563
10546 -721563 -771405 -685718 -662179 -609744 -644197 -630839 -539905 -546253 -710237 -714606 -597250
10535 -597250 -626717 -621315 -743932 -736040 -827311 -759822 -666253 -659418 -746027 -737629 -678435 -625611
10523 -625611 -710687 -597699 -595449 -661849 -720867 -671184 -664415 -655349 -647401 -764589 -707334 -770476
10511 -770476 -778710 -802122 -689647 -631334 -678307 -667810 -681179 -711966 -558865 -620822 -722786
10500 -722786 -679121 -549144 -477756 -587463 -547874 -671094 -660818 -588025 -465930 -486486 -588340
$$ packed form
10580e75669q0095j8985J845O8576Q056K8774M8351o7797q0994p4996Q6411L3065
10568f23458N0279Q3330j5300j75622K0567J62631L2396m9522n0800J1197j324
10557e55626j02665K2952K8920k0487m0277j22488R6821J4283m0685J7097j9408
10546g21563m9842Q5687K3539N2435l4453J3358R0934o348j63984m369J17356
10535e97250k9467N402j22617P892r1271O7489R3569O835q6609Q398N9194N2824
10523f25611q5076J12988K250o6400n9018M9683O769R066P948j17188N7255o3142
10511g70476q234k3412J12475N8313m6973J0497j3369l0787J53101o1957j01964
10500g22786M3665J29977P1388j09707L9589j23220J0276P2793J22095k0556j01854
$$ plain form
10489 -588340 -581246 -596062 -577968 -632020 -674546 -680250 -715854 -686834 -590694 -509218 -577168 -620072
10477 -620072 -618703 -555816 -534962 -508683 -566256 -526311 -602556 -478097 -389647 -379646 -480340
10466 -480340 -524331 -632750 -584173 -472048 -621289 -566171 -502905 -551694 -687796 -619803 -525936
10455 -525936 -456857 -467219 -525478 -429724 -343285 -586019 -647248 -509052 -378377 -569871 -625622
10444 -625622 -610070 -512912 -538988 -497190 -541271 -604070 -595122 -638594 -643833 -594941 -489934 -597822
10432 -597822 -769805 -734107 -643520 -556976 -561642 -575737 -489068 -411356 -469682 -558543 -380569
10421 -380569 -503827 -542637 -529269 -533914 -507149 -651219 -570857 -614909 -592916 -578264 -669580
10410 -669580 -783885 -801970 -676304 -661429 -631783 -473530 -435297 -586377 -588868 -621980 -626776
$$ packed form
10489e88340P094j4816J8094n4052m2526n704l5604K9020R6140Q1476o7950m2904
10477f20072J369O2887K0854K6279n7573L9945p6245J24459Q8450J0001j00694
10466d80340m3991j08419M8577J12125j49241N5118O3266m8789j36102O7993R3867
10455e25936O9079j0362n8259R5754Q6439k42734o1229J38196J30675j91494n5751
10444f25622J5552R7158k6076M1798m4081o2799Q948m3472n239M8892J05007j07888
10432e97822j71983L5698R0587Q6544m666j4095Q6669P7712n8326q8861J77974
10421c80569j23258l8810J3368m645K6765j44070Q0362m4052K1993J4652r1316
10410f69580j14305j8085J25666J4875K9646J58253L8233j51080k491l3112m796
$$ plain form
10399 -626776 -638014 -654723 -564538 -447574 -449259 -551141 -628035 -528905 -481375 -497245 -448261
10388 -448261 -454399 -433550 -448670 -410006 -446138 -440218 -464642 -539931 -489221 -613439 -500355
10377 -500355 -397647 -380483 -409879 -566981 -590052 -515393 -535072 -466606 -475762 -399207 -348509
10366 -348509 -421145 -391818 -404347 -456338 -444217 -470238 -461677 -444672 -336413 -381081 -457537
10355 -457537 -468856 -558221 -419241 -382381 -400392 -368479 -499138 -451230 -369237 -370943 -199813
10344 -199813 -316890 -429428 -455208 -555804 -516126 -433485 -500049 -463472 -388470 -456462 -506683
10333 -506683 -509607 -468056 -466247 -509402 -533683 -540464 -424740 -525473 -522042 -477081 -388065 -457525
10321 -457525 -469101 -533278 -512193 -452160 -470967 -420947 -393650 -404746 -425726 -326449 -250930
$$ packed form
10399f26776j1238j6709R0185J16964j685j01882p6894R9130M7530j5870M8984
10388d48261o138K0849j5120L8664l6132N920k4424p5289N0710j24218J13084
10377e00355J02708J7164k9396j57102k3071P4659j9679O8466r156P6555N0698
10366c48509p2636K9327j2529n1991J2121k6021Q561J7005J08259m4668p6456
10355d57537j1319q9365J38980L6860j8011L1913j30659M7908Q1993j706J71130
10344a99813j17077j12538k5780j00596L9678Q2641o6564L6577P5002o7992n0221
10333e06683k924M1551J809m3155k4281o781J15724j00733L431M4961Q9016o9460
10321d57525j1576o4177K1085O0033j8807N0020K7297j1096k0980R9277P5519
$$ plain form
10310 -250930 -268095 -444332 -533834 -468965 -585665 -531122 -537877 -484498 -455213 -372630 -367619
10299 -367619 -385805 -342388 -322516 -265108 -411502 -418114 -404840 -297305 -388685 -419044 -389488
10288 -389488 -260566 -301687 -407309 -392523 -291071 -258185 -358012 -399031 -325310 -352576 -324574
10277 -324574 -223345 -274730 -279414 -266322 -261762 -338521 -225050 -259977 -346320 -214305 -251038
10266 -251038 -258639 -278632 -385608 -341080 -350291 -390347 -466146 -479911 -420951 -392223 -382135 -427373
10254 -427373 -422404 -397405 -343685 -365234 -395933 -433093 -392201 -441753 -524298 -472663 -520579 -504377
10242 -504377 -423640 -434186 -463789 -453584 -343828 -335875 -362669 -385423 -361421 -340649 -253007
10231 -253007 -218383 -135179 -318300 -326079 -354186 -345499 -376194 -360958 -379607 -280122 -323941 -355515
$$ packed form
10310b50930j7165j76237q9502O4869j16700N4543o755N3379K9285Q2583N011
10299c67619j8186M3417J9872N7408j46394o612J3274J07535r1380l0359K9556
10288c89488J28922m1121j05622J4786J01452L2886r9827m1019P3721k7266K8002
10277c24574J01229n1385m684J3092M560p6759J13471l4927q6343J32015l6733
10266b51038p601j9993j06976M4528r211m0056p5799j3765N8960K8728J0088m5238
10254d27373M969K4999N3720k1549l0699l7160M0892m9552q2545N1635m7916J6202
10242e04377Q0737j0546k9603J0205J09756P953k6794k2754K4002K0772Q7642
10231b53007L4624Q3204j83121p779k8107Q687l0695J5236j8649R9485m3819l1574
$$ plain form
10219 -355515 -267131 -208619 -288936 -331986 -144742 -224480 -272376 -367451 -169615 -115887 -269111
10208 -269111 -291474 -255176 -168833 -178726 -250132 -200326 -272394 -360426 -258944 -256737 -337388 -266622
10196 -266622 -326615 -356854 -442198 -368047 -358396 -312236 -391608 -402900 -321221 -446099 -396222
10185 -396222 -303780 -293380 -231446 -305720 -441486 -341215 -154412 -101846 -148632 -144273 -161548
10174 -161548 -178159 -212913 -156038 -138186 -418 -181243 -157076 -49650 -34762 -20646 -134427
10163 -134427 96765 53486 29183 46666 86868 20813 -74528 -58781 -90975 27431 182473
10152 182473 265081 273709 305895 400560 541702 842199 999860 1234961 1258755 1270388 1264774
10141 1264774 1291270 995225 767405 558679 319298 204042 184034 212778 83472 50061
$$ packed form
10219c55515Q8384N8512q0317m3050J87244p9738m7896r5075J97836N3728j53224
10208b69111k2363L6298Q6343r893p1406M9806p2068q8032J01482K207q0651P0766
10196b66622n9993l0239q5344P4151R651M6160p9372j1292Q1679j24878M9877
10185c96222R2442J0400O1934p4274j35766J00271J86803N2566m6786M359j7275
10174a61548j6611l4754N6875J7852J37768j80825K4167J07426J4888J4116j13781
10163a34427K31192m3279k4303J7483M0202o6055r5341J5747l2194J18406J55042
10152A82473Q2608Q628L2186R4665J41142L00497J57661K35101K3794J1633n614
10141A264774K6496k96045k27820k08726k39381j15256k0008K8744j29306l3411
$$ plain form
10131 50061 83321 49740 75001 160148 -42940 -109087 23259 16197 -142745 -139383 -99090
10120 -99090 -65326 -100398 -42049 6993 -71333 -223231 -267576 -175456 -74970 -57284 -75762
10109 -75762 -55558 -93278 -152844 -227579 -266342 -194421 -174689 -219418 -283491 -179280 -126082
10098 -126082 -120869 -342655 -394989 -361205 -347795 -209947 -98103 -193191 -263559 -309650 -353120
10087 -353120 -387649 -285905 -334429 -371753 -315464 -223278 -253900 -278900 -223647 -267957 -233495
10076 -233495 -231260 -167400 -69726 -143523 -200728 -208824 -287749 -162152 -210878 -188904 -159395 -12300
10064 -12300 -60103 -74203 38421 -23707 -35557 -37202 -114067 -93186 -92251 -34899 -49833 -99302
10052 -99302 -88845 -96267 -66123 29426 -176161 -297254 -272939 -131157 -129590 -268856 -341054
$$ packed form
10131E0061L3260l3581K5261Q5147k03088o6147J32346p062j58942L362M0293
10120i9090L3764l5072N8349M9042p8326j51898m4345R2120J00486J7686j8478
10109g5762K0204l7720n9566p4735l8763P1921J9732m4729o4073J04211N3198
10098a26082N213k21786n2334L3784J3410J37848J11844r5088p0368m6091m3470
10087c53120l4529J01744m8524l7324N6289R2186l0622k5000N5253m4310L4462
10076b33495K235O3860R7674p3797n7205q096p8925J25597m8726K1974K9509J47095
10064a2300m7803j4100J12624o2128j1850j645p6865K0881R35N7352j4934m9469
10052i9302J0457p422L0144R5549k05587j21093K4315J41782J567j39266p2198
$$ plain form
10041 -341054 -188158 -120727 -70474 -65535 -137421 -162791 -258432 -94004 25257 103063 8452
10030 8452 23104 -56023 -154369 -170530 -256125 -306392 -231155 -206000 -254652 -276591 -143086 -247421
10018 -247421 -323452 -328223 -324130 -312919 -381487 -215010 -332991 -427037 -306790 -309380 -291296
10007 -291296 -280070 -271252 -187085 -167361 -229399 -162296 -186076 -61523 -108792 -12647 -144388
9996 -144388 -192560 -94144 -93991 -63852 6419 -103732 -177383 -39122 75018 -116625 -197211
9985 -197211 -138314 -227933 -165195 -131726 -148723 -144533 -149473 -126533 -105356 -225184 -223328 -231034
9973 -231034 -205972 -233277 -99183 -230557 -290717 -196888 -63994 -111791 -207166 -247348 -172658
9962 -172658 -235601 -315148 -403483 -418725 -452724 -383034 -372165 -428113 -445125 -328931 -346535
$$ packed form
10041c41054J52896O7431N0253M939p1886k5370r5641J64428J19261P7806r4611
10030H452J4652p9127r8346j6161q5595n0267P5237K5155m8652k1939J33505j04335
10018b47421p6031m771M093J1211o8568J66477j17981r4046J20247k590J8084
10007b91296J1226Q818Q4167J9724o2038O7103k3780J24553m7269R6145j31741
9996a44388m8172R8416J53L0139P0271j10151p3651J38261J14140j91643q0586
9985a97211N8897q9619O2738L3469j6997M190m940K2940K1177j19828J856p706
9973b31034K5062k7305J34094j31374o0160R3829J32894m7797r5375m0182P4690
9962a72658o2943p9547q8335j5242l3999O9690J0869n5948j7012J16194j7604
$$ plain form
9951 -346535 -418804 -454123 -453864 -374081 -306569 -256803 -349125 -255581 -262645 -186216 -128508 -109675
9939 -109675 -152927 -213089 -222688 -259285 -256858 -172990 -39059 -73897 -188987 -287561 -226628 -196813
9927 -196813 -275592 -275998 -339489 -298201 -286387 -163008 -116420 -125336 -101559 -64610 -123300 -208298
9915 -208298 -298966 -354885 -269088 -138258 -294919 -344948 -310253 -288418 -299057 -348266 -291520
9904 -291520 -309333 -358173 -393655 -371255 -333765 -376645 -466839 -393706 -270112 -389807 -445634
9893 -445634 -368918 -225615 -200857 -275133 -254997 -247427 -238927 -316493 -398170 -306329 -345699 -424451
9881 -424451 -311927 -296959 -267728 -268941 -291147 -179740 -266932 -292780 -118319 -118057 -279048
9870 -279048 -346439 -267606 -253881 -346071 -385219 -623079 -654166 -562895 -497954 -381120 -358718
$$ packed form
9951c46535p2269l5319K59P9783O7512M9766r2322R3544p064P6429N7708J8833
9939a09675m3252o0162r599l6597K427Q3868J33931l4838j15090r8574O0933K9815
9927a96813p8779m06o3491M1288J1814J23379M6588q916K3777L6949n8690q4998
9915b08298r0668n5919Q5797J30830j56661n0029L4695K1835j0639m9209N6746
9904b91520j7813m8840l5482K2400L7490m2880r0194P3133J23594j19695n5827
9893d45634P6716J43303K4758p4276K0136P570Q500p7566q1677R1841l9370p8752
9881d24451J12524J4968K9231j213k2206J11407q7192k5848J74461K62j60991
9870b79048o7391P8833J3725r2190l9148k37860l1087R1271O4941J16834K2402
$$ plain form
9859 -358718 -345725 -390661 -295535 -338615 -432098 -456595 -486274 -484590 -450160 -428041 -349339 -391621
9847 -391621 -271852 -153421 -236078 -422470 -389868 -315593 -285850 -391327 -428037 -330587 -292707
9836 -292707 -243399 -261986 -246616 -272864 -324728 -312450 -332993 -318549 -312722 -322391 -373419 -417900
9824 -417900 -473637 -464022 -437334 -314583 -209939 -117467 -26519 88491 94433 12752 -507
9813 -507 89474 187843 304221 381351 290614 90447 137532 81703 22275 41314 -33353 -52816
9801 -52816 -134559 -273508 -268353 -240767 -187744 -101725 -198132 -146325 100697 -19451 -130733
9790 -130733 -31286 -42236 113468 32512 -59349 -53793 -60571 65228 -54899 -143926 -153288 -149192
9778 -149192 -78568 -119286 -216336 -260931 -262316 -319639 -149535 -283783 -328420 -294129 -279081
$$ packed form
9859c58718J2993m4936R5126m3080r3483k4497k9679J684L4430K2119P8702m2282
9847c91621J19769J18431q2657j86392L2602P4275K9743j05477l6710R7450L7880
9836b92707M9308j8587J5370k6248n1864J2278k0543J4444N827r669n1028m4481
9824d17900n5737R615K6688J22751J04644R2472R0948J15010N942q1681j3259
9813e07Q9981R8369J16378P7130r0737k00167M7085n5829n9428J9039p4667j9463
9801e2816q1743j38949N155K7586N3023Q6019r6407N1807K47022j20148j11282
9790a30733R9447j0950J55704q0956r1861N556o778J25799j20127q9027r362M096
9778a49192P0624m0718r7050m4595j385n7323J70104j34248m4637L4291J5048
$$ plain form
9767 -279081 -230091 -145675 -75835 -37680 110499 279228 362687 501096 539886 573106 754715
9756 754715 921999 970220 956701 1030382 1147994 1222657 1293383 1285284 1273123 1252839 1338573
9745 1338573 1357223 1428552 1336645 1349715 1464013 1552282 1620237 1804465 1867832 1846761 1696303
9734 1696303 1722044 1690977 1698888 1894522 1873928 1871740 1927423 2133703 2177284 2193233 2374131
9723 2374131 2656393 2752461 2815613 3015124 3086730 3175004 3304968 3487814 3492574 3665183 3760648
9712 3760648 3737676 3841541 3954119 4043504 4151079 4162630 4182127 4442134 4703646 4711205 4874380
9701 4874380 5115792 5120344 5260479 5463706 5764476 6141298 6585974 6853362 7227738 7724169
9691 7724169 8326989 8937571 9494623 10065216 10589058 11119897 11639971 12180139 12910458 13556865
$$ packed form
9767b79081M8990Q4416O9840L8155J48179J68729Q3459J38409L8790L3220J81609
9756G54715J67284M8221j3519P3681J17612P4663P0726q099j2161k0284Q5734
9745A338573J8650P1329r1907J3070J14298Q8269O7955J84228O3367k1071j50458
9734A696303K5741l1067P911J95634k0594k188N5683K06280M3581J5949J80898
9723B374131K82262R6068O3152J99511P1606Q8274J29964J82846M760J72609R5465
9712C760648k2972J03865J12578Q9385J07575J1551J9497K60007K61512P559J63175
9701D874380K41412M552J40135K03227L00770L76822M44676K67388L74376M96431
9691G724169O02820O10582N57052N70593N23842N30839N20074N40168P30319O46407
$$ plain form
9681 13556865 14271853 15070002 15673611 16551273 17638368 18962836 20701024 22650791 25055426
9672 25055426 27787111 31174248 35089939 39677640 44684405 50616992 57488927 66081378
9664 66081378 77590338 93821046 117308463 152808156 203487034 261350642 302276299
9657 302276299 316347974 312783197 298824249 278098759 249649316 212619888 172801268
9650 172801268 138415673 111131298 89967761 73742859 61385864 51947432 44627251
9643 44627251 38787428 34302177 30964293 28163162 25994928 24172645 22444878 20778709
9635 20778709 19327954 18130792 16783929 15691030 14744735 13854242 12998587 12501964 11858781
9626 11858781 11326773 10876482 10410760 10096027 9719651 9380762 9024291 8863074 8674274
$$ packed form
9681A3556865P14988P98149O03609Q77662J087095J324468J738188J949767K404635
9672B5055426K731685L387137L915691M587701N006765N932587O871935Q592451
9664F6081378J1508960J6230708K3487417L5499693N0678878N7863608M0925657
9657C02276299J4071675l564777j3958948k0725490k8449443l7029428l9818620
9650A72801268l4385595k7284375k1163537j6224902j2356995r438432p320181
9643D4627251n839823m485251l337884k801131k168234j822283j727767j666169
9635B0778709j450755j197162j346863j092899r46295q90493q55655m96623o43183
9626A1858781n32008m50291m65722l14733l76376l38889l56471j61217j88800
$$ plain form
9617 8674274 8389931 8000856 7724211 7648133 7439321 7296492 7122470 6935825 6536239 6266726
9607 6266726 6067458 5817282 5600205 5248479 5024762 4893733 4652059 4487129 4285690 4043233
9597 4043233 3873786 3721100 3489353 3353180 3234887 3133844 3059767 2938919 2872744 2782102
9587 2782102 2706855 2666143 2834076 2751151 2672804 2550131 2297899 2318253 2339826 2341575 2418406
9576 2418406 2417237 2420177 2732640 3011584 3292686 3506942 3773423 3860716 3784861 3611167 3389142
9565 3389142 3077617 2765952 2647496 2402767 2039700 1807759 1726464 1703955 1795079 1952958
9555 1952958 1772099 1642070 1661598 1637073 1549668 1525053 1491119 1461429 1504229 1589812 1617360
9544 1617360 1610710 1577403 1594839 1547163 1494139 1480635 1430034 1299988 1237672 1293729 1248058
$$ packed form
9617H674274k84343l89075k76645p6078k08812j42829j74022j86645l99586k69513
9607F266726j99268k50176k17077l51726k23717j31029k41674j64930k01439k42457
9597D043233j69447j52686k31747j36173j18293j01043p4077j20848o6175r0642
9587B782102p5247m0712J67933q2925p8347j22673k52232K0354K1573J749P6831
9576B418406j169K940L12463K78944K81102K14256K66481Q7293p5855j73694k22025
9565C389142l11525l11665j18456k44729l63067k31941q1295k2509R1124J57879
9555A952958j80859j30029J9528k4525q7405k4615l3934k9690M2800Q5583K7548
9544A617360o650l3307J7436m7676n3024j3504n0601j30046o2316N6057m5671
$$ plain form
9533 1248058 1218092 1182377 1118910 1032856 883104 783749 892372 886253 853439 840221 768919
9522 768919 760971 764910 762180 791628 784314 781815 724520 676414 731273 730876 827806 962098 853824
9509 853824 787924 694863 688000 746136 742902 765907 814805 957368 953898 970588 965209 1050310
9497 1050310 1103541 1380217 1629226 1783894 2070919 2387574 2504353 2668280 2844059 3035955
9487 3035955 3223630 3493830 3671723 3776393 3912768 3981536 4128957 4050592 3965747 3811031
9477 3811031 3901205 3745159 3590759 3342433 3115208 2863358 2664222 2287487 2007267 1861051
9467 1861051 1660997 1425955 1331700 991416 889258 744590 644713 588442 633971 592778
9457 592778 479639 483382 404360 391833 566336 624251 527099 493910 427067 494606 571891
$$ packed form
9533A248058k9966l5715o3467q6054j49752r9355J08623o119l2814j3218p1302
9522G68919p948L939k730K9448p314k499n7295m8106N4859l97R6930J34292j08274
9509H53824o5900r3061o863N8136l234K3005M8898J42563l470J6690n379Q5101
9497A050310N3231K76676K49009J54668K87025L16655J16779J63927J75779J91896
9487C035955J87675K70200J77893J04670J36375O8768J47421p8365q4845j54716
9477C811031R0174j56046j54400k48326k27225k51850j99136l76735k80220j46216
9467A861051k00054k35042r4255l40284j02158j44668r9877n6271M5529m1193
9457E92778j13139L743p9022j2527J74503N7915r7152l3189o6843O7539P7285
$$ plain form
9446 571891 429545 389486 410587 315073 248922 133853 149170 148772 139272 192149 239885 256665
9434 256665 329215 275353 312231 203117 168122 321645 253220 213530 236502 213516 253303
9423 253303 213564 239148 265863 411879 357509 296229 423968 297438 263746 439641 426877
9412 426877 514555 510146 431605 368795 472446 501252 402874 524898 563742 604904 636278
9401 636278 605799 640172 740985 870166 1061381 1189914 1171888 1384826 1617951 1925807
9391 1925807 2224229 2725360 3108971 3135899 3028393 2876339 2832419 2765851 2592166 2317562
9381 2317562 2054137 1926335 1798935 1612350 1545011 1549743 1589661 1578444 1601208 1565447 1555446
9370 1555446 1682144 1647037 1690376 1725738 1745017 1593197 1592234 1647143 1511473 1488330 1522489
$$ packed form
9446E71891j42346m0059K1101r5514o6151j15069J5317l98r500N2877M7736J6780
9434B56665P2550n3862L6878j09114l4995J53523o8425l9690K2972k2986L9787
9423B53303l9739K5584K6715J46016n4370o1280J27739j26530l3692J75895j2764
9412D26877Q7678m409p8541o2810J03651K8806r8378J22024L8844M1162L1374
9401F36278l0479L4373J00813J29181J91215J28533j8026K12938K33125L07856
9391A925807K98422N01131L83611K6928j07506j52054m3920o6568j73685k74604
9381B317562k63425j27802j27400j86585o7339M732L9918j1217K2764l5761j0001
9370A555446J26698l5107M3339L5362J9279j51820r63N4909j35670k3143L4159
$$ plain form
9359 1522489 1591465 1739398 1942729 2159472 2373622 2757986 3053049 3367292 3493344 3712548
9349 3712548 4035478 4099828 3821641 3591431 3343395 2898098 2690668 2401538 2128327 1947878
9339 1947878 1862332 1665931 1624922 1493941 1319747 1221490 1132840 1015453 926567 902927 808514
9328 808514 807164 761180 752772 611171 535032 610159 533122 532163 382378 475695 600139 424561
9316 424561 334529 433696 442710 365386 213645 384301 510345 458634 316465 416331 505013
9305 505013 469289 467421 390836 413619 392064 426691 469739 681909 526401 448948 581470
9294 581470 565894 329607 329398 389864 532663 679657 645778 502286 475261 578736 562906
9283 562906 505126 398326 377907 320575 426639 557893 505247 346185 252882 343836 478903
$$ packed form
9359A522489O8976J47933K03331K16743K14150L84364K95063L14243J26052K19204
9349C712548L22930O4350k78187k30210k48036m45297k07430k89130k73211j80449
9339A947878q5546j96401m1009j30981j74194r8257q8650j17387q8886k3640r4413
9328H08514j350m5984q408j41601p6139P5127p7037r59j49785R3317J24444j75578
9316D24561r0032R9167R014p7324j51741J70656J26044n1711j42169R9866Q8682
9305E05013l5724j868p6585K2783k1555L4627M3048K12170j55508p7453J32522
9294E81470j5576k36287k09O0466J42799J46994l3879j43492k7025J03475j5830
9283E62906n7780j06800k0419n7332J06064J31254n2646j59062r3303R0954J35067
$$ plain form
9272 478903 480751 556161 650940 755199 569798 691293 796406 762296 747469 856121 804624
9261 804624 794853 869211 867078 887983 851634 792611 764942 691641 651692 621672 580669 633141
9249 633141 621241 637770 760190 851460 862905 793582 900981 1085565 1051531 1079840 870457
9238 870457 809637 846512 995612 1131175 1116670 1125704 1091607 1094419 1198443 1244663 1319427
9227 1319427 1303157 1497065 1622110 1621771 1478497 1526345 1694596 1772646 1733741 1631767 1487632
9216 1487632 1552577 1609128 1733540 1840890 1716398 1753755 1738365 1799231 1844801 1769515 1684017
9205 1684017 1738759 1766971 1824962 1830046 1883489 1807347 1769064 1787862 1862616 1952508 1978443 1929477
9193 1929477 1995777 2045600 2042902 2131318 2103380 2172783 2249191 2312427 2326745 2361684 2511476
$$ packed form
9272D78903J848P5410R4779J04259j85401J21495J05113l4110j4827J08652n1497
9261H04624r771P4358k133K0905l6349n9023k7669p3301l9949l0020m1003N2472
9249F33141j1900J6529J22420R1270J1445o9323J07399J84584l4034K8309k09383
9238H70457o0820L6875J49100J35563j4505R034l4097K812J04024M6220P4764
9227A319427j6270J93908J25045l39j43274M7848J68251P8050l8905j01974j44135
9216A487632O4945N6551J24412J07350j24492L7357j5390O0866M5570p5286q5498
9205A684017N4742K8212N7991N084N3443p6142l8283J8798P4754Q9892K5935m8966
9193A929477O6300M9823k698Q8416k7938O9403P6408O3236J4318L4939J49792
$$ plain form
9182 2511476 2649222 2726400 2688842 2720877 2903241 2996211 3018268 3066091 3065270 3126749 3274575
9171 3274575 3375045 3510839 3721267 3952336 4315521 4578964 4683099 4626711 4636131 4629257
9161 4629257 4485621 4302776 4241986 4145177 3787715 3642820 3773820 3732153 3712695 3714560 3823993
9150 3823993 3834177 3755977 3799770 3785315 4055850 4281870 4195179 4288734 4461505 4569146 4655630
9139 4655630 4729905 4703077 4754433 4982278 5055847 4989108 5076535 5169209 5198463 5265052 5382574
9128 5382574 5401944 5457689 5561234 5674821 5761079 5771243 5871806 5838166 5960055 6048095 6104425
9117 6104425 6246111 6384139 6366129 6522234 6726354 6854149 6951341 7125253 7412196 7621594
9107 7621594 7723412 7966221 8162701 8303798 8246969 8326627 8482566 8571927 8603737 8705945
$$ packed form
9182B511476J37746P7178l7558L2035J82364R2970K2057M7823q21O1479J47826
9171C274575J00470J35794K10428K31069L63185K63443J04135n6388R420o874
9161D629257j43636j82845o0790r6809l57462j44895J31000m1667j9458J865J09433
9150C823993J0184p8200M3793j4455K70535K26020q6691R3555J72771J07641Q6484
9139D655630P4275k6828N1356K27845P3569o6739Q7427R2674K9254O6589J17522
9128E382574J9370N5745J03545J13587Q6258J0164J00563l3640J21889Q8040N6330
9117F104425J41686J38028j8010J56105K04120J27795R7192J73912K86943K09398
9107G621594J01818K42809J96480J41097n6829P9658J55939Q9361L1810J02208
$$ plain form
9097 8705945 8841812 8992836 9025362 9265454 9611069 9768496 9956024 10125562 10304648 10516344
9087 10516344 10767399 11055220 11434322 11704421 12031341 12235273 12378755 12816838 13269953
9078 13269953 13786622 14227356 14555092 14780542 15121402 15657265 16126661 16512923 17044379
9069 17044379 17730327 18303527 18785563 19240867 19545013 19510235 19511456 19201641 18997204 18758180
9059 18758180 18373911 18151145 17884711 17799529 17905108 17852031 17957268 18218980 18476084 18961680
9049 18961680 19392169 19806702 20271730 20746284 21182973 21474083 21632155 21713180 21642559 21631997
9039 21631997 21724922 21704530 21739205 21796695 22075299 22157495 22386339 22693824 23220745 23810460
9029 23810460 24549824 25520849 26487290 27365786 27996665 28354302 28428620 28312260 27764242 26950910
$$ packed form
9097H705945J35867J51024L2526K40092L45615J57427J87528J69538J79086K11696
9087A0516344K51055K87821L79102K70099L26920K03932J43482M38083M53115
9078A3269953N16669M40734L27736K25450L40860N35863M69396L86262N31456
9069A7044379O85948N73200M82036M55304L04146l4778J221l09815k04437k39024
9059A8758180l84269k22766k66434q5182J05579n3077J05237K61712K57104M85596
9049A8961680M30489M14533M65028M74554M36689K91110J58072Q1025p0621j0562
9039B1631997R2925k0392L4675N7490K78604Q2196K28844L07485N26921N89715
9029B3810460P39364R71025R66441Q78496O30879L57637P4318j16360n48018q13332
$$ plain form
9019 26950910 26210854 25406310 24710068 24027243 23535792 23205476 22953639 23005499 23065822 23204179
9009 23204179 23355151 23610167 23883964 24080584 24147810 24290357 24294687 24083704 23966008 24031237
8999 24031237 23950686 23981670 24341407 24719536 25250539 25983216 26708563 27666710 28719984 29812985
8989 29812985 30947135 31868296 32290095 32490228 32348216 31659872 30721918 29631475 28449711
8980 28449711 27220303 26172980 25201968 24346669 23707685 23214832 22792952 22450468 22184382
8971 22184382 22069225 21890107 21958353 21964970 22106361 22197966 22424783 22691853 23065200 23622233
8961 23622233 24305339 24651920 24972498 25494470 25941352 26427507 26933740 27258631 27674938
8952 27674938 27920086 28003854 28159925 27997147 27644413 27082867 26677830 26025343 25400750 24834483
$$ packed form
9019B6950910p40056q04544o96242o82825m91451l30316k51837N1860O0323J38357
9009B3204179J50972K55016K73797J96620O7226J42547M330k10983j17696O5229
8999B4031237q0551L0984L59737L78129N31003P32677P25347R58147J053274J093001
8989B9812985J134150R21161M21799K00133j42012o88344r37954j090443j181764
8980B8449711j229408j047323r71012q55299o38984m92853m21880l42484k66086
8971B2184382j15157j79118O8246O617J41391R1605K26817K67070L73347N57033
8961B3622233O83106L46581L20578N21972M46882M86155N06233L24891M16307
8952B7674938K45148Q3768J56071j62778l52734n61546m05037o52487o24593n66267
$$ plain form
8942 24834483 24382184 24049525 23780310 23673410 23614060 23780693 24166465 24499156 25118910 25685393
8932 25685393 26356031 26795277 27423335 28083439 28507295 28813196 29042491 29151719 29352853
8923 29352853 29530495 29606134 29444645 29208511 28907510 28908164 28715196 28266438 28362739 28405466
8913 28405466 28253025 28339017 28592202 28899987 29369416 30099006 31062919 32452205 34421604
8904 34421604 36805572 39433487 42259008 45199947 47631011 49548683 50852552 51201240
8896 51201240 51120310 50533183 49504041 48305673 47079497 45956420 44848866 43968558 43083648
8887 43083648 42487242 41868350 41302255 40576964 39899327 39363610 38839549 38387293 38093142
8878 38093142 38207533 38261672 38566476 39240251 40149809 41408116 43213316 45342243 48276748
$$ packed form
8942B4834483m52299l32659k69215j06900n9350J66633L85772L32691O19754N66483
8932B5685393O70638M39246O28058O60104M23856L05901K29295J09228K01134
8923B9352853J77642P5639j61489k36134l01001O54j92968m48758R6301M2727
8913B8405466j52441Q5992K53185L07785M69429P29590R63913J389286J969399
8904C4421604K383968K627915K825521K940939K431064J917672J303869L48688
8896E1201240q0930n87127j029142j198368j226176j123077j107554q80308q84910
8887D3083648n96406o18892n66095p25291o77637n35717n24061m52256k94151
8878C8093142J14391N4139L04804O73775R09558J258307J805200K128927K934505
$$ plain form
8869 48276748 52002838 56177546 60445931 64631247 68274501 70841159 72151499 72105209
8861 72105209 71244717 69531285 67561334 65543063 63565674 61742968 60203025 59046127
8853 59046127 57985189 57176867 56648864 56145680 55882851 55789306 55882761 56119197 56513684 57148910
8843 57148910 57858946 58583335 59607051 60646792 62230768 64224252 66508512 69027072
8835 69027072 71985562 74908155 77656064 80051187 82040627 83482946 84462741 84947557
8827 84947557 85103174 84831017 84104686 82654645 80301518 77471683 74059570 70365760 66585709
8818 66585709 63152706 59856901 57071564 54705870 52828020 51337129 50247369 49414029
8810 49414029 48888560 48491068 48307671 48184349 47880545 47695335 47451376 47200174 46956224
$$ packed form
8869D8276748L726090M174708M268385M185316L643254K566658J310340m6290
8861G2105209q60492j713432j969951k018271j977389j822706j539943j156898
8853E9046127j060938q08322n28003n03184k62829r3545R3455K36436L94487O35226
8843E7148910P10036P24389J023716J039741J583976J993484K284260K518560
8835F9027072K958490K922593K747909K395123J989440J442319R79795M84816
8827H4947557J55617k72157p26331j450041k353127k829835l412113l693810l780051
8818F6585709l433003l295805k785337k365694j877850j490891j089760q33340
8810D9414029n25469l97492j83397j23322l03804j85210k43959k51202k43950
$$ plain form
8801 46956224 46768228 46661447 46572016 46625340 46700150 46712177 46689870 46629873 46533905 46462407 46182429
8790 46182429 45971396 45881459 45651410 45449947 45339581 45397051 45227700 44980526 44751279 44407523
8780 44407523 44175381 43996957 44010876 44076132 44202759 44510913 44709553 45133910 45516554 45641548
8770 45641548 45701293 45695676 45496967 45314065 45223616 44967309 44802544 44790587 45070403 45310280
8760 45310280 45402701 45491609 45597728 45770095 45798150 45876103 45930005 46045254 46242794 46411670
8750 46411670 46751470 47010421 47376568 48090000 48917912 49960023 51388776 53007209 54885567
8741 54885567 56870807 58767788 60289868 61732445 62839417 63417544 63668115 63670775 63563268
8732 63563268 63242624 62746051 61990077 60926938 59584510 58167982 56464716 54746376 53233110
$$ packed form
8801D6956224j87996j06781q9431N3324P4810J2027k2307n9997r5968p1498k79978
8790D6182429k11033q9937k30049k01463j10366N7470j69351k47174k29247l43756
8780D4407523k32142j78424J3919O5256J26627L08154J98640M24357L82644J24994
8770D5641548N9745n617j98709j82902r0449k56307j64765j1957K79816K39877
8760D5310280R2421Q8908J06119J72367K8055P7953N3902J15249J97540J68876
8750D6411670L39800K58951L66147P13432Q27912J042111J428753J618433J878358
8741E4885567J985240J896981J522080J442577J106972N78127K50571K660j07507
8732F3563268l20644m96573p55974j063139j342428j416528j703266j718340j513266
$$ plain form
8723 53233110 52004125 51015027 50349299 50163554 49873324 49793577 49806997 49971977 50332641 50721745
8713 50721745 50845557 51082659 51696794 52527308 53587975 54786481 56140967 57515884 58555212
8704 58555212 59304420 59758975 59992068 59894290 59291096 58547710 57682154 56531387 55262562
8695 55262562 53937910 52459394 51005822 49479418 48209786 47052001 45873588 44820118
8687 44820118 43836105 43074619 42634477 42339085 42222126 42146469 42293084 42488610 42914130 43448408
8677 43448408 44186888 44829362 45358557 45876517 46096688 46202037 46374135 46241759 45963353
8668 45963353 45726136 45394012 45076606 44721322 44428945 44007031 43560005 43066181 42299893
8659 42299893 41345093 40428556 39522431 38459689 37399018 36521629 35612845 34928949 34361325
$$ packed form
8723E3233110j228985r89098o65728j85745k90230p9747J3420J64980L60664L89104
8713E0721745J23812K37102O14135Q30514J060667J198506J354486J374917J039328
8704E8555212P49208M54555K33093r7778o03194p43386q65556j150767j268825
8695E5262562j324652j478516j453572j526404j269632j157785j178413j053470
8687D4820118r84013p61486m40142k95392j16959p5657J46615J95526M25520N34278
8677D3448408P38480O42474N29195N17960K20171J05349J72098j32376k78406
8668D5963353k37217l32124l17406l55284k92377m21914m47026m93824p66288
8659D2299893r54800r16537r06125j062742j060671q77389r08784o83896n67624
$$ plain form
8650 34361325 33833516 33501404 33248441 33017089 32992014 33017489 32985331 32879240 32951091 33095660
8640 33095660 32992769 33036148 33132116 33023499 33026194 32866627 32940352 32832723 32817521 32793037 32769569
8629 32769569 32693718 32711636 32892364 32681109 32616194 32434505 32196266 31971852 31615939 31172679
8619 31172679 30749436 30318116 30064101 29792040 29493292 29167065 28710039 28272184 27990339
8610 27990339 27655776 27421164 27044820 26733150 26598732 26656005 26677541 26685448 26671309 26776015
8600 26776015 26917421 27127012 27334261 27592276 27937862 28411016 29042986 29963581 31350651
8591 31350651 32790541 34009364 34643837 34844387 34892138 34766547 34384872 33676297 32627220
8582 32627220 31594864 30782929 30086022 29348261 28661984 28058553 27462164 27010677 26611601
$$ packed form
8650C4361325n27809l32112k52963k31352k5075K5475l2158j06091P1851J44569
8640C3095660j02891M3379R5968j08617K695j59567P3725j07629j5202k4484k3468
8629C2769569p5851J7918J80728k11255o4915j81689k38239k24414l55913m43260
8619C1172679m23243m31320k54015k72061k98748l26227m57026m37855k81845
8610B7990339l34563k34612l76344l11670j34418N7273K1536P907j4139J04706
8600B6776015J41406K09591K07249K58015L45586M73154O31970R20595J387070
8591C1350651J439890J218823O34473K00550M7751j25591l81675p08575j049077
8582C2627220j032356q11935o96907p37761o86277o03431n96389m51487l99076
$$ plain form
8573 26611601 26265485 26008317 25819850 25772415 25747110 25726386 25670259 25865588 26219241 26495088
8563 26495088 26778037 26960793 27205250 27577219 27828526 28074200 28422733 28790029 29025070
8554 29025070 29160137 29347544 29546383 29594134 29620364 29418324 29208665 28928375 28618377 28262050
8544 28262050 27913024 27487704 27024058 26569811 26058323 25645773 25132263 24659228 24319965
8535 24319965 24128677 23751363 23493959 23277424 23120866 22980387 22944870 22921604 22853550 22834564
8525 22834564 22983334 23185601 23298830 23663346 23998070 24320229 24645408 24598018 24701535 25080362
8515 25080362 25160558 25238356 25328070 25488754 25492891 25373885 25239945 25157013 24938235 24704072
8505 24704072 24519557 24234731 23976334 23632761 23320945 23053984 22716966 22335516 21683841
$$ packed form
8573B6611601l46116k57168j88467m7435k5305k0724n6127J95329L53653K75847
8563B6495088K82949J82756K44457L71969K51307K45674L48533L67296K35041
8554B9025070J35067J87407J98839M7751K6230k02040k09659k80290l09998l56327
8544B8262050l49026m25320m63646m54247n11488m12550n13510m73035l39263
8535B4319965j91288l77314k57404k16535j56558j40479l5517k3266o8054j8986
8525B2834564J48770K02267J13229L64516L34724L22159L25179m7390J03517L78827
8515B5080362Q0196P7798Q9714J60684M137j19006j33940q2932k18778k34163
8505B4704072j84515k84826k58397l43573l11816k66961l37018l81450o51675
$$ plain form
8496 21683841 21138688 20605856 20282630 19973317 19587473 19162251 18724956 18495234 18302819
8487 18302819 18121589 17964487 18139480 18263586 18271605 18339902 18521517 18697728 18949452 19161543
8477 19161543 19325268 19410730 19384596 19329987 19403204 19536826 19595637 19624231 19762403 19701001 19651728
8466 19651728 19484858 19220422 19047738 18763776 18587412 18302610 18120088 17712293 17363901
8457 17363901 17083531 16734859 16330365 15914798 15616663 15261493 14915224 14571151 14264581
8448 14264581 14153427 14017057 13967346 13779127 13628241 13540217 13505296 13451979 13341812 13221891
8438 13221891 13058929 13131430 13025480 13050704 13060202 13040260 13132391 13373216 13472776 13609426 13826530
8427 13826530 14063390 14140698 14054198 13884498 13690931 13467085 13149819 12868854 12596667 12451093
$$ packed form
8496B1683841n45153n32832l23226l09313l85844m25222m37295k29722j92415
8487A8302819j81230j57102J74993J24106Q019O8297J81615J76211K51724K12091
8477A9161543J63725Q5462k6134n4609P3217J33622N8811K8594J38172o1402m9273
8466A9651728j66870k64436j72684k83962j76364k84802j82522m07795l48392
8457A7363901k80370l48672m04494m15567k98135l55170l46269l44073l06570
8448A4264581j11154j36370m9711j88219j50886q8024l4921n3317j10167j19921
8438A3221891j62962P2501j05950K5224R498j9942R2131K40825R9560J36650K17104
8427A3826530K36860P7308q6500j69700j93567k23846l17266k80965k72187j45574
$$ plain form
8417 12451093 12418423 12484175 12423696 12287699 12199090 11919633 11697151 11447259 11102607 10748514
8407 10748514 10382930 10165423 9892533 9668591 9519677 9331258 9321457 9242996 9115808 9277935
8397 9277935 9272334 9343266 9588819 9682152 10002611 10299595 10453478 10540483 10608239 10517507 10223459
8386 10223459 10043037 9853126 9743611 9871852 9815771 9796086 9869604 9958827 10023922 9753905
8376 9753905 9590403 9451177 9288620 9095301 8752468 8695615 8516483 8438808 8301788 8271146
8366 8271146 8316774 8347702 8231471 8029553 7936123 7879701 7913242 7764375 7856194 7772912 7624786
8355 7624786 7626402 7557758 7651584 7699016 7695731 7942229 7932829 8103586 8293153 8606560 8847553
8344 8847553 9011069 9440011 9698900 10160576 10612444 11109359 11706266 12058975 12472133 12887190
$$ packed form
8417A2451093l2670O5752o0479j35997q8609k79457k22482k49892l44652l54093
8407A0748514l65584k17507k72890k23942j48914j88419r801p8461j27188J62127
8397I277935n601P0932K45553R3333L20459K96984J53883Q7005O7756r0732k94048
8386A0223459j80422j89911j09515J28241n6081j9685P3518Q9223O5095k70017
8376I753905j63502j39226j62557j93319l42833n6853j79132p7675j37020l0642
8366H271146M5628L0928j16231k01918r3430n6422L3541j48867R1819q3282j48126
8355G624786J616o8644R3826M7432l285K46498r400J70757J89567L13407K40993
8344H847553J63516M28942K58889M61676M51868M96915N96907L52709M13158M15057
$$ plain form
8334 12887190 13189827 13422572 13602642 13552272 13490687 13347883 13303751 12951366 12411246 11845161
8324 11845161 11258304 10676237 10055273 9633310 9138367 8617146 8082949 7665136 7254467
8315 7254467 6973147 6878396 6677224 6395467 6281905 6237175 6347668 6362644 6206435 6098920
8305 6098920 5998277 5847671 5675578 5456767 5186001 5138810 5108399 4964175 4927590 4769955
8295 4769955 4659276 4525539 4451933 4372076 4323406 4309308 4306599 4278771 4409412 4411252 4284482
8284 4284482 4345734 4373970 4370982 4261850 4335320 4462946 4508265 4450094 4419278 4382722 4572287
8273 4572287 4654450 4779359 4925761 4937656 4942126 4989477 4890575 4710700 4653947 4782154 4693330
8262 4693330 4555677 4662877 4599894 4630388 4581043 4526438 4484890 4472578 4361628 4066865 4135977
$$ packed form
8334A2887190L02637K32745J80070n0370o1585j42804m4132l52385n40120n66085
8324A1845161n86857n82067o20964m21963m94943n21221n34197m17813m10669
8315G254467k81320r4751k01172k81757j13562m4730J10493J4976j56209j07515
8305F098920j00643j50606j72093k18811k70766m7191l0411j44224l6585j57635
8295D769955j10679j33737p3606p9857m8670j4098k709k7828J30641J840j26770
8284D284482O1252K8236k988j09132P3470J27626M5319n8171l0816l6556J89565
8273D572287Q2163J24909J46402J1895M470M7351r8902j79875n6753J28207q8824
8262D693330j37653J07200o2983L0494m9345n4605m1548j2312j10950k94763O9112
$$ plain form
8251 4135977 4158510 4155944 4001434 3861336 3922248 3943925 3952412 3872745 3886818 3928537 3886427
8240 3886427 3828608 3906893 3966485 4059666 4069643 4177159 4279027 4213996 4218888 4325045 4248274
8229 4248274 4219096 3892198 3809630 3902585 3941510 3824773 3803561 3783481 3729515 3592353 3489605
8218 3489605 3445946 3474607 3372867 3265625 3288573 3224155 3160123 3235740 3383298 3367394 3373964
8207 3373964 3332735 3215376 3289973 3385281 3423423 3341040 3170540 3270052 3277004 3409827 3395096
8196 3395096 3414849 3270097 3352313 3487273 3938569 3790161 3613832 3431183 3359817 3538165
8186 3538165 3488267 3607867 3705977 3597179 3468203 3418534 3363593 3483218 3355502 3376330
8176 3376330 3409048 3323176 3252051 3370095 3372376 3415723 3517151 3464368 3289800 3226895 3166515
$$ packed form
8251D135977K2533k566j54510j40098O0912K1677Q487p9667J4073M1719m2110
8240C886427n7819P8285N9592R3181R977J07516J01868o5031M892J06157p6771
8229D248274k9178l26898q2568R2955L8925j16737k1212k0080n3966j37162j02748
8218C489605m3659K8661j01740j07242K2948o4418o4032P5617J47558j5904O570
8207C373964m1229j17359P4597R5308L8142q2383j70500R9512O952J32823j4731
8196C395096J9753j44752Q2216J34960M51296j48408j76329j82649p1366J78348
8186C538165m9898J19600R8110j08798j28976m9669n4941J19625j27716K0828
8176C376330L2718q5872p1125J18044K281M3347J01428n2783j74568o2905o0380
$$ plain form
8165 3166515 3154624 3256107 3172776 3104424 3076508 2988450 2987731 2900508 2926325 2756236 2612889
8154 2612889 2758251 2721676 2709658 2626794 2536762 2604416 2729994 2739657 2622379 2628361 2643706
8143 2643706 2648480 2693652 2668374 2560278 2638133 2703122 2645109 2735673 2724726 2753587 2839400
8132 2839400 2749547 2571268 2446815 2501134 2487975 2468951 2258675 2031946 1908931 1936471
8122 1936471 1969090 1799571 1778346 1875936 1937851 1815696 1792357 1910802 1925624 1989876 1964998
8111 1964998 2172963 2152087 2086665 2092821 1978712 2064053 1948298 2059910 2104240 2202740 2153930
8100 2153930 2031856 2073803 2129370 2163996 2160136 1991787 1927731 1897758 1912339 1821769 1591149
8089 1591149 1463886 1473613 1464794 1470418 1549083 1518586 1412510 1358965 1448974 1448620 1570751 1574954
$$ packed form
8165C166515j1891J01483q3331o8352k7916q8058p19q7223K5817j70089j43347
8154B612889J45362l6575j2018q2864r0032O7654J25578R663j17278N982J5345
8143B643706M774M5172k5278j08096P7855O4989n8013R0564j0947K8861Q5813
8132B839400q9853j78279j24453N4319j3159j9024k10276k26729j23015K7540
8122A936471L2619j69519k1225R7590O1915j22155k3339J18445J4822O4252k4878
8111A964998K07965k0876o5422O156j14109Q5341j15755J11612M4330R8500m8810
8100B153930j22074M1947N5567L4626l860j68349o4056k9973J4581r0570k30620
8089A591149j27263R727q819N624P8665l0497j06076n3545R0009l54J22131M203
$$ plain form
8077 1574954 1640069 1602881 1540546 1575167 1610729 1628383 1618827 1516679 1487285 1505058 1445602
8066 1445602 1279250 1227625 1321316 1160955 1099008 1161658 1010550 970890 1118633 922833
8056 922833 858281 822220 825666 899022 808526 685589 580654 637185 719232 742974 625835
8045 625835 584307 590384 500962 461047 483352 516693 525118 574436 467130 325842 420579 415868
8033 415868 240324 251342 292356 290208 340240 287427 213192 277673 227834 229011 192128 180162
8021 180162 188056 219661 296828 233640 281012 195622 232280 338388 352355 393383 396091 265550
8009 265550 266941 275968 386447 285327 216042 307282 209624 198241 231607 238256 370347 324882
7997 324882 336430 426946 498042 412286 403962 447770 553577 615857 614565 688269 579177 573730
$$ packed form
8077A574954O5115l7188o2335L4621L5562J7654r556j02148k9394J7773n9456
8066A445602j66352n1625R3691j60361o1947O2650j51108l9660J47743j95800
8056I22833o4552l6061L446P3356r0496j22937j04935N6531Q2047K3742j17139
8045F25835m1528O077q9422l9915K2305L3341Q425M9318j07306j41288R4737m711
8033D15868j75544J1018M1014k148N0032n2813p4235O4481m9839J177l6883j1966
8021A80162P894L1605P7167o3188M7372q5390L6658J06108J3967M1028K708j30541
8009B65550J391R027J10479j01120o9285R1240r7658j1383L3366O649J32091m5465
7997C24882J1548R0516P1096q5756q324M3808J05807O2280j292P3704j09092n447
$$ plain form
7985 573730 758067 880514 817133 900712 932727 962568 1010057 1009587 840959 855933 819412
7974 819412 881887 848041 845496 927257 984425 1019552 1091049 1090755 1042305 1042584 913077 1003850
7962 1003850 1159585 1115543 1122857 931964 1015211 1047234 996389 994699 1060911 1031357 1042285
7951 1042285 1097710 1090977 1114433 924070 922211 891424 905398 1146082 1269596 1156011 1091157
7940 1091157 1124496 1132628 1107641 1170102 1018860 1062220 867789 667739 859784 900793 1009585
7929 1009585 1055763 1054503 1093056 1067245 1084711 1191500 1278887 1245499 1313292 1292312 1431688
7918 1431688 1385579 1329203 1408782 1389650 1239747 1363637 1440104 1476978 1562213 1457124 1243855
7907 1243855 1242804 1299977 1295337 1445607 1377784 1215681 1203031 1172126 1189369 1152389 1128815
$$ packed form
7985E73730J84337J22447o3381Q3579L2015K9841M7489m70j68628J4974l6521
7974H19412O2475l3846k545Q1761N7168L5127P1497k94m8450K79j29507R0773
7962A003850J55735m4042P314j90893Q3247L2023n0845j690O6212k9554J0928
7951A042285N5425o733K3456j90363j859l0787J3974K40684J23514j13585o4854
7940A091157L3339Q132k4987O2461j51242M3360j94431k00050J92045M1009J08792
7929A009585M6178j260L8553k5811J7466J06789Q7387l3388O7793k0980J39376
7918A431688m6109n6376P9579j9132j49903J23890P6467L6874Q5235j05089k13269
7907A243855j051N7173m640J50270o7823j62103j2650l0905J7243l6980k3574
$$ plain form
7896 1128815 1124604 965544 978777 901185 840357 811665 852134 1023676 914233 812267 797004
7885 797004 772786 801478 839452 860176 724231 749488 820038 757095 776269 857290 926585
7874 926585 919198 1044341 1073904 1118736 1166423 1133452 1300508 1308130 1498016 1586660 1629257
7863 1629257 1835541 1748456 1702056 1813156 1921591 2056435 2188880 2323135 2347111 2497369
7853 2497369 2658668 2775362 2714525 2583518 2547503 2517094 2367041 2240338 2240549 2273810 2085862
7842 2085862 2101055 2051431 2056385 2072753 2041958 2151296 2325514 2341759 2290180 2232860 2145100
7831 2145100 2116570 2017228 1981788 1931362 1901227 1858329 1928615 1881761 1818655 1816896 1923528
7820 1923528 1898454 1800024 1663310 1803782 1700181 1680495 1694989 1679138 1738417 1807310 1791001
$$ packed form
7896A128815m211j59060J3233p7592o0828k8692M0469J71542j09443j01966j5263
7885G97004k4218K8692L7974K0724j35945K5257P0550o2943J9174Q1021O9295
7874I26585p387J25143K9563M4832M7687l2971J67056P622J89886Q8644M2597
7863A629257K06284q7085m6400J11100J08435J34844J32445J34255K3976J50258
7853B497369J61299J16694o0837j31007l6015l0409j50053j26703K11L3261j87948
7842B085862J5193m9624M954J6368l0795J09338J74218J6245n1579n7320q7760
7831B145100k8530r9342l5440n0426l0135m2898P0286m6854o3106j759J06632
7820A923528k5074r8430j36714J40472j03601j9686J4494j5851N9279O8893j6309
$$ plain form
7809 1791001 1719855 1770100 1740074 1764231 1647032 1674435 1595202 1688755 1738133 1654995 1712789
7798 1712789 1690523 1645459 1719787 1781553 1698634 1798958 1758327 1613160 1601973 1648388 1660515
7787 1660515 1491898 1671450 1776146 1762747 1738236 1739559 1724924 1636846 1770239 1880188 1773250
7776 1773250 1778680 1755576 1731173 1850510 1916781 2068547 2044798 1886631 1974075 1876362 1924585
7765 1924585 1961321 1921872 1777313 1739501 1939255 1935523 2048713 2172904 2299126 2399304
7755 2399304 2571509 2665362 2551912 2411574 2259794 2220139 2175443 2070461 2006048 1896069
7745 1896069 1865714 1661116 1716194 1764927 1959365 1998918 1956023 2106201 2181758 1996548 1959420
7734 1959420 1853346 1780899 1618828 1508814 1591934 1506091 1709121 1816614 1864526 1904497
$$ packed form
7809A791001p1146N0245l0026K4157j17199K7403p9233R3553M9378q3138N7794
7798A712789k2266m5064P4328O1766q2919J00324m0631j45167j1187M6415J2127
7787A660515j68617J79552J04696j3399k4511J323j4635q8078J33393J09949j06938
7776A773250N430k3104k4403J19337O6271J51766k3749j58167Q7444r7713M8223
7765A924585L6736l9449j44559l7812J99754l732J13190J24191J26222J00178
7755B399304J72205R3853j13450j40338j51780l9655m4696j04982o4413j09979
7745A896069l0355k04598N5078M8733J94438L9553m2895J50178P5557j85210l7128
7734A959420j06074p2447j62071j10014Q3120q5843K03030J07493M7912L9971
$$ plain form
7724 1904497 1896535 1955596 2059983 2236114 2314749 2374593 2417892 2397206 2343107 2095966 1944204
7713 1944204 1800463 1767792 1689759 1701581 1600040 1458617 1425173 1357312 1333603 1233350 1168543
7702 1168543 1097192 1059876 1074424 993188 1013658 1084010 996780 995917 893543 924417 1082056
7691 1082056 1222772 1237642 1233208 1339901 1528257 1623647 1494278 1447761 1309027 1137967
7681 1137967 1116013 1007537 846939 830462 680512 777150 689529 640655 718181 709584 655685
7670 655685 634757 547657 530020 567172 436299 388233 418876 501256 443349 311750 354240
7659 354240 441894 495052 545040 542615 537339 592034 733185 712692 678108 715313 679096 635641
7647 635641 649177 548401 472703 454560 469190 307050 399817 520599 512271 409887 419501
$$ packed form
7724A904497p962N9061J04387J76131P8635N9844M3299k0686n4099k47141j51762
7713A944204j43741l2671p8033J1822j01541j41423l3444o7861k3709j00253o4807
7702A168543p1351l7316J4548q1236K0470P0352q7230q63j02374L0874J57639
7691A082056J40716J4870m434J06693J88356R5390j29369m6517j38734j71060
7681A137967k1954j08476j60598j6477j49950R6638q7621m8874P7526q597n3899
7670F55685k0928q7100j7637L7152j30873m8066L0643Q2380n7907j31599M2490
7659C54240Q7654N3158M9988k425n276N4695J41151k0493l4584L7205l6217m3455
7647F35641J3536j00776p5698j8143J4630j62140R2767J20782q328j02384R614
$$ plain form
7636 419501 447534 427897 352399 406770 346046 262056 291905 125146 203996 211033 154179 102055
7624 102055 122670 97602 63832 82945 131618 194234 396585 376042 385888 319812 319154 550843
7612 550843 612430 467858 442470 504113 329060 398822 629819 522607 477621 466600 485815
7601 485815 576663 593203 572799 513291 561176 704901 638738 649791 488943 289617 316624
7590 316624 306786 360650 421004 459028 354725 387253 363080 305735 269709 249965 452071
7579 452071 457361 537323 644979 776537 619097 623989 939960 989201 1102023 1150644 1320758
7568 1320758 1444368 1494769 1573054 1732778 1902253 2048453 2174922 2452061 2829485 3328415
7558 3328415 3822982 4305393 4907690 5403032 5875793 6362230 6572605 6676115 6789197 6794257
$$ packed form
7636D19501K8033j9637p5498N4371o0724q3990K9849j66759P8850P037n6854n2124
7624A02055K0615k5068l3770J9113M8673O2616K02351k0543R846o6076o58K31689
7612E50843O1587j44572k5388O1643j75053O9762K30997j07212m4986j1021J9215
7601D85815R0848J6540k0404n9508M7885J43725o6163J1053j60848j99326K7007
7590C16624r838N3864O0354L8024j04303L2528k4173n7345l6026j9744K02106
7579D52071N290P9962J07656J31558j57440M892L15971M9241J12822M8621J70114
7568A320758J23610N0401P8285J59724J69475J46200J26469K77139L77424M98930
7558C328415M94567M82411O02297M95342M72761M86437K10375J03510J13082N060
$$ plain form
7548 6794257 6711422 6408311 6076583 5823239 5344726 4859577 4258660 3675625 3219925 2811627
7538 2811627 2474863 2209612 1931816 1774594 1565827 1425589 1273101 1201337 1009652 1024830
7528 1024830 1036096 1015840 966164 912842 755333 820278 822759 710707 836585 848909 921378
7517 921378 876044 780296 855842 1002545 1016040 1148693 1172810 1252924 1387947 1550754 1720465
7506 1720465 1888465 1951038 2210856 2458085 2617620 2704216 2910795 3144109 3504180 3798576
7496 3798576 4136201 4438898 4882534 5463790 5828714 6200544 6524321 6648383 6905711 7151403
7486 7151403 7037047 6982559 6852927 6548725 6309602 6013933 5560548 5114553 4709529 4172617
7476 4172617 3762951 3444439 3042987 2749668 2499385 2387266 2327959 2188691 2018093 2099454
$$ packed form
7548F794257q2835l03111l31728k53344m78513m85149o00917n83035m55700m08298
7538B811627l36764k65251k77796j57222k08767j40238j52488p1764j91685J5178
7528A024830J1266k0256m9676n3322j57509O4945K481j12052J25878J2324P2469
7517I21378m5334r5748P5546J46703J3495J32653K4117Q0114J35023J62807J69711
7506A720465J68000O2573K59818K47229J59535Q6596K06579K33314L60071K94396
7496C798576L37625L02697M43636N81256L64924L71830L23777J24062K57328K45692
7486G151403j14356n4488j29632l04202k39123k95669m53385m45995m05024n36912
7476D172617m09666l18512m01452k93319k50283j12119n9307j39268j70598Q1361
$$ plain form
7466 2099454 2083332 2047996 2106923 2120003 2111576 2231723 2338220 2483296 2512742 2601613 2806066
7455 2806066 2990584 3130913 3309830 3345235 3361989 3560840 3500226 3588340 3568216 3444738
7445 3444738 3404648 3370253 3273575 3272864 3216409 3169481 3074665 2977424 2905016 3031556 3009459 3021110
7433 3021110 3056176 3126828 3183427 3235531 3395164 3634466 3631734 3410299 3300770 3336086 3173158
7422 3173158 3072351 2934724 2678556 2462958 2287425 2053416 1960060 1779438 1514448 1454153
7412 1454153 1307986 1213733 1088834 973087 871591 818980 809772 844487 665708 528190
7402 528190 473722 517593 444352 400549 253859 248444 209925 293397 390959 407569 512774
7391 512774 484304 503347 504924 576348 615427 564061 580813 618093 695375 672850 828887 854236
$$ packed form
7466B099454j6122l5336N8927J3080q427J20147J06497J45076K9446Q8871K04453
7455B806066J84518J40329J78917L5405J6754J98851o0614Q8114k0124j23478
7445C444738m0090l4395r6678p11n6455m6928r4816r7241p2408J26540k2097J1651
7433C021110L5066P0652N6599N2104J59633K39302k732k21435j09529L5316j62928
7422C173158j00807j37627k56168k15598j75533k34009r3356j80622k64990o0295
7412A454153j46167r4253j24899j15747j01496n2611r208L4715j78779j37518
7402E28190n4468M3871p3241m3803j46690n415l8519Q3472R7562J6610J05205
7391E12774k8470J9043J577P1424L9079n1366J6752L7280P7282k2525J56037K5349
$$ plain form
7379 854236 849305 824652 857668 870785 898090 841504 975156 989703 902112 888403 825992 786382
7367 786382 840538 896617 906182 972043 902502 1049164 1061389 881854 1015634 1016073 1035292 1035190
7355 1035190 1073803 1205402 1351095 1503170 1350957 1573226 1902278 1923594 2115015 2189718
7345 2189718 2375576 2558596 2616191 2704382 2828145 3176997 3398231 3531795 3866803 4119628
7335 4119628 4349020 4561441 5046136 5435765 5822688 6639905 7276327 8121218 8947210 9934289
7325 9934289 11032412 12276654 13759766 15463168 17359902 19408192 21601191 23754400
7317 23754400 25706505 27526838 28999764 30054469 30685443 30941864 30740014 30008149 28853968
7308 28853968 27365415 25515750 23615239 21525901 19293815 17265186 15678366 13989422
$$ packed form
7379H54236m931k4653L3016J3117K7305n6586J33652J4547q7591j3709o2411l9610
7367G86382N4156N6079R565O5861o9541J46662J2225j79535J33780M39J9219j02
7355A035190L8613J31599J45693J52075j52213K22269L29052K1316J91421P4703
7345B189718J85858J83020N7595Q8191J23763L48852K21234J33564L35008K52825
7335D119628K29392K12421M84695L89629L86923Q17217O36422Q44891Q25992R87079
7325I934289J098123J244242J483112J703402J896734K048290K192999K153209
7317B3754400J952105J820333J472926J054705O30974K56421k01850p31865j154181
7308B8853968j488553j849665j900511k089338k232086k028629j586820j688944
$$ plain form
7300 13989422 12479880 11261766 10321493 9407384 8659212 8054711 7562509 7169470 6605116
7291 6605116 6232877 5936049 5647956 5247905 4914485 4767107 4470766 4247287 4026991 3707438
7281 3707438 3450784 3175235 3222302 3181800 2961034 2817070 2744447 2770695 2692371 2756876 2622603
7270 2622603 2576116 2638010 2649783 2719864 2818557 3014383 3213829 3374113 3388634 3301808 3404981
7259 3404981 3509112 3393649 3211385 3110799 3064682 2819633 2528230 2342260 2204608 2068104
7249 2068104 1980098 1767599 1588498 1298983 1123641 1010130 968558 868605 685490 538906
7239 538906 507436 534157 409841 351727 292500 279158 374051 283183 157996 115016 132270
7228 132270 172030 170242 156326 166351 92111 36150 -13644 -51371 -104766 -77362 -118526 -41339
$$ packed form
7300A3989422j509542j218114r40273r14109p48172o04501m92202l93039n64354
7291F605116l72239k96828k88093m00051l33420j47378k96341k23479k20296l19553
7281C707438k56654k75549M7067m0502k20766j43964p2623K6248p8324O4505j34273
7270B622603m6487O1894J1773P0081R8693J95826J99446J60284J4521q6826J03173
7259C404981J04131j15463j82264j00586m6117k45049k91403j85970j37652j36504
7249B068104q8006k12499j79101k89515j75342j13511m1572r9953j83115j46584
7239E38906l1470K6721j24316n8114n9227j3342R4893r0868j25187m2980J7254
7228A32270L9760j788j3916J0025p4240n5961m9794l7727n3395K7404m1164P7187
$$ plain form
7216 -41339 -82669 3701 155408 195644 226814 235128 102090 33834 98735 289826 331783
7205 331783 423166 484319 491517 507773 604163 734364 670596 668795 595287 647778 634287 707972
7193 707972 707649 564960 483995 414980 477676 437208 307393 203170 78285 180518 204754
7182 204754 228289 278623 336420 247326 148581 117938 181112 148767 138748 200652 277757 201008
7170 201008 112137 53917 30217 57587 27349 35839 -8835 -38083 -76523 -44734 -117948 -60635
7158 -60635 -17316 -116819 -152869 -40609 -33284 45447 9425 -65476 130361 254163 360638
7147 360638 398548 478280 568177 637857 766703 833161 1065175 1381807 1598476 1691637 1858064
7136 1858064 2036711 2176112 2470204 2705694 2921541 3188646 3592877 4104863 4330270 4532912
$$ packed form
7216d1339m1330Q6370J51707M0236L1170Q314j33038o8256O4901J91091M1957
7205C31783R1383O1153P198J6256R6390J30201o3768j801p3508N2491j3491P3685
7193G07972l23j42689q0965o9015O2696m0468j29815j04223j24885J02233K4236
7182B04754K3535N0334N7797q9094r8745l0643O3174l2345j0019O1904P7105p6749
7170B01008q8871n8220k3700K7370l0238Q490m4674k9248l8440L1789p3214N7313
7158f0635M3319r9503l6050J12260P325P8731l6022p4901J95837J23802J06475
7147C60638L7910P9732Q9897O9680J28846O6458K32014L16632K16669R3161J66427
7136A858064J78647J39401K94092K35490K15847K67105M04231N11986K25407K02642
$$ plain form
7126 4532912 4716561 4771007 4839417 4916351 4839236 4787864 4673839 4519412 4426322 4194002 3892475
7115 3892475 3676498 3678803 3717740 3662911 3579246 3676708 3758352 3937242 4121910 4054202 3838968
7104 3838968 3683012 3476498 3345034 3068364 2791348 2582803 2225081 1797695 1425386 1180171
7094 1180171 1033988 899922 630504 392828 315095 27677 -96814 -154088 -313868 -444169
7084 -444169 -563288 -549592 -533384 -680364 -748152 -838577 -766453 -747692 -887033 -874315 -915162
7073 -915162 -1059793 -1093064 -1090634 -1010142 -1074512 -1064608 -1044356 -978735 -1020467 -1143594 -1233876 -1218828
7061 -1218828 -1193916 -1259548 -1301419 -1230043 -1085751 -1169160 -1216446 -1308708 -1409522 -1389977 -1428923
7050 -1428923 -1426032 -1364733 -1406834 -1402327 -1392707 -1323569 -1214004 -1298951 -1494866 -1476358 -1421194 -1470124
$$ packed form
7126D532912J83649N4446O8410P6934p7115n1372j14025j54427r3090k32320l01527
7115C892475k15977K305L8937n4829q3665R7462Q1644J78890J84668o7708k15234
7104C838968j55956k06514j31464k76670k77016k08545l57722m27386l72309k45215
7094A180171j46183j34066k69418k37676p7733k87418j24491n7274j59780j30301
7084d44169j19119J3696J6208j46980o7788r0425P2124J8761j39341J2718m0847
7073i15162j44631l3271K430Q0492o4370R904K0252O5621m1732j23127r0282J5048
7061a218828K4912o5632m1871P1376J44292q3409m7286r2262j00814J9545l8946
7050a428923K891O1299m2101M507R620O9138J09565q4947j95915J8508N5164m8930
$$ plain form
7038 -1470124 -1420131 -1500839 -1533728 -1538200 -1586303 -1531181 -1717310 -1531700 -1449891 -1443091 -1387281
7027 -1387281 -1460587 -1623467 -1692193 -1580936 -1583389 -1530988 -1502037 -1595105 -1551759 -1518858 -1413938
7016 -1413938 -1492581 -1501519 -1554275 -1625314 -1472017 -1207007 -1244045 -1292815 -1347224 -1359046 -1403185
7005 -1403185 -1455688 -1354046 -1285446 -1348679 -1266869 -1285887 -1339918 -1188761 -1026328 -1046219 -1092484
6994 -1092484 -1135073 -1119168 -997027 -1023872 -1072630 -1031514 -1139520 -1107411 -1075866 -1005936 -983406
6983 -983406 -1118591 -1046671 -903653 -808753 -733496 -735223 -848983 -775314 -697542 -693684 -685192 -690654
6971 -690654 -651336 -576977 -701492 -760760 -804580 -761965 -622529 -704533 -729279 -773859 -772443
6960 -772443 -673625 -538636 -514804 -461477 -442847 -461960 -281711 -266517 -151518 -175662 -203140
$$ packed form
7038a470124M9993q0708l2889m472m8103N5122j86129J85610Q1809O800N5810
7027a387281p3306j62880o8726J11257k453N2401K8951r3068M3346L2901J04920
7016a413938p8643q938n2756p1039J53297K65010l7038m8770n4409j1822m4139
7005a403185n2503J01642O8600o3233Q1810j9018n4031J51157J62433j9891m6265
6994a092484m2589J5905J22141k6845m8758M1116j08006L2109L1545O9930K2530
6983i83406j35185P1920J43018R4900P5257j727j13760P3669P7772L858Q492n462
6971f90654L9318P4359j24515n9268m3820M2615J39436q2004k4746m4580J416
6960g72443R8818J34989K3832N3327J8630j9113J80249J5194J14999k4144k7478
$$ plain form
6949 -203140 -206255 -271005 -313396 -99536 -151836 -82007 -123374 -197349 -331594 -354226 -384890
6938 -384890 -424350 -452585 -478307 -457602 -393650 -436328 -601281 -734874 -750662 -603402 -598673
6927 -598673 -720748 -646614 -445219 -504105 -581352 -647843 -639447 -573728 -475449 -630903 -592599
6916 -592599 -590285 -539531 -421738 -379667 -369254 -360814 -212036 -201149 -153596 -236736 -195675 -93097
6904 -93097 -149520 -117876 -96923 -51620 76987 96184 128369 102652 81970 190767 140501
6893 140501 131931 152279 87880 6658 -45714 4169 -156 -69303 -85086 -101353 -278765 -405234
6881 -405234 -496953 -651868 -630186 -509641 -557160 -432900 -515483 -498960 -393758 -346647 -363238
6870 -363238 -458644 -489143 -301272 -367715 -483862 -293487 -267629 -343265 -257831 -227467 -277402
$$ packed form
6949b03140l115o4750m2391K13860n2300O9829m1367p3975j34245k2632l0664
6938c84890l9460k8235k5722K0705O3952m2678j64953j33593j5788J47260M729
6927e98673j22075P4134K01395n8886p7247o6491Q396O5719R8279j55454L8304
6916e92599K314N0754J17793M2071J0413Q440J48778J0887M7553q3140M1061J02578
6904i3097n6423L1644K0953M5303J28607J9197L2185k5717k0682J08797n0266
6893A40501q570K0348o4399q1222n2372M9883m325o9147j5783j6267j77412j26469
6881d05234r1719j54915K1682J20545m7519J24260q2583J6523J05202M7111j6591
6870c63238r5406l0499J87871o6443j16147J90375K5858p5636Q5434L0364m9935
$$ plain form
6859 -277402 -253821 -230249 -76756 -161163 -178299 -247466 -275044 -224770 -249205 -235462 -225818 -184591
6847 -184591 -87157 -75393 9354 16827 123582 139829 292582 347104 422254 521986 529525 565709
6835 565709 649210 610065 648422 773870 802333 920158 949682 921657 1061110 1016060 899062
6824 899062 871786 941266 862068 843869 814681 818316 891833 792221 842313 819384 638766 613787
6812 613787 570212 630136 616109 551003 506650 509535 688362 715816 737831 761842 657519
6801 657519 682338 651988 631075 744814 698448 719364 724037 633198 542100 613291 619942 537684
6789 537684 529717 441646 432521 485416 545826 528313 478316 528553 706189 584611 608713 750789
6777 750789 578920 742171 801232 821622 895328 982227 1206642 1391375 1404790 1561666 1609804
$$ packed form
6859b77402K3581K3572J53493q4407j7136o9167k7578N0274k4435J3743R644M1227
6847a84591R7434J1764Q4747P473J06755J6247J52753N4522P5150R9732P539L6184
6835E65709Q3501l9145L8357J25448K8463J17825K9524k8025J39453m5050j16998
6824H99062k7276O9480p9198j8199k9188L635P3517r9612N0092k2929j80618k4979
6812F13787m3575N9924j4027o5106m4353K885J78827K7454K2015K4011j04323
6801F57519K4819l0350k0913J13739m6366K0916M673r0839r1098P1191O651q2258
6789E37684p967q8071r125N2895O0410j7513m9997N0237J77636j21578K4102J42076
6777G50789j71869J63251N9061K0390P3706Q6899K24415J84733J3415J56876M8138
$$ plain form
6766 1609804 1663944 1836624 2018071 2177304 2239090 2205288 2354621 2425007 2542557 2591286
6756 2591286 2708142 2761404 2871469 2879555 3013156 3096532 3198933 3262961 3226455 3360330 3422133
6745 3422133 3413831 3395500 3450738 3277445 3166763 3270010 3236948 3020604 2926940 2844629 2690374
6734 2690374 2802510 2675845 2636132 2633189 2513558 2528125 2509280 2454990 2375949 2216770 2021855
6723 2021855 1947949 1806716 1693228 1442303 1515090 1426124 1341824 1217303 1192769 1056013
6713 1056013 936106 880785 835621 717419 628836 560937 558189 337568 205820 232202 227153
6702 227153 119628 -55356 -123855 -72216 -32866 -76831 -200423 -366596 -457928 -593777 -625171
$$ packed form
6766A609804N4140J72680J81447J59233O1786l3802J49333P0386J17550M8729
6756B591286J16856N3262J10065Q086J33601Q3376J02401O4028l6506J33875O1803
6745C422133q302j8331N5238j73293j10682J03247l3062k16344r3664q2311j54255
6734B690374J12136j26665l9713k943j19631J4567j8845n4290p9041j59179j94915
6723B021855p3906j41233j13488k50925P2787q8966q4300j24521k4534j36756
6713A056013j19907n5321m5164j18202q8583o7899k748k20621j31748K6382n049
6702B27153j07525j74984o8499N1639L9350m3965j23592j66173r1332j35849l1394
$$ [...]
##END NTUPLES=NMR SPECTRUM
##END=
