##TITLE=1H_TG-2403-1
 200.13Hz, CDCl3.
 8 sc
 
1.1.2026
##JCAMPDX= 6.0         $$ Bruker NMR JCAMP-DX V2.0
##DATA TYPE= NMR SPECTRUM
##DATA CLASS= NTUPLES
##ORIGIN= UXNMR, Bruker Analytische Messtechnik GmbH
##OWNER= pz
$$ XWIN-NMR		Version 3.5
$$ Wed Apr  1 14:00:54 2026 Russian Standard Time (UT+4h)  she@DPX200
##.OBSERVE FREQUENCY= 200.1313
##.OBSERVE NUCLEUS= ^1H
##.ACQUISITION MODE= SIMULTANEOUS
##.ACQUISITION SCHEME= undefined
##.AVERAGES= 8
##.DIGITISER RES= 18
##SPECTROMETER/DATA SYSTEM= spect
##.PULSE SEQUENCE= zg30
##.SOLVENT NAME= CDCl3
##.SHIFT REFERENCE= (INTERNAL, CDCl3, 0, 15.4461)
##AUDIT TRAIL= $$ (NUMBER, WHEN, WHO, WHERE, WHAT)
$$ ##TITLE= Audit trail, XWIN-NMR		Version 3.5
$$ ##JCAMPDX= 5.01
$$ ##ORIGIN= Bruker BioSpin GmbH
$$ ##OWNER= she
$$ F:/spectra/data/she/nmr/H-C/1/pdata/1/auditp.txt
$$ ##AUDIT TRAIL=  $$ (NUMBER, WHEN, WHO, WHERE, WHAT)
(   1,<2026-04-01 13:59:03.76 +0400>,<she>,<DPX200>,
      <created by zg, POWCHK disabled, PULCHK disabled
       configuration hash MD5:
       00 E9 B6 7A A2 85 ED C7 34 08 36 98 17 FE 4E 26
       data hash MD5: 16K
       69 5E 77 1E 04 4A CB D6 58 E7 4E 92 72 00 FF F1>)
(   2,<2026-04-01 13:59:38.23 +0400>,<she>,<DPX200>,
      <Start of raw data processing
       efp BC_mod = 2 LB = 0.25 FT_mod = 6 PKNL = 1 PHC0 = -3710.619 PHC1 = 12.19231 SI = 16K 
       data hash MD5: 16K
       CD 1B 8E 63 65 A6 5C C3 11 80 D3 16 92 B4 95 18>)
(   3,<2026-04-01 13:59:56.17 +0400>,<she>,<DPX200>,
      <pk PHC0 = 0.8315213 PHC1 = -2.6 
       data hash MD5: 16K
       7C BD 69 1B DB 0B 3F 3E 9E F4 BB F0 6B EE BB 31>)
(   4,<2026-04-01 13:59:59.34 +0400>,<she>,<DPX200>,
      <abs ABSG = 5 
       data hash MD5: 16K
       6B BE 65 F3 C6 6B C7 D8 F8 81 73 09 2D 50 A3 A1>)
$$ ##END=
$$ 
$$ hash MD5
$$ 5D 95 CF E9 9E 45 B7 D4 62 5C BE 2E 70 A1 63 94
##$RELAX= 
##$RELAX= 
##$RELAX= 
##$RELAX= 
##$RELAX= 
##$RELAX= 
$$ Bruker specific parameters
$$ --------------------------
##$DU= <F:/spectra>
##$EXPNO= 1
##$NAME= <H-C>
##$PROCNO= 1
##$TYPE= <nmr>
##$USER= <she>
##$AMP= (0..31)
100 100 100 100 100 100 100 100 100 100 100 100 100 100 100 100 100 100 
100 100 100 100 100 100 100 100 100 100 100 100 100 100 
##$AQSEQ= 0
##$AQ_mod= 1
##$AUNM= <au_zg>
##$AUTOPOS= <>
##$BF1= 200.13
##$BF2= 200.13
##$BF3= 200.13
##$BF4= 200.13
##$BF5= 200.13
##$BF6= 200.13
##$BF7= 200.13
##$BF8= 200.13
##$BYTORDA= 1
##$CFDGTYP= 0
##$CFRGTYP= 5
##$CHEMSTR= <none>
##$CNST= (0..31)
1 1 145 1 1 1 1 1 1 1 1 1 1 1 1 1 1 1 1 1 1 1 1 1 1 1 1 1 1 1 1 1 
##$CPDPRG= <>
##$CPDPRG1= <>
##$CPDPRG2= <>
##$CPDPRG3= <>
##$CPDPRG4= <mlev>
##$CPDPRG5= <mlev>
##$CPDPRG6= <mlev>
##$CPDPRG7= <mlev>
##$CPDPRG8= <mlev>
##$CPDPRGB= <>
##$CPDPRGT= <>
##$D= (0..31)
0 0.7 0 0 0 0 0 0 0 0 0 0.03 0 0 0 0 0 0 0 0 0 0 0 0 0 0 0 0 0 0 0 0 
##$DATE= 1775037543
##$DBL= (0..7)
120 120 120 120 120 120 120 120 
##$DBP= (0..7)
150 150 150 150 150 150 150 150 
##$DBP07= 0
##$DBPNAM0= <>
##$DBPNAM1= <>
##$DBPNAM2= <>
##$DBPNAM3= <>
##$DBPNAM4= <>
$$ [...]
##$SUBNAM3= <"">
##$SUBNAM4= <"">
##$SUBNAM5= <"">
##$SUBNAM6= <"">
##$SUBNAM7= <"">
##$SUBNAM8= <"">
##$SUBNAM9= <"">
##$SW= 18.0517328524113
##$SWIBOX= (0..15)
0 0 2 0 0 0 0 0 0 0 0 0 0 0 0 0 
##$SW_h= 3612.71676300578
##$TD= 16384
##$TD0= 1
##$TE= 0
##$TE2= 300
##$TE3= 300
##$TEG= 300
##$TL= (0..7)
0 120 120 120 120 120 120 120 
##$TP= (0..7)
150 150 150 150 150 150 150 150 
##$TP07= 0
##$TPNAME0= <>
##$TPNAME1= <>
##$TPNAME2= <>
##$TPNAME3= <>
##$TPNAME4= <>
##$TPNAME5= <>
##$TPNAME6= <>
##$TPNAME7= <>
##$TPOAL= (0..7)
0.5 0.5 0.5 0.5 0.5 0.5 0.5 0.5 
##$TPOFFS= (0..7)
0 0 0 0 0 0 0 0 
##$TUNHIN= 0
##$TUNHOUT= 0
##$TUNXOUT= 0
##$USERA1= <user>
##$USERA2= <user>
##$USERA3= <user>
##$USERA4= <user>
##$USERA5= <user>
##$V9= 5
##$VALIST= <valist>
##$VCLIST= <CCCCCCCCCCCCCCC>
##$VD= 0
##$VDLIST= <DDDDDDDDDDDDDDD>
##$VPLIST= <PPPPPPPPPPPPPPP>
##$VTLIST= <TTTTTTTTTTTTTTT>
##$WBST= 1024
##$WBSW= 4
##$XGAIN= (0..3)
0 0 0 0 
##$XL= 0
##$YL= 0
##$YMAX_a= 656535
##$YMIN_a= -898945
##$ZGOPTNS= <>
##$ZL1= 120
##$ZL2= 120
##$ZL3= 120
##$ZL4= 120
##$ABSF1= 15.48466
##$ABSF2= -2.567189
##$ABSG= 5
##$ABSL= 3
##$ALPHA= 0
##$AQORDER= 0
##$ASSFAC= 0
##$ASSFACI= 0
##$ASSFACX= 0
##$ASSWID= 0
##$AUNMP= <proc_1d>
##$AZFE= 0.1
##$AZFW= 0.1
##$BCFW= 0
##$BC_mod= 2
##$BYTORDP= 0
##$COROFFS= 0
##$CY= -3
##$DATMOD= 1
##$DC= 0
##$DFILT= <>
##$DTYPP= 0
##$F1P= 0
##$F2P= 0
##$FCOR= 1
##$FTSIZE= 16384
##$FT_mod= 6
##$GAMMA= 0
##$GB= 0
##$INTBC= 1
##$INTSCL= 3.241238e-09
##$ISEN= 128
##$LB= 0.25
##$LEV0= 0
##$LPBIN= 0
##$MAXI= 10000
##$MC2= 0
##$MEAN= 0
##$ME_mod= 0
##$MI= 1.114404
##$NCOEF= 0
##$NC_proc= -7
##$NLEV= 6
##$NOISF1= 3.799351
##$NOISF2= 2.8
##$NSP= 0
##$NTH_PI= 0
##$NZP= 0
##$OFFSET= 15.4461
##$PC= 1
##$PHC0= -3709.787
##$PHC1= 9.59231
##$PH_mod= 1
##$PKNL= yes
##$PPARMOD= 0
##$PSCAL= 0
##$PSIGN= 0
##$REVERSE= no
##$SF= 200.130015129854
##$SI= 16384
##$SIGF1= 3
##$SIGF2= 2
##$SINO= 0.751879
##$SIOLD= 32768
##$SREGLST= <19F.Aceton>
##$SSB= 0
##$STSI= 16384
##$STSR= 0
##$SW_p= 3612.71676300578
##$SYMM= 0
##$S_DEV= 0
##$TDeff= 16384
##$TDoff= 0
##$TI= <>
##$TILT= no
##$TM1= 0
##$TM2= 0
##$TOPLEV= 0
##$USERP1= <user>
##$USERP2= <user>
##$USERP3= <user>
##$USERP4= <user>
##$USERP5= <user>
##$WDW= 1
##$XDIM= 16384
##$YMAX_p= 416679276
##$YMIN_p= -1994266
$$ End of Bruker specific parameters
$$ ---------------------------------
##NTUPLES= NMR SPECTRUM
##VAR_NAME=  FREQUENCY,     SPECTRUM/REAL,   SPECTRUM/IMAG
##SYMBOL=    X,             R,               I
##VAR_TYPE=  INDEPENDENT,   DEPENDENT,       DEPENDENT
##VAR_FORM=  AFFN,          ASDF,            ASDF
##VAR_DIM=   16384,         16384,           16384
##UNITS=     HZ,            ARBITRARY UNITS, ARBITRARY UNITS
##FACTOR=    0.220516191357247, 1,           1
##FIRST=     3091.22827372486, 0,            0
##LAST=      -521.48848928092, 0,            0
##MIN=       -521.48848928092, -1994266,     0
##MAX=       3091.22827372486, 416679276,    0
$$ Real data points
##PAGE= N=1
##DATA TABLE= (X++(R..R)), XYDATA
$$ [...]
$$ plain form
5002 48222784 47329103 48002535 48331884 48118042 48063678 47839698 48195049 48577577 47648765 48185734
4992 48185734 47812962 47821946 48201821 49079386 49051859 49528263 49919893 50338152 50948036 51016115
4982 51016115 50277156 50484874 50766561 51242165 51790447 51609852 51980504 52276738 52316739 52329986
4972 52329986 52593485 52863055 53419276 53961371 54164948 54660329 55739147 57079472 57465403
4963 57465403 57672475 58841750 59455890 60865656 62190334 63061293 64145142 65487226 65609544
4954 65609544 65795472 66797194 67470912 66969277 66392301 65312956 65371123 64234767 63807710
4945 63807710 63441909 63306798 63142358 63067240 63183232 63539305 64149201 64949252 65383277 66264308
4935 66264308 67516977 67772074 67881478 68048820 68156749 67658211 67116250 66911907 66439086
$$ packed form
5002D8222784q93681O73432L29349k13842n4364k23980L55351L82528r28812N36969
4992D8185734l72772Q984L79875Q77565k7527M76404L91630M18259O09884O8079
4982E1016115p38959K07718K81687M75604N48282j80595L70652K96234M0001J3247
4972E2329986K63499K69570N56221N42095K03577M95381J078818J340325L85931
4963E7465403K07072J169275O14140J409766J324678Q70959J083849J342084J22318
4954F5609544J85928J001722O73718n01635n76976j079345N8167j136356m27057
4945F3807710l65801j35111j64440p5118J15992L56073O09896Q00051M34025Q81031
4935F6264308J252669K55097J09404J67342J07929m98538n41961k04343m72821
$$ plain form
4926 66439086 65701282 64549534 63757593 64153199 62943094 62441561 62146326 62044044 61340640
4917 61340640 59947370 59099138 58816999 58988796 59387138 59013053 58835134 59209570 60006828
4908 60006828 60659568 61733023 62852213 64940819 65527913 66266524 67115667 67493229 68169885
4899 68169885 68179678 69804329 71366049 71991702 73235528 74360110 75334692 75985349 77707057
4890 77707057 79739198 81261009 84342390 86384098 88149448 90935105 92537667 93740954
4882 93740954 94335696 94241093 94714575 92695920 92267451 92406418 90991120 91906722 91514046
4873 91514046 92446550 94313180 94824634 94835288 95960406 97052130 97465924 97751667 98794140
4864 98794140 99551897 100685328 100629991 99980038 99830039 98674553 98753711 98591578 98958690
$$ packed form
4926F6439086p37804j151748p91941L95606j210105n01533k95235j02282p03404
4917F1340640j393270q48232k82139J71797L98342l74085j77919L74436P97258
4908F0006828O52740J073455J119190K088606N87094P38611Q49143L77562O76656
4899F8169885R793J624651J561720O25653J243826J124582R74582O50657J721708
4890G7707057K032141J521811L081381K041708J765350K785657J602562J203287
4882I3740954N94742r4603M73482k018655m28469J38967j415298R15602l92676
4873I1514046R32504J866630N11454J0654J125118J091724M13794K85743J042473
4864I8794140P57757J133431n5337o49953j49999j155486P9158j62133L67112
$$ plain form
4855 98958690 100426353 100582585 101415238 102065225 101149945 101413981 100067462 97370728 95766165
4846 95766165 92911307 90625515 89244381 87599452 87666633 87455975 87594596 87757259 87821849
4837 87821849 87761046 88372266 88914224 89860358 91304553 92624156 92573138 93078180 92363176
4828 92363176 90755254 89046233 86564372 85316408 83760744 82198610 81617880 80171020
4820 80171020 80191750 79157572 78458312 78362824 77367405 76508902 76029030 74856800 74125289
4811 74125289 74163079 74056517 73245921 72139642 71530338 70011820 68932200 67613824 66803235
4802 66803235 65983563 66477614 67369598 67605262 66764709 66116061 64680251 64308711 62912825
4793 62912825 62045127 61594500 61610703 61187123 60444611 61295926 62446970 62858399 63465524
$$ packed form
4855I8958690J467663J56232Q32653O49987r15280K64036j346519k696734j604563
4846I5766165k854858k285792j381134j644929O7181k10658J38621J62663O4590
4837H7821849o0803O11220N41958R46134J444195J319603n1018N05042p15004
4828I2363176j607922j709021k481861j247964j555664j562134n80730j446860
4820H0171020K0730j034178o99260r5488r95419q58503m79872j172230p31511
4811G4125289L7790j06562q10596j106279o09304j518518j079620j318376q10589
4802F6803235q19672M94051Q91984K35664q40553o48648j435810l71540j395886
4793F2912825q67698m50627J6203m23580p42512Q51315J151044M11429O07125
$$ plain form
4784 63465524 64116637 64624082 64367962 64635666 64429681 64339671 65014843 65049111 65662815 66096510
4774 66096510 66751970 65722296 64485046 63389746 63413131 63170984 63135576 62931862 62870575
4765 62870575 62810439 62242833 62043695 62484986 62493146 62703104 61914443 61441072 61568860 62194255
4755 62194255 62114220 61823196 61230335 60390612 60860950 60551929 59923649 59002738 59241778 59309560
4745 59309560 59610965 60429070 60212135 59950408 59986252 59833649 59664729 60542843 61128400 61343840
4735 61343840 62147106 62486202 62890024 62748983 61547574 60760725 60835906 60421072 60799442
4726 60799442 62253098 62201414 62092596 62144662 63030301 63825497 64231660 64622898 65547812 66319389
4716 66319389 66556464 66914373 67004680 67668276 68700918 67842800 67305944 66993699 67142143
$$ packed form
4784F3465524O51113N07445k56120K67704k05985r0010O75172L4268O13704M33695
4774F6096510O55460j029674j237250j095300K3385k42147l5408k03714o1287
4765F2870575o0136n67606j99138M41291Q160K09958p88661m73371J27788O25395
4755F2194255q0035k91024n92861q39723M70338l09021o28280r20911K39040O7782
4745E9309560L01405Q18105k16935k61727L5844j52603j68920Q78114N85557K15440
4735F1343840Q03266L39096M03822j41041j201409p86849P5181m14834L78370
4726F0799442J453656n1684j08818N2066Q85639P95196M06163L91238R24914P71577
4716F6319389K37075L57909R0307O63596J032642q58118n36856l12245J48444
$$ plain form
4707 67142143 66950809 66846111 66614953 66683131 66242169 65080188 64234993 63596973 63850250
4698 63850250 62466859 60403338 60291803 59583509 58898167 58553395 58250482 58511097 58466031
4689 58466031 58376095 57629347 57671201 57873202 57833985 58339127 58844143 59103901 59927788 61618785
4679 61618785 63176513 63968632 65268749 65164540 67223229 67897480 68622722 68736144 69663750
4670 69663750 69804358 69890253 69389192 69855710 70637803 70435508 70380896 70600425 71158374 72143385
4660 72143385 73784417 73492924 73714947 75238937 76403488 78092991 80492638 83362321
4652 83362321 88346659 94186142 100154718 104036494 108071810 111089522 112232088 111962239
4644 111962239 110621121 108629146 107285253 106552716 106011545 106969913 109512949 112929128
$$ packed form
4707F7142143j91334j04698k31158O8178m40962j161981q45195o38020K53277
4698F3850250j383391k063521j11535p08294o85342l44772l02913K60615m5066
4689E8466031q9936p46748M1854K02001l9217N05142N05016K59758Q23887J690997
4679F1618785J557728P92119J300117j04209K058689O74251P25242J13422R27606
4670F9663750J40608Q5895n01061M66518P82093k02295n4612K19529N57949R85011
4660G2143385J641032k91493K22023J523990J164551J689503K399647K869683
4652H3362321M984338N839483N968576L881776M035316L017712J142566k69849
4644A11962239j341118j991975j343893p32537n41171R58368K543036L416179
$$ plain form
4636 112929128 115543817 119514986 122663326 125329413 127403867 126570106 125012113 123215363
4628 123215363 119762200 118173263 115473580 112769602 112691458 113154260 114108596 115251867 116478508
4619 116478508 118472585 120233489 121918672 123457325 126377210 130822847 135777843 141066662
4611 141066662 145817497 151603491 156512751 161020093 164335588 166438857 168087670 168935769
4603 168935769 167948382 167335957 166064039 164516889 162354981 161619916 159971241 159583863 159534086
4594 159534086 159794836 160113014 160306291 161362588 163250200 164563329 166752671 169305590
4586 169305590 174126163 181526368 190191512 202125401 216062203 228636143 242287048
4579 242287048 254390395 265458186 275826972 283403038 290074558 295624790 301428237 307318964
$$ packed form
4636A12929128K614689L971169L148340K666087K074454q33761j557993j796750
4628A23215363l453163j588937k699683k703978p8144M62802R54336J143271J226641
4619A16478508J994077J760904J685183J538653K919885M445637M954996N288819
4611A41066662M750835N785994M909260M507342L315495K103269J648813Q48099
4603A68935769r87387o12425j271918j547150k161908p35065j648675l87378m9777
4594A59534086K60750L18178J93277J056297J887612J313129K189342K552919
4586A69305590M820573P400205Q665144J1933889J3936802J2573940J3650905
4579B42287048J2103347J1067791J0368786P576066O671520N550232N803447N890727
$$ plain form
4571 307318964 312214957 315306100 317402619 317340120 315876155 313429454 313551081 315195812
4563 315195812 320536609 328820905 337209605 343862737 345849994 343156361 333884321 318228150
4555 318228150 299447938 278017295 257988677 241526671 230094548 220787803 214410383
4548 214410383 210124528 204976282 199694408 195133801 189396680 184287743 179016199 174103644
4540 174103644 170264352 165748288 161346564 156950015 153164758 149694148 146080840 142473105
4532 142473105 140483516 139384553 137637390 136414769 137146037 138926226 141649221 143117045
4524 143117045 144120295 145181756 147005602 148693914 149676885 150535786 153623066 155026942
4516 155026942 155663103 157087839 158295888 157736231 157736260 157787318 158297680 160006018 161929679
$$ packed form
4571C07318964M895993L091143K096519o2499j463965k446701J21627J644731
4563C15195812N340797Q284296Q388700O653132J987257k693633r272040j5656171
4555C18228150j8780212k1430643k0028618j6462006j1432123r306745o377420
4548B14410383m285855n148246n281874m560607n737121n108937n271544m912555
4540A74103644l839292m516064m401724m396549l785257l470610l613308l607735
4532A42473105j989589j098963j747163j222621P31268J780189K722995J467824
4524A43117045J003250J061461J823846J688312R82971Q58901L087280J403876
4516A55026942O36161J424736J208049n59657K9N1058N10362J708338J923661
$$ plain form
4507 161929679 164707490 168073892 173044016 178163269 185889443 195922785 209950286 227685432
4499 227685432 248204930 269594705 289494444 304735627 312504611 311873172 303334714 289513369
4491 289513369 272864889 255718669 239839942 227797150 219198950 212043977 209074448
4484 209074448 207688666 208152096 209470538 209403703 208750685 207414324 204384737 201599461 197931426
4475 197931426 195098220 193732890 192228111 191172099 192089955 193583046 195692431 197295481
4467 197295481 199566100 203102824 206528660 211440460 216324941 220476464 225379700 231617864
4459 231617864 237214823 243104382 249502729 254905869 260829927 266342722 271789809 276642745
4451 276642745 279793812 282597386 282630685 281820870 281372150 280297258 279795210 279441958 278419963
$$ packed form
4507A61929679K777811L366402M970124N119253P726174J0033342J4027501J7735146
4499B27685432K0519498K1389775J9899739J5241183P768984o31439q538458j3821345
4491B89513369j6648480j7146220j5878727j2042792q598200p154973k969529
4484B09074448j385782M63430J318442o6835o53018j336361l029587k785276l668035
4475A97931426k833206j365330j504779j056012R17856J493091K109385J603050
4467A97295481K270619L536724L425836M911800M884481M151523M903236O238164
4459B31617864N596959N889559O398347N403140N924058N512795N447087M852936
4451B76642745L151067K803574L3299q09815m48720j074892n02048l53252j021995
$$ plain form
4442 278419963 277053729 273795174 268856917 263140187 257332974 252381747 248605149 245214142
4434 245214142 244749315 247270617 254339903 268942453 292072769 319058660 348948189 376975144
4426 376975144 398816241 412908094 415918075 408189971 391359098 368254817 341112766
4419 341112766 314360815 292560568 275444440 261868407 251382231 242665654 235923027
4412 235923027 232253098 230966873 232327055 233667365 233366743 231537924 231121329 231674750
4404 231674750 231694409 231357683 228433047 224460346 219298170 212695003 205965618 199019853
4396 199019853 193129821 186968438 182799660 180585264 179388849 179362155 180024152 180509141 182176642
4387 182176642 183719392 184648213 186160914 188261332 189289396 189587150 190724329 190186461
$$ packed form
4442B78419963j366234l258555m938257n716730n807213m951227l776598l391007
4434B45214142m64827K521302P069286J4602550K3130316K6985891K9889529K8026955
4426C76975144K1841097J4091853L009981p728104j6830873k3104281k7142051
4419C41112766k6751951k1800247j7116128j3576033j0486176q716577o742627
4412B35923027l669929j286225J360182J340310l00622j828819m16595N53421
4404B31674750J9659l36726k924636l972701n162176o603167o729385o945765
4396A99019853n890032o161383m168778k214396j196415k6694O61997M84989J667501
4387A82176642J542750R28821J512701K100418J028064K97754J137179n37868
$$ plain form
4379 190186461 189808176 186013000 180583024 175247656 168777884 163710633 160451271 156714740
4371 156714740 155209683 154753346 155811043 156236600 155593953 155419730 153558599 150391684 147587020
4362 147587020 143742715 140285363 137660462 134155236 130339470 127265851 125529067 124265154
4354 124265154 122688056 122042038 120831820 119736989 118833006 118024730 116163826 115158731
4346 115158731 114452740 113019484 112275833 113476978 112134631 111531021 112303520 111207667 111137822
4337 111137822 109988889 109992346 109893008 108298340 106671760 106665762 105549618 106299531 107963615
4328 107963615 108476159 109865597 111612543 112987632 115407489 117355378 118899944 120602818
4320 120602818 120032599 118900353 118255621 115365904 112489063 109826204 106765052 104827641
$$ packed form
4379A90186461l78285l795176n429976n335368o469772n067251l259362l736531
4371A56714740j505057m56337J057697M25557o42647j74223j861131l166915k804664
4362A47587020l844305l457352k624901l505226l815766l073619j736784j263913
4354A24265154j577098o46018j210218j094831r03983q08276j860904j005095
4346A15158731p05991j433256p43651J201145j342347o03610P72499j095853o9845
4337A11137822j148933L457r9338j594668j626580n998j116144P49913J664084
4328A07963615N12544J389438J746946J375089K419857J947889J544566J702874
4320A20602818n70219j132246o44732k889717k876841k662859l061152j937411
$$ plain form
4312 104827641 104097382 101212628 100206431 99736048 98860460 99145561 99783541 101227443 102080499
4303 102080499 103586333 105266307 106609231 107766783 108603877 109054678 108956695 107850363 105395915
4294 105395915 103003784 100716516 98695704 96990037 96014308 95392153 94630259 94127417 92873536
4285 92873536 92826526 91744810 91781069 91990343 91797311 91484250 91371049 91559287 91489676 91911483
4275 91911483 93422002 94466148 96203534 99059301 101295359 103591761 106949182 112047121
4267 112047121 118715372 124214820 129225575 133214455 134768315 134872448 132252728 130177869
4259 130177869 127409045 123631584 120905156 117558533 113270493 109340098 105764799 103108817
4251 103108817 100892975 99354223 97730187 97807908 97796490 98344635 99083780 99703455 101172633
$$ packed form
4312A04827641p30259k884754j006197m70383q75588K85101O37980J443902Q53056
4303A02080499J505834J679974J342924J157552Q37094M50801r7983j106332k454448
4294A05395915k392131k287268k020812j705667r75729o22155p61894n02842j253881
4285I2873536m7010j081716L6259K09274j93032l13061j13201J88238o9611M21807
4275I1911483J510519J044146J737386K855767K236058K296402L357421N097939
4267A12047121O668251N499448N010755L988880J553860J04133k619720k074859
4259A30177869k768824l777461k726428l346623m288040l930395l575299k655982
4251A03108817k215842j538752j624036P7721j1418N48145P39145O19675J469178
$$ plain form
4242 101172633 103852893 106550119 109108574 110481529 112128921 113941959 113055864 111807661
4234 111807661 111883628 110485585 109802618 109106390 107468868 107900369 108080701 107464157 107726683
4225 107726683 107439075 107182969 107124934 105683976 104626545 103401840 102255385 100700351 99238674
4216 99238674 98486036 98283559 97411021 97834258 96357713 94546559 93708601 93038032 92501816
4207 92501816 93716330 93890166 93939373 95135822 95631263 94681031 93182868 91985962 91393580
4198 91393580 90775147 89044012 88388252 87844386 87136293 86731647 85749162 86622952 87098696
4189 87098696 87618179 88380950 89048715 90003099 91704858 93512580 96508742 98883135 98949314
4180 98949314 97435964 94959353 92619358 89898181 87817893 85746452 84331250 84388036
$$ packed form
4242A01172633K680260K697226K558455J372955J647392J813038q86095j248203
4234A11807661P5967j398043o82967o96228j637522M31501J80332o16544K62526
4225A07726683k87608k56106n8035j440958j057431j224705j146455j555034j461677
4216I9238674p52638k02477q72538M23237j476545j811154q37958o70569n36216
4207I2501816J214514J73836M9207J196449M95441r50232j498163j196906n92382
4198I1393580o18433j731135o55760n43866p08093m04646r82485Q73790M75744
4189H7098696N19483P62771O67765R54384J701759J807722K996162K374393O6179
4180I8949314j513350k476611k339995k721177k080288k071441j415202N6786
$$ plain form
4172 84388036 84127141 83737681 84426933 84151346 84175668 83797392 84033337 83790634 83390542 83517063
4162 83517063 83740127 83147107 82722006 82658283 83856936 84476354 85393934 85019203 85115287 85859976
4152 85859976 86152087 87625786 89241629 90216711 90085814 88828111 88454444 87353424 85643963
4143 85643963 85379818 84817548 85374207 85259677 85790570 86144161 86248927 86960310 86828897
4134 86828897 86701287 87044159 88192851 88770954 89356267 89191136 89824930 91282314 92143019
4125 92143019 92567785 92902171 91649794 90636578 90023432 88975253 88558526 88918665 88701473
4116 88701473 88663678 88440500 88060747 88939309 89712653 90527044 90297074 90885562 90918400 91181574
4106 91181574 91008734 91026643 91188114 90796700 90660392 91011785 91111798 91031847 90858274 90770929
$$ packed form
4172H4388036k60895l89460O89252k75587K4322l78276K35945k42703m00092J26521
4162H3517063K23064n93020m25101o3723J198653O19418R17580l74731R6084P44689
4152H5859976K92111J473699J615843R75082j30897j257703l73667j101020j709461
4143H5643963k64145n62270N56659j14530N30893L53591J04766P11383j31413
4134H6828897j27610L42872J148692N78103N85313j65131O33794J457384Q60705
4125I2143019M24766L34386j252377j013216o13146j048179m16727L60139k17192
4116H8701473l7795k23178l79753Q78562P73344Q14391k29970N88488L2838K63174
4106I1181574j72840J7909J61471l91414j36308L51393J00013p9951j73573q7345
$$ plain form
4096 90770929 90941853 91260071 90965489 90987326 89779383 89102567 88838566 89009158 88607495
4087 88607495 87871447 88581682 88353819 88015609 87336225 87057020 87248085 87052198 86688804
4078 86688804 87097181 86564541 86655244 86608407 85822801 85280117 85142496 85689709 85823523 86508024
4068 86508024 86233556 86151772 85950192 86765849 87583009 87638118 87668848 86905692 88216693 88403517
4058 88403517 87664230 86774120 87198547 87187542 86557468 86075647 85972020 86556304 86509509 85192769
4048 85192769 84536490 84691642 85689320 85127105 84268289 84924858 84336965 84230823 83038705
4039 83038705 82108532 81146870 78960165 78086757 77258770 76325312 75040281 74163663 73966853
4030 73966853 73054481 72863829 72076105 71786173 70861815 69953607 68644928 68505218 68323293
$$ packed form
4096I0770929J70924L18218k94582K1837j207943o76816k64001J70592m01663
4087H8607495p36048P10235k27863l38210o79384k79205J91065j95887l63394
4078H6688804M08377n32640R0703m6837p85606n42684j37621N47213J33814O84501
4068H6508024k74468q1784k01580Q15657Q17160N5109L0730p63156J311001J86824
4058H8403517p39287q90110M24427j1005o30074m81821j03627N84284m6795j316740
4048H5192769o56279J55152R97678n62215q58816O56569n87893j06142j192118
4039H3038705r30173r61662k186705q73408q27987r33458j285031q76618j96810
4030G3966853r12372j90652p87724k89932r24358r08208j308679j39710j81925
$$ plain form
4021 68323293 68203082 67464927 66056074 65465269 65455634 64177585 62905475 62119218 61684791
4012 61684791 60681939 60104622 59444796 59453613 59559335 58685688 59044395 59198632 59851440 60207425
4002 60207425 59771089 59587709 58471276 57827451 57656234 56500145 55853281 55277210 55442767
3993 55442767 55682416 56040302 55473833 54854169 53675331 54225343 53771144 53614685 54275656
3984 54275656 55529246 56297960 56148659 55481060 57033803 58330028 59462006 60666755 61351952
3975 61351952 62240551 63070691 62675731 61653756 61140988 59627107 58932741 58324236 56658229
3966 56658229 56261985 55099033 53639551 53184507 51883686 51678786 51885515 51773869 51211411
3957 51211411 50796629 50946741 51754166 52623471 54603877 55971155 57568278 59940152 62127458
$$ packed form
4021F8323293j20211p38155j408853n90805r635j278049j272110p86257m34427
4012F1684791j002852n77317o59826Q817J05722q73647L58707J54237O52808L55985
4002F0207425m36336j83380j116433o43825j71217j156089o46864n76071J65557
3993E5442767K39649L57886n66469o19664j178838N50012m54199j56459O60971
3984E4275656J253590P68714j49301o67599J552743J296225J131978J204749O85197
3975F1351952Q88599Q30140l94960j021975n12768j513881o94366o08505j666007
3966E6658229l96244j162952j459482m55044j300821k04900K06729j11646n62458
3957E1211411m14782J50112Q07425Q69305J980406J367278J597123K371874K187306
$$ plain form
3948 62127458 63146725 64220987 65508442 65198311 65702271 65894414 65293711 65599787 64455750
3939 64455750 63637914 63234604 63437635 63444422 62002500 60407291 59409734 58563401 57837455
3930 57837455 57985634 57751660 57954652 58289850 59249057 60494796 61918599 63583279 63903607
3921 63903607 64288592 64106857 63496664 61559016 59582980 58559398 56472069 55636620 54847968
3912 54847968 54055064 54588757 54300166 53259895 52651539 52388291 52298087 52255549 51953698 52213467
3902 52213467 52452451 52491700 52441042 53536950 53562983 53939770 54466970 54899469 56141632 56049419
3892 56049419 56432272 56447747 55765900 55529507 54278828 53327392 53286449 54016528 53588207 53177766
3882 53177766 52458484 51969744 50859294 50397038 49920879 50327396 51267081 51641426 52329501
$$ packed form
3948F2127458J019267J074262J287455l10131N03960J92143o00703L06076j144037
3939F4455750q17836m03310K03031O787j441922j595209r97557q46333p25946
3930E7837455J48179k33974K02992L35198R59207J245739J423803J664680L20328
3921F3903607L84985j81735o10193j937648j976036j023582k087329q35449p88652
3912E4847968p92904N33693k88591j040271o08356k63248r0204m2538l01851K59769
3902E2213467K38984L9249n0658J095908K6033L76787N27200M32499J242163r2213
3892E6049419L82853J5475o81847k36393j250679r51436m0943P30079m28321m10441
3882E3177766p19282m88740j110450m62256m76159M06517R39685L74345O88075
$$ plain form
3873 52329501 53230140 54167487 55367297 55888472 55935392 55629843 54188543 54065528 53429310
3864 53429310 52963830 51983842 51318943 50992678 49894951 50381638 50123870 49269595 48851588
3855 48851588 48217862 48126380 47646894 47688541 48160049 47474142 48194088 48488771 48269328 49234817
3845 49234817 49802910 50473161 50717871 50846212 49525239 50160139 49363290 48595331 48250945
3836 48250945 48133802 47528248 47553629 47861350 48022102 47869006 48135932 48414350 49141762 49679425
3826 49679425 50860992 52234376 53011040 53651056 54555125 55460087 57159271 58524409 59976571
3817 59976571 60645811 60903948 61313203 61013695 60556827 59569777 58601562 58148452 57346643
3808 57346643 56395481 55796126 55247384 55114135 54970543 55657501 55856880 56776022 58838065
$$ packed form
3873E2329501R00639R37347J199810N21175M6920l05549j441300j23015o36218
3864E3429310m65480r79988o64899l26265j097727M86687k57768q54275m18007
3855D8851588o33726r1482m79486M1647M71508o85907P19946K94683k19443R65489
3845D9234817N68093O70251K44710J28341j320973O34900p96849p67959l44386
3836D8250945j17143o05554K5381L07721J60752j53096K66926K78418P27412N37663
3826D9679425J181567J373384P76664O40016R04069R04962J699184J365138J452162
3817E9976571O69240K58137M09255k99508m56868r87050r68215m53110q01809
3808E7346643r51162n99355n48742j33249j43592O86958J99379R19142K062043
$$ plain form
3799 58838065 60282154 61038525 61822145 61684513 61596998 61297752 61123805 61728637 62239123
3790 62239123 64272559 66472183 67647074 69591508 69508569 68953556 66864178 65060741 62765143
3781 62765143 60536209 58638230 56936442 55912942 54882669 54182539 53959973 53213269 54160489
3772 54160489 54257706 54556873 55419453 56025856 56818870 58069978 58494048 58943828 59738798
3763 59738798 59630145 60155830 60525604 59659416 59394129 59366695 59224572 58334077 57606260 58298745
3753 58298745 58684510 58845577 59386792 59706349 59959603 60009615 59549299 60481625 59918449 58823517
3743 58823517 57493775 56563763 55654145 54107223 52330604 52075670 51623278 50495193 49522011
3734 49522011 49578383 49595612 50298773 51936938 52958463 53661091 54018232 53302789 51726965
$$ packed form
3799E8838065J444089P56371P83620j37632q7515k99246j73947O04832N10486
3790F2239123K033436K199624J174891J944434q2939n55013k089378j803437k295598
3781F2765143k228934j897979j701788j023500j030273p00130k22566p46704R47220
3772E4160489R7217K99167Q62580O06403P93014J251108M24070M49780P94970
3763E9738798j08653N25685L69774q66188k65287k7434j42123q90495p27817O92485
3753E8298745L85765J61067N41215L19557K53254N0012m60316R32326n63176j094932
3743E8823517j329742r30012r09618j546922j776619k54934m52392j128085r73182
3734D9522011N6372J7229P03161J638165J021525P02628L57141p15443j575824
$$ plain form
3725 51726965 50342532 50984765 50160871 49556212 49804976 48960781 48902620 48370440 47838277
3716 47838277 47603359 47312977 46606651 45981025 45490757 45161144 45041703 44703123 44793025 44520014
3706 44520014 43963096 44109640 44063283 44460766 44870551 45538279 45573143 45971593 46621752 46828661
3696 46828661 46455846 46278951 45816303 44472071 43808635 43600007 42313222 41746790 40540982
3687 40540982 39768250 40778742 41228073 40780410 41521534 41038968 41501100 42024396 41884584
3678 41884584 43269601 44672700 45283690 45008224 44847147 44657407 44230615 43898325 43867567
3669 43867567 43200595 42624324 42002474 41428244 40264485 40039939 39228608 38401746 38664822
3660 38664822 37757794 36177857 35904703 34502098 34314665 34057084 33731205 34050776 34237137
$$ packed form
3725E1726965j384433O42233q23894o04659K48764q44195n8161n32180n32163
3716D7838277k34918k90382p06326o25626m90268l29613j19441l38580Q9902k73011
3706D4520014n56918J46544m6357L97483M09785O67728L4864L98450O50159K06909
3696D6828661l72815j76895m62648j344232o63436k08628j286785n66432j205808
3687D0540982p72732J010492M49331m47663P41124m82566M62132N23296j39812
3678D1884584J385017J403099O10990k75466j61077j89740m26792l32290l0758
3669D3867567o66972n76271o21850n74230j163759k24546q11331q26862K63076
3660C8664822r07028j579937k73154j402605j87433k57581l25879L19571J86361
$$ plain form
3651 34237137 33361870 33498996 34185372 35098341 35525756 36161774 36183623 37739883 39128351
3642 39128351 38878231 39937567 41127177 41448145 41545595 41926991 41738649 40991902 40439054
3633 40439054 40330734 39852362 39532323 39543832 38722597 38809671 38000756 36497763 36286341 36787257
3623 36787257 37669603 37543856 37177785 36627475 36369411 36860535 37687525 36773981 37856357
3614 37856357 38205227 39435837 40226754 41701660 43048554 44109136 46471918 48524127
3606 48524127 49675635 52023068 53891913 55013992 55435840 56199546 56301070 56449399 55749793
3597 55749793 54436406 51633510 49482417 47087162 44977485 42954821 42461666 41650954
3589 41650954 41241242 41098942 40038507 40368438 40313755 39804224 39538878 40173889 40117492 41630982
$$ packed form
3651C4237137q75267J37126O86376R12969M27415O36018K1849J556260J388468
3642C9128351k50120J059336J189610L20968R7450L81396j88342p46747n52848
3633D0439054j08320m78372l20039J1509q21235Q7074q08915j502993k11422N00916
3623C6787257Q82346j25747l66071n50310k58064M91124Q26990r13544J082376
3614C7856357L48870J230610P90917J474906J346894J060582K362782K052209
3606D8524127J151508K347433J868845J122079M21848P63706J01524J48329o99606
3597E5749793j313387k802896k151093k395255k109677k022664m93155q10712
3589D1650954m09712j42300j060435L29931n4683n09531k65346O35011n6397J513490
$$ plain form
3579 41630982 42314091 42722729 43220454 45398956 46837895 49707955 52597751 54074360 56107522
3570 56107522 57234331 57464025 58781481 58905881 58426753 57757380 56350825 54401714 54350555
3561 54350555 53407912 52906480 51921974 50842233 50497994 50147267 49784150 49172655 49737746
3552 49737746 51128804 52418666 53492120 56178007 58467234 59748579 61926588 62344565
3544 62344565 62584098 62836143 61971474 60306099 58246586 57205920 55513212 55271363 56029106
3535 56029106 55450432 56180014 57811543 59010556 59571307 59669643 59120311 60511946 61422607
3526 61422607 61672224 61917423 61622533 62341718 63952591 64338988 65404067 68148277 69939356
3517 69939356 72277333 74582451 76336147 78429186 80647615 82918233 83775906 84156956
$$ packed form
3579D1630982O83109M08638M97725K178502J438939K870060K889796J476609K033162
3570E6107522J126809K29694J317456J24400m79128o69373j406555j949111n1159
3561E4350555r42643n01432r84506j079741l44239l50727l63117o11495N65091
3552D9737746J391058J289862J073454K685887K289227J281345K178009M17977
3544F2344565K39533K52045q64669j665375k059513j040666j692708k41849P57743
3535E6029106n78674P29582J631529J199013N60751R8336n49332J391635R10661
3526F1422607K49617K45199k94890P19185J610873L86397J065079K744210J791079
3517F9939356K337977K305118J753696K093039K218429K270618Q57673L81050
$$ plain form
3509 84156956 84622840 85810420 86655422 86508120 86335033 87389107 88001327 87038861 85770043
3500 85770043 83773800 81618092 79680230 77202968 75287956 74004996 73790048 72603985
3492 72603985 71884903 70751315 69183190 69816980 69576594 69235365 68706261 69421832 70626191
3483 70626191 72634116 72603274 72903021 72160059 72173722 72381307 72884812 72772001 73684771 75806602
3473 75806602 77713464 78815222 80803320 82002127 83057682 84573426 86705888 88317005
3465 88317005 90598034 94362054 97353561 99749633 102114648 103902725 106271623 109337935
3457 109337935 111926633 114653104 117878893 118402889 119606718 119615168 118645477 117376562 116146770
3448 116146770 114221418 112990000 112699671 113227868 114701713 115683134 117835714 119384545
$$ packed form
3509H4156956M65884J187580Q45002j47302j73087J054074O12220r62466j268818
3500H5770043j996243k155708j937862k477262j915012j282960k14948j186063
3492G2603985p19082j133588j568125O33790k40386l41229n29104P15571J204359
3483G0626191K007925l0842K99747p42962J3663K07585N03505j12811R12770K121831
3473G5806602J906862J101758J988098J198807J055555J515744K132462J611117
3465H8317005K281029L764020K991507K396072K365015J788077K368898L066312
3457A09337935K588698K726471L225789N23996J203829Q450r69691j268915j229792
3448A16146770j925352j231418k90329N28197J473845R81421K152580J548831
$$ plain form
3440 119384545 120036549 121448719 121790687 122340360 124415376 125457429 128181712 130594805
3432 130594805 133798918 138144436 142666605 146231877 149924941 152208552 151884006 149207016
3424 149207016 144768138 139412453 134605730 129152372 125350174 122274380 119568851 117970388
3416 117970388 117235462 116276823 115748250 114627800 115319084 114994215 115022731 115718413 116981831
3407 116981831 118014678 120999929 124212531 127666943 133329389 140597851 147130617 155487296
3399 155487296 164109499 172004917 179732200 187426766 195239647 202922586 209709572 213516683
3391 213516683 215537220 216780885 216121040 213881749 212729021 212367937 213556232 214612966
3383 214612966 216578225 217446381 216639376 213964569 207653959 199438047 191647884 184357671
$$ packed form
3440A19384545O52004J412170L41968N49673K075016J042053K724283K413093
3432A30594805L204113M345518M522169L565272L693064K283611l24546k676990
3424A49207016m438878n355685m806723n453358l802198l075794k705529j598463
3416A17970388p34926r58639n28573j120450O91284l24869K8516O95682J263418
3407A16981831J032847K985251L212602L454412N662446P268462O532766Q356679
3399A55487296Q622203P895418P727283P694566P812881P682939O786986L807111
3391B13516683K020537J243665o59845k239291j152728l61084J188295J056734
3383B14612966J965259Q68156q07005k674807o310610q215912p790163p290213
$$ plain form
3375 184357671 179454585 175857530 174545404 174562829 176601197 179620433 182935028 186628476
3367 186628476 191571174 199357648 209090565 218096766 227158818 235940659 245211904 258122670
3359 258122670 274166987 290122789 299947688 298692058 289537659 276101133 262300833
3352 262300833 248288895 234676121 221332915 205855342 190637629 177857189 168052348
3345 168052348 159869035 153370561 148096180 143220514 140877425 139640246 137392244 136729401
3337 136729401 137097953 138347161 139739797 143549198 148507311 156589746 166845627 180884838
3329 180884838 194738585 204650009 205354386 194652376 179176885 164002573 151714456
3322 151714456 142349117 137420127 135324106 135065127 138109390 143574059 152543965 164409746
$$ packed form
3375A84357671m903086l597055j312126J7425K038368L019236L314595L693448
3367A86628476M942698P786474R732917R006201R062052Q781841R271245J2910766
3359B58122670J6044317J5955802R824899j255630r154399j3436526j3800300
3352B62300833j4011938j3612774j3343206j5477573j5217713j2780440r804841
3345A68052348q183313o498474n274381m875666k343089j237179k248002o62843
3337A36729401L68552J249208J392636L809401M958113Q082435J0255881J4039211
3329A80884838J3853747R911424P04377j0702010j5475491j5174312j2288117
3322A51714456r365339m928990k096021k58979L044263N464669Q969906J1865781
$$ plain form
3314 164409746 176119997 184701448 186293125 183259931 176474781 167676039 160781530 154583779
3306 154583779 148278267 145280881 141949607 139981098 138372209 135772702 133611457 131876507
3298 131876507 130569182 129445916 129225484 128864272 129644341 131367307 132481564 135632524
3290 135632524 138456403 142077347 145930091 151287794 159701482 170629074 183307354 193242923
3282 193242923 197217243 195241484 188625616 179599639 169700399 160238610 152694877 147213326
3274 147213326 142273598 138379369 134276430 131821066 129862654 126945564 125882884 126656229
3266 126656229 128293882 131138661 133222680 134423394 136262611 137929676 137744956 137560117
3258 137560117 136736339 134518504 133590680 132132462 130627356 129967365 129587283 128997996 128073266
$$ packed form
3314A64409746J1710251Q581451J591677l033194o785150q798742o894509o197751
3306A54583779o305512k997386l331274j968509j608889k599507k161245j734950
3298A31876507j307325j123266k20432l61212P80069J722966J114257L150960
3290A35632524K823879L620944L852744N357703Q413688J0927592J2678280R935569
3282A93242923L974320j975759o615868r025977r899240r461789p543733n481551
3274A47213326m939728l894229m102939k455364j958412k917090j062680P73345
3266A26656229J637653K844779K084019J200714J839217J667065j84720j84839
3258A37560117q23778k217835r27824j458218j505106o59991l80082n89287r24730
$$ plain form
3249 128073266 126246930 124657970 122549599 121118919 119412748 117550226 116506202 115567400
3241 115567400 114742971 114596095 114657140 115787371 116774848 118288146 120117592 122282518 124232306
3232 124232306 126339626 126726809 125050427 123372787 120269950 118435493 115701080 114079375
3224 114079375 112756279 110263323 109044535 107620574 105779463 103832324 102750454 99880502
3216 99880502 97931274 97160974 95154138 94790459 94001553 92882297 93508546 93916751 92919164
3207 92919164 93087572 93110439 92888837 94232873 94921354 95797206 97764170 100402989 103340478
3198 103340478 105185143 108384847 110955391 114512172 116745720 117124458 118983468 119896576
3190 119896576 119075763 118316919 117091881 114381536 112336532 109440531 107461239 104865896
$$ packed form
3249A28073266j826336j588960k108371j430680j706171j862522j044024r38802
3241A15567400q24429j46876O1045J130231R87477J513298J829446K164926J949788
3232A24232306K107320L87183j676382j677640l102837j834457k734413j621705
3224A14079375j323096k492956j218788j423961j841111j947139j081870k869952
3216I9880502j949228p70300k006836l63679p88906j119256O26249M08205r97587
3207I2919164J68408K2867k21602J344036O88481Q75852J966964K638819K937489
3198A03340478J844665L199704K570544L556781K233548L78738J859010R13108
3190A19896576q20813p58844j225038k710345k045004k896001j979292k595343
$$ plain form
3182 104865896 101849925 99262145 97541002 95341571 93862231 91558910 88585507 86638744
3174 86638744 84658402 82420468 80939592 79982054 80074742 80082941 80788014 83089132 85918639
3165 85918639 88230069 89961151 90079072 88534586 86552789 83950115 82026429 81906950
3157 81906950 81252994 81439997 81982605 82183907 82913171 81645784 80110091 76988543 73507114
3148 73507114 70219511 67339246 65714441 64462211 63276751 62835742 63071716 62936486 62602128
3139 62602128 62201304 64063291 66364812 67866438 70045843 71621371 73066003 74040783
3131 74040783 75103334 75368612 76040048 76757608 77310466 78194892 78726353 78394369 78797965
3122 78797965 78102274 75773180 73891229 70861019 67705710 63723230 59085996 54735039
$$ packed form
3182A04865896l015971k587780j721143k199431j479340k303321k973403j946763
3174H6638744j980342k237934j480876r57538R2688Q199P05073K301118K829507
3165H5918639K311430J731082J17921j544486j981797k602674j923686j19479
3157H1906950o53956J87003N42608K01302P29264j267387j535693l121548l481429
3148G3507114l287603k880265j624805j252230j185460m41009K35974j35230l34358
3139F2602128m00824J861987K301521J501626K179405J575528J444632R74780
3131G4040783J062551K65278O71436P17560N52858Q84426N31461l31984M03596
3122G8797965o95691k329094j881951l030210l155309l982480m637234m350957
$$ plain form
3114 54735039 52833485 51091824 50245674 49360579 47449478 46497084 46082994 45551361 46045818
3105 46045818 47009889 47260069 47693319 47456140 46978371 45626493 44773680 44060815 43022920
3096 43022920 41619275 39986289 39610854 39609014 39582564 38844658 38770418 39251256 39342983 38532859
3086 38532859 37118537 36198304 34543693 33692178 31806280 30472555 30941109 30565022 29280260
3077 29280260 28741079 28103380 28083824 28059878 28424195 27849152 28206898 27882118 27497915 27199195
3067 27199195 26864266 26378970 26283450 25824864 25611636 25964804 26095300 26690284 26340136 26264630
3057 26264630 26571416 26230179 26045227 25612457 25405322 25089826 25824169 25940708 25510450
3048 25510450 25646208 25824148 26414266 27071671 27697304 26664418 25762930 25210569 25271003
$$ packed form
3114E4735039j901554j741661q46150q85095j911101r52394m14090n31633M94457
3105D6045818R64071K50180M33250k37179m77769j351878q52813p12865j037895
3096D3022920j403645j632986l75435j840k6450p37906p4240M80838R1727q10124
3086C8532859j414322r20233j654611q51515j885898j333725M68554l76087j284762
3077B9280260n39181o37699j9556k3946L64317n75043L57746l24780l84203k98720
3067B7199195l34929m85296r5520m58586k13228L53168J30496N94984l50148p5506
3057B6264630L06786l41237j84952m32770k07135l15496P34343J16539m30258
3048B5510450J35758J77940N90118O57405O25633j032886r01488n52361O0434
$$ plain form
3039 25271003 23512662 23107313 23415772 23339072 22647055 21800949 21592002 20900886 21104806
3030 21104806 21674706 20776141 21454352 21105859 20267177 20321283 19447681 19425079 18430848 17085967
3020 17085967 17545978 17851736 17689554 17473348 17575557 16334194 16026095 16145172 15829160
3011 15829160 16656998 17432414 16270114 16303972 15875366 14933850 15227757 14814079 14746733 14116887
3001 14116887 13413982 13173332 13312772 13343424 13102892 12465086 12254511 13144171 13347265 12503435
2991 12503435 12030459 11648715 10935365 10146401 10295180 10414682 11661906 11342657 10326061
2982 10326061 9652809 9437490 9289872 9652100 9878923 10232502 10214677 9533653 9770341 9752335
2972 9752335 9993057 9265910 9220544 9563934 9300321 10317537 10353530 9551107 9674468 9302520
$$ packed form
3039B5271003j758341m05349L08459p6700o92017q46106k08947o91116K03920
3030B1104806N69900q98565O78211l48493q38682N4106q73602k2602r94231j344881
3020A7085967M60011L05758j62182k16206J02209j241363l08099J19077l16012
3011A5829160Q27838P75416j162300L3858m28606r41516K93907m13678o7346o29846
3001A4116887p02905k40650J39440L0652k40532o37806k10575Q89660K03094q43830
2991A2503435m72976l81744p13350p88964J48779J19502J247224l19249j016596
2982A0326061o73252k15319j47618L62228K26823L53579j7825o81024K36688j8006
2972I752335K40722p27147m5366L43390k63613J017216L5993q02423J23361l71948
$$ plain form
2962 9302520 9731724 9611269 8743180 8328435 7263502 8186554 8285604 7339005 7628993 7828259
2952 7828259 8608388 8278596 7302113 7029329 7374016 8232045 8589484 7970827 8665407 8972402
2942 8972402 9300970 9343730 9494548 9785436 10582923 12025438 12509912 12415795 13533374 14353365
2932 14353365 15064485 14771074 13627138 13248867 12721018 12115183 11796439 11038827 11263526
2923 11263526 11122119 10288959 10687997 9962254 10229905 10673021 9686998 9897289 9117442
2914 9117442 9250022 9918228 10120409 9928807 10117074 10816805 10801439 11004000 11045669 11802241
2904 11802241 12502506 13118848 13069569 13560305 13874761 13390780 12404036 11574148 11001575 10315241
2894 10315241 9280174 9169870 8619841 8798740 8961941 8570643 8175270 8199715 7756980
$$ packed form
2962I302520M29204j20455q68089m14745j064933R23052R9050r46599K89988J99266
2952G828259P80129l29792r76483k72784L44687Q58029L57439o18657O94580L06995
2942H972402L28568M2760J50818K90888P97487J442515M84474r4117J117579Q19991
2932A4353365P11120k93411j143936l78271n27849o05835l18744p57612K24699
2923A1263526j41407q33160L99038p25743K67651M43116r86023K10291p79847
2914I117442J32580O68206K02181j91602J88267O99731j5366K02561M1669P56572
2904A1802241P00265O16342m9279M90736L14456m83981r86744q29888n72573o86334
2894A0315241j035067j10304n50029J78899J63201l91298l95373K4445m42735
$$ plain form
2885 7756980 8008982 7826790 7677773 6380498 5998009 6285097 5359917 5419998 5650202 5329417
2875 5329417 5705792 4977464 4608725 5931428 6379673 6267465 5762621 5359372 5514750
2866 5514750 5540958 5720998 5417574 4909344 4677322 4788673 5237994 4854950 4567141 5030848
2856 5030848 4680271 4310305 4107835 3867715 4496451 5069080 4743568 3992657 4127930 4695450
2846 4695450 4307571 4091453 3403291 3416141 3787970 3290812 3900274 4266927 5184187 4624085
2836 4624085 3884965 3333550 3647222 3460587 3410044 3572101 2970674 3133986 3575854 2515299
2826 2515299 3562204 3290992 2891459 3228599 3156104 2896390 3269807 2714184 3353917 3095608
2816 3095608 2264457 2026131 2293319 2936991 2935272 3425069 3237347 2849079 3442812 3231660
$$ packed form
2885G756980K52002j82192j49017j297275l82489K87088r25180O0081K30204l20785
2875E329417L76375p28328l68739J322703M48245j12208n04844m03249J55378
2866E514750K6208J80040l03424n08230k32022J11351M49321l83044k87809M63707
2856E030848l50577l69966k02470k40120O28736N72629l25512p50911J35273N67520
2846D695450l87879k16118o88162J2850L71829m97158O09462L66653R17260n60102
2836D624085p39120n51415L13672j86635n0543J62057o01427J63312M41868j060555
2826B515299J046905k71212l99533L37140p2495k59714L73417n55623O39733k58309
2816C095608q31151k38326K67188O43672j719M89797j87722l88268N93733k11152
$$ plain form
2806 3231660 3051703 2736978 2966596 3373748 2316999 2564068 2428528 2539392 3193530
2797 3193530 2460702 2200753 2979526 2640865 3019331 2766791 2986038 2575455 2176496 2344481
2787 2344481 3330321 3012679 2722055 2193876 1798331 1801905 1954056 1334129 2307172 2486019
2777 2486019 2635651 2906944 2536599 2779783 3040520 2592088 2584206 3048024 2437366 2049484
2767 2049484 1495301 546212 1005021 711998 1111249 1553548 2034140 1959275 1424718 1717316
2757 1717316 2042436 2083368 1516830 1366421 927981 1414816 1733598 1073169 873321 946494
2747 946494 -17946 980929 1199671 1420560 1739422 2145286 1933722 1730204 1822357 1828457
2737 1828457 1516857 788748 1037564 1526450 1769987 1911080 2112745 1716710 1247472 1947942
$$ packed form
2806C231660j79957l14725K29618M07152j056749K47069j35540J10864O54138
2797C193530p32828k59949P78773l38661L78466k52540K19247m10583l98959J67985
2787B344481R85840l17642k90624n28179l95545L574J52151o19927R73043J78847
2777B486019J49632K71293l70345K43184K60737m48432p882M63818o10658l87882
2767B049484n54183r49089M58809k93023L99251M42299M80592p4865n34557K92598
2757A717316L25120M0932n66538j50409m38440M86835L18782o60429j99848P3173
2747I46494r64440R98875K18742K20889L18862M05864k11564k03518R2153O100
2737A828457l11600p28109K48816M88886K43537J41093K01665l96035m69238P00470
$$ plain form
2727 1947942 1043788 1498725 1849815 1753020 1962121 1612822 1717519 1023279 2183718 2370736
2717 2370736 2460133 2172297 2301746 2115965 1916149 1270068 1481758 1541278 1867152 1813660
2707 1813660 1273683 2009427 2214536 2011069 1165053 1370093 1417016 2043945 2263781 2167262
2697 2167262 1414111 1191858 1146191 877782 1435276 1561929 597368 748247 839173 744489
2687 744489 1098516 711373 1196542 1339307 1229321 1052918 1462738 2244641 1756433 2156888
2677 2156888 2064453 1513933 1088111 995559 661413 215027 586596 750142 1158289 2157306
2667 2157306 1864588 1492119 909910 1382769 1917521 919766 396110 364728 275958 663376
2657 663376 420607 220859 530170 515852 1248054 1651252 857017 1930542 1576404 1584264
$$ packed form
2727A947942r04154M54937L51090r6795K09101l49299J04697o94240J160439J87018
2717B370736Q9397k87836J29449j85781j99816o46081K11690N9520L25874n3492
2707A813660n39977P35744K05109k03467q46016K05040M6923O26929K19836r6519
2697B167262p53151k22253m5667k68409N57494J26653r64561J50879R0926r4684
2687G44489L54027l87143M85169J42765j09986j76403M09820P81903m88208M00455
2677B156888r2435n50520m25822r2552l34146m46386L71569J63546M08147R99017
2667B157306k92718l72469n82209M72859N34752r97755n23656l1382q8770L87418
2657F63376k42769j99748L09311j4318P32202M03198p94235J073525l54138P860
$$ plain form
2647 1584264 985028 289678 1244204 1310500 1458034 557268 371566 701041 752122 1112319
2637 1112319 2031218 2012705 2399778 2063250 1935246 2648422 1820397 1861467 1636986 1499090
2627 1499090 2365445 1603599 1820513 990650 678466 309316 297924 1595378 1480889 856853
2617 856853 590220 684207 1129858 1425345 1004210 1261240 1951938 1490212 653734 419018
2607 419018 875569 505579 1092156 1829403 1150001 2039019 1802234 718742 937375 962535
2597 962535 1154786 1129163 732604 268988 492932 289384 565553 836880 1142860 1232268
2587 1232268 873160 1170650 694022 917161 136853 1047557 1316563 752067 759528 373228
2577 373228 543086 263351 269160 700042 1225440 1211924 1617525 821141 1140318 1961274
$$ packed form
2647A584264n99236o95350R54526O6296J47534r00766j85702L29475N1081L60197
2637A112319R18899j8513L87073l36528j28004P13176q28025M1070k24481j37896
2627A499090Q66355p61846K16914q29863l12184l69150j1392J297454j14489o24036
2617H56853k66633R3987M45651K95487m21135K57030O90698m61726q36478k34716
2607D19018M56551l69990N86577P37247o79402Q89018k36785j083492K18633K5160
2597I62535J92251k5623l96559m63616K23944k03548K76169K71327L05980Q9408
2587A232268l59108K97490m76628K23139p80308R10704K69006n64496P461l86300
2577C73228J69858k79735N809M30882N25398j3516M05601p96384L19177Q20956
$$ plain form
2567 1961274 992064 944804 1449525 1419099 1759554 -246424 481620 1389922 1498289 1119570
2557 1119570 915884 985759 759735 1612150 779600 -113442 836438 1071112 827763 1150638
2547 1150638 1239058 866675 1263704 1899353 2126565 1911222 1894143 2102192 1557637 825933
2537 825933 452455 1285884 2063618 2003528 829524 839581 937352 1116448 377113 -486379
2527 -486379 24081 1129353 1115913 1327744 964195 920455 1744355 1941389 1366564 1589641
2517 1589641 2576186 1647480 1223219 1025720 835658 1102843 1905125 1612345 991499 1040647
2507 1040647 992687 1848391 1622320 1161791 1462033 2365866 1731795 1142028 1602776 806544
2497 806544 1284795 2152525 1646919 1433644 1683576 2245297 2214233 974334 1177353 1961557
$$ packed form
2567A961274r69210m7260N04721l0426L40455k005978P28044R08302J08367l78719
2557A119570k03686O9875k26024Q52415q32550q93042R49880K34674k43349L22875
2547A150638Q8420l72383L97029O35649K27212k15343j7079K08049n44555p31704
2537H25933l73478Q33429P77734o0090j174004J0057R7771J79096p39335q63492
2527d86379N10460J105272j3440K11831l63549m3740Q23900J97034n74825K23077
2517A589641R86545r28706m24261j97499j90062K67185Q02282k92780o20846M9148
2507A040647m7960Q55704k26071m60529L00242R03833o34071n89767M60748p96232
2497H06544M78251Q67730n05606k13275K49932N61721l1064j239899K03019P84204
$$ plain form
2487 1961557 2587378 2993491 2091668 1799708 2257245 2515372 1799603 1726359 1828265 2517471
2477 2517471 2482135 2643985 2445901 1962031 2273244 2580621 2336311 2298629 3278347 2427375
2467 2427375 1712765 2739690 2718758 2354490 2084578 1669655 683740 968957 1450521 2076068
2457 2076068 2247085 2170147 2281346 2501583 2510087 2652387 2065465 2454560 2762654 2312740
2447 2312740 1511566 1978141 2835124 2461292 2296853 1767625 2008685 2716795 2818987 2525108
2437 2525108 2223958 2686596 2832511 2289185 2303002 2190320 2321517 2184497 1926859 1870438
2427 1870438 1642913 2054793 3176499 2526275 2374407 2816825 3046418 3491967 3617895
2418 3617895 2512530 2161296 2774217 2018719 2191821 2565366 2785822 4105646 3704559
$$ packed form
2487A961557O25821M06113r01823k91960M57537K58127p15769p3244J01906O89206
2477B517471l5336J61850j98084m83870L11213L07377k44310l7682R79718q50972
2467B427375p14610J026925k0932l64268k69912m14923r85915K85217M81564O25547
2457B076068J71017p6938J11199K20237Q504J42300n86922L89095L08094m49914
2447B312740q01174M66575Q56983l73832j64439n29228K41060P08110J02192k93879
2437B525108l01150M62638J45915n43326J3817j12682J31197j37020k57638n6421
2427A870438k27525M11880J121706o50224j51868M42418K29593M45549J25928
2418C617895j105365l51234O12921p55498J73102L73545K20456J319824m01087
$$ plain form
2409 3704559 3259003 3061274 4432736 4569911 4776697 4173408 4334261 5065809 5154406 5271747
2399 5271747 5411065 5041043 5674348 6032866 5765041 6063961 6932485 7571321 8353209 8370411
2389 8370411 8328503 8402333 8070962 9061172 10416354 11618718 14433030 17770786 20757744
2380 20757744 23396930 24341821 25247378 25322926 26666935 27673577 30276368 35287097 42223818
2371 42223818 52252374 66552860 91587616 140350468 216058099 309367583 383785012
2364 383785012 377561113 312889976 249993048 192691920 142554146 108104885 85326239
2357 85326239 69067131 56742717 47234172 41085321 36645137 34485860 33296508 31668713
2349 31668713 28934072 24812552 20298425 18724826 18588872 18249399 17632065 15492361 13518113
$$ packed form
2409C704559m45556j97729J371462J37175K06786o03289J60853P31548Q8597J17341
2399E271747J39318l70022O33305L58518k67825K98920Q68524O38836P81888J7202
2389H370411m1908P3830l31371R90210J355182J202364K814312L337756K986958
2380B0757744K639186R44891R05557P5548J344009J006642K602791N010729O936721
2371D2223818J0028556J4300486K5034756M8762852P5707631R3309484P4417429
2364C83785012o223899o4671137o2896928n7301128n0137774l4449261k2778646
2357H5326239j6259108j2324414r508545o148851m440184k159277j189352j627795
2349C1668713k734641m121520m514127j573599j35954l39473o17334k139704j974248
$$ plain form
2340 13518113 12103413 11950462 12846071 12111555 11027720 10618449 9578778 8458178 8324212
2331 8324212 8037374 8613030 9025991 7917459 7844764 7609989 8263354 7893653 7116839 6969347
2321 6969347 6765972 6866631 7026926 6966987 5558351 5834576 5505090 4485820 5542094
2312 5542094 5914532 5088346 5157867 3860780 3841802 4055056 3740282 3815228 2833847 2505253
2302 2505253 2488972 2453751 2060083 2396750 2041904 1458053 1666044 2459229 2427960 2286349
2292 2286349 2418859 2773445 2284498 1628507 1824447 1779856 1366201 1231780 1517657 2146796
2282 2146796 2478084 1955683 1406642 1536637 1831049 1362119 1984291 2098466 1194875 491940
2272 491940 351040 359721 1116705 1477651 1131990 1457461 1056081 1366802 691789 -25829
$$ packed form
2340A3518113j414700j52951Q95609p34516j083835m09271j039671j120600j33966
2331H324212k86838N75656M12961j108532p2695k34775O53365l69701p76814j47492
2321F969347k03375J00659J60295n9939j408636K76225l29486j019270J056274
2312E542094L72438q26186O9521j297087j8978K13254l14774P4946r81381l28594
2302B505253j6281l5221l93668L36667l54846n83851K07991P93185l1269j41611
2292B286349J32510L54586m88947o55991J95940m4591m13655j34421K85877O29139
2282B146796L31288n22401n49041J29995K94412m68930O22172J14175r03591p02935
2272D91940j40900Q681P56984L60946l45661L25471m01380L10721o75013p17618
$$ plain form
2262 -25829 755386 1144321 998100 466784 1572848 817057 352379 358562 529141 776562
2252 776562 1823031 1803258 1851424 1865447 957866 1095520 1284902 1151650 1481463 988393
2242 988393 603929 801491 955906 844377 1037210 1110427 1105126 1015032 521863 153420
2232 153420 -193713 946459 271704 141741 101519 582127 194817 171345 373538 -548021
2222 -548021 -313794 216379 168127 169871 1339310 1732142 1548977 1306904 877486 730712
2212 730712 612735 713435 994822 518939 82471 447049 684367 336792 1321407 1199809
2202 1199809 50892 51116 -172161 733904 752177 417325 263417 -558737 -37969 318467
2192 318467 -9013 -215580 -264978 -378317 985068 913197 779072 774336 1050940 1169080
$$ packed form
2262b5829P81215L88935j46221n31316J106064p55791m64678O183J70579K47421
2252G76562J046469j9773M8166J4023r07581J37654J89382j33252L29813m93070
2242I88393l84464J97562J54415j11529J92833P3217n301r0094m93169l68443
2232A53420l47133J140172o74755j29963m0222M80608l87310k3472K02193r21559
2222e48021K34227N30173m8252J744J169439L92832j83165k42073m29418j46774
2212G30712j17977J00700K81387m75883m36468L64578K37318l47575R84615j21598
2202A199809j148917K24k23277R06065J8273l34852j53908q22154N20768L56436
2192C18467l27480k06567m9398j13339J363385p1871j34125m736K76604J18140
$$ plain form
2182 1169080 781018 454931 -607441 -323369 -31099 95264 -242445 -351655 374700
2173 374700 485192 -911285 -820203 -926128 -664476 -415553 -521495 -200461 -200316 -266175
2163 -266175 1251809 245184 -395971 -8973 69786 281779 1232021 764708 338536 156174
2153 156174 99396 408610 -390822 -410301 356985 656461 593229 541322 501395 967876 1092228
2142 1092228 1201776 579145 992018 870344 527181 1101043 635615 122561 216380 164540
2132 164540 -283289 -460955 195125 -121440 -664319 -101823 431189 663048 361155 755764
2122 755764 903767 623393 508777 -439336 -485138 -216296 -208492 7833 161518 -118889
2112 -118889 515102 -668837 -43967 377089 -525896 107536 -400456 650030 1087717
$$ packed form
2182A169080l88062l26087j062372K84072K92270J26363l37709j09210P26355
2173C74700J10492j396477R1082j05925K61652K48923j05942L21034J45o5859
2163b66175J517984j006625o41155L86998P8759K11993R50242m67313m26172j82362
2153A56174n6778L09214p99432j9479P67286K99476o3232n1907l9927M66481J24352
2142A092228J09548o22631M12873j21674l43163N73862m65428n13054R3819n1840
2132A64540m47829j77666O56080l16565n42879N62496N33012K31859l01893L94609
2122G55764J48003k80374j14616r48113m5802K68842P804K16325J53685k80407
2112a18889O33991j183939O24870M21056r02985O33432n07992J050486M37687
$$ plain form
2103 1087717 119930 44034 798089 637455 561703 -100451 752521 1248981 1276011 897216
2093 897216 711630 1074499 400696 415262 388712 257201 1179378 1224900 247039 219296
2083 219296 -16903 576860 1036623 813797 613725 -492438 -314291 311284 -170961 -176442
2073 -176442 -660799 206522 1003054 631603 35625 485886 171693 -123859 -186951 -22478
2063 -22478 -70428 327592 -37777 -134513 -1642955 -412364 204946 243149 123000 -207516
2053 -207516 -13696 830652 706116 271887 731515 488730 438094 39593 -311412 -326828
2043 -326828 173229 -29651 -305984 -600512 -178890 82383 -341272 -597951 -458249 -678096
2033 -678096 -425252 808061 200479 19063 -759219 -695051 -884596 -1994266 -729716
$$ packed form
2103A087717r67787p5896P54055j60634p5752o62154Q52972M96460K7030l78795
2093H97216j85586L62869o73803J4566k6550j31511R22177M5522r77861k7743
2083B19296k36199N93763M59763k22826k00072j106163J78147O25575m82245n481
2073a76442m84357Q67321P96532l71451n95978M50261l14193k95552o3092J64473
2063b2478m7950L98020l65369r6736j508442J230591O17310L8203j20149l30516
2053b07516J93820Q44348j24536m34229M59628k42785n0636l98501l51005j5416
2043c26828N00057k02880k76333k94528M21622K61273m23655k56679J39702k19847
2033f78096K52844J233313o07582j81416p78282O4168j89545j109670J264550
$$ plain form
2024 -729716 -195470 -15301 -565025 -331223 367222 813817 237230 215317 -537300 -120754
2014 -120754 -63447 -124858 -167561 -248962 -623349 -985122 -1259692 -950637 -606628 50688
2004 50688 -995551 -1264569 -793111 -1014048 -343596 -407176 -299047 -46553 -290203 820773
1994 820773 -156573 -485084 -457836 -449446 -91740 753132 553584 573786 618217 -242552 -658966
1983 -658966 -421460 29028 151099 678316 -736308 -851237 20074 300651 234617 50540
1973 50540 -348260 130914 -178322 -282534 -207405 299720 -26832 -500056 -203021 403421
1963 403421 733833 -103428 -884922 -780895 -782409 -147287 -270163 215300 644043 -426123
1953 -426123 -355164 721584 -436923 -484375 -355316 -588254 103842 -249216 -494436 18943
$$ packed form
2024g29716N34246J80169n49724K33802O98445M46595n76587k1913p52617M16546
2014a20754N7307o1411m2703q1401l74387l61773k74570L09055L44009O57316
2004E0688j046239k69018M71458k20937O70452o3580J08129K52494k43650J110976
1994H20773r77346l28511K7248Q390L57706Q44872j99548K0202M4431q60769m16414
1983f58966K37506M50488J22071N27217j414624j14929Q71311K80577o6034j84077
1973E0540l98800M79174l09236j04212P5129N07125l26552m73224K97035O06442
1963D03421L30412q37261p81494J04027j514O35122j22876M85463M28743j070166
1953d26123P0959J076748j158507m7452J29059k32938O92096l53058k45220N13379
$$ plain form
1943 18943 33729 -158096 234048 365639 807306 978363 260184 -64811 761037 236663
1933 236663 -359978 -1033565 -971971 -643054 -772780 -255202 -275142 -234657 765028 -105444
1923 -105444 -21303 631547 118814 362494 174469 -173819 276324 140591 36360 729686
1913 729686 399972 -938333 -560440 -565209 -313682 448314 -55211 321914 -222861 -413757
1903 -413757 -1172970 -325739 -72693 -300433 -478912 -502120 -263498 312759 315119 -141184
1893 -141184 -358937 53124 659361 696580 21243 -6520 2623 -860193 -1083731 -538663
1883 -538663 403820 -158416 -96927 51075 -478827 -323890 152949 348228 1461594 1522548
1873 1522548 1375622 344849 273144 237859 -253927 -652982 -330060 -213778 -86392 244
$$ packed form
1943A8943J4786j91825L92144J31591M41667J71057p18179l24995Q25848n24374
1933B36663n96641o73587O1594L28917j29726N17578j9940M0485R99685q70472
1923a05444Q4141O52850n12733K43680j88025l48288M50143j35733j04231O93326
1913G29686l29714j338305L77893m769K51527P61996n03525L77125n44775j90896
1903d13757p59213Q47231K53046k27740j78479k3208K38622N76257K360m56303
1893a41184k17753M12061O06237L7219o75337k7763R143q62816k23538N45068
1883e38663R42483n62236O1489J48002n29902J54937M76839J95279J113366O0954
1873A522548j46926j030773p1705l5285m91786l99055L22922J16282J27386Q6636
$$ plain form
1863 244 -728656 -577640 -918598 -1580804 -797187 -668248 -266793 105922 -21187 195924
1853 195924 -146409 -194728 20118 416200 878901 300832 404408 635032 485749 1040627
1843 1040627 302017 -5197 -287396 -414016 -248306 -1078780 -1246000 -923328 -1002821 -773139
1833 -773139 -615321 -412267 203205 -172262 -501094 52719 348693 493358 455227 316563
1823 316563 527033 163761 -133376 169671 -193613 -679260 -1162021 -530518 -709513 -629271
1813 -629271 -274008 -488272 255557 -739618 -727742 -359970 -195072 158240 -510322 -497424
1803 -497424 44600 23960 -74247 -106487 -616506 -966684 -1081826 -54159 -177474 -317920
1793 -317920 -262847 -1083901 -853629 -631739 -234474 84253 -55746 17478 -584731 -1333377
$$ packed form
1863B44p28900J51016l40958o62206P83617J28939M01455L72715j27109K17111
1853A95924l42333m8319K14846L96082M62701n78069J03576K30624j49283N54878
1843A040627p38610l07214k82199j26620J65710q30474j67220L22672p9493K29682
1833g73139J57818K03054O15472l75467l28832N53813K95974J44665l8131j38664
1823C16563K10470l63272k97137L03047l63284m85647m82761O31503j78995Q0242
1813f29271L55263k14264P43829r95175J1876L67772J64898L53312o68562J2898
1803d97424N42024k0640r8207l2240n10019l50178j15142J027667j23315j40446
1793c17920N5073q21054K30272K21890L97265L18727j39999P3224o02209p48646
$$ plain form
1783 -1333377 -57652 167211 538758 792129 -376895 319317 143382 125436 -224802
1774 -224802 -144243 -212526 -595253 -801798 -766254 -1261019 -949888 -1436181 -1529935 -768407
1764 -768407 -683209 321930 616210 -440467 -156239 -310774 -166260 824457 732903 299355
1754 299355 172013 -565561 -322250 -732668 -796096 -1096266 37594 449516 -248120 -32704
1744 -32704 101495 454097 -21057 -410958 -299232 298820 952847 286756 -98495 8077
1734 8077 -443132 -1235344 -1248470 -729905 -259696 166641 -865229 -1205947 -1060742 -1276257
1724 -1276257 -630063 191951 179370 944302 -107461 191606 -458800 -708166 -524308 -269220
1714 -269220 777465 802571 -342633 442078 -43039 -429679 -699672 -639810 -290895 749624
$$ packed form
1783a333377J275725K24863L71547K53371j169024O96212j75935j7946l50238
1774b24802Q0559o8283l82727k06545L5544m94765L11131m86293r3754P61528
1764g68407Q5198J005139K94280j056677K84228j54535J44514R90717r1554m33548
1754B99355j27342p37574K43311m10418o3428l00170J133860M11922o97636K15416
1744c2704J34199L52602m75154l89901J11726N98052O54027o66091l85251J06572
1734H077m51209p92212j3126N18565M70209M26337j031870l40718J45205k15515
1724a276257O46194Q22014j2581P64932j051763K99067o50406k49366J83858K55088
1714b69220J046685K5106j145204P84711m85117l86640k69993N9862L48915J040519
$$ plain form
1704 749624 -342487 -982280 -1714063 -1401038 -1484950 -766569 -692016 -538478 48258 42221
1694 42221 222401 718731 -231621 -680049 467303 288757 577942 440399 651250 549807
1684 549807 -637031 -399875 1047254 133346 131673 -505955 -1349501 -1096481 -1062735 -1226931
1674 -1226931 518391 361538 -628277 -826669 -546597 -491481 -320800 -582603 20826 346598
1664 346598 227268 -69552 762351 440964 504299 -96916 -672356 -137004 569934 746689
1654 746689 -64688 -824785 -330196 -826273 -1166553 -342970 -350493 -283039 -711034 -1160281
1644 -1160281 428517 739175 490047 161226 -1148417 -750721 -986447 -680530 -816605
1635 -816605 -695710 -705542 -547887 150383 -605452 281168 -151033 -804126 -266243 -720476
$$ packed form
1704G49624j092111o39793p31783L13025q3912P18381P4553J53538N86736o037
1694D2221J80180M96330r50352m48428J147352j78546K89185j37543K10851j01443
1684E49807j186838K37156J447129r13908j673o37628q43546K53020L3746j64196
1674a226931J745322j56853r89815j98392K80072N5116J70681k61803O03429L25772
1664C46598j19330k96820Q31903l21387O3335o01215n75440N35352P06938J76755
1654G46689q11377p60097M94589m96077l40280Q23583p523O7454m27995m49247
1644a160281J588798L10658k49128l28821j309643L97696k35726L05917j36075
1635h16605J20895r832J57655O98270p55835Q86620m32201o53093N37883m54233
$$ plain form
1625 -720476 -106251 448517 171847 239315 -256960 -1548084 -1096624 -351836 376523 146114
1615 146114 -173121 23500 -633142 -386527 -399184 -833998 -429715 92811 -92937 -714547
1605 -714547 -220364 -130692 71007 -213209 -382792 -40705 358979 501170 -304880 -923779
1595 -923779 7845 114854 359267 -211478 278771 743490 -240179 -665265 -157478 -531506
1585 -531506 -673932 -271038 -1231667 -476069 -513821 -374019 -548246 -227024 564970 -14525
1575 -14525 666259 310720 -254777 441933 146801 252403 216357 339768 -373514 -883780
1565 -883780 -816024 -368414 -729536 -72891 513746 535891 -664778 -736361 -129705 -325389
1555 -325389 -679657 -439657 -31166 -176023 -305377 577652 757924 608051 -178239 -1030257
$$ packed form
1625g20476O14225N54768k76670O7468m96275j291124M51460P44788P28359k30409
1615A46114l19235J96621o56642K46615j2657m34814M04283N22526j85748o21610
1605g14547M94183Q9672K01699k84216j69583L42087L99684J42191q06050o18899
1595i23779R31624J07009K44413n70745M90249M64719r83669m25086N07787l74028
1585e31506j42426M02894r60629P55598l7752J39802j74227L21222P91994n79495
1575a4525O80784l55539n65497O96710k95132J05602l6046J23411p13282n10266
1565h83780O7756M47610l61122O56645N86637K2145j200669p1583O06656j95684
1555c25389l54268K40000M08491j44857j29354Q83029J80272j49873p86290q52018
$$ plain form
1545 -1030257 -599285 -1303380 -941158 -1067207 -1089634 -362214 16258 -575727 -431204 -788815
1535 -788815 -350500 185589 -9260 -169675 277932 212774 247197 7353 -436924 -572483
1525 -572483 -524835 107469 200354 -170314 41808 -179700 -337712 -310530 16085 -32475
1515 -32475 295828 -17342 -777360 11670 6511 -281866 173895 371301 392396 162362
1505 162362 -19921 313232 -672230 242532 48282 -393715 -152638 -843811 -698773 -192945
1495 -192945 -290270 -348174 -209193 177211 110098 -187648 -198051 -288975 -371506 -66096 -154456
1484 -154456 -130177 -414607 -831828 -1044982 -1381821 -1110585 -827426 -228858 -426871 -352031
1474 -352031 -529324 -662945 -591159 -153271 -339911 -645368 -186180 -103189 -539676 -610148
$$ packed form
1545a030257M30972p04095L62222j26049k2427P27420L78472n91985J44523l57611
1535g88815M38315N36089j94849j60415M47607o5158L4423k39844m44277j35559
1525e72483M7648O32304R2885l70668K12122k21508j58012K7182L26615m8560
1515c2475L28303l13170p60018P89030n159k88377M55761J97406K1095k30034
1505A62362j82283L33153r85462R14762j94250m41997K41077o91173J45038N05828
1495a92945r7325n7904J38981L86404o7113k97746j0403r0924q2531L05410q8360
1484a54456K4279k84430m17221k13154l36839K71236K83159N98568j98013P4840
1474c52031j77293j33621P1786M37888j86640l05457M59188Q2991m36487p0472
$$ plain form
1464 -610148 -1065259 -336931 -187370 -643089 -419106 -148863 -589112 -546094 -270769 -48413
1454 -48413 26542 -260512 -228694 -570828 -946063 -1387786 -648387 -207075 -465 187161
1444 187161 -888433 -159284 312845 -509639 56913 -112997 -891456 122422 130189 88396
1434 88396 -106436 -747677 -900570 -543368 -740585 -159485 178579 -858441 -226328 -251853
1424 -251853 -460459 255917 579449 -422941 -902401 -793275 -514117 -462803 -437183 -129961
1414 -129961 -276509 -468002 -704538 -1239135 -277871 -124924 -562993 -1054326 -441345 23551
1404 23551 -193979 -221830 -583547 -643399 -384833 3897 -257143 -716184 -179168 -65633
1394 -65633 125898 248897 211361 242796 -138190 520 -377414 -408501 123085 -364694
$$ packed form
1464f10148m55111P28328J49561m55719K23983K70243m40249M3018K75325K22356
1454d8413P4955k87054L1818l42134l75235m41723P39399M41312K06610J87626
1444A87161j075594P29149M72129q22484N66552j69910p78459J013878P767m1793
1434H8396j94832o41241j52893L57202j97217N81100L38064j037020O32113k5525
1424b51853k08606P16376L23532j002390m79460J09126K79158N1314K5620L07222
1414a29961j46548j91493k36536n34597R61264J52947m38069m91333O12981M64896
1404B3551k17530k7851l61717n9852K58566L88730k61040m59041N37016J13535
1394f5633J91531J22999l7536L1435l80986J38710l77934l1087N31586m87779
$$ plain form
1384 -364694 -155468 -446881 -635751 129512 252637 -139560 -478053 -850452 506979 305573
1374 305573 -19290 162976 -871704 127211 898680 179221 -762682 -754451 -610085 -206238
1364 -206238 779258 480611 78785 180124 -575609 -399431 -196533 657152 769435 -100570
1354 -100570 -427808 -705151 -855170 -97534 -232976 85835 -458859 -500644 -810840 -1207171
1344 -1207171 -588735 -434018 -344260 17644 -338701 88503 241150 -128289 -312146 -562381
1334 -562381 -426283 -858495 -408463 -694646 -163681 -90744 -436492 -196146 323791 267095
1324 267095 -238103 -710896 19613 706790 143341 415203 466694 -19452 20097 -1190959
1314 -1190959 -462195 -46952 193474 548763 -19372 115383 753269 530892 5912 307740
$$ packed form
1384c64694K09226k91413j88870P65263J23125l92197l38493l72399J357431k01406
1374C05573l24863J82266j034680R98915P71469p19459r41903Q231J44366M03847
1364b06238R85496k98647m01826J01339p55733J76178K02898Q53685J12283q70005
1354a00570l27238k77343j50019P57636j35442L18811n44694m1785l10196l96331
1344a207171O18436J54717Q9758L61904l56345M27204J52647l69439j83857k50235
1334e62381J36098m32212M50032k86183N30965P2937l45748K40346N19937n6696
1324B67095n05198m72793P30509O87177n63449K71862N1491m86146L9549j211056
1314a190959P28764M15243K40426L55289n68135J34755O37886k22377n24980L01828
$$ plain form
1304 307740 956862 1758678 1921037 967827 -74623 -547854 -853976 -1220412 -579672 -495128
1294 -495128 -1079664 -1160834 -1031049 -1038892 -727873 133307 419804 722506 929031 370542
1284 370542 370799 585296 -294768 -381320 -183708 128113 187212 -178669 -1171054 -1056948 -856655
1273 -856655 -898238 -1120513 180601 298813 -152869 -34661 -746962 -463292 300415 -164356
1263 -164356 -309507 -562732 -525203 -572120 -1041085 -1371025 -1709534 -739035 -373016 -404986
1253 -404986 175936 -48878 -220143 287284 336362 832740 -65997 226501 -290753 -753692
1243 -753692 353641 6377 18068 504950 -549025 160683 343029 473501 855624 609131
1233 609131 -16455 -141796 -34418 208054 67597 -763930 -367491 -841764 -596030 -301336
$$ packed form
1304C07740O49122Q01816J62359r53210j042450m73231l06122l66436O40740Q4544
1294d95128n84536q1170J29785p843L11019Q61180K86497L02702K06525n58489
1284C70542K57K14497q80064q6552J97612L11821N9099l65881r92385J14106K00293
1273h56655m1583k22275J301114J18212m51682J18208p12301K83670P63707m64771
1263a64356j45151k53225L7529m6917m68965l29940l38509R70499L66019l1970
1253d04986N80922k24814j71265N07427M9078M96378q98737K92498n17254m62939
1243g53692J107333l47264J1691M86882j053975P09708J82346J30472L82123k46493
1233F09131o25586j25341J07378K42472j40457q31527L96439m74273K45734K94694
$$ plain form
1223 -301336 -312890 -578134 -339922 -390994 -251482 568629 1289879 22975 171922 -506034
1213 -506034 -175996 194256 -440212 -86899 208246 -523754 -506434 -1148049 -776696 -385687
1203 -385687 -731035 -682154 -563489 -303619 -389811 -153583 -371967 -256465 -51938 -155123
1193 -155123 -335856 -1313906 -567559 -319899 -823993 461079 -70859 -418098 -311767 -357083
1183 -357083 -371806 -144131 -728091 -172310 113248 -598058 -1253160 -964643 -482929 195421
1173 195421 -250551 -582537 268950 -347974 -581940 -492414 -454728 633104 994914 358590
1163 358590 189929 -544263 -125089 -100068 -821055 325185 588055 968778 1093762 469820
1153 469820 -130319 -362635 337827 823094 784053 905444 1237940 554091 210141 -719471
$$ packed form
1223c01336j1554k65244K38212n1072J39512Q20111P21250j266904J48947o77956
1213e06034L30038L70252o34468L53313K95145p32000J7320o41615L71353L91009
1203c85687l45348M8881J18665K59870q6192K36228k18384J15502K04527j03185
1193a55123j80733r78050P46347K47660n04094J285072n31938l47239J06331m5316
1183c57083j4723K27675n83960N55781K85558p11306o55102K88517M81714O78350
1173A95421m45972l31986Q51487o16924k33966Q9526L7686J087832L61810o36324
1163C58590j68661p34192M19174K5021p20987J146240K62870L80723J24984o23942
1153D69820o00139k32316P00462M85267l9041J21391L32496o83849l43950r29612
$$ plain form
1143 -719471 -1298317 -837806 192699 -173559 -521703 -818798 -1106514 -349697 191735 94854
1133 94854 108555 513592 317256 852328 -485227 -437318 -63646 67076 435045 24033
1123 24033 -243879 181023 -641999 -1102880 -1558748 -118685 868372 937588 599421 -230501
1113 -230501 -665729 -438287 -606622 -396534 373618 62232 -500144 -161929 -855736 -192381
1103 -192381 381683 -64428 -384253 -70418 441830 316996 569393 655709 -85781 601476
1093 601476 -3525 453287 262471 -398377 -676398 -1014427 -241859 -97714 124156 617975
1083 617975 496429 -40389 187209 -325552 718906 678628 895452 -13664 -258869 56263
1073 56263 100378 -47207 -20747 -104107 -42180 -696882 -1114572 -88540 230219 158691 429255
$$ packed form
1143g19471n78846M60511J030505l66258l48144k97095k87716P56817N41432r6881
1133I4854J3701M05037j96336N35072j337555M7909L73672J30722L67969m11012
1123B4033k67912M24902q23022m60881m55868J440063R87057O9216l38167q29922
1113b30501m35228K27442j68335K10088P70152l11386n62376L38215o93807O63355
1103a92381N74064m46111l19825L13835N12248j24834K52397Q6316p41490O87257
1093F01476o05001M56812j90816o60848k78021l38029P72568J44145K21870M93819
1083F17975j21546n36818K27598n12761J044458m0278K16824r09116k45205L15132
1073E6263M4115j47585K6460q3360O1927o54702m17690J026032L18759p1528K70564
$$ plain form
1062 429255 -318222 839403 628458 570060 -186203 -244705 192655 450693 -106775 54008
1052 54008 -41034 -47721 -788224 -433684 307629 611637 650950 66608 506907 352362 -155112
1041 -155112 -326235 -257156 -36351 -704121 -659109 -177256 -24196 -97338 18011 40606
1031 40606 -136140 -74578 131804 139899 127795 -120207 -764421 -292027 -486813 154071 57629
1020 57629 -499099 -286151 145637 -918726 -323320 656918 426434 595385 562562 78997
1010 78997 110765 -704318 -535052 -323222 101794 457021 237039 -167383 201227 -580281
1000 -580281 -108698 -70635 19654 865505 1433799 1130192 668038 -55886 76721 232839
990 232839 170466 1012741 -260639 -1043007 -1194333 -924330 -674763 164298 117639 1131539
$$ packed form
1062D29255p47477J157625k10945n8398p56263n8502M37360K58038n57468J60783
1052E4008r5042o687p40503L54540P41313L04008L9313n84342M40299j54545n07474
1041a55112j71123O9079K20805o67770M5012M81853J53060p3142J15349K2595
1031D0606j76746O1562K06382Q095j2104k48002o44214M72394j94786O40884r6442
1020E7629n56728K12948M31788j064363N95406R80238k30484J68951l2823m83565
1010G8997L1768q15083J69266K11830M25016L55227k19982m04422L68610p81508
1000e80281M71583L8063R0289Q45851N68294l03607m62154p23924J32607J56118
990B32839o2373Q42275j273380p82368j51326K70003K49567Q39061m6659J013900
$$ plain form
980 1131539 710594 413293 303426 -82040 -116468 1432766 455335 -321259 599715 199588
970 199588 32370 -290634 -1087041 -515693 612655 520671 655907 494168 -46356 -722942
960 -722942 -878659 -253407 288966 195889 585379 -114602 -590873 -671963 -400808 -426275
950 -426275 -675547 -562683 -524651 -736122 -416654 -684546 -380250 -130869 646019 97191
940 97191 402461 741 -508712 165507 -410706 -504788 -410506 60344 -515257 -151864
930 -151864 -803557 -966579 -61423 -106013 508884 353330 708695 831592 -265247 -375744
920 -375744 -117025 -19492 163406 275288 523524 449034 253447 412953 90820 -404611
910 -404611 -258186 -153876 -477292 -138778 -246180 -585979 153106 589077 1014660 446343
$$ packed form
980A131539m20945k97301j09867l85466l4428J549234r77431p76594R20974m00127
970A99588j67218l23004p96407N71348J128348r1984J35236j61739n40524o76586
960g22942j55717O25252N42373r3077L89490o99981m76271q1090K71155k5467
950d26275k49272J12864L8032k11471L19468k67892L04296K49381P76888n48828
940I7191L05270m01720n09453O74219n76213r4082R4282M70850n75601L63393
930a51864o51693j63022R05156m4590O14897j55554L55365J22897j096839j10497
920c75744K58719R7533J82898J11882K48236p4490j95587J59506l22133m95431
910d04611J46425J04310l23416L38514j07402l39799P39085M35971M25583n68317
$$ plain form
900 446343 -160962 -639705 -190063 462592 -349892 -199451 90599 -260831 -128718 -375089
890 -375089 -27344 65384 152898 -231456 -983721 67563 394090 118211 58395 -162002
880 -162002 -25388 -165504 342586 -116895 -494260 -910300 -987169 -219919 122716 30520
870 30520 283625 113948 4420 -360982 -1181603 -664527 -114938 410469 197921 439286
860 439286 163195 -528372 -666682 -669457 -232779 -404789 -633705 -203298 110212 496468
850 496468 -26496 -71177 78200 429449 -17682 -497526 -518402 282043 386652 -113209
840 -113209 -7420 -56255 427979 372142 339838 232436 388296 -94139 -272008 -88175
830 -88175 534608 548056 -156828 -565089 180270 426585 -209162 140036 -27801 271253
$$ packed form
900D46343o07305m78743M49642O52655q12484J50441K90050l51430J32113k46371
890c75089L47745R2728Q7514l84354p52265J051284L26527k75879n9816k20397
880a62002J36614j40116N08090m59481l77365m16040p6869P67250L42635r2196
870C0520K53105j69677j09528l65402q20621N17076N49589N25407k12548K41365
860D39286k76091o91567j38310k775M36678j72010k28916M30407L13510L86256
850D96468n22964m4681J49377L51249m47131m79844k0876Q00445J04609m99861
840a13209J05789m8835M84234n5837l2304j07402J55860m82435j77869J83833
830h8175O22783J3448p04884m08261P45359K46315o35747L49198j67837K99054
$$ plain form
820 271253 -224602 -479998 -635026 -93297 -144087 -1131557 -533126 -336507 -138562 283446
810 283446 403571 987056 3017 -57900 158740 493881 763251 426944 857144 1289959
800 1289959 306385 -56047 -950395 -428974 359907 -235054 -354234 -523071 -501381 363174
790 363174 -99151 83636 83097 599018 583536 81411 -161865 -505871 -57856 -546316 -218562
779 -218562 282567 482963 1099524 791756 -539973 -253921 -172829 359811 322490 -633649
769 -633649 -271457 -88417 320448 -41971 -586557 -477042 -492988 537547 256401 172759
759 172759 399891 -169770 -430050 16820 73217 1087848 180960 -274335 -516721 -295864
749 -295864 470142 929323 259790 -791675 -1204130 -117617 136732 400046 556404 124097
$$ packed form
820B71253m95855k55396j55028N41729n0790r87470N98431J96619J97945M22008
810B83446J20125N83485r84039o0917K16640L35141K69370l36307M30200M32815
800A289959r83574l62432q94348N21421P88881n94961j19180j68837K1690Q64555
790C63174m62325J82787n39N15921j5482n02125k43276l44006M48015m88460L27754
779b18562N01129K00396O16561l07768j331729K86052Q1092N32640l7321r56139
769f33649L62192J83040M08865l62419n44586J09515j5946J030535k81146q3642
759A72759K27132n69661k60280M46870N6397J014631r06888m55295k42386K20857
749b95864P66006M59181o69533j051465m12455J086513K54349K63314J56358m32307
$$ plain form
739 124097 373705 -101864 655186 381824 599771 1203751 331197 -356280 -185966 -20819
729 -20819 408562 -366749 -767939 -475030 676660 1726683 1306596 593747 -368200 -476640
719 -476640 -177704 421141 1034958 177947 63466 936881 173594 387891 940914 1107653
709 1107653 834543 919979 1141274 462115 644342 341121 -473143 -553323 -205264 252736
699 252736 317624 -99987 39529 -118354 17421 -11892 -353595 590978 562847 247726
689 247726 -219545 -150503 420274 -12366 -116887 -512442 -451388 -193001 -480036 -575439
679 -575439 -660197 -140624 407471 -266015 145164 570004 -638572 -526345 -876619 227331
669 227331 726339 220467 -34939 -880199 -1049949 -1090218 -627198 -262069 478223 783069
$$ packed form
739A24097K49608m75569P57050k73362K17947O03980q72554o87477J70314J65147
729b0819M29381p75311m01190K92909J151690J050023m20087p12849r61947j08440
719d76640K98936N98845O13817q57011j14481Q73415p63287K14297N53023J66739
709A107653k73110Q5436K21295o79159J82227l03221q14264q0180L48059M58000
699B52736O4888m17611J39516j57883J35775k9313l41703R44573k8131l15121
689B47726m67271O9042N70777m32640j04521l95555O1054K58387k87035r5403
679e75439q4758N19573N48095o73486M11179M24840j208576J12227l50274J103950
669B27331M99008n05872k55406q45260j69750m0269M63020L65129P40292L04846
$$ plain form
659 783069 151022 84160 199323 503505 -322132 66647 130863 265730 324507 543476
649 543476 -100461 -455227 36357 157685 673529 990810 1221887 280710 -581650 -1018946
639 -1018946 -630366 333089 665187 755337 681151 -61421 -398977 -974528 -258296 442415
629 442415 609419 523697 803920 535333 -28009 -159768 -95673 -324533 195382 222951
619 222951 -97060 69950 -72680 1451 26282 153860 478592 -313729 256003 -60124
609 -60124 230495 -455135 107956 -143491 -72479 227351 40108 -602159 -51848 179498
599 179498 -163204 -157408 -220170 -150110 -644459 397442 183718 -125874 -497815 -351090
589 -351090 194932 -451292 -191576 -190714 -80868 423089 213821 -165420 -51955 382223
$$ packed form
659G83069o32047o6862J15163L04182q25637L88779O4216J34867N8777K18969
649E43476o43937l54766M91584J21328N15844L17281K31077r41177q62360m37296
639a018946L88580R63455L32098R0150p4186p42572l37556n75551P16232P00711
629D42415J67004q5722K80223k68587n63342j31759O4095k28860N19915K7569
619B22951l20011J67010j42630P4131K4831J27578L24732p92321N69732l16127
609f0124K90619o85630N63091k51447P1012K99830j87243o42267N50311K31346
599A79498l42702N796o2762P0060m94349J041901k13724l09592l71941J46725
589c51090N46022o46224K59716Q62J09846N03957k09268l79241J13465M34178
$$ plain form
579 382223 -204694 425975 45521 -640941 132221 692935 347240 -9373 -518755 466624
569 466624 580941 429209 -287564 143056 286358 894454 836810 560751 503097 700435
559 700435 -278964 -205804 1108512 1031172 482925 400585 184245 -400258 -358445 142577
549 142577 54982 261595 473282 448263 840188 1107133 434852 -240156 29251 338662
539 338662 59863 -44717 118814 227771 828536 311653 528042 743540 851949 -6058
529 -6058 -398487 -714063 -153062 -676273 -706210 -828245 -503475 180168 713562 924806
519 924806 316960 -418160 -134771 739204 924193 1019708 342584 121485 778755 -356271
509 -356271 -748541 -183444 -275186 -30377 -109694 -114259 -32431 539783 718622 -305902 106291
$$ packed form
579C82223n86917O30669l80454o86462P73162N60714l45695l56613n09382R85379
569D66624J14317j51732p16773M30620J43302O08096n7644k76059n7654J97338
559G00435r79399P3160J314316p7340n48247q2340k16340n84503M1813N01022
549A42577q7595K06613K11687k5019L91925K66945o72281o75008K69407L09411
539C38662k78799j04580J63531J08957O00765n16883K16389K15498J08409q58007
529f058l92429l15576N61001n23211k9937j22035L24770O83643N33394K11244
519I24806o07846p35120K83389Q73975J84989R5515o77124k21099O57270j135026
509c56271l92270N65097r1742K44809p9317m565Q1828N72214J78839j024524M12193
$$ plain form
498 106291 589383 393430 367158 228217 159643 -115638 378237 597262 792923 747198
488 747198 553137 -597930 -375266 -556498 -66270 1188317 1068440 886812 671185 301598
478 301598 608654 -188866 -122689 -368662 -401666 -135674 397342 -214098 276399 61742
468 61742 217807 974181 864698 1344427 994691 151344 -289454 54582 778665 531530
458 531530 376815 -333144 -206641 148770 -19054 -177143 102684 790933 1251152 1117976
448 1117976 450785 348012 -327441 -100228 -597203 -378033 -35682 131300 216200 412408
438 412408 253986 511919 1182350 907842 241218 705729 686342 734831 1089837 1215073
428 1215073 420995 203284 -159830 -85263 -301935 -298899 -249879 -295494 -235335 405135 -104493
$$ packed form
498A06291M83092j95953k6272j38941o8574k75281M93875K19025J95661m5725
488G47198j94061j151067K22664j81232M90228J254587j19877j81628k15627l69587
478C01598L07056p97520O6177k45973l3004K65992N33016o11440M90497k14657
468F1742J56065P56374j09483M79729l49736q43347m40798L44036P24083k47135
458E31530j54715p09959J26503L55411j67824j58089K79827O88249M60219j33176
448A117976o67191j02773o75453K27213m96975K19170L42351J66982Q4900J96208
438D12408j58422K57933O70431k74508o66624M64511j9387M8489L55006J25236
428A215073p94078k17711l63114P4567k16672L036M9020m5615O0159O40470n09628
$$ plain form
417 -104493 1016269 718543 -407520 -345964 419572 530151 793027 60482 -131099 -244486
407 -244486 -475970 268330 -44338 20761 928477 1361698 117448 463556 1118225 850417
397 850417 -37841 145500 -139138 -667786 -945387 -467441 -591557 -995304 -615690 406169
387 406169 410081 286580 148063 -86811 451073 599771 -133888 629627 559385 673399
377 673399 199498 470700 286250 -375820 -402743 176748 -250658 -163707 158211 111830
367 111830 834666 458983 754496 551468 838776 428012 53205 13644 -331344 -24029
357 -24029 187436 440507 598103 -134156 -561240 -84664 506755 991342 1007445 1101249
347 1101249 914873 943330 1558503 418138 1010745 695500 175369 -686486 -96181 156626
$$ packed form
417a04493J120762k97726j126063O1556P65536J10579K62876p32545j91581j13387
407b44486k31484P44300l12668O5099R07716M33221j244250L46108O54669k67808
397H50417q88258J83341k84638n28648k77601M77946j24116m03747L79614J021859
387D06169L912j23501j38517k34874N37884J48698p33659P63515p0242J14014
377F73399m73901K71202j84450o62070k6923N79491m27406Q6951L21918m6381
367A11830P22836l75683K95513k03028K87308m10764l74807l9561l44988L07315
357b4029K11465K53071J57596p32259m27084M76576N91419M84587J6103R3804
347A101249j86376K8457O15173j140365N92607l15245n20131q61855N90305K52807
$$ plain form
337 156626 -303004 366180 435103 281119 612842 520309 179408 3629 101668 -459613
327 -459613 -277065 999739 566842 50160 -64082 -550679 -473424 -903520 -847422 -584744
317 -584744 -267756 1156 361411 322062 -39546 283466 465021 502607 -300267 324058
307 324058 361678 1696362 943244 1206385 619471 312928 -68614 -707200 -524340 -380060
297 -380060 -466281 519467 1018629 207570 -39051 543153 -200759 -564682 -560044 -816602
287 -816602 -295763 43371 -207279 -417949 298000 466797 86106 -244078 467829 1038443
277 1038443 1558341 966204 417385 1139450 654253 367173 -81312 573208 976728 -67556
267 -67556 -253205 -490624 172824 -658065 221648 733790 -176439 -159768 516982 -11295
$$ packed form
337A56626m59630O69184O8923j53984L31723r2533l40901j75779R8039n61281
327d59613J82548J276804m32897n16682j14242m86597P7255m30096N6098K62678
317e84744L16988K68912L60255l9349l61608L23012J81555L7586q02874O24325
307C24058L7620J334684p53118K63141n86914l06543l81542o38586J82860J44280
297c80060q6221R85748M99162q11059k46621N82204p43912l63923M638k56558
287h16602N20839L39134k50650k10670P15949J68797l80691l30184P11907N70614
277A038443N19898n92137n48819P22065m85197k87080m48485O54520M03520j044284
267f7556j85649k37419O63448q30889Q79713N12142r10229J6671O76750n28277
$$ plain form
257 -11295 162548 -549886 -540973 -291197 280781 210251 -303694 225112 695380 126312 -127983
246 -127983 -161118 172223 1539277 1315930 713945 332258 676726 743809 -5736 -855576
236 -855576 -731920 -145693 281071 266646 -407585 -94002 213637 -67714 106151 12901
226 12901 593600 916968 791277 221876 -165538 -639575 -16782 -159428 -193179 487183
216 487183 809669 977041 58975 398429 -195417 759731 1395917 1299298 1082650 421926
206 421926 34596 -404415 -744422 -263661 194578 815236 876578 695623 158858 517428
196 517428 560866 462675 287524 431534 1099506 1229796 1346642 767828 -744360 -63425
186 -63425 678971 99615 309237 872412 1413790 636890 637969 834656 1052453 1265113
$$ packed form
257a1295J73843p12434Q913K49776N71978p0530n13945N28806M70268n69068k54295
246a27983l3135L33341J367054k23347o01985l81687L44468O7083p49545q49840
236h55576J23656N86227M26764j4425o74231L13583L07639k81351J73865r3250
226A2901N80699L23368j25691n69401l87414m74037O22793j42646l3751O80362
216D87183L22486J67372r18066L39454n93846R55148O36186r6619k16648o60724
206D21926l87330m39011l40007M80761M58239O20658O1342j80955n36765L58570
196E17428M3438r8191j75151J44010O67972J30290J16846n78814j512188O80935
186f3425P42396n79356K09622N63175N41378p76900J079J96687K17797K12660
$$ plain form
176 1265113 1128562 -303603 136023 130756 373446 384289 222972 -738718 -957529 -332629
166 -332629 162661 -853050 -588463 91594 35679 156383 1090147 736182 864857 1046669
156 1046669 479672 -365870 -152230 629209 197704 -519747 -697613 -224541 -60806 -35811
146 -35811 257602 83075 429949 -23957 -41017 888966 950679 515754 546176 482858 556336
135 556336 191730 -755630 -506454 -83221 -7679 36123 1048135 513101 36497 -394791
125 -394791 203503 445571 751084 637586 760834 397467 285358 78254 -78407 283457
115 283457 639318 151553 121989 186239 337764 674469 -143562 -117419 241830 530548
105 530548 266346 249830 592288 133949 668686 459344 572535 1118373 666649 94325
$$ packed form
176A265113j36551j432165M39626n267K42690J0843j61317r61690k18811O24900
166c32629M95290j015711K64587O80057n5915J20704R33764l53965J28675J81812
156A046669n66997q45542K13640P81439m31505p17451j77866M73072J63735K4995
146c5811K93413j74527L46874m53906j7060R29983O1713m34925L0422o3318P3478
135E56336l64606r47360K49176M23233P5542M3802J012012n35034m76604m31288
125c94791N98294K42068L05513j13498J23248l63367j12109k07104j56661L61864
115B83457L55861m87765k9564O4250J51525L36705q18031K6143L59249K88718
105E30548k64202j6516L42458m58339N34737k09342J13191N45838m51724n72324
$$ plain form
95 94325 72707 -223081 -190831 224367 777705 311583 75152 314653 586439 582070 393248
84 393248 -178535 336333 85155 116593 323233 114318 201497 746808 39460 353937
74 353937 291034 68593 378973 -2818 121794 261081 942114 313293 -42316 -495374
64 -495374 -85352 240969 -231175 175458 216094 561983 900411 714607 834346 787243
54 787243 447091 891643 721914 291705 615253 296362 567446 219185 -41904 366487
44 366487 673904 566155 66426 -542876 -67986 -317246 472734 450187 442821 811185 1029360
33 1029360 377708 562363 313821 306877 -245810 500484 439984 869160 1188747 304446
23 304446 80527 -17728 43851 426131 833814 511568 227273 311155 445318 -350176 136880
$$ packed form
95I4325k1618k95788L2250M15198N53338m66122k36431K39501K71786m369j88822
84C93248n71783N14868k51178L1438K06640k08915Q7179N45311p07348L14477
74C53937o2903k22441L10380l81791J24612J39287O81033o28821l55609m53058
64d95374M10022L26321m72144M06633M0636L45889L38428j85804J19739m7103
54G87243l40152M44552j69729m30209L23548l18891K71084l48261k61089M08391
44C66487L07417j07749m99729o09302M74890k49260P89980k2547p366L68364K18175
33A029360o51652J84655k48542o944n52687P46294o0500M29176L19587q84301
23C04446k23919r8255O1579L82280M07683l22246k84295Q3882J34163p95494M87056
$$ plain form
12 136880 563671 447398 463365 -102824 25499 241755 257593 563039 615194 597244 90754
1 90754 416774
0 416774
$$ packed form
12A36880M26791j16273J5967n66189J28323K16256J5838L05446N2155j7950n06490
1I0754L26020
0D16774
$$ Imaginary data points
##PAGE= N=2
##DATA TABLE= (X++(I..I)), XYDATA
$$ plain form
16383 -5853511 -5435647 -5023111 -5379237 -5169657 -5073803 -5157695 -4923818 -4424742 -4573230 -4528036
16373 -4528036 -4284674 -4461657 -4570786 -4789719 -4124712 -4341357 -4107020 -3990680 -3780184
16364 -3780184 -3605144 -3823595 -3588170 -3606024 -3033085 -2864077 -2935186 -3349293 -2872438 -3076665
16354 -3076665 -2857443 -2611751 -2293383 -2314409 -2610366 -2214312 -2860100 -2421959 -1823908 -1953939
16344 -1953939 -1490202 -1397652 -1505204 -1492182 -1380248 -736245 -1200476 -1034663 -886831 -1254402
16334 -1254402 -1130277 -887948 -1021353 -579247 -756995 -1081859 -1376594 -501798 -843735
16325 -843735 -551760 235633 -228153 137392 250918 150651 41794 248497 807827 918817
16315 918817 1043834 836674 242575 777803 719840 636515 1049036 1043088 1341280 1676562
$$ packed form
16383e853511M17864M12536l56126K09580R5854q3892K33877M99076j48488M5194
16373d528036K43362j76983j09129k18933O65007k16645K34337J16340K10496
16364c780184J75040k18451K35425j7854N72939J69008p1109m14107M76855k04227
16354c076665K19222K45692L18368k1026k95957L96054o45788M38141N98051j30031
16344a953939M63737R2550j07552J3022J11934O44003m64231J65813J47832l67571
16334a254402J24125K42329j33405M42106j77748l24864k94735Q74796l41937
16325h43735K91975P87393m63786L65545J13526j00267j08857K06703N59330J10990
16315I18817J25017k07160n94099N35228n7963q3325M12521n948K98192L35282
$$ plain form
16305 1676562 1314048 1160360 1112528 1470065 893931 1243379 1124197 1639290 2117327 1852650
16295 1852650 1319345 1541159 2131815 2521882 2806005 2160747 2254344 2840060 3212797 2966665
16285 2966665 3089973 3407596 3586526 3561407 3339548 3419526 3213691 3244917 3105887 3387648
16275 3387648 3565328 3215243 3230712 3418555 3643661 3101452 3469568 3377204 3996585 4509540
16265 4509540 4216299 4085339 4421503 4431753 4260347 4104691 4601750 5383883 5286443 4836710
16255 4836710 5208540 5269947 4876875 4977763 4886024 5550475 5768657 5243493 5034392 5406963
16245 5406963 5457474 4639550 4933727 5204266 5392152 5138093 5444882 5013102 4926165 5462577
16235 5462577 5706660 5949283 6032711 6176382 6424703 6452717 6061337 5729701 5371517 6389021
$$ packed form
16305A676562l62514j53688m7832L57537n76134L49448j19182N15093M78037k64677
16295A852650n33305K21814N90656L90067K84123o45258R3597N85716L72737k46132
16285B966665J23308L17623J78930k5119k21859P9978k05835L1226j39030K81761
16275C387648J77680l50085J5469J87843K25106n42209L68116r2364O19381N12955
16265D509540k93241j30960L36164J0250j71406j55656M97059P82133r7440m49733
16255D836710L71830O1407l93072J00888r1739O64451K18182n25164k09101L72571
16245E406963N0511q17924K94177K70539J87886k54059L06789m31780q6937N36412
16235E462577K44083K42623Q3428J43671K48321K8014l91380l31636l58184J017504
$$ plain form
16225 6389021 6505360 6142627 5758472 5913608 6792701 6746497 6560809 6289507 6547385 6686261
16215 6686261 6808023 6440940 6695117 6266495 6494037 6700643 6127732 6230228 6146586 6658096
16205 6658096 7234399 6937963 6672046 6870095 6415685 6779890 7164700 7342950 7455322
16196 7455322 7685070 7512142 7738619 7503547 7611835 7921200 7696981 7588629 7248426
16187 7248426 7020394 7944881 7527159 7477286 7764741 7805362 7783506 7623504 7664978 8037112
16177 8037112 8197222 7955199 7789930 8314628 8233530 8020480 7656333 7879743 8065565 8546186
16167 8546186 8079321 7875897 7521492 7757099 8399174 8548068 8892277 8409759 8854193
16158 8854193 8433533 7880955 8250926 8590217 9031673 9668417 9303611 8070405 7577328
$$ packed form
16225F389021J16339l62733l84155J55136Q79093m6204j85688k71302K57878J38876
16215F686261J21762l67083K54177m28622K27542K06606n72911J02496q3642N11510
16205F658096N76303k96436k65917J98049m54410L64205L84810J78250J12372
16196G455322K29748j72928K26477k35072J08288L09365k24219j08352l40203
16187G248426k28032R24487m17722m9873K87455M0621k1856j60002M1474L72134
16177H037112J60110k42023j65269N24698q1098k13050l64147K23410J85822M80621
16167H546186m66865k03424l54405K35607O42075J48894L44209m82518M44434
16158H854193m20660n52578L69971L39291M41456O36744l64806j233206m93077
$$ plain form
16149 7577328 7881340 7978325 8109688 7619015 8006841 8508524 8374105 7769550 8187343 7930852
16139 7930852 8913587 8182651 8392475 8129682 8428593 8598434 7675112 8440991 8316070
16130 8316070 8418972 9495886 8398826 8252422 8501150 8549782 8934994 9372164 10137525
16121 10137525 9373785 8667479 8633783 8618702 8061684 8284300 8704935 8549984 8602446 8819381
16111 8819381 8244004 9212252 9059496 8754415 9466533 9354216 9046440 9020275 8419588 9007721
16101 9007721 8974255 8777489 8577887 8366029 8379759 8488388 8161319 7832681 9048009 9630964
16091 9630964 9808698 9837347 9633758 9304643 8929198 8971303 9037821 9904464 9695767 9287136
16081 9287136 8923988 8597159 8054031 8415768 9059796 9588470 8691579 8348348 8994799
$$ packed form
16149G577328L04012R6985J31363m90673L87826N01683j34419o04555M17793k56491
16139G930852R82735p30936K09824k62793K98911J69841r23322P65879j24921
16130H316070J02902J076914j097060j46404K48728M8632L85212M37170P65361
16121A0137525p63740p06306l3696j5081n57018K22616M20635j54951N2462K16935
16111H819381n75377R68248j52756l05081P12118j12317l07776k6165o00687N88133
16101I007721l3466j96766j99602k11858J3730J08629l27069l28638J215328N82955
16091I630964J77734K8649k03589l29115l75445M2105O6518Q66643k08697m08631
16081I287136l63148l26829n43128L61737O44028N28674q96891l43231O46451
$$ plain form
16072 8994799 9012069 9802203 8932359 9173910 9553598 9831365 9812108 8469085 8331633 8725997
16062 8725997 8261682 8590538 9060656 9890152 10204016 9254726 8622899 7890293 8863524
16053 8863524 10130266 9514918 10043296 10119967 9109106 8700806 8734036 9736356 9599287
16044 9599287 8821705 8994251 9054124 9144148 9123172 8430268 7731936 8215853 8662634 8531127
16034 8531127 8670147 9302097 9302441 8732709 9078290 9927111 10312769 10094597 10287502 9169088
16024 9169088 9356552 9322299 8584349 9257088 9484307 9451211 9324637 9566237 9666483 9857281
16014 9857281 8903317 8381324 8736982 9057936 9814924 9545076 9402404 9374555 8849306 8555570
16004 8555570 8563439 8649004 9123190 9610075 9292222 9203932 9685071 9395741 8420244 8443504
$$ packed form
16072H994799J7270P90134q69844K41551L79688K77767j9257j343023j37452L94364
16062H725997m64315L28856M70118Q29496L13864r49290o31827p32606R73231
16053H863524J266742o15348N28378P6671j010861m08300L3230J002320j37069
16044I599287p77582J72546N9873R0024k0976o92904o98332M83917M46781j31507
16034H531127J39020O31950L44n69732L45581Q48821L85658k18172J92905j118414
16024I169088J87464l4253p37950O72739K27219l3096j26574K41600J00246J90798
16014I857281r53964n21993L55658L20954P56988k69848j42672k7849n25249k93736
16004H555570P869Q5565M74186M86885l17853q8290M81139k89330r75497K3260
$$ plain form
15994 8443504 8886171 9137396 8999652 8601459 8488680 9820707 9973897 9203518 9631505
15985 9631505 10132503 9400728 9290715 9134786 8873980 9226568 9600256 10373465 10100109
15976 10100109 9575394 9630891 9704709 8570147 8947291 9972559 8867567 9374290 9638659
15967 9638659 9372686 9089761 8977666 9774853 10696559 9582052 8881667 9247251 9380527
15958 9380527 9933250 9753780 9709279 10121612 10195736 10052995 9961046 9710433 9675850 9631940
15948 9631940 9659158 9785394 9952160 10011727 9688881 8389217 7923154 8737382 8578834 9344810
15938 9344810 10160316 9804868 9626392 9101790 9063346 8626033 9690598 9879113 9497284
15929 9497284 8944173 8671751 8679643 8828733 9245282 9067419 8969232 9700160 9215231 9361113
$$ packed form
15994H443504M42667K51225j37744l98193j12779J332027J53190p70379M27987
15985I631505N00998p31775j10013j55929k60806L52588L73688P73209k73356
15976A0100109n24715N5497P3818j134562L77144J025268j104992N06723K64369
15967I638659k65973k82925j12095P97187R21706j114507p00385L65584J33276
15958I380527N52723j79470m4501M12333P4124j42741r1949k50613l4583m3910
15948I631940K7218J26236J66766N9567l22846j299664m66063Q14228j58548P65976
15938I344810Q15506l55448j78476n24602l8444m37313J064565J88515l81829
15929I497284n53111k72422P892J49090M16549j77863r8187P30928m84929J45882
$$ plain form
15919 9361113 8647336 8399229 9587638 9714463 9069092 9835423 10107877 9945139 9772554
15910 9772554 9092486 8598608 9108168 10009291 10012763 9583411 8808166 8623689 9348914 9554197
15900 9554197 8744814 8582051 8755172 9169459 8992218 9209867 9174128 9605900 10201504 9690080
15890 9690080 8992097 9443005 10301338 10256499 10030116 9947219 10554215 10755775 9782019 9693908
15880 9693908 8737560 9177038 8880158 9527583 9645843 9962229 9536503 8962470 9031044 9306626
15870 9306626 9082004 9172588 9729505 9589665 8844449 9125241 9557086 9091614 8904244 9202772
$$ packed form
15919I361113p13777k48107J188409J26825o45371P66331K72454j62738j72585
15910I772554o80068m93878N09560R01123L472m29352p75245j84477P25225K05283
15900I554197q09383j62763J73121M14287j77241K17649l5739M31772N95604n11424
15890I690080o97983M50908Q58333m4839k26383q2897O06996K01560r73756q8111
15880I693908r56348M39478k96880O47425J18260L16386m25726n74033O8574K75582
15870I306626k24622R0584N56917j39840p45216K80792M31845m65472j87370K98528
$$ [...]
##END NTUPLES=NMR SPECTRUM
##END=
