##TITLE=1H_TG-2402-x4
 200.13Hz, CDCl3.
 8 sc
 
25.3.2026
##JCAMPDX= 6.0         $$ Bruker NMR JCAMP-DX V2.0
##DATA TYPE= NMR SPECTRUM
##DATA CLASS= NTUPLES
##ORIGIN= UXNMR, Bruker Analytische Messtechnik GmbH
##OWNER= pz
$$ XWIN-NMR		Version 3.5
$$ Wed Mar 25 15:58:05 2026 Russian Standard Time (UT+4h)  she@DPX200
##.OBSERVE FREQUENCY= 200.1313
##.OBSERVE NUCLEUS= ^1H
##.ACQUISITION MODE= SIMULTANEOUS
##.ACQUISITION SCHEME= undefined
##.AVERAGES= 8
##.DIGITISER RES= 18
##SPECTROMETER/DATA SYSTEM= spect
##.PULSE SEQUENCE= zg30
##.SOLVENT NAME= CDCl3
##.SHIFT REFERENCE= (INTERNAL, CDCl3, 0, 15.4825)
##AUDIT TRAIL= $$ (NUMBER, WHEN, WHO, WHERE, WHAT)
$$ ##TITLE= Audit trail, XWIN-NMR		Version 3.5
$$ ##JCAMPDX= 5.01
$$ ##ORIGIN= Bruker BioSpin GmbH
$$ ##OWNER= she
$$ F:/spectra/data/she/nmr/H-C/1/pdata/1/auditp.txt
$$ ##AUDIT TRAIL=  $$ (NUMBER, WHEN, WHO, WHERE, WHAT)
(   1,<2026-03-25 15:56:17.62 +0400>,<she>,<DPX200>,
      <created by zg, POWCHK disabled, PULCHK disabled
       configuration hash MD5:
       00 E9 B6 7A A2 85 ED C7 34 08 36 98 17 FE 4E 26
       data hash MD5: 16K
       67 95 2A A9 60 E2 2D 43 FE 1A A1 BA 19 94 52 72>)
(   2,<2026-03-25 15:56:21.95 +0400>,<she>,<DPX200>,
      <Start of raw data processing
       efp BC_mod = 2 LB = 0.25 FT_mod = 6 PKNL = 1 PHC0 = -3712.138 PHC1 = 12.7923 SI = 16K 
       data hash MD5: 16K
       26 EE F0 74 EF 86 B6 7D 58 17 DC EA C4 90 01 D5>)
(   3,<2026-03-25 15:56:45.85 +0400>,<she>,<DPX200>,
      <pk PHC0 = 3.347013 PHC1 = -0.1999993 
       data hash MD5: 16K
       87 2F B5 1D 00 17 81 43 36 C7 0E 13 8E D1 8A C1>)
(   4,<2026-03-25 15:56:50.03 +0400>,<she>,<DPX200>,
      <abs ABSG = 5 
       data hash MD5: 16K
       9B FC 3C FE 88 9C A4 77 87 90 33 21 E9 A8 49 E9>)
$$ ##END=
$$ 
$$ hash MD5
$$ 78 6A AD C7 53 25 7C 1C 1C 00 93 5B 71 3D 63 FF
##$RELAX= 
##$RELAX= 
##$RELAX= 
##$RELAX= 
##$RELAX= 
##$RELAX= 
$$ Bruker specific parameters
$$ --------------------------
##$DU= <F:/spectra>
##$EXPNO= 1
##$NAME= <H-C>
##$PROCNO= 1
##$TYPE= <nmr>
##$USER= <she>
##$AMP= (0..31)
100 100 100 100 100 100 100 100 100 100 100 100 100 100 100 100 100 100 
100 100 100 100 100 100 100 100 100 100 100 100 100 100 
##$AQSEQ= 0
##$AQ_mod= 1
##$AUNM= <au_zg>
##$AUTOPOS= <>
##$BF1= 200.13
##$BF2= 200.13
##$BF3= 200.13
##$BF4= 200.13
##$BF5= 200.13
##$BF6= 200.13
##$BF7= 200.13
##$BF8= 200.13
##$BYTORDA= 1
##$CFDGTYP= 0
##$CFRGTYP= 5
##$CHEMSTR= <none>
##$CNST= (0..31)
1 1 145 1 1 1 1 1 1 1 1 1 1 1 1 1 1 1 1 1 1 1 1 1 1 1 1 1 1 1 1 1 
##$CPDPRG= <>
##$CPDPRG1= <>
##$CPDPRG2= <>
##$CPDPRG3= <>
##$CPDPRG4= <mlev>
##$CPDPRG5= <mlev>
##$CPDPRG6= <mlev>
##$CPDPRG7= <mlev>
##$CPDPRG8= <mlev>
##$CPDPRGB= <>
##$CPDPRGT= <>
##$D= (0..31)
0 0.7 0 0 0 0 0 0 0 0 0 0.03 0 0 0 0 0 0 0 0 0 0 0 0 0 0 0 0 0 0 0 0 
##$DATE= 1774439777
##$DBL= (0..7)
120 120 120 120 120 120 120 120 
##$DBP= (0..7)
150 150 150 150 150 150 150 150 
##$DBP07= 0
##$DBPNAM0= <>
##$DBPNAM1= <>
##$DBPNAM2= <>
##$DBPNAM3= <>
##$DBPNAM4= <>
$$ [...]
##$SUBNAM3= <"">
##$SUBNAM4= <"">
##$SUBNAM5= <"">
##$SUBNAM6= <"">
##$SUBNAM7= <"">
##$SUBNAM8= <"">
##$SUBNAM9= <"">
##$SW= 18.0517328524113
##$SWIBOX= (0..15)
0 0 2 0 0 0 0 0 0 0 0 0 0 0 0 0 
##$SW_h= 3612.71676300578
##$TD= 16384
##$TD0= 1
##$TE= 0
##$TE2= 300
##$TE3= 300
##$TEG= 300
##$TL= (0..7)
0 120 120 120 120 120 120 120 
##$TP= (0..7)
150 150 150 150 150 150 150 150 
##$TP07= 0
##$TPNAME0= <>
##$TPNAME1= <>
##$TPNAME2= <>
##$TPNAME3= <>
##$TPNAME4= <>
##$TPNAME5= <>
##$TPNAME6= <>
##$TPNAME7= <>
##$TPOAL= (0..7)
0.5 0.5 0.5 0.5 0.5 0.5 0.5 0.5 
##$TPOFFS= (0..7)
0 0 0 0 0 0 0 0 
##$TUNHIN= 0
##$TUNHOUT= 0
##$TUNXOUT= 0
##$USERA1= <user>
##$USERA2= <user>
##$USERA3= <user>
##$USERA4= <user>
##$USERA5= <user>
##$V9= 5
##$VALIST= <valist>
##$VCLIST= <CCCCCCCCCCCCCCC>
##$VD= 0
##$VDLIST= <DDDDDDDDDDDDDDD>
##$VPLIST= <PPPPPPPPPPPPPPP>
##$VTLIST= <TTTTTTTTTTTTTTT>
##$WBST= 1024
##$WBSW= 4
##$XGAIN= (0..3)
0 0 0 0 
##$XL= 0
##$YL= 0
##$YMAX_a= 211173
##$YMIN_a= -283622
##$ZGOPTNS= <>
##$ZL1= 120
##$ZL2= 120
##$ZL3= 120
##$ZL4= 120
##$ABSF1= 15.49678
##$ABSF2= -2.555069
##$ABSG= 5
##$ABSL= 3
##$ALPHA= 0
##$AQORDER= 0
##$ASSFAC= 0
##$ASSFACI= 0
##$ASSFACX= 0
##$ASSWID= 0
##$AUNMP= <proc_1d>
##$AZFE= 0.1
##$AZFW= 0.1
##$BCFW= 0
##$BC_mod= 2
##$BYTORDP= 0
##$COROFFS= 0
##$CY= -3
##$DATMOD= 1
##$DC= 0
##$DFILT= <>
##$DTYPP= 0
##$F1P= 0
##$F2P= 0
##$FCOR= 1
##$FTSIZE= 16384
##$FT_mod= 6
##$GAMMA= 0
##$GB= 0
##$INTBC= 1
##$INTSCL= 3.241238e-09
##$ISEN= 128
##$LB= 0.25
##$LEV0= 0
##$LPBIN= 0
##$MAXI= 10000
##$MC2= 0
##$MEAN= 0
##$ME_mod= 0
##$MI= 1.114404
##$NCOEF= 0
##$NC_proc= -7
##$NLEV= 6
##$NOISF1= 3.799351
##$NOISF2= 2.8
##$NSP= 0
##$NTH_PI= 0
##$NZP= 0
##$OFFSET= 15.48246
##$PC= 1
##$PHC0= -3708.791
##$PHC1= 12.5923
##$PH_mod= 1
##$PKNL= yes
##$PPARMOD= 0
##$PSCAL= 0
##$PSIGN= 0
##$REVERSE= no
##$SF= 200.130007854211
##$SI= 16384
##$SIGF1= 3
##$SIGF2= 2
##$SINO= 0.751879
##$SIOLD= 32768
##$SREGLST= <19F.Aceton>
##$SSB= 0
##$STSI= 16384
##$STSR= 0
##$SW_p= 3612.71676300578
##$SYMM= 0
##$S_DEV= 0
##$TDeff= 16384
##$TDoff= 0
##$TI= <>
##$TILT= no
##$TM1= 0
##$TM2= 0
##$TOPLEV= 0
##$USERP1= <user>
##$USERP2= <user>
##$USERP3= <user>
##$USERP4= <user>
##$USERP5= <user>
##$WDW= 1
##$XDIM= 16384
##$YMAX_p= 417990414
##$YMIN_p= -1214017
$$ End of Bruker specific parameters
$$ ---------------------------------
##NTUPLES= NMR SPECTRUM
##VAR_NAME=  FREQUENCY,     SPECTRUM/REAL,   SPECTRUM/IMAG
##SYMBOL=    X,             R,               I
##VAR_TYPE=  INDEPENDENT,   DEPENDENT,       DEPENDENT
##VAR_FORM=  AFFN,          ASDF,            ASDF
##VAR_DIM=   16384,         16384,           16384
##UNITS=     HZ,            ARBITRARY UNITS, ARBITRARY UNITS
##FACTOR=    0.220516191357247, 1,           1
##FIRST=     3098.5048457999, 0,             0
##LAST=      -514.211917205885, 0,           0
##MIN=       -514.211917205885, -1214017,    0
##MAX=       3098.5048457999, 417990414,     0
$$ Real data points
##PAGE= N=1
##DATA TABLE= (X++(R..R)), XYDATA
$$ [...]
$$ plain form
5155 5988352 6120450 6284716 6214374 6149412 6099341 6178376 6471150 6487127 6772206 6758914 7096291
5144 7096291 7336618 7462179 7795921 7999701 8275554 8161417 8198292 8457394 8769411 8967151
5134 8967151 9033131 9179694 9196850 9337342 9355578 9747812 9919015 9953933 9955532 10070272 10322136
5123 10322136 10604470 10761731 10814432 10756545 11122589 11177560 11213970 11387194 11216863 11607832
5113 11607832 11679443 11594057 11702471 11641888 11837642 11940004 12124725 12145594 12296988 12471416
5103 12471416 12732706 12714669 12639663 12720962 12914445 13160537 13537914 13357095 13194720 13507453
5093 13507453 13777670 13774018 13775431 13907437 13915577 14146060 14605094 14789905 14746216 14976715 14938352
5082 14938352 14975210 15237373 15437232 15346623 15713702 15674930 15751384 16227252 16227975 16299884 16719107
$$ packed form
5155E988352J32098J64266p0342o4962n0071P9035K92774J5977K85079j3292L37377
5144G096291K40327J25561L33742K03780K75853j14137L6875K59102L12017J97740
5134H967151O5980J46563J7156J40492J8236L92234J71203L4918J599J14740K51864
5123A0322136K82334J57261N2701n7887L66044N4971L6410J73224j70331L90969
5113A1607832P1611q5386J08414o0583J95754J02362J84721K0869J51394J74428
5103A2471416K61290j8037p5006Q1299J93483K46092L77377j80819j62375L12733
5093A3507453K70217l652J413J32006Q140K30483M59034J84811m3689K30499l8363
5082A4938352L6858K62163J99859r0609L67079l8772P6454M75868P23P1909M19223
$$ plain form
5071 16719107 16688548 16743956 16803541 17181289 17401415 17468372 17557133 17759582 18009185 18162463
5061 18162463 18230479 18219289 18187871 18285295 18612257 18706339 19008134 19093693 18911479 18982589 19347557
5050 19347557 19490276 19426900 19874458 20086508 19992624 20131059 20162833 20446965 20591037 20831619
5040 20831619 20901375 20837522 20775492 20552231 20613419 20784070 20673521 20402949 20120663 20179772
5030 20179772 20035698 20001677 19883581 19903455 19897442 19561847 19239383 19020621 19207466 18771297
5020 18771297 18437194 18495871 18304258 18039869 17786279 17940531 17344142 16888031 16742543 16444156
5010 16444156 16231684 15717147 15579147 14979322 14574864 14032552 13854275 13613366 13341028
5001 13341028 13187768 12804261 12683150 12292382 11800192 11599067 11514238 11410111 11262029 11013235
$$ packed form
5071A6719107l0559N5408N9585L77748K20126O6957Q8761K02449K49603J53278
5061A8162463O8016j1190l1418R7424L26962R4082L01795Q5559j82214P1110L64968
5050A9347557J42719o3376M47558K12050r3884J38435L1774K84132J44072K40582
5040B0831619O9756o3853o2030k23261O1188J70651j10549k70572k82286N9109
5030B0179772j44074l4021j18096J9874o013l35595l22464k18762J86845m36169
5020A8771297l34103N8677j91613k64389k53590J54252n96389m56111j45488k98387
5010A6444156k12472n14537j38000n99825m04458n42312j78277k40909k72338
5001A3341028j53260l83507j21111l90768m92190k01125q4829j04127j48082k48794
$$ plain form
4991 11013235 10765256 10624637 10523104 10272681 10239222 10145816 9971646 9713055 9440013 9458135
4981 9458135 9306363 9085135 9041129 9020176 9019949 8893383 8922617 8781127 8599135 8589044 8506921
4970 8506921 8457255 8413557 8136035 7998086 8168457 8259800 8101670 7968399 8055125 7976412
4960 7976412 7991649 8127190 8253248 8122957 7950182 7995114 8155635 8442549 8474589 8512753
4950 8512753 8441293 8449542 8784605 8980065 8949883 9009531 9120907 9433874 9395048 9356079 9592644
4939 9592644 9657414 10076775 10330091 10284855 10344321 10741665 10963352 11226882 11151576 11325019
4929 11325019 11433684 11754864 12080019 12063515 12260671 12533470 12597909 12587301 12901044 13157780
4919 13157780 13424281 13585067 13716914 14015860 14239882 14475987 14637065 15020899 15200740
$$ packed form
4991A1013235k47979j40619j01533k50423l3459r3406j74170k58591k73042J8122
4981I458135j51772k21228m4006k0953k27j26566K9234j41490j81992j0091q2123
4970H506921m9666m3698k77522j37949J70371R1343j58130j33271Q6726p8713
4960G976412J5237J35541J26058j30291j72775M4932J60521K86914L2040L8164
4950H512753p1460Q249L35063J95460l0182N9648J11376L12967l8826l8969K36565
4939I592644O4770M19361K53316m5236N9466L97344K21687K63530p5306J73443
4929A1325019J08665L21180L25155j6504J97156K72799O4439j0608L13743K56736
4919A3157780K66501J60786J31847K98946K24022K36105J61078L83834J79841
$$ plain form
4910 15200740 15241449 15596903 15854182 16141751 16246272 16464187 16547861 16689433 16697601 16706859
4900 16706859 16823798 17008999 17126845 17295292 17572775 17563051 17510782 17620067 17932825 17772522
4890 17772522 17823378 18098296 18447453 18735832 18854701 18977060 19231753 19583768 19939903 20189891
4880 20189891 20347161 20622785 20793786 20999822 21088322 21532787 21730471 21945270 21975423 22185329
4870 22185329 22290138 22299371 22273951 22190913 22197755 22365657 22622231 22591916 22828505 22749772 22901974
4859 22901974 23040882 23098510 23067906 23165582 23244767 23279528 23343096 23302728 23577477 23785905 23864445
4848 23864445 23766603 24094282 24224822 24374941 24790294 25160904 25556435 25935928 25813150 26069376
4838 26069376 26672591 27059097 27063279 27282309 27781306 28006124 27914097 28050057 28143424 28081527
$$ packed form
4910A5200740M0709L55454K57279K87569J04521K17915Q3674J41572Q168R258
4900A6706859J16939J85201J17846J68447K77483r724n2269J09285L12758j60303
4890A7772522N0856K74918L49157K88379J18869J22359K54693L52015L56135K49988
4880B0189891J57270K75624J71001K06036Q8500M44465J97684K14799L0153K09906
4870B2185329J04809R233k5420q3038O842J67902K56574l0315K36589p8733J52202
4859B2901974J38908N7628l0604R7676P9185L4761O3568m0368K74749K08428P8540
4848B3864445r7842L27679J30540J50119M15353L70610L95531L79493j22778K56226
4838B6069376O03215L86506M182K19030M98997K24818r2027J35960R3367o1897
$$ plain form
4828 28081527 28102088 27744153 27926485 27819981 27372672 27527914 27696704 27609650 27410874 27539355
4818 27539355 27459267 27524754 27461615 27717466 27971603 27999405 27995986 28293387 28674990 28775882
4808 28775882 29184913 29493372 29636740 29739400 30121223 30346545 30112091 30290166 30459366
4799 30459366 30222537 30359740 30443915 30376656 29918136 29775726 29757447 29746463 29405749 29546510
4789 29546510 29454418 29420590 29724563 29730865 29563084 29802063 30114412 30294242 30522512 30944888
4779 30944888 31119709 31584433 31935978 32281488 32498474 32936572 33426690 33726451 34254126
4770 34254126 34253724 34412118 34492556 34829246 34868610 34965524 35106941 35029869 35029503 35075577 35286002
4759 35286002 35399772 35328455 35118239 35195976 35323044 35291915 35528147 35359655 35062361 35269363
$$ packed form
4828B8081527K0561l57935J82332j06504m47309J55242J68790q7054j98776J28481
4818B7539355q0088O5487o3139K55851K54137K7802l419K97401L81603J00892
4808B8775882M09031L08459J43368J02660L81823K25322k34454J78075J69200
4799C0459366k36829J37203Q4175o7259m58520j42410j8279j0984l40714J40761
4789B9546510r2092l3828L03973O302j67781K38979L12349J79830K28270M22376
4779C0944888J74821M64724L51545L45510K16986M38098M90118K99761N27675
4770C4254126m02J58394Q0438L36690L9364R6914J41417p7072l66M6074K10425
4759C5286002J13770p1317k10216P7737J27068l1129K36232j68492k97294K07002
$$ plain form
4749 35269363 35508686 35446503 35210600 35395989 35549335 35306324 35458796 35428349 35539297 36074714
4739 36074714 36009994 36204903 36705381 37182022 37485166 37739747 38056660 38888438 39286543 39797892
4729 39797892 40277240 40890914 41720812 42162083 42903883 43709063 44323366 45184949 46098295
4720 46098295 46528823 47265116 47735820 48022226 48651543 49374873 49823141 50053784 50194187
4711 50194187 50576034 50786094 51083730 51280395 51152517 51412712 51740870 52019744 52571395
4702 52571395 53000554 53674222 54388586 55303099 56121331 57256416 58319870 60020228 61935826
4693 61935826 63637389 65155433 66923663 68533789 70008748 71263921 72433751 73190677
4685 73190677 73621810 73714995 73454094 73005502 72222494 71506462 70985562 70628726 70216856 69546956
$$ packed form
4749C5269363K39323o2183k35903J85389J53346k43011J52472l0447J10948N35417
4739C6074714o4720J94909N00478M76641L03144K54581L16913Q31778L98105N11349
4729C9797892M79348O13674Q29898M41271P41800Q05180O14303Q61583R13346
4720D6098295M30528P36293M70704K86406O29317P23330M48268K30643J40403
4711E0194187L81847K10060K97636J96665j27878K60195L28158K78874N51651
4702E2571395M29159O73668P14364R14513Q18232J135085J063454J700358J915598
4693F1935826J701563J518044J768230J610126J474959J255173J169830P56926
4685G3190677M31133R3185k60901m48592p83008p16032n20900l56836m11870o69900
$$ plain form
4675 69546956 68901182 68286930 67806986 67257200 66602040 66581769 66031844 65492078 65029819 64914562
4665 64914562 64564956 64172331 64128302 64072280 63547443 62990680 62616743 62009477 61386812 60620425
4655 60620425 59817232 58832745 57805471 56872019 55824804 55172885 54149009 53189654 51881487
4646 51881487 50614238 49362615 48227982 47113248 46120811 45090164 44258572 43454547 42238437
4637 42238437 41457450 40625586 39579498 38615593 37417237 36420078 35749672 34964902 34054520
4628 34054520 33280134 32600294 31930731 31114217 30234683 29365284 28625204 27931917 26984099
4619 26984099 26374158 25711061 24812223 24126193 23506103 22689234 22335041 21865607 21158889
4610 21158889 20464849 20087387 19521370 19039647 18647744 18152065 17763658 17235519 16901554
$$ packed form
4675F9546956o45774o14252m79944n49786o55160k0271n49925n39766m62259j15257
4665F4914562l49606l92625m4029n6022n24837n56763l73937o07266o22665p66387
4655F0620425q03193r84487j027274r33452j047215o51919j023876r59355j308167
4646E1881487j267249j251623j134633j114734r92437j030647q31592q04025j216110
4637D2238437p80987q31864j046088r63905j198356r97159o70406p84770r10382
4628C4054520p74386o79840o69563q16514q79534q69399p40080o93287r47818
4619B6984099o09941o63097q98838o86030o20090q16869l54193m69434p06718
4610B1158889o94040l77462n66017m81723l91903m95679l88407n28139l33965
$$ plain form
4601 16901554 16356114 15746176 15642691 15620365 15344345 15140866 14983968 14806419 14664322 14561426
4591 14561426 14757730 14715797 14696489 14832774 14598070 14366345 14201219 14091055 14036943 13999003
4581 13999003 13780810 13816716 13424691 12975034 12824036 12383741 12198607 11705192 11344709 10988510
4571 10988510 10886776 10741233 10305966 10007355 9738484 9676296 9541681 9427844 9396644 9123824
4561 9123824 9039901 8983863 9158638 9418515 9288217 9067370 9254475 9398602 9617135 9800652
4551 9800652 9758120 10196054 10351154 10209511 10258160 10318647 10190606 9980105 10075359 10101469
4541 10101469 9848279 9678858 9298291 9192691 8932038 8648299 8197913 7891842 7795612 7426610
4531 7426610 7208585 7049157 6625308 6367128 6176920 5893044 5608213 5416329 5458953 5147862
$$ packed form
4601A6901554n45440o09938j03485k2326k76020k03479j56898j77549j42097j02896
4591A4561426J96304m1933j9308J36285k34704k31725j65126j10164n4112l7940
4581A3999003k18193L5906l92025m49657j50998m40295j85134m93415l60483l56199
4571A0988510j01734j45543m35267k98611k68871o2188j34615j13837l1200k72820
4561I123824q3923n6038J74775K59877j30298k20847J87105J44127K18533J83517
4551I800652m2532M37934J55100j41643M8649O0487j28041k10501R5254K6110
4541A0101469k53190j69421l80567j05600k60653k83739m50386l06071r6230l69002
4531G426610k18025j59428m23849k58180j90208k83876k84831j91884M2624l11091
$$ plain form
4521 5147862 4875605 4776737 4469148 4517533 4684275 4246773 4120604 4184337 4066214 3845091
4511 3845091 3803551 3774936 3706831 3628824 3604699 3575677 3734847 3629893 3641738 3485682 3426165
4500 3426165 3448171 3544544 3587182 3482307 3246123 3350496 3211216 3080143 3577939 3730602
4490 3730602 3575103 3358974 3504136 3353187 3767669 4004707 3792708 3746121 3734463 3921349
4480 3921349 3637742 3532647 3841035 4149037 4357283 4237908 4431569 4622217 4964838 4900846
4470 4900846 4839220 4929134 4983504 4937239 5091658 5233756 5655393 5609774 5583159 5975816 6129946
4459 6129946 5964475 6203245 6426789 6457603 6615214 6874915 6833208 6693054 6912787 6937808
4449 6937808 7175142 7329108 7379164 7231008 7304441 7306728 7528831 7807100 7749065 7732312 7752676
$$ packed form
4521E147862k72257r8868l07589M8385J66742m37502j26169O3733j18123k21123
4511C845091m1540k8615o8105p8007k4125k9022J59170j04954J1845j56056n9517
4500C426165K2006R6373M2638j04875k36184J04373j39280j31073M97796J52663
4490C730602j55499k16129J45162j50949M14482K37038k11999m6587j1658J86886
4480C921349k83607j05095L08388L08002K08246j19375J93661J90648L42621o3992
4470D900846o1626Q9914N4370m6265J54419J42098M21637m5619k6615L92657J54130
4459F129946j65471K38770K23544L0814J57611K59701m1707j40154K19733K5021
4449F937808K37334J53966N0056j48156P3433K287K22103K78269n8035j6753K0364
$$ plain form
4438 7752676 7903942 8076826 7888656 7744858 7855096 7776983 7836038 7918616 8000420 7841273
4428 7841273 7742198 7808627 7683386 7425303 7351229 7388229 7565850 7432137 6791691 6589166
4418 6589166 6541674 6373002 6352727 6228995 6067810 5959386 5714760 5699739 5721287 5524220
4408 5524220 5221254 5236592 5305713 4945319 4918870 4697337 4608910 4602787 4449264 4370983 4235328
4397 4235328 4142832 4090231 4220536 4103883 4187849 3885486 4062509 4090457 4015664 4293814
4387 4293814 4349779 4409677 4276675 3982929 3690860 3352733 3303199 3365761 3391869 3353674 3424160
4376 3424160 3430928 3372227 3161786 3064582 3125856 3136351 2942617 2895773 3059758 2989108 3063670
4365 3063670 3236586 3151029 3300563 3050374 2861528 2733041 2827928 2970623 2844650 3084408
$$ packed form
4438G752676J51266J72884j88170j43798J10238p8113N9055Q2578Q1804j59147
4428G841273r9075O6429j25241k58083p4074L7000J77621j33713o40446k02525
4418F589166m7492j68672k0275j23732j61185j08424k44626j5021K1548j97067
4408E524220l02966J5338O9121l60394k6449k21533q8427o123j53523p8281j35655
4397D235328r2496n2601J30305j16653Q3966l02363J77023K7948p4793K78150
4387D293814N5965N9898j33002k93746k92069l38127m9534O2562K6108l8195P0486
4376C424160O768n8701k10441r7204O1274J0495j93734m6844J63985p0650P4562
4365C063670J72916q5557J49534k50189j88846j28487R4887J42695j25973K39758
$$ plain form
4355 3084408 2941360 3056140 3127447 2945441 2941878 2982713 2949391 2949211 3035945 3326081 3211311
4344 3211311 2947262 3171696 3291022 3412298 3330524 3162999 3213028 3019857 3421915 3372806
4334 3372806 3222945 3448747 3421799 3540657 3890681 3968527 3832321 3928262 4018832 4026341 3893365
4323 3893365 4125851 4076828 4178149 4078279 4196791 4449015 4633810 4861814 4966125 5044852
4313 5044852 5287668 5587021 5697358 6049727 6332943 6284125 6577511 6833962 6803214 6859769
4303 6859769 6866963 7048196 7127070 7291282 7624209 7899989 7966019 8235937 8419467 8643165
4293 8643165 8478203 8389485 8687567 8865922 9172805 9355665 9529492 9870339 10028661 10414136
4283 10414136 10636604 10915230 10976573 11155830 11480739 11823908 12338291 12713050 12811206 13128936
$$ packed form
4355C084408j43048J14780P1307j82006l563M0835l3322j80Q6734K90136j14770
4344C211311k64049K24434J19326J21276q1774j67525N0029j93171M02058m9109
4334C372806j49861K25802k6948J18858L50024P7846j36206R5941R0570P509j32976
4323C893365K32486m9023J01321r9870J18512K52224J84795K28004J04311P8727
4313E044852K42816K99353J10337L52369K83216m8818K93386K56451l0748N6555
4303F859769P194J81233P8874J64212L32927K75780O6030K69918J83530K23698
4293H643165j64962q8718K98082J78355L06883J82860J73827L40847J58322L85475
4283A0414136K22468K78626O1343J79257L24909L43169N14383L74759R8156L17730
$$ plain form
4273 13128936 13789404 14102919 14077303 14286560 14995198 15525988 15625132 15986497 16452137 16623833
4263 16623833 16966785 17156828 17188509 17402899 17338516 17487165 17401929 17461119 17430637 17381846
4253 17381846 17114581 17088513 17183567 16883529 16544860 16193596 15974271 15640092 15241836 14949593
4243 14949593 14793521 14395828 13738967 12846720 12454449 11988234 11700296 11606385 11078864 10583577
4233 10583577 10630511 10752913 10909067 10588117 10353511 10408149 10535109 10748135 11041348 11229162
4223 11229162 11485937 11805592 11947567 12246476 12699344 12995259 13429262 13786360 13831948 13914988
4213 13914988 14118310 14505899 14818121 14790417 14967262 15112556 15333810 15581306 15251710 15134928
4203 15134928 15371154 15125125 14907627 15050732 14782430 14221355 13707628 13869545 13595564
$$ packed form
4273A3128936O60468L13515k5616K09257P08638N30790R9144L61365M65640J71696
4263A6623833L42952J90043L1681K14390o4383J48649q5236N9190l0482m8791
4253A7381846k67265k6068R5054l00038l38669l51264k19325l34179l98256k92243
4243A4949593j56072l97693o56861q92247l92271m66215k87938r3911n27521m95287
4233A0583577M6934J22402J56154l20950k34606N4638J26960K13026K93213J87814
4223A1229162K56775L19655J41975K98909M52868K95915M34003L57098M5588Q3040
4213A3914988K03322L87589L12222k7704J76845J45294K21254K47496l29596j16782
4203A5134928K36226k46029k17498J43105k68302n61075n13727J61917k73981
$$ plain form
4194 13595564 13200246 12864180 12530430 12409573 12003115 11296726 10848641 10550423 10156202
4185 10156202 9474460 9484806 9043582 8505309 8449829 8076670 7849518 7804987 7627965 7557130
4175 7557130 7337717 7255914 7194988 6805853 6907742 6722355 6507450 6558317 6768920 6560711
4165 6560711 6546494 6506652 6341636 6433729 6671164 6511644 6390996 6332408 6692195 6720552
4155 6720552 6472251 6519683 6652805 6607918 6481229 6478103 6486036 6561566 6658351 6873875 6843570
4144 6843570 6695624 6897060 7202878 7295107 7183814 7276508 7339584 7277015 7364376 7638351
4134 7638351 7382018 7599285 7916445 7772784 7677819 7685087 7954862 8037932 8079261 8402163
4124 8402163 8444103 8427434 8273776 8374370 8627381 8826662 8892328 8735524 9043411 9253911
$$ packed form
4194A3595564l95318l36066l33750j20857m06458p06389m48085k98218l94221
4185A0156202o81742J0346m41224n38273n5480l73159k27152m4531j77022p0835
4175G557130k19413q1803o0926l89135J01889j85387k14905N0867K10603k08209
4165F560711j4217l9842j65016R2093K37435j59520j20648n8588L59787K8357
4155F720552k48301M7432J33122m4887j26689l126P933P5530R6785K15524l0305
4144F843570j47946K01436L05818R2229j11293R2694O3076o2569Q7361K73975
4134G638351k56333K17267L17160j43661r4965P268K69775Q3070M1329L22902
4124H402163M1940j6669j53658J00594K53011J99281O5666j56804L07887K10500
$$ plain form
4114 9253911 9345922 9360548 9672460 9728458 9843757 10045463 10499581 10703872 10934847 11203956
4104 11203956 11426442 12077118 12102018 12435068 12671670 13219356 13315278 13550207 14040341 14523511
4094 14523511 15037703 15220422 15711732 16018914 16322424 16936538 17413384 17803269 18238580
4085 18238580 18822889 19468470 19777163 20261374 20759127 21615053 21957968 22628002 23462062
4076 23462062 24229603 24971426 25833221 26433666 27201090 27682423 28177862 28939920 29728196
4067 29728196 30503900 30868768 31499272 32246753 33034943 33991181 34631578 35311174 36085760
4058 36085760 36888337 37682101 38431480 39407594 40447082 41464776 42375429 43199137 44288817
4049 44288817 45227301 46245589 46935359 47461223 48170625 49029766 49759629 50656948 51380793
$$ packed form
4114I253911R2011J4626L11912N5998J15299K01706M54118K04291K30975K69109
4104A1203956K22486O50676K4900L33050K36602N47686R5922K34929M90134M83170
4094A4523511N14192J82719M91310L07182L03510O14114M76846L89885M35311
4085A8238580N84309O45581L08693M84211M97753Q55926L42915O70034Q34060
4076B3462062P67541P41823Q61795O00445P67424M81333M95439P62058P88276
4067B9728196P75704L64868O30504P47481P88190R56238O40397O79596P74586
4058C6085760Q02577P93764P49379R76114J039488J017694R10653Q23708J089680
4049D4288817R38484J018288O89770N25864P09402Q59141P29863Q97319P23845
$$ plain form
4040 51380793 52127049 52890372 53547822 54206955 54831843 55558117 56183709 56857264 57781477
4031 57781477 58472182 59372337 60454957 61354016 62396626 63333825 64436914 65508787 66950508
4022 66950508 68322104 69444588 70539209 71609744 72801650 74067441 75104738 75734469
4014 75734469 76500538 77453022 78320637 79177385 79959889 80524089 80976282 81619335 81975522
4005 81975522 82611616 83251114 83739452 83920525 84117612 84712588 85303413 85558334 85937088
3996 85937088 86640320 87097364 86989714 87145111 87414289 87595818 87936421 88274950 88453198
3987 88453198 88384345 88398974 88545234 88531299 88250093 88208467 88415754 87928182 87650460 86935304
3977 86935304 86470945 86050993 85044635 84133978 83261010 82053787 81132060 80818306 80291510
$$ packed form
4040E1380793P46256P63323O57450O59133O24888P26274O25592O73555R24213
4031E7781477O90705R00155J082620Q99059J042610R37199J103089J071873J441721
4022F6950508J371596J122484J094621J070535J191906J265791J037297O29731
4014G5734469P66069R52484Q67615Q56748P82504N64200M52193O43053L56187
4005H1975522O36094O39498M88338J81073J97087N94976N90825K54921L78754
3996H5937088P03232M57044j07650J55397K69178J81529L40603L38529J78248
3987H8453198o8853J4629J46260j3935k81206m1626K07287m87572k77722p15156
3977H6935304m64359m19952j006358r10657q72968j207223r21727l13754n26796
$$ plain form
3968 80291510 79605779 78966480 78379943 78123938 77506180 77196931 76625568 76148026 75831006
3959 75831006 75244233 74955972 74550824 74406669 73997618 74018477 74082352 73960009 73841086 74029451
3949 74029451 74080561 73958826 74020306 73788984 73304615 72992582 72670290 72100133 71649839 71123928
3939 71123928 70562089 70097235 69187054 68290877 67256950 66141259 65174333 64235363 63003831
3930 63003831 61747215 60327368 59122224 57712697 56398523 55171251 53927556 52522977
3922 52522977 51203655 50304295 49263710 48233716 47302170 46374339 45817256 45345924 44736480
3913 44736480 44217859 43634522 43598785 43116951 42614810 42186825 41841522 41349588 41165890 40531985
3903 40531985 40246070 40219859 39614288 39025697 38700997 38383319 37946312 37688338 37160912 36716495
$$ packed form
3968H0291510o85731o39299n86537k56005o17758l09249n71363m77542l17020
3959G5831006n86773k88261m05148j44155m09051K0859O3875j22343j18923J88365
3949G4029451N1110j21735O1480k31322m84369l12033l22292n70157m50294n25911
3939G1123928n61839m64854r10181q96177j033927j115691r66926r38970j231532
3930F3003831j256616j419847j205144j409527j314174j227272j243695j404579
3922E2522977j319322q99360j040585j029994r31546r27831n57083m71332o09444
3913D4736480n18621n83337l5737m81834n02141m27985l45303m91934j83698o33905
3903D0531985k85915k6211o05571n88591l24700l17678m37007k57974n27426m44417
$$ plain form
3893 36716495 36450236 36255022 36048568 36278319 36267985 36658422 36864744 37207051 37514867 37934034
3883 37934034 38295226 38816103 39359032 39897832 40487600 40818720 41506171 41684968 42099519
3874 42099519 42367290 42528589 42667276 42492695 42126331 41668541 41328745 41097759 40541211
3865 40541211 40210568 40103745 39708586 39433296 39215478 39182082 38881635 38739136 38477831 38002712
3855 38002712 37642212 37215105 36994962 36761788 36609162 36878500 37341737 37736595 38058999
3846 38058999 38600541 39243759 40054079 40769281 41426258 41806015 42470570 43006736 43304764
3837 43304764 43163419 42828349 42548549 42216600 42069135 41822719 41423986 40734284 40329883
3828 40329883 40001031 39701452 39285792 38702250 38234182 37881510 37155368 36375260 35359436
$$ packed form
3893C6716495k66259j95214k06454K29751j0334L90437K06322L42307L07816M19167
3883C7934034L61192N20877N42929N38800N89768L31120O87451J78797M14551
3874D2099519K67771J61299J38687j74581l66364m57790l39796k30986n56548
3865D0541211l30643j06823l95159k75290k17818l3396l00447j42499k61305m75119
3855C8002712l60500m27107k20143k33174j52626K69338M63237L94858L22404
3846C8058999N41542O43218Q10320P15202O56977L79757O64555N36166K98028
3837D3304764j41345l35070k79800l31949j47465k46416l98733o89702m04401
3828D0329883l28852k99579m15660n83542m68068l52672p26142p80108j015824
$$ plain form
3819 35359436 34099469 32690722 31332505 29664724 28232013 26935370 25657963 24302432
3811 24302432 23003797 21730757 21023369 20638188 19884213 19064864 18748515 18093369 17894776
3802 17894776 17857850 17864587 17942603 17638369 17858737 17877219 17576334 17578407 17552017 17475762 17377878
3791 17377878 17110573 17187430 17088144 17165531 17229302 16991062 17026337 16982390 16802995 16641447
3781 16641447 16430957 16651801 16468973 16755696 16849517 16840391 16974784 16988719 17162820 17333377
3771 17333377 17536876 17893886 18230404 18791791 19105751 19656962 20154836 20510913 21184591
3762 21184591 21847075 22276166 22945138 23673341 24034695 24605244 25558429 26046628 26390236
3753 26390236 26654020 27105281 27572316 27649092 27534918 27803619 27904954 27619684 27761910 27661181
$$ packed form
3819C5359436j259967j408747j358217j667781j432711j296643j277407j355531
3811B4302432j298635j273040p07388l85181p53975q19349l16349o55146j98593
3802A7894776l6926O737P8016l04234K20368J8482l00885K073k6390p6255r7884
3791A7377878k67305P6857r9286P7387O3771k38240L5275m3947j79395j61548
3781A6641447k10490K20844j82828K86723R3821r126J34393J3935J74101J70557
3771A7333377K03499L57010L36518N61387L13960N51211M97874L56077O73678
3762B1184591O62484M29091O68972P28203L61354N70549R53185M88199L43608
3753B6390236K63784M51261M67035P6776j14174K68701J01335k85270J42226j00729
$$ plain form
3743 27661181 27475656 27347705 26976402 26736912 26738378 26649035 26084012 25664768 25514882 25055581
3733 25055581 24819583 24927081 24936871 24814101 24996343 24638124 24475701 24207231 24249142 24124542
3723 24124542 24057920 24191539 24468410 24646806 24897862 25162463 25438729 25822933 26331210 26465538
3713 26465538 26823168 27627981 28095946 28715043 29255034 29575029 30113874 30533012 31083276
3704 31083276 31170678 31105703 31518427 31879088 32000146 32162765 32103530 32383177 32264699 32189084
3694 32189084 32452948 32249585 32153594 32072679 32317085 32111681 31918854 31773843 31793487 31706379
3684 31706379 31380943 31006564 30733873 30385860 30181293 29740790 29498303 29091053 28923771
3675 28923771 28966662 28591149 28133545 27794593 27872638 27812848 27728005 27573125 27235979 27171463
$$ packed form
3743B7661181j85525j27951l71303k39490J466q9343n65023m19244j49886m59301
3733B5055581k35998J07498R790j22770J82242l58219j62423k68470M1911j24600
3723B4124542o6622J33619K76871J78396K51056K64601K76266L84204N08277J34328
3713B6465538L57630Q04813M67965O19097N39991L19995N38845M19138N50264
3704C1083276Q7402o4975M12724L60661J21058J62619n9235K79647j18478p5615
3694C2189084K63864k03363r5991q0915K44406k05404j92827j45011J9644q7108
3684C1706379l25436l74379k72691l48013k04567m40503k42487m07250j67282
3675B8923771M2891l75513m57604l38952P8045n9790q4843j54880l37146o4516
$$ plain form
3665 27171463 27259196 27503829 27343414 27514746 27784828 27848416 28036581 28502872 28709587 28949302
3655 28949302 29276882 29499774 30036054 30200709 30259346 30185440 30567794 30784898 30853357 30616001
3645 30616001 30741135 31095997 31510523 31895483 32197339 32573234 33047985 33541225 33703088
3636 33703088 33758106 33608225 33299214 33216775 33151211 32687021 32040474 31551442 31254756 30829424
3626 30829424 30582468 30320860 30240917 30002661 30032530 30139416 30048947 30095339 30250188 30473283
3616 30473283 30418511 30491625 30284366 30323420 30438394 30528564 30374852 30288809 30376868 30092848
3606 30092848 30014796 29818809 29711870 29483021 29306203 29027427 28817600 28743593 28573553 28086650
3596 28086650 27731249 27479377 27392711 27258101 26892863 26748250 26674933 26575891 26353325 26178172
$$ packed form
3665B7171463Q7733K44633j60415J71332K70082O3588J88165M66291K06715K39715
3655B8949302L27580K22892N36280J64655N8637p3906L82354K17104O8459k37356
3645C0616001J25134L54862M14526L84960L01856L75895M74751M93240J61863
3636C3703088N5018j49881l09011q2439o5564m64190o46547m89032k96686m25332
3626C0829424k46956k61608p9943k38256K9869J06886r0469M6392J54849K23095
3616C0473283n4772P3114k07259L9054J14974R0170j53712q6043Q8059k84020
3606C0092848p8052j95987j06939k28849j76818k78776k09827p4007j70040m86903
3596B8086650l55401k51872q6666j34610l65238j44613p3317r9042k22566j75153
$$ plain form
3586 26178172 26221528 26272385 26266695 26328653 26223615 25852753 25406254 25081621 24865643 24476544
3576 24476544 24243732 24111613 23276897 22711211 22636939 22475890 22256710 21984719 21612642 21367270
3566 21367270 21245739 21047525 21027380 20474062 20238315 20011815 19803860 19738316 19437862 19557184
3556 19557184 19386510 18948158 18778858 18706710 18550302 18469992 18582134 18595129 18541578 18571202
3546 18571202 18831316 19143133 19296076 19497150 19762051 20216684 20581096 21263910 21906785
3537 21906785 22461675 23148147 24107352 25190052 26140829 27308293 28832967 30243100 32400286
3528 32400286 34651387 37248762 40168698 43695805 48059701 52854707 58257001 63537900
3520 63537900 68608742 72564867 74609637 74114624 72027264 68521028 64123454 59269284
$$ packed form
3586B6178172M3356N0857n690O1958j05038l70862m46499l24633k15978l89099
3576B4476544k32812j32119q34716n65686p4272j61049k19180k71991l72077k45372
3566B1367270j21531j98214k0145n53318k35747k26500k07955o5544l00454J19322
3556A9557184j70674m38352j69300p2148j56408q0310J12142J2995n3551K9624
3546A8571202K60114L11817J52943K01074K64901M54633L64412O82814O42875
3537B1906785N54890O86472R59205J082700R50777J167464J524674J410133K157186
3528C2400286K251101K597375K919936L527107M363896M795006N402294N280899
3520F3537900N070842L956125K044770m95013k087360l506236m397574m854170
$$ plain form
3512 59269284 54656851 50314288 46451971 43191267 40558660 38392815 36408014 35187105
3504 35187105 34071468 33111276 32068250 31173835 30661118 30281327 30166698 30081398 30073368 30205061
3494 30205061 30411485 30585332 31495618 32188597 33031263 34107883 35438939 36895030 38369009
3485 38369009 40614014 42675000 44963882 47312689 49365671 51127026 52674608 54205683
3477 54205683 55377154 55869821 56094694 55987540 55201792 54351490 53497330 52309478 50438319
3468 50438319 48347132 46462425 44400435 42329565 40334149 39086368 38116998 37004822
3460 37004822 36075228 35435189 34864694 34547317 34504205 34549195 34942357 35637778 36271168 37034066
3450 37034066 37655648 38051612 38323424 38742462 39081496 39512144 40384058 41553317 42688782
$$ packed form
3512E9269284m612433m342563l862317l260704k632607k165845j984801j220909
3504C5187105j115637r60192j043026q94415n12717l79791j14629q5300q030J31693
3494C0205061K06424J73847R10286O92979Q42666J076620J331056J456091J473979
3485C8369009K245005K060986K288882K348807K052982J761355J547582J531075
3477E4205683J171471M92667K24873j07154p85748q50302q54160j187852j871159
3468E0438319k091187j884707k061990k070870j995416j247781r69370j112176
3460C7004822r29594o40039n70495l17377m3112M4990L93162O95421O33390P62898
3450C7034066O21582L95964K71812M19038L39034M30648Q71914J169259J135465
$$ plain form
3441 42688782 43867286 45051221 46473879 47714349 49114781 50748843 52107208 53612370
3433 53612370 55706178 57668624 59946634 62982906 66778127 71226742 76379780 82381419
3425 82381419 89689435 97836376 106526707 115249970 123436620 130885824 136335589 139490398
3417 139490398 140070933 138756454 135945336 132105125 127693584 123375989 119168650 115370577
3409 115370577 112211079 110186592 109459173 110312791 113024544 117547248 123965890 132489838
3401 132489838 142119002 152226581 160970516 166665612 168705933 167047148 162942762 157225028
3393 157225028 150754773 144567313 138880633 133554415 128384102 122834646 117121231 111308383
3385 111308383 105175699 99481761 93939222 88832016 84358736 80443904 77396325 75203676
$$ packed form
3441D2688782J178504J183935J422658J240470J400432J634062J358365J505162
3433E3612370K093808J962446K278010L036272L795221M448615N153038O001639
3425H2381419P308016Q146941Q690331Q723263Q186650P449204N449765L154809
3417A39490398N80535j314479k811118l840211m411541m317595m207339l798073
3409A15370577l159498k024487p27419Q53618K711753M522704O418642Q523948
3401A32489838R629164J0107579Q743935N695096K040321j658785m104386n717734
3393A57225028o470255o187460n686680n326218n170313n549456n713415n812848
3385A11308383o132684n693938n542539n107206m473280l914832l047579k192649
$$ plain form
3377 75203676 73830440 73012036 72966425 73343687 74268417 76044755 78286820 80823901 83762930
3368 83762930 86778414 90131988 93610559 96806848 99191313 100881480 101060527 100103516
3360 100103516 98039877 94599132 90990247 87127448 83075882 79297484 75818966 72689233
3352 72689233 70383886 68197168 66337437 64312568 62682878 61271220 59771542 58195399
3344 58195399 56787676 55666896 54258283 52681933 50972576 49785937 48620399 47323285
3336 47323285 46304643 45357048 44437453 43611899 43046856 42061116 41190976 40351185 39596797
3327 39596797 38963793 38359636 37926765 37567998 37109166 36711126 36468091 36423025 36370145 36382783
3317 36382783 36573568 36821472 36944048 37240918 37952275 38479743 39052279 40067453 41168585
$$ packed form
3377G5203676j373236q18404m5611L77262R24730J776338K242065K537081K939029
3368H3762930L015484L353574L478571L196289K384465J690167J79047r57011
3360A00103516k063639l440745l608885l862799m051566l778398l478518l129733
3352G2689233k305347k186718j859731k024869j629690j411658j499678j576143
3344E8195399j407723j120780j408613j576350j709357j186639j165538j297114
3336D7323285j018642r47595r19595q25554n65043r85740q70140q39791p54388
3327C9596797o33004o04157m32871l58767m58832l98040k43035m5066n2880J2638
3317C6382783J90785K47904J22576K96870P11357N27468N72536J015174J101132
$$ plain form
3308 41168585 42023241 42902893 43891962 45211096 46448483 47625744 48790407 49854057 50651603
3299 50651603 51644925 52557932 53335172 54251131 54908169 55478781 55972436 56522162 57622026
3290 57622026 58596537 59929992 61355159 63211333 65604776 68389992 71642288 75588335
3282 75588335 79943228 84428788 89443362 94506426 99112949 102738389 105182632 105750089
3274 105750089 104780880 102310247 98721368 94270964 89149809 83789972 78428059 73524765
3266 73524765 69222389 65379957 62114893 59064412 56372058 54202380 52290647 50848453
3258 50848453 49746849 48896361 48756349 48585980 48379451 49038805 49826836 50969396 52359915
3249 52359915 54309857 56568351 59581618 63113924 66391659 69815094 72703369 74576537
$$ packed form
3308D1168585Q54656Q79652R89069J319134J237387J177261J164663J063650P97546
3299E0651603R93322R13007P77240R15959O57038N70612M93655N49726J099864
3290E7622026R74511J333455J425167J856174K393443K785216L252296L946047
3282G5588335M354893M485560N014574N063064M606523L625440K444243N67457
3274A05750089r69209k470633l588879m450404n121155n359837n361913m903294
3266G3524765m302376l842432l265064l050481k692354k169678j911733j442194
3258E0848453j101604q50488j40012j70369k06529O59354P88031J142560J390519
3249E2359915J949942K258494L013267L532306L277735L423435K888275J873168
$$ plain form
3241 74576537 75641585 75399572 73966055 71332501 68259885 64862099 61327485 57847451
3233 57847451 54951576 52350734 50179539 48550101 47075333 45969837 45207692 45026741
3225 45026741 45269817 45767338 46033499 46942117 48546522 50686977 53413459 56948136 61138252
3216 61138252 65480716 70509778 75295532 79420656 82165195 82784712 81239542 78126000
3208 78126000 73471508 68296220 63143025 58240925 53955502 50273683 47365276 44885041
3200 44885041 42759104 41277218 40237874 39258946 38885950 38745695 38814103 39192418 40360132
3191 40360132 41321061 42710477 44607303 46634343 49365318 52181987 55069426 58445745
3183 58445745 61437864 63989760 66230268 67372075 67601823 67088257 65912716 64030854
$$ packed form
3241G4576537J065048k42013j433517k633554l072616l397786l534614l480034
3233E7847451k895875k600842k171195j629438j474768j105496p62145j80951
3225D5026741K43076M97521K66161R08618J604405K140455K726482L534677M190116
3216F1138252M342464N029062M785754M125124K744539O19517j545170l113542
3208G8126000m654492n175288n153195m902100m285423l681819k908407k480235
3200D4885041k125937j481886j039344r78928l72996j40255O8408L78315J167714
3191D0360132R60929J389416J896826K027040K730975K816669K887439L376319
3183E8445745K992119K551896K240508J141807K29748n13566j175541j881862
$$ plain form
3175 64030854 61813902 60074633 58361734 57128710 56551044 56628084 57315651 59203614 61797452
3166 61797452 65555758 70532541 76517612 83689914 91585299 98739787 104970651 109001912
3158 109001912 109924559 107904787 103098622 96236895 88242082 79854111 71602844 64320767
3150 64320767 57586771 51796284 47139744 43018853 39350459 36105585 33356654 31291904
3142 31291904 29202177 27584491 25868338 24385463 23238479 22154383 21635359 20665690
3134 20665690 19806773 19294362 18436538 17906509 17356989 16506680 15949312 15402748 14621606
3125 14621606 14213239 13666517 13253312 13197697 12852889 12389904 12207157 11807125 11407852 11246978
3115 11246978 11237345 10911435 10762337 10780466 10434871 10203755 9809428 9514934 9384149 9146266
$$ packed form
3175F4030854k216952j739269j712899j233024n77666P7040O87567J887963K593838
3166F1797452L758306M976783N985071P172302P895385P154488O230864M031261
3158A09001912R22647k019772m806165o861727p994813q387971q251267p282077
3150F4320767o733996n790487m656540m120891l668394l244874k748931k064750
3142C1291904k089727j617686j716153j482875j146984j084096n19024r69669
3134B0665690q58917n12411q57824n30029n49520q50309n57368n46564p81142
3125A4621606m08367n46722m13205n5615l44808m62985j82747m00032l99273j60874
3115A1246978r633l25910j49098J8129l45595k31116l94327k94494j30785k37883
$$ plain form
3105 9146266 8942616 8779787 8831772 8712896 8478395 8258651 8170042 7982567 7610591 7613286
3095 7613286 7501203 7145260 7186448 7160885 6726236 6390392 6481758 6703167 6586250 6290793
3085 6290793 6057191 6261931 6328298 5923479 5591482 5657397 5614691 5526328 5419475 5172123
3075 5172123 4994154 4972167 4994101 4948951 4704955 4444118 4482778 4406225 4388481 4264805 4255463
3064 4255463 4470352 4348675 4114619 3841634 3847646 3985452 3831282 3996479 4128435 3897140
3054 3897140 3628366 3439998 3223641 3056456 3342832 3341089 3178709 2958931 3163711 3177974
3044 3177974 3024460 2925826 2976987 2808532 2788420 3067447 2857722 2742520 2749613 2670663 2580363
3033 2580363 2545569 2538275 2503002 2497217 2650263 2652844 2652246 2778249 2680453 2638221 2717780 2698604
$$ packed form
3105I146266k03650j62829N1985j18876k34501k19744q8609j87475l71976K695
3095G613286j12083l55943M1188k5563m34649l35844R1366K21409j16917k95457
3085F290793k33602K04740O6367m04819l31997O5915m2706q8363j06853k47352
3075E172123j77969k1987K1934m5150k43996k60837L8660p6553j7744j23676r342
3064D255463K14889j21677k34056k72985O012J37806j54170J65197J31956k31295
3054C897140k68774j88368k16357j67185K86376j743j62380k19778K04780J4263
3044C177974j53514r8634N1161j68455k0112K79027k09725j15202P093p8950r0300
3033B580363l4794p294l5273n785J53046K581n98J26003r7796m2232P9559j9176
$$ plain form
3021 2698604 2470999 2316192 2726599 2631764 2683119 2705666 2530420 2398829 2103260 1931460
3011 1931460 2446008 2269118 2072088 2473231 2415667 2214976 2300628 1966062 2023587 2361918
3001 2361918 2368356 2288117 2244159 2103804 2235588 2347648 2342128 2419862 2385649 2458302 2538276
2990 2538276 2236403 2060035 2124861 2246772 2468858 2190372 2083788 2294942 2260269 2299838
2980 2299838 2179166 2133088 2180650 2124258 2208939 1914183 1767574 2066833 2038173 1639838
2970 1639838 1724167 1501761 1628151 1697091 1821801 1758048 1680446 1743708 1813725 1719630 1763571
2959 1763571 1766815 1658861 1602951 1726245 1821436 1784048 1597976 1518594 1498652 1770696 1675937
2948 1675937 1726085 1548627 1324618 1433970 1454561 1658385 1578127 1480652 1400098 1324520 1086181
$$ packed form
3021B698604k27605j54807M10407r4835N1355K2547j75246j31591k95569j71800
3011A931460N14548j76890j97030M01143n7564k00691Q5652l34566N7525L38331
3001B361918O438q0239m3958j40355J31784J12060n520P7734l4213P2653P9974
2990B538276l01873j76368O4826J21911K22086k78486j06584K11154l4673L9569
2980B299838j20672m6078M7562n6392Q4681k94756j46609K99259k8660l98335
2970A639838Q4329k22406J26390O8940J24710o3753p7602O3262P0017r4095M3941
2959A763571L244j07954n5910J23294R5191l7388j86072p9382j9942K72044r4759
2948A675937N0148j77458k24009J09352K0591K03824q0258r7475q0554p5578k38339
$$ plain form
2937 1086181 946493 1076070 1379334 1325497 1314918 1244816 1372233 1316516 1391192 1360026 1175876
2926 1175876 1291988 1569901 1540739 1600854 1565062 1224007 1055026 1160081 1245642 1321967
2916 1321967 1248018 959763 907461 1059946 927132 935509 849311 973034 1009885 1172991 1233434
2905 1233434 1054270 1086552 1110221 1349049 1390770 1337578 1320764 1280932 1111175 1084377 1199032
2894 1199032 1258961 1200366 1349584 1267124 953661 802793 1009878 1177975 1044110 949844
2884 949844 1036383 808928 536507 687467 660438 915566 919368 877413 922055 886536 713848
2873 713848 649577 1135616 1511159 1325618 1161442 1054375 930679 893605 847975 939610
2863 939610 804605 845192 894011 589927 418098 634837 573019 414670 529930 736656
$$ packed form
2937A086181j39688J29577L03264n3837j0579p0102J27417n5717P4676l1166j84150
2926A175876J16112K77913k9162O0115l5792l41055j68981J05055Q5561P6325
2916A321967p3949k88255n2302J52485j32814Q377q6198J23723L6851J63106O0443
2905A233434j79164L2282K3669K38828M1721n3192j6814l9832j69757k6798J14655
2894A199032N9929n8595J49218q2460l13463j50868K07085J68097j33865r4266
2884I49844Q6539k27455k72421J50960k7029K55128L802m1955M4642l5519j72688
2873G13848o4271M86039L75543j85541j64176j07067j23696l7074m5630R1635
2863I39610j35005M0587M8819l04084j71829K16739o1818j58349J15260K06726
$$ plain form
2853 736656 603782 414157 394780 489511 385849 514912 535889 388909 549408 510333
2843 510333 568579 740023 726783 580302 519079 638784 490319 672228 605806 475103
2833 475103 464788 462600 348750 442989 481745 402952 408055 671782 447674 12489 126081
2822 126081 317735 189976 187318 36475 159205 338946 319616 497953 364864 117355
2812 117355 115267 301329 517237 304564 111023 328087 495952 481889 525639 554769 388328
2801 388328 436802 388030 354465 434376 305886 329031 362935 35382 213644 296932 402593
2790 402593 458602 364590 375014 497608 424563 383512 380573 337102 249981 50839 -184977
2779 -184977 -228453 89183 293264 75903 357957 432218 366234 37555 40542 209813 236844
$$ packed form
2853G36656j32874j89625j9377R4731j03662J29063K0977j46980J60499l9075
2843E10333N8246J71444j3240j46481o1223J19705j48465J81909o6422j30703
2833D75103j0315k188j13850R4239L8756p8793N103K63727k24108m35185J13592
2822A26081J91654j27759k658j50843J22730J79741j9330J78337j33089k47509
2812A17355k088J86062K15908k12673j93541K17064J67865j4063M3750K9130j66441
2801C88328M8474m8772l3565P9911j28490K3145L3904l27553J78262Q3288J05661
2790D02593N6009r4012J0424J22594p3045m1051k939m3471q7121j99142k35816
2779a84977m3476L17636K04081k17361K82054P4261o5984l28679K987J69271K7031
$$ plain form
2768 236844 278473 30431 -141453 -140219 214125 280218 229520 375315 363713 254830 284443
2757 284443 216989 -8344 417783 435211 558152 408837 482843 373883 263850 413249
2747 413249 439841 360135 225221 400156 308964 185823 212959 125994 62124 260108 87224
2736 87224 47011 82528 -4315 -46866 -204732 6469 291527 445546 523518 425658 272551
2725 272551 197022 75178 116489 -39703 -48038 128875 259270 318523 195498 -104406 167562
2714 167562 426592 187827 254113 412510 382211 73605 893 13939 162093 -772
2704 -772 -44865 204765 147577 -4645 223 220339 246163 282992 -35780 -83295 77618
2693 77618 58379 232103 353962 625765 480943 618872 422721 632115 548072 357165
$$ packed form
2768B36844M1629k48042j71884J234L54344O6093n0698J45795j1602j08883K9613
2757B84443o7454k25333M26127J7428J22941j49315P4006j08960j10033J49399
2747D13249K6592p9706j34914J74935r1192j23141K7136q6965o3870J97984j72884
2736H7224m0213L5517q6843m2551j57866K11201K85058J54019P7972r7860j53107
2725B72551p5529j21844M1311j56192q335J76913J30395N9253j23025k99904K71968
2714A67562K59030k38765O6286J58397l0299l08606p2712J3046J48154j62865
2704g72m4093K49630n7188j52222M868K20116K5824L6829l18772m7515J60913
2693G7618j9239J73724J21859K71803j44822J37929j96151K09394q4043j90907
$$ plain form
2683 357165 399303 489224 501173 528482 283571 309883 448168 261727 72325 101457 278410
2672 278410 129338 152813 380229 337405 563594 439648 198555 185889 161009 294171
2662 294171 417985 333559 399599 710156 505756 287161 415326 401574 434537 302729
2652 302729 264678 107580 249839 63429 -120434 -133336 98064 239939 397359 328908
2642 328908 218058 270715 289754 329785 105251 281087 320464 333620 168963 61039 115320
2631 115320 291504 338949 344201 301445 300015 359436 476032 574398 372093 399133 210685
2620 210685 410108 554216 554149 495853 396377 512148 417042 479844 443588 654574 689037
2609 689037 509341 433944 424878 582922 730893 829976 991540 1219638 1713706 1943781
$$ packed form
2683C57165M2138Q9921J1949K7309k44911K6312J38285j86441j89402K9132J76953
2672B78410j49072K3475K27416m2824K26189j23946k41093j2666k4880J33162
2662B94171J23814q4426O6040L10557k04400k18595J28165j3752L2963j31808
2652C02729l8051j57098J42259j86410j83863j2902K31400J41875J57420o8451
2642C28908j10850N2657J9039M0031k24534J75836L9377J3156j64657j07924N4281
2631A15320J76184M7445N252m2756j430N9421J16596R8366k02305K7040j88448
2620B10685J99423J44108o7n8296r9476J15771r5106O2802l6256K10986L4463
2609F89037j79696p5397r066J58044J47971R9083J61564K28098M94068K30075
$$ plain form
2599 1943781 2241568 2126344 1935737 1626827 1378401 1100081 996806 942248 962657 958711
2589 958711 779144 576486 423103 389351 345342 391587 615080 692868 690109 548157 323829
2578 323829 228772 277197 473380 462260 611522 444028 353985 184977 177675 312140 384823
2567 384823 587033 530644 698491 633586 574525 490278 349155 403592 557509 367373 530592
2556 530592 335223 298811 342253 3842 91219 186730 310782 446946 380616 515576 554796
2545 554796 598660 332540 468249 521273 415807 520827 525012 417590 414796 567544 496775
2534 496775 382336 646474 604839 411551 466851 452908 360045 490368 515217 585204 638093
2523 638093 644573 646058 575882 565759 538755 228466 198480 256283 390815 426611 486882 506145
$$ packed form
2599A943781K97787j15224j90607l08910k48426k78320j03275n4558K0409l946
2589I58711j79567k02658j53383l3752m4009M6245K23493P7788k759j41952k24328
2578C23829r5057M8425J96183j1120J49262j67494r0043j69008p302J34465P2683
2567C84823K02210n6389J67847o4905n9061q4247j41123N4437J53917j90136J63219
2556E30592j95369l6412M3442l38411Q7377R5511J24052J36164o6330J34960L9220
2545E54796M3864k66120J35709N3024j05466J05020M185j07422k794J52748p0769
2534D96775j14439K64138m1635j93288N5300j3943r2863J30323K4849O9987N2889
2523F38093O480J485p0176j0123k7004l10289k9986N7803J34532L5796O0271J9263
$$ plain form
2511 506145 449923 977330 858989 683868 660540 744826 718063 769422 628311 762935 750830
2500 750830 772039 713297 485868 614481 742301 888264 839624 824100 934458 846765 1188281
2489 1188281 1214457 1231370 1162177 967646 1095911 1102980 1198654 1055811 1004292 1147273 1080860
2478 1080860 1074283 945224 834720 844967 1112928 1428979 1464757 1230287 1282268 1091549
2468 1091549 919669 1055033 1210073 1075488 1030311 1300549 1163090 1230267 1576743 1495884
2458 1495884 1359006 1344880 1449877 1470777 1595620 1595077 1653139 1649148 1577950 1581235 1583866 1587293
2446 1587293 1689263 1635958 1513511 1744567 1609784 1785145 1730132 1677138 1828571 1986128
2436 1986128 1631757 1883065 2084606 1890439 1825892 1928548 2095350 2041246 1926258 1940635
$$ packed form
2511E06145n6222N27407j18341j75121k3328Q4286k6763N1359j41111J34624j2105
2500G50830K1209n8742k27429J28613J27820J45963m8640j5524J10358q7693L41516
2489A188281K6176J6913o9193j94531J28265P069R5674j42843n1519J42981o6413
2478A080860o577j29059j10504J0247K67961L16051L5778k34470N1981j90719
2468A091549j71880J35364J55040j34585m5177K70238j37459O7177L46476q0859
2458A495884j36878j4126J04997K0900J24843n43N8062l991p1198L285K631L427
2446A587293J01970n3305j22447K31056j34783J75361n5013n2994J51433J57557
2436A986128l54371K51308K01541j94167o4547J02656J66802n4104j14988J4377
$$ plain form
2426 1940635 2262343 2215330 2276622 2376116 2576152 2669317 2720195 2689529 2725382 2596188 2743418
2415 2743418 2568668 2660899 2486907 2751275 2881909 2957440 3052456 2946315 2940217 3226242
2405 3226242 3210027 3310145 3182699 3245992 3250258 3481792 3624857 3897405 3673152 3806154
2395 3806154 4115366 4106993 3813472 3922809 3888390 4072818 4056206 4092941 4147036 4599602 4828060
2384 4828060 4982627 5214014 5308679 5450563 5357956 5321804 5451384 5547608 5632617 5864878
2374 5864878 5850872 6327030 6569916 6542049 6828226 7037203 7389564 7681922 7654240 8054072
2364 8054072 8336143 8357560 8309568 8478652 8441575 8474256 8526293 9063584 9186662 10109045
2354 10109045 10720562 11674357 12950235 15272445 18297605 22054555 25726726 28085388
$$ packed form
2426A940635L21708m7013O1292R9494K00036R3165N0878l0666L5853j29194J47230
2415B743418j74750R2231j73992K64368J30634P5531R5016j06141o098K86025
2405C226242j6215J00118j27446O3293M266K31534J43065K72548k24253J33002
2395C806154L09212q373k93521J09337l4419J84428j6612L6735N4095M52566K28458
2384D828060J54567K31387R4665J41884r2607l6152J29580R6224Q5009K32261
2374E864878j4006M76158K42886k7867K86177K08977L52361K92358k7682L99832
2364H054072K82071K1417m7992J69084l7077L2681N2037N37291J23078R22383
2354A0109045O11517R53795J275878K322210L025160L756950L672171K358662
$$ plain form
2346 28085388 28443142 28778377 29503273 31920307 34752187 40117000 47210968 58370352
2338 58370352 75324199 104888085 147790080 213493033 307896199 408293543 417990414
2331 417990414 364451166 305596893 237318184 183848672 139195569 106008035 81205243
2324 81205243 63487497 50282889 43483790 39517070 37585543 36424829 36857874 34811601
2316 34811601 32040966 29038775 26162414 23540312 21432089 19359062 18231051 17006076
2308 17006076 16086582 15112818 14618815 13653691 12964158 11908023 11271256 10652009 9899143
2299 9899143 9354478 9332915 9167574 8889361 8094903 8105759 7942580 7759894 7414864 7289251
2289 7289251 7062271 6693889 6744896 6850726 6695814 6572499 5986566 5628001 5587669 5472167
$$ packed form
2346B8085388L57754L35235P24896K417034K831880N364813P093968J1159384
2338E8370352J6953847K9563886M2901995O5702953R4403166J00397344R696871
2331D17990414n3539248n8854273o8278709n3469512m4653103l3187534k4802792
2324H1205243j7717746j3204608o799099l966720j931527j160714M33045k046273
2316C4811601k770635l002191k876361k622102k108223k073027j128011j224975
2308A7006076r19494r73764m94003r65124o89533j056135o36767o19247p52866
2299I899143n44665k1563j65341k78213p94458J0856j63179j82686l45030j25613
2289G289251k26980l68382N1007J05830j54912j23315n85933l58565m0332j15502
$$ plain form
2279 5472167 5192627 5082383 5090399 5133309 5062894 4646082 4291562 4453255 4414350 4291095
2269 4291095 4094416 3830608 3805513 3642213 3695248 3733242 3757460 3784844 3491376 3251399
2259 3251399 3124980 3020946 3265181 3079303 2878315 2702706 2765119 2757008 2508024 2546552
2249 2546552 2635481 2484729 2521809 2296066 2073168 1984049 2050845 1935310 2017911 2104680 2019887
2238 2019887 1705141 1765394 1811549 1931824 1781052 1869799 1962575 2119721 1923571 1780327
2228 1780327 1835977 1879247 1767561 1483439 1679542 1681208 1592170 1700969 1506589 1510044 1567544
2217 1567544 1466898 1217028 1483694 1522847 1450252 1498540 1215505 863506 841417 1023067
2207 1023067 1308678 1134138 964642 1158297 1147171 820605 855252 996251 900639 954509
$$ packed form
2279E472167k79540j10244Q016M2910p0415m16812l54520J61693l8905j23255
2269D291095j96679k63808k5095j63300N3035L7994K4218K7384k93468k39977
2259C251399j26419j04034K44235j85878k00988j75609O2413q111k48984L8528
2249B546552Q8929j50752L7080k25743k22898q9119O6796j15535Q2601Q6769q4793
2238B019887l14746O0253M6155J20275j50772Q8747R2776J57146j96150j43244
2228A780327N5650M3270j11686k84122J96103J666q9038J08799j94380L455N7500
2217A567544j00646k49870K66666L9153p2595M8288k83035l51999k2089J81650
2207A023067K85611j74540j69496J93655j1126l26566L4647J40999r5612N3870
$$ plain form
2197 954509 714603 620398 521902 738385 1086011 972309 934333 821320 654369 657056 443841
2186 443841 430781 434874 288176 441991 646310 722191 711875 870542 703362 649380 788403
2175 788403 430806 646005 716075 784226 589984 378975 589079 285851 317891 241996
2165 241996 293734 432984 516706 362007 460291 613972 496249 79999 210417 338829
2155 338829 302022 323791 387365 520552 462468 299706 320250 319914 342727 254496 488099
2144 488099 344169 111939 260532 441046 363232 411642 439155 326675 365373 425337 516183
2133 516183 408402 441781 428283 522904 382992 307666 674072 781739 364345 334471 423763
2122 423763 306327 180032 143406 303118 369513 331889 72190 -14098 -83759 -139670 -85200
$$ packed form
2197I54509k39906r4205r8496K16483L47626j13702l7976j13013j66951K687k13215
2186D43841j3060M093j46698J53815K04319P5881j0316J58667j67180n3982J39023
2175G88403l57597K15199P0070O8151j94242k11009K10104l03228L2040p5895
2165B41996N1738J39250Q3722j54699R8284J53681j17723m16250J30418J28412
2155C38829l6807K1769O3574J33187n8084j62762K0544l36K2813q8231K33603
2144D88099j43930k32230J48593J80514p7814M8410K7513j12480L8698N9964R0846
2133E16183j07781L3379j3498R4621j39912p5326L66406J07667m17394k9874Q9292
2122D23763j17436j26295l6626J59712O6395l7624k59699q6288o9661n5911N4470
$$ plain form
2111 -85200 91675 197463 46609 -44477 63854 264267 230384 128938 -37772 -43250 214775
2100 214775 367013 236569 190373 62457 -75903 54814 61180 21159 219543 323746
2090 323746 429148 98232 -47967 143964 -37954 33293 -106828 -242548 82593 272693
2080 272693 491436 130671 160973 22868 18904 326351 345667 281313 181397 164292 594036
2069 594036 711436 442388 648755 1059696 1459994 1828233 1830788 1945144 1748177 1624679
2059 1624679 1271456 952498 772212 227500 268507 169262 43372 -85051 37547 590586
2049 590586 470957 426179 152651 9573 83240 -49157 -233115 -243176 -16262 281683
2039 281683 109499 -78331 29938 172851 -48597 -175841 -77485 -116675 174435 330594
$$ packed form
2111h5200J76875J05788j50854r1086J08331K00413l3883j01446j66710n478K58025
2100B14775J52238j30444m6196j27916j38360J30717O366m0021J98384J04203
2090C23746J05402l30916j46199J91931j81918P1247j40121j35720L25141J90100
2080B72693K18743l60765L0302j38105l964L07447J9316o4354r9916j7105M29744
2069E94036J17400k69048K06367M10941M00298L68239K555J14356j96967j23498
2059A624679l53223l18958j80286n44712M1007r9245j25890j28423J22598N53039
2049E90586j19629m4778k73528j43078P3667j32397j83958j0061K26914K97945
2039B81683j72184j87830J08269J42913k21448j27244R8356l9190K91110J56159
$$ plain form
2029 330594 -5350 -72315 -47641 119165 212027 -18312 -109638 -42441 -50465 68026 106271
2018 106271 -65724 -75930 -133455 45066 57568 45436 -39995 -118802 -58462 -130978 47447
2007 47447 -93104 -97005 -51072 -61316 -69508 40057 151969 -63363 -69423 27320 -96060
1996 -96060 -14917 44382 -93753 -114236 -198719 -303391 -158324 146741 -98681 -13469 -58683
1985 -58683 84453 39427 73208 115419 167374 54340 82506 -53160 -118794 -53342 42321
1974 42321 24747 -175047 -270808 -128206 96403 154226 60294 -103391 -9944 154081 201493
1963 201493 11478 -238080 -87890 27703 -49704 6346 -19641 -66561 19856 196148 -87179
1952 -87179 -247108 -107149 5630 92316 222172 233906 215581 27725 -217503 18583
$$ packed form
2029C30594l35944o6965K4674J66806R2862k30339r1326O7197q024J18491L8245
2018A06271j71995j0206n7525J78521J2502j2132q5431p8807O0340p2516J78425
2007D7447j40551l901M5933j0244q192J09565J11912k15332o060R6743j23380
1996i6060Q1143N9299j38135k0483q4483j04672J45067L05065k45422Q5212m5214
1985e8683J43136m5026L3781M2211N1955j13034K8166j35666o5634O5452R5663
1974D2321j7574j99794r5761J42602K24609N7823r3932j63685R3447J64025M7412
1963B01493j90015k49558J50190J15593p7407N6050k5987m6920Q6417J76292k83327
1952h7179j59929J39959J12779Q6686J29856J1734j8325j87856k45228K36086
$$ plain form
1942 18583 22179 153884 -22436 -111769 6483 16418 -109145 -167756 -52106 -133079 -339298
1931 -339298 -411627 -313204 -73558 -244059 -217491 -31042 176671 43218 21199 163930
1921 163930 -91156 -276033 -376419 -206878 -293305 -308412 -279658 -146766 -90463 -210687
1911 -210687 -260729 -403358 -446412 -540034 -348932 -186578 -404274 -139055 -100297 -183928 -15933
1900 -15933 15605 -178112 -440456 -239202 -363973 -256781 6930 36352 138980 -44339
1890 -44339 131696 248636 -823 -169779 -76960 -177253 -47292 -21775 -96067 -100656 -257344
1879 -257344 -235740 -54310 93606 -32240 6872 -182933 -165675 -25334 82961 -3123
1869 -3123 65661 106941 178133 92645 126415 -44407 -21471 193441 -211086 133471 194307
$$ packed form
1942A8583L596J31705j76320q9333J18252R935j25563n8611J15650q0973k06219
1931c39298p2329R8423K39646j70501K6568J86449K07713j33453k2019J42731
1921A63930k55086j84877j00386J69541q6427j5107K8754J32892N6303j20224
1911b10687n0042j42629m3054r3622J91102J62354k17696K65219L8758q3631J67995
1900a5933L1538j93717k62344K01254j24771J07192K63711K9422J02628j83319
1890d4339J76035J16940k49459j68956R2819j00293J29961K5517p4292m589j56688
1879b57344K1604J81430J47916j25846L9112j89805J7258J40341J08295q6084
1869c123O8784M1280P1192q5488L3770j70822K2936K14912m04527L44557O0836
$$ plain form
1858 194307 -153239 -362994 -333383 -337028 69187 -113326 -123020 -244307 -302792 -202107 -284143
1847 -284143 -292877 -289600 -209106 -8005 161975 83291 -114313 -51653 -179186 125797 149869
1836 149869 -87890 -232023 -308761 -232229 108395 236415 180815 269720 77401 -74570
1826 -74570 16112 -37901 118242 -108891 -1123 -103547 -247361 -92319 -149337 132183
1816 132183 275754 216140 -68579 167020 67241 -116367 -103238 76840 -50763 162669
1806 162669 83484 137076 213419 -228889 -361808 -409120 -458386 -367013 -407144 -330974 -359159
1795 -359159 -158862 -149735 -96488 -182046 -124829 -184561 -358840 -345028 -344922 63832 127536 58579
1783 58579 -146571 -116072 71609 -1975 -155275 -179482 -42625 108419 -116762 -310948
$$ packed form
1858A94307l47546k09755K9611l645M06215j82513r694j21287n8485J00685q2036
1847b84143q734L277Q0494K01101J69980p8684j97604O2660j27533L04983K4072
1836A49869k37759j44133p6738P6532L40624J28020n5600Q8905j92319j51971
1826g4570R0682n4013J56143k27133J07768j02424j43814J55042n7018K81520
1816A32183J43571n9614k84719K35599r9779j83608J3129J80078j27603K13432
1806A62669p9185N3592P6343m42308j32919m7312m9266R1373m0131P6170k8185
1795c59159K00297R127N3247q5558N7217n9732j74279J3812J06M08754O3704o8957
1783E8579k05150L0499J87681p3584j53300k4207J36857J51044k25181j94186
$$ plain form
1773 -310948 -406481 -33989 27959 -242892 -120579 -297049 -186492 -132526 -188986 -98220 -174123
1762 -174123 -265196 -413566 -338211 35301 201103 206090 -7198 85062 165219 -33735 31413
1751 31413 277207 264907 70276 -52910 -175831 -272683 -335389 -212791 104251 52914 -286386
1740 -286386 -8391 53251 74054 -22444 -186886 -368513 -151498 -95015 -55399 -61923 -128854
1729 -128854 -16063 -78096 6332 -190661 -313017 3189 -38882 48309 58077 -47025 233868
1718 233868 37716 12558 -64964 -18148 -95046 76851 357624 45925 -53930 -98760 -237954
1707 -237954 -122498 -240465 -99793 -72642 -180333 -342787 -350733 -276437 -136209 -138756 -146341
1696 -146341 -211530 -349427 -166563 -78671 -84351 -54082 147702 145614 -198023 -346195 -177840
$$ packed form
1773c10948r5533L72492O1948k70851J22313j76470J10557N3966n6460R0766p5903
1762a74123r1073j48370P5355L73512J65802M987k13288R2260Q0157j98954O5148
1751C1413K45794j2300j94631j23186j22921r6852o2706J22598L17042n1337l39300
1740b86386K77995O1642K0803r6498j64442j81627K17015N6483L9616o524o6931
1729a28854J12791o2033Q4428j96993j22356L16206m2071Q7191R768j05102K80893
1718B33868j96152k5158p7522M6816p6898J71897K80773l11699r9855m4830j39194
1707b37954J15456j17967J40672K7151j07691j62454p946P4296J40228k547p585
1696a46341o5189j37897J82864Q7892n680L0269K01784k088l43637j48172J68355
$$ plain form
1685 -177840 -92274 -32969 -148966 -136465 209066 46530 3054 -34437 -31436 -376462 -464588
1674 -464588 -288513 -223941 -72132 123655 165925 126947 -139998 -306726 -359704 -544623
1664 -544623 -434486 -195433 -380478 -187826 -229363 -48845 246056 138229 173698 142399
1654 142399 -38716 54405 57243 -57134 73585 78345 56660 224590 299761 196788 156697
1643 156697 248459 189173 -159847 -10533 -221799 -145616 -219515 -207964 -204670 94711 -81218
1632 -81218 -177459 -194272 -56698 -281028 -299634 -168274 -5214 -130724 -260199 141455
1622 141455 66401 -223443 -265337 -214688 -390056 -284250 -230408 -238495 -143338 -458209 -379441
1611 -379441 180660 53873 -136000 -132943 42571 94853 82172 286094 147805 -10928
$$ packed form
1685a77840Q5566N9305j15997J2501L45531j62536m3476l7491L001l45026q8126
1674d64588J76075O4572J51809J95787M2270l8978k66945j66728n2978j84919
1664e44623J10137K39053j85045J92652m1537J80518K94901j07827L5469l1299
1654A42399j81115R3121K838j14377J30719M760k1685J67930P5171j02973m0091
1643A56697R1762n9286l49020J49314k11266P6183p3899J1551L294K99381j75929
1632h1218r6241j6813J37574k24330j8606J31360J63060j25510j29475M01654
1622A41455p5054k89844m1894N0649j75368J05806N3842q087R5157l14871P8768
1611c79441N60101j26787j89873L057J75514N2282j2681K03922j38289j58733
$$ plain form
1601 -10928 -96611 -97136 -128928 -128976 -120717 -46629 -217762 40467 258211 231062 53506 -149266
1589 -149266 -121524 56419 97446 -90184 -182478 -239529 -290651 -24167 -74355 115593 225024
1578 225024 76789 98283 -35588 -79292 31895 -109770 -125336 -63880 -79905 -224163 -382123
1567 -382123 -143181 -72329 -53289 -91610 -231118 -344680 -34875 -142349 -87922 -224131
1557 -224131 -273584 -87427 -185172 -218053 -41361 28067 40026 230880 224244 77661 -48423
1546 -48423 -251614 -14402 76495 37967 -88880 -60373 74799 427344 295538 61607
1536 61607 3121 22426 -129691 -227069 -139441 -252424 -91807 -316627 -399348 -236321 -300812
1525 -300812 -213689 -72897 32287 156406 66793 -194357 -380559 -470106 -273356 -174181
$$ packed form
1601a0928q5683n25l1792m8Q259P4088j71133K58229K17744k7149j77556k02772
1589a49266K7742J77943M1027j87630r2294n7051n1122K66484n0188J89948J09431
1578B25024j48235K1494j33871m3704J11187j41665j5566O1456j6025j44258j57960
1567c82123K38942P0852J9040l8321j39508j13562L09805j07474N4427j36209
1557b24131m9453J86157r7745l2881J76692O9428J1959J90854o636j46583j26084
1546d8423k03191K37212R0897l8528j26847K8507J35172L52545j31806k33931
1536F1607n8486J9305j52117r7378Q7628j12983J60617k24820q2721J63027o4491
1525c00812Q7123J40792J05184J24119q9613k61150j86202q9547J96750R9175
$$ plain form
1515 -174181 -33391 -169140 -38073 -113649 -33316 123277 65507 -89892 -204503 -298225
1505 -298225 -363914 -308219 -466137 -631855 -408287 -331948 -149121 -74408 -91626 -125844 -245581
1494 -245581 -143246 -219536 156130 73111 -300523 -202625 -112545 -62812 -171097 -149884 -259938
1483 -259938 -170952 16563 25733 110998 -228534 -48626 1250 -27449 -166540 -42266 -102863
1472 -102863 -201565 -368863 -438982 -277783 -425667 -366548 -220771 -129511 -129573 -175555 -149801
1461 -149801 -292312 -348349 -210411 -48837 35264 -227238 -319078 -448512 -368451 -106778
1451 -106778 -75361 -114043 -151781 -94193 -391079 -149240 65121 -683 176665 -84928 -120619
1440 -120619 -275454 -113766 -73970 -123052 -225050 -35452 -88040 -156773 59208 -269130
$$ packed form
1515a74181J40790j35749J31067p5576Q0333J56593n7770j55399j14611r3722
1505b98225o5689N5695j57918j65718K23568P6339J82827P4713j7218l4218j19737
1494b45581J02335p6290L75666q3019l73634R7898R0080M9733j08285K1213j10054
1483b59938Q8986J87515R170Q5265l39532J79908M9876k8699j39091J24274o0597
1472a02863r8702j67298p0119J61199j47884N9119J45777R1260o2m5982K5754
1461a49801j42511n6037J37938J61574Q4101k62502r1840j29434Q0061K61673
1451a06778L1417l8682l7738N7588k96886K41839K14361o5804J77348k61593l5691
1440a20619j54835J61688L9796m9082j01998J89598n2588o8733K15981l28338
$$ plain form
1430 -269130 -213936 -7292 7377 -179042 -259907 -172790 -98446 -277967 -140720 -5795 -159383
1419 -159383 -204296 150889 -142334 -175183 -218894 -66058 86918 -99310 -318737 -119318
1409 -119318 -36767 -23459 -174122 -77209 92799 -321104 -398941 -432247 -360163 -22336 105714
1398 105714 -63200 -59744 132816 129998 14892 68700 47893 66359 597 -33379 62713
1387 62713 -140404 -219340 -213727 -33930 5404 -117341 -46021 -197057 -294865 -336431 -49334
1376 -49334 72113 -165155 -101803 -159339 -490162 -299381 -168462 -12768 11493 -144032
1366 -144032 -201647 -22435 -62436 84183 -47752 -188923 -189529 40304 39555 -186031 -426670
1355 -426670 -423246 -93737 -51112 -186238 -153679 161284 117840 -354516 -334321 -121160 -186967
$$ packed form
1430b69130N5194K06644J4669j86419q0865Q7117P4344j79521J37247J34925j53588
1419a59383m4913L55185k93223l2849m3711J52836J52976j86228k19427J99419
1409a19318Q2551J3308j50663R6913J70008m13903p7837l3306P2084L37827J28050
1398A05714j68914L456J92560k818j15106N3808k0807J8466o5762l3976R6092
1387F2713k03117p8936N613J79797L9334j22745P1320j51036r7808m1566K87097
1376d9334J21447k37268O3352n7536l30823J90781J30919J55694K4261j55525
1366a44032n7615J79212m0001J46619j31935j41171o06K29833p49k25586k40639
1355d26670L424L29509M2625j35126L2559L14963m3444m72356K0195K13161o5807
$$ plain form
1344 -186967 -104569 28157 -305956 -312510 -346085 -496701 -241410 -40462 -62843 -290415 -328768
1333 -328768 -390554 -284912 -170074 52430 -281070 -282019 -30020 -36203 -247167 -79750 -104908
1322 -104908 -203092 -233578 -247939 -163179 -117816 -47772 109470 145735 -101061 -125235 24073
1311 24073 254362 202808 62121 183481 180454 64696 81934 104558 21942 -112631 -324235
1300 -324235 -442236 -170417 -192737 114525 218346 127769 -174823 -305037 -273052 -361237
1290 -361237 -422287 -339289 -427232 -103921 -3920 -545467 -355368 -94770 -201352 -212640
1280 -212640 -217017 -299776 -279360 -186373 -10575 20497 -9794 -120867 -275094 -217532 -184901
1269 -184901 -165481 -367203 -73832 29840 -204227 -338496 -127203 47089 54647 186440
$$ packed form
1344a86967Q2398J32726l34113o554l3575j50616K55291K00948k2381k27572l8353
1333c28768o1786J05642J14838K22504l33500r49K51999o183k10964J67417k5158
1322a04908r8184l0486j4361Q4760M5363P0044J57242L6265k46796k4174J49308
1311B4073K30289n1554j40687J21360l027j15758J7238K2624q2616j34573k11604
1300c24235j18001K71819k2320L07262J03821r0577l02592j30214L1985q8185
1290c61237o1050Q2998q7943L23311J00001n41547J90099K60598j06582j1288
1280b12640m377q2759K0416R2987J75798L1072l0291j11073j54227N7562L2631
1269a84901J9420k01722K93371J03672k34067j34269K11293J74292P558J31793
$$ plain form
1259 186440 -278837 -192432 -97396 -189565 -132149 -310036 -338026 -272174 -195301 -3374 46059
1248 46059 211506 199562 -117267 -354664 -150718 24075 31436 3359 171194 5011 -222758
1237 -222758 -255200 -256624 -14937 326643 92967 51214 -191183 -353320 -141095 -94947 -21386
1226 -21386 77717 32818 110736 22841 -108709 -148602 -75671 -76333 -218629 -69693 -242363
1215 -242363 -146843 -87116 -64551 -290021 -394685 -223223 -145248 -233090 -208185 -191217 -35932
1204 -35932 -149027 -298097 -392904 -387703 -274618 -225453 -144486 -285058 -189821 3661 117909
1193 117909 148330 -8731 186631 295664 231441 -57716 73498 137571 -40826 78032
1183 78032 -131358 160 33333 19159 -48318 -38002 268675 197463 51696 129729 -76540
$$ packed form
1259A86440m65277Q6405R5036r2169N7416j77887k7990O5852P6873J91927M9433
1248D6059J65447j1944l16829k37397K03946J74793P361k8077J67835j66183k27769
1237b22758l2442j424K41687L41580k33676m1753k42397j62137K12225M6148P3561
1226b1386R9103m4899P7918q7895j31550l9893P2931o62j42296J48936j72670
1215b42363R5520N9727K2565k25470j04664J71462P7975q7842K4905J6968J55285
1204c5932j13095j49070r4807N201J13085M9165Q0967j40572R5237J93482J14248
1193A17909L0421j57061J95362J09033o4223k89157J31214O4073j78397J18858
1183G8032k09390J31518L3173j4174o7477J0316L06677p1212j45767P8033k06269
$$ plain form
1172 -76540 -145613 -296770 -242397 -263045 -212857 -209126 -270969 47740 230587 138874 -171945
1161 -171945 -274907 -66805 -100241 -283962 -96999 19214 -138421 -129687 -189346 -206226 -71095
1150 -71095 -244821 -85615 102796 -19955 -124752 -28810 12937 -283013 -121169 -198597
1140 -198597 -178440 27520 209132 75477 -157726 38553 -149570 -76570 -44646 40742
1130 40742 39457 194433 -10836 20160 7355 -414329 -188650 -44845 20773 66942 -309361
1119 -309361 -382723 -229104 -130651 -185843 -210890 -106008 -226589 -95669 -6933 -122321 -295711
1108 -295711 -179336 -60729 229433 102526 -28383 217136 -61880 260936 99577 -48273
1098 -48273 86296 -117000 7354 -56447 -348143 -420420 -236332 -46159 735 -12664 -110329
$$ packed form
1172g6540o9073j51157N4373k0648N0188L731o1843L18709J82847r1713l10819
1161a71945j02962K08102l3436j83721J86963J16213j57635Q734n9659j6880J35131
1150g1095j73726J59206J88411j22751j04797R5942M1747k95950J61844p7428
1140a98597K0157K05960J81612j33655k33203J96279j88123P3000L1924Q5388
1130D0742j285J54976k05269L0996j2805m21684K25679J43805O5618M6169l76303
1119c09361p3362J53619R8453n5192k5047J04882j20581J30920Q8736j15388j73390
1108b95711J16375J18607K90162j26907j30909K45519k79016L22816j61359j47850
1098d8273J34569k03296J24354o3801k91696p2277J84088J90173M6894j3399r7665
$$ plain form
1087 -110329 -57755 63006 -134672 -438771 -310098 -51317 158318 29092 -114403 -31084
1077 -31084 -181537 -178281 -362620 -366659 -59860 -137533 -674 60931 70096 148547 -31706
1066 -31706 -54766 -211015 -91594 -155809 130639 212081 133522 35395 -56953 -219743 64104
1055 64104 -62872 -46095 125517 42484 85124 32182 -231888 -320500 -290000 -101188 -188694
1044 -188694 -334911 -272561 -276356 121234 11099 -143176 -275049 -333779 -328252 -235375 -221566
1033 -221566 -25454 -29617 -55552 -127621 -371347 -371225 -325598 -351057 -221488 82087 120071
1022 120071 -4292 178801 265759 -144984 -239391 -46194 -158933 -71090 46408 -55221
1012 -55221 -136686 -146225 -26793 32583 -60651 -34964 -151388 -121457 2030 265284 72833
$$ packed form
1087a10329N2574J20761j97678l04099J28673K58781K09635j29226j43495Q3319
1077c1084j50453L256j84339m039L06799p7673J36859O1605R165P8451j80253
1066c1706k3060j56249J19421o4215K86448Q1442p8559r8127r2348j62790K83847
1055F4104j26976J6777J71612q3033M2640n2942k64070q8612L0500J88812q7506
1044a88694j46217O2350l795L97590j10135j54275j31873n8730N527R2877J3809
1033b21566J96112m163k5935p2069k43726J22M5627k5459J29569L03575L7984
1022A20071j24363J83093Q6958m10743r4407J93197j12739Q7843J17498j01629
1012e5221q1465r539J19432N9376r3234K5687j16424K9931J23487K63254j92451
$$ plain form
1001 72833 -22752 -185771 -173176 142122 118783 48562 57491 10202 -44444 -88056 128414
990 128414 329359 -75226 76849 111670 110120 69954 47233 -138629 -247495 9354 -43716
979 -43716 -113827 -110408 -53737 -148458 -74356 17116 247850 277801 304942 160800 19756 73495
967 73495 107729 -183808 -222639 53867 81490 -97134 -196938 -187322 -157748 -60266 -93364 27808
955 27808 110327 -217129 -89407 -186566 -153977 -51289 -129906 50916 -66543 -92234 -106812
944 -106812 -115427 -88806 -94882 38117 27720 37468 -96963 71536 275713 118896 -143985
933 -143985 -227013 18095 2142 11145 51774 121438 191741 275 -1585 84584 177788 -5497
921 -5497 -338396 -167016 19627 -44819 -81199 65658 218523 325803 281921 501818 186755
$$ packed form
1001G2833r5585j63019J2595L15298k3339p0221Q929m7289n4646m3612K16470
990A28414K00945m04585J52075L4821j550m0166k2721j85862j08866K56849n3070
979d3716p0111L419N6671r4721P4102R1472K30734K9951K7141j44142j41044N3739
967G3495L4234k91537l8831K76506K7623j78624r9804R616K9574R7482l3098J21172
955B7808Q2519l27456J27722r7159L2589J02688p8617J80822j17459k5691j4578
944a06812q615K6621o076J32999j0397R748j34431J68499K04177j56817k62881
933a43985q3028K45108j5953R003M0629O9664P0303j91466j860Q6169R3204j83285
921e497l32899J71380J86643o4446l6380J46857J52865J07280m3882K19897l15063
$$ plain form
910 186755 242298 -12683 -248758 -222079 -21233 -172612 -98664 59847 42093 -206454 170650
899 170650 186746 58806 222347 192275 7271 -103884 -196200 -12957 118118 -96336
889 -96336 26196 27203 54484 -50 252914 151275 56163 -12518 -87355 -82629 -199020 -225072
877 -225072 -57370 -314868 -360722 -337156 -113334 28862 -180303 -18566 -229072 -370401
867 -370401 -294489 -61344 61374 161873 242528 -39169 -58549 -253138 -221784 -273604 -45719
856 -45719 156719 133668 15059 -223425 87915 3719 -180041 -38665 -105374 -170727 -157489
845 -157489 -165777 83028 37477 -101632 -277342 -186905 99775 167127 31413 -53359 -124016
834 -124016 128227 293547 29495 171850 299601 95483 -36848 249490 51786 -9884
$$ packed form
910A86755N5543k54981k36075K6679K00846j51379P3948J58511j7754k48547L77104
899A70650J6096j27940J63541l0072j85004j11155r2316J83243J31075k14454
889i6336J22532J007K7281n4534K52964j01639r5112o8681p4837M726j16391k6052
877b25072J67702k57498m5854K3566K23822J42196k09165J61737k10506j41329
867c70401P5912K33145J22718J00499Q0655k81697j9380j94589L1354n1820K27885
856d5719K02438k3051j18609k38484L11340q4196j83760J41376o6709o5353J3238
845a57489q288K48805m5551j39109j75710R0437K86680O7352j35714q4772p0657
834a24016K52243J65320k64052J42355J27751k04118j32331K86338j97704o1670
$$ plain form
824 -9884 242633 361312 338716 153654 -1349 106951 -16216 -38822 262 109401 -21404
813 -21404 176406 179292 261970 182777 79128 55307 160414 90863 104478 122375 -71252
802 -71252 -111594 -132350 -97436 -26192 -168553 36029 120095 -13203 -48696 -214653 11824
791 11824 -117855 -87562 -11364 121415 -92849 -30676 13230 -30106 -26663 -166157 -340537
780 -340537 -9911 88906 -145967 -197869 -274170 -315673 -205903 -157732 -171468 -252719 -243959
769 -243959 62545 32461 -103270 -153131 158722 239739 102350 -64240 -162578 -54097 68339
758 68339 -124035 69733 263939 -29366 -125134 -25770 -224604 -251422 -220251 -207465 -218996
747 -218996 -238847 -96756 -33996 -98950 -73296 -61472 76780 393220 169867 124617 -74089
$$ packed form
824i884K52517J18679k2596j85062j55003J08300j23167k2606L9084J09139j30805
813b1404J97810K886Q2678p9193j03649k3821J05107o9551J3615J7897j93627
802g1252m0342k0756L4914P1244j42361K04582Q4066j33298l5493j65957K26477
791A1824j29679L0293P6198J32779k14264O2173M3906m3336L443j39494j74380
780c40537L30626R8817k34873n1902p6301m1503J09770M8171j3736q1251Q760
769b43959L06504l0084j35731m9861L11853Q1017j37389j66590r8338J08481J22436
758F8339j92374J93768J94206k93305r5768R9364j98834k6818L1171J2786j1531
747b18996j9851J42091O2760o4954K5654J1824J38252L16440k23353m5250j98706
$$ plain form
736 -74089 -102060 24410 140663 -1364 51995 209529 200957 108722 -63082 -28474 78623
725 78623 95656 7884 -218527 -121236 -257040 -116687 5113 -22725 72041 -7113 104482
714 104482 447009 136470 225562 453778 298229 249844 66438 -195815 -286875 4790
704 4790 -431527 -410827 7639 -82406 -203626 -125032 -92465 50976 204477 195565 375747
693 375747 86143 -19737 -42469 137089 17424 128057 364062 224501 208526 -101693
683 -101693 -224196 -135247 -61979 -42155 45609 71433 203525 -56183 -169847 -135730 -95929
672 -95929 -49747 13515 -44259 112287 27838 -40630 -271007 -227242 73453 128278 137619 323064
660 323064 230476 76561 106978 34875 226873 24539 43822 127422 -68863 -250041 -272033
$$ packed form
736g4089k7971J26470J16253j42027N3359J57534q572r2235j71804L4608J07097
725G8623J7033q7772k26411R7291j35804J40353J21800k7838R4766p9154J11595
714A04482L42527l10539Q9092K28216j55549m8385j83406k62253r1060K91665
704D790m36317K0700M18466r0045j21220P8594L2567J43441J53501q912J80182
693C75747k89604j05880k2732J79558j19665J10633K36005j39561j5975l10219
683a01693j22503Q8949P3268J9824Q7764K5824J32092k59708j13664L4117L9801
672i5929M6182O3262n7774J56546q4449o8468k30377M3765L00695N4825R341J85445
660C23064r2588j53915L0417p2103J91998k02334J9283Q3600j96285j81178k1992
$$ plain form
649 -272033 -127018 23399 185936 62188 -107843 -215042 -299763 -251752 6895 -65846
639 -65846 -58864 204250 389630 542727 326438 363164 311338 85392 -121925 133915 269126
628 269126 300574 183373 190807 259053 49617 -167303 -138895 -30162 98796 151196 68044
617 68044 242032 316891 -25592 -13209 285048 -24400 -57358 189639 270106 353911 210406
606 210406 -32321 260932 240783 65635 105813 -25251 -83358 -35586 13098 300667 281252
595 281252 101544 65836 80607 333513 124276 -206408 68723 115684 145366 58116 106993
584 106993 171755 74186 248364 -96137 -173525 147485 41331 301732 241822 282256 210234
573 210234 -51558 -33872 -25332 -191918 36270 7639 -31679 -49906 134726 -21666 -48698
$$ packed form
649b72033J45015J50417J62537j23748j70031j07199q4721M8011K58647p2741
639f5846O982K63114J85380J53097k16289L6726n1826k25946k07317K55840J35211
628B69126L1448j17201P434O8246k09436k16920K8408J08733J28958N2400q3152
617F8044J73988P4859l42483J2383K98257l09448l2958K46997Q0467Q3805j43505
606B10406k42727K93253k0149j75148M0178j31064n8107M7772M8684K87569j9415
595B81252j79708l5708J4771K52906k09237l30684K75131M6961K9682q7250M8877
584A06993O4762r7569J74178l44501p7388L21010j06154K60401n9910M0434p2022
573B10234k61792J7686Q540j66586K28188k8631l9318j8227J84632j56392k7032
$$ plain form
562 -48698 230866 14296 -140367 47531 44061 -5619 357194 -25239 103662 23632 284778
551 284778 293838 165823 442685 255451 6617 -92470 -80970 -114762 -12527 152457 38445
540 38445 130420 123948 -35405 -399835 -176117 2803 -8749 -115439 -259958 91561 69297
529 69297 -13346 -9083 -10687 174451 277351 214164 312738 347419 188597 59329 170551
518 170551 248559 76559 126294 86311 -84933 55628 37542 56020 104443 -23609 29195
507 29195 -41729 10230 276414 373197 -109336 -218142 41499 -135801 -200209 -32430 -43588
496 -43588 33146 298040 231718 -68068 -29390 308367 -6925 -138556 347653 399707 157536
485 157536 -2458 110552 104226 99576 300477 300900 204022 239818 -33128 -100710 -84880 -70297
$$ packed form
562d8698K79564k16570j54663J87898l470m9680L62813l82433J28901q0030K61146
551B84778R060j28015K76862j87234k48834r9087J1500l3792J02235J64984j14012
540C8445R1975o472j59353l64430K23718J78920j1552j06690j44519L51519k2264
529F9297q2643M263j604J85138J02900o3187R8574L4681j58822j29268J11222
518A70551P8008j72000M9735l9983j71244J40561j8086J8478M8423j28052N2804
507B9195p0924N1959K66184R6783m82533j08806K59641j77300o4408J67779j1158
496d3588P6734K64894o6322k99786L8678L37757l15292j31631M86209N2054k42171
485A57536j59994J13010o326m650K00901M23r6878L5796k72946o7582J5830J4583
$$ plain form
473 -70297 53309 -35977 -72539 -160060 109983 194714 -15126 47380 114219 123942 178374 112386
461 112386 139263 47749 -88588 -93203 98291 207834 166736 20975 -29942 -41428 242033
450 242033 181611 210721 168459 122247 256177 236836 124402 265787 246620 121498 358941
439 358941 168720 53288 -12000 146294 162265 145424 275361 489736 405729 245816 218108
428 218108 176859 154134 242559 113056 -213310 -172992 -118432 -134109 -86495 211028 252948
417 252948 154468 128351 2272 -28920 118533 361163 474305 430479 137647 -20630 99183
406 99183 325191 261604 257379 246776 199088 303 -71666 92185 -78505 -35834 54025
395 54025 48580 166549 19993 -107378 -4339 -79793 134943 301763 340036 319830 408062
$$ packed form
473g0297J23606q9286l6562q7521K70043Q4731k09840O2506O6839R723N4432o5988
461A12386K6877r1514j36337m615J91494J09543m1098j45761n0917j1486K83461
450B42033o0422K9110m2262m6212J33930j9341j12434J41385j9167j25122K37443
439C58941j90221j15432o5288J58294J5971j6841J29937K14375q4007j59913k7708
428B18108m1249k2725Q8425j29503l26366M0318N4560j5677M7614K97523M1920
417B52948r8480k6117j26079l1192J47453K42630J13142m3826k92832j58277J19813
406I9183K26008o3587m225j0603m7688j98785p1969J63851j70690M2671Q9859
395E4025n445J17969j46556j27371J03039p5454K14736J66820L8273k0206Q8232
$$ plain form
384 408062 364680 214446 46434 138072 205606 308265 268669 232447 -30990 -39996 -10003
373 -10003 -28581 40238 -1107 -53070 -1484 391338 313843 517517 480764 279368 306979
362 306979 163054 55338 41517 2433 86101 204714 114919 -41545 -30372 189332 326928
351 326928 200319 348091 280059 173626 -71418 -198616 -325914 -243292 83858 258023
341 258023 112078 -54440 101963 114574 198328 -101432 -172315 -203910 -322903 -216197 -195547
330 -195547 -194741 25959 287975 67474 -120227 -114931 92443 269071 196297 183376 -95555
319 -95555 -184709 -87312 43955 228164 120560 231368 149990 -28903 -42794 123962 446976
308 446976 353860 -301 372744 321851 75806 157112 296543 191528 -24491 167565
$$ packed form
384D08062m3382j50234j68012R1638O7534J02659l9596l6222k63437r006K9993
373a0003j8578O8819m1345n1963N1586L92822p7495K03674l6753k01396K7611
362C06979j43925j07716j3821l9084Q3668J18613q9795j56464J1173K19704J37596
351C26928j26609J47772o8032j06433k45044j27198j27298Q2622L27150J74165
341B58023j45945j66518J56403J2611Q3754k99760p0883l1595j18993J06706K0650
330a95547Q06K20700K62016k20501j87701N296K07374J76628p2774j2921k78931
319i5555q9154R7397J31267J84209j07604J10808q1378j78893j3891J66756L23014
308D46976r3116l54161L73045n0893k46045Q1306J39431j05015k16019J92056
$$ plain form
298 167565 221496 235471 194843 121370 -17452 93132 174988 58479 337929 274417 6912
287 6912 -96100 -77088 177790 236157 194358 97790 219803 400828 215330 130312 61022
276 61022 30149 46817 56098 -30066 -128519 101958 100116 72192 7356 46864 -41173 147221
264 147221 265977 203788 130689 306747 408007 225710 213704 212881 110307 93205 143145
253 143145 157627 79896 6671 -8403 95550 225841 244494 267752 78267 120625 80592
242 80592 90861 168759 333483 240932 289349 276968 184491 201020 23685 146016 120616
231 120616 204422 293393 332155 319217 562049 290766 1991 -14296 116016 257953 569871
220 569871 434093 237752 270098 242825 85505 -75942 235243 292717 313036 433702 471124
$$ packed form
298A67565N3931J3975m0628p3473j38822J10584Q1856j16509K79450o3512k67505
287F912j03012J9012K54878N8367m1799r6568J22013J81025j85498q5018o9290
276F1022l0873J6668R281q6164r8453K30477j842k7924o4836L9508q8037J88394
264A47221J18756o2189p3099J76058J01260j82297j2006q23j02574j7102M9940
253A43145J4482p7731p3225j5074J03953J30291J8653K3258j89485M2358m0033
242H0592J0269P7898J64724r2551M8417j2381r2477J6529j77335J22331k5400
231A20616Q3806Q8971L8762j2938K42832k71283k88775j6287J30312J41937L11918
220E69871j35778j96341L2346k7273j57320j61447L11185N7474K0319J20666L7422
$$ plain form
209 471124 181331 227599 166180 298211 487616 149810 70553 219795 231493 182355 112157
198 112157 -5797 81860 99314 149200 274018 310525 162761 -97736 -31810 155798 204540
187 204540 82721 49271 228315 361225 99387 105522 46200 -114886 -80190 -141103 -90533
176 -90533 -77271 -107896 76282 63825 33372 -95472 736 203164 272196 200583 99926
165 99926 15135 109555 71414 -149328 -221789 -90876 36874 73569 304961 348169 32764
154 32764 77556 42643 168433 58451 -61458 67964 277889 202158 70627 112204 -36627
143 -36627 -21523 -23915 100828 145172 -114320 -163787 63613 98698 122629 151464 139405 -9662
131 -9662 9613 -50451 -121274 -11845 7020 77243 -11603 -75201 82242 35290 -45174 14606
$$ packed form
209D71124k89793M6268o1419J32031J89405l37806p9257J49242J1698m9138p0198
198A12157j17954Q7657J7454M9886J24818L6507j47764k60497O5926J87608M8742
187B04540j21819l3450J79044J32910k61838O135n9322j61086L4696o0913N0570
176i0533J3262l0625J84178j2457l0453j28844R6208K02428O9032p1613j00657
165I9926q4791R4420l8141k20742p2461J30913J27750L6695K31392M3208l15405
154C2764M4792l4913J25790j09982j19909J29422K09925p5731j31531M1577j48831
143c6627J5104k392J24743M4344k59492m9467K27400L5085K3931K8835j2059j49067
131i662J9275o0064p0823J09429J8865P0223q8846o3598J57443m6952q0464N9780
$$ plain form
119 14606 7723 41642 273825 273643 105585 -12804 116013 -41094 -34647 -23372 16536 -11010
107 -11010 -13900 -187305 -288296 -111153 -218414 -101405 32345 -142769 -33893 75408
97 75408 -140700 -269212 -127749 17941 -83785 -121918 101083 130902 12375 28675 3786
86 3786 -230877 -51164 143908 78309 -30632 -38572 -181168 -220693 -11402 67802 -82462
75 -82462 -10866 33953 -34927 -154268 -132227 -171411 -236807 -2579 -105018 -215772 -82378
64 -82378 56568 -183705 -314285 -107110 -61913 -58274 38289 -83341 -18123 148118 4031
53 4031 -74366 -80566 -241795 -193596 -135233 -73225 -110428 -151228 -335994 -471532 -241710 -105689
41 -105689 -64096 -169936 -172422 -233412 -157963 -188519 -222238 -226825 -260349 -376690 -390713 -368070
$$ packed form
119A4606o883L3919K32183j82j68058j18389J28817j57107O447J1275L9908k7546
107a1010k890j73405j00991J77143j07261J17009J33750j75114J08876J09301
97G5408k16108j28512J41463J45690j01726l8133K23001K9819j18527J6300k4889
86C786k34663J79713J95072o5599j08941p940j42596l9525K09291P9204j50264
75h2462P1596M4819o8880j19341K2041l9184o5396K34228j02439j10754J33394
64h2378J38946k40273j30580K07175M5197L639R6563j21630O5218J66241j44087
53D031p8397o200j61229M8199N8363O2008l7203m0800j84766j35538K29822J36021
41a05689M1593j05840k486o0990P5449l0556l3719m587l3524j16341j4023K2643
$$ plain form
29 -368070 -430841 -185077 -159170 -212502 -257014 -164223 -125849 56850 -17131 -203234 -258771
18 -258771 -331860 -182220 -214859 -411605 -256853 -214276 -99881 -33267 -162393 -224132 -227566
7 -227566 -226772 -277762 -317830 -105201 -49468 -5684 -274231
0 -274231
$$ packed form
29c68070o2771K45764K5907n3332m4512R2791L8374J82699p3981j86103n5537
18b58771p3089J49640l2639j96746J54752M2577J14395O6614j29126o1739l434
7b27566P94n0990m0068K12629N5733M3784k68547
0b74231
$$ Imaginary data points
##PAGE= N=2
##DATA TABLE= (X++(I..I)), XYDATA
$$ plain form
16383 -2220870 -2129523 -1999397 -1962396 -1940302 -2121773 -1888316 -1987949 -2008907 -1851057 -1883740
16373 -1883740 -1787765 -1910553 -1961391 -1953979 -1982928 -1886703 -1842413 -1728037 -1787470 -1625341 -1725078
16362 -1725078 -1640762 -1712690 -1764566 -1450393 -1426902 -1396499 -1273647 -1311541 -1249653 -1241735 -1346517
16351 -1346517 -1211180 -1058662 -1099256 -1133883 -1053488 -995296 -1011706 -962018 -1087059 -960648
16341 -960648 -787058 -750465 -798763 -1054096 -811731 -643153 -654915 -555994 -569544 -512553 -605704
16330 -605704 -632147 -551084 -535872 -495124 -356342 -396792 -294037 -211443 -202491 -224493 -322005
16319 -322005 -315699 -246301 -176887 -125605 -33641 184752 340870 282071 282057 351183 343479 151484
16307 151484 266407 407814 448248 527397 386673 550246 593810 438404 461806 651635
$$ packed form
16383b220870R1347J30126L7001K2094j81471K33457r9633k0958J57850l2683
16373a883740R5975j22788n0838P412k8949R6225M4290J14376n9433J62129r9737
16362a725078Q4316p1928n1876L14173K3491L0403J22852l7894O1888P918j04782
16351a346517J35337J52518m0594l4627Q0395N8192j6410M9688j25041J26411
16341i60648J73590L6593m8298k55333K42365J68578j1762R8921j3550N6991r3151
16330f05704k6443Q1063J5212M0748J38782m0450J02755Q2594Q952k2002r7512
16319c22005O306O9398O9414N1282R1964K18393J56118n8799j4O9126p704j91995
16307A51484J14923J41407M0434P9149j40724J63573M3564j55406K3402J89829
$$ plain form
16297 651635 549815 378244 340762 174081 457689 623438 784678 868099 656807 775754
16287 775754 899677 738980 903232 924574 886416 806590 623245 842953 859868 754219
16277 754219 657455 916289 987676 813105 936008 1058325 1130500 1065168 1114079 1059265 1094474
16266 1094474 1103825 1031561 1079957 1256180 1110655 1083295 1325797 1309763 1264332 1452260 1429953
16255 1429953 1223025 1442268 1590001 1441224 1558458 1719440 1610126 1428656 1607063
16246 1607063 1598049 1654169 1764500 1711187 1814683 1748289 1643502 1568522 1733990 1800724 1779289
16235 1779289 1818696 1633866 1735027 1831163 1827493 1845844 1964297 1910995 1859797 1786516 1958597
16224 1958597 1945341 2237982 2081507 1975846 2145186 1692137 1720297 1738947 1957242 1896817
$$ packed form
16297F51635j01820j71571l7482j66681K83608J65749J61240Q3421k11292J18947
16287G75754J23923j60697J64252K1342l8158p9826j83345K19708J6915j05649
16277G54219r6764K58834P1387j74571J22903J22317P2175o5332M8911n4814L5209
16266A094474R351p2264M8396J76223j45525k7360K42502j6034m5431J87928k2307
16255A429953k06928K19243J47733j48777J17234J60982j09314j81470J78407
16246A607063r014N6120J10331n3313J03496o6394j04787p4980J65468O6734k1435
16235A779289L9407j84830J01161R6136l670J8351J18453n3302n1198p3281J72081
16224A958597j3256K92641j56475j05661J69340m53049K8160J8650K18295o0425
$$ plain form
16214 1896817 1847824 2009445 2039956 2295579 2323703 2472233 2457641 2383415 2258744 2242810
16204 2242810 2205747 2226744 2274050 2110133 2170310 2313342 2357913 2339025 2304988 2383106 2371258
16193 2371258 2373145 2487833 2530198 2482549 2326640 2301985 2505171 2530179 2613842 2485406 2330687
16182 2330687 2463501 2386319 2258213 2469849 2639565 2622259 2533210 2163197 2342038 2439783
16172 2439783 2503189 2392812 2794859 2445338 2601818 2475873 2625431 2585535 2410542 2410640
16162 2410640 2286474 2589313 2628908 2669841 2530686 2648037 2795829 2670781 2617060 2480430
16152 2480430 2351732 2615834 2710330 2724477 2627230 2680224 2956692 2909795 2813750 2916536
16142 2916536 2915834 2857243 2796560 2695756 2869076 2869643 2770796 2757015 2922650 3099041 2972032
$$ packed form
16214A896817m8993J61621L0511K55623K8124J48530j4592p4226j24671j5934
16204B242810l7063K0997M7306j63917O0177J43032M4571j8888l4037P8118j1848
16193B371258J887J14688M2365m7649j55909k4655K03186K5008Q3663j28436j54719
16182B330687J32814p7182j28106K11636J69716j7306q9049l70013J78841R7745
16172B439783O3406j10377M02047l49521J56480j25945J49558l9896j74993R8
16162B410640j24166L02839L9595M0933j39155J17351J47792j25048n3721j36630
16152B480430j28698K64102R4496J4147r7247N2994K76468m6897r6045J02786
16142B916536p02n8591o0683j00804J73320N67r8847j3781J65635J76391j27009
$$ plain form
16131 2972032 2902289 2951182 2862427 2807158 2873684 2765558 2833788 2684732 2741241 2684466 2765336
16120 2765336 2699631 2750018 2876946 2976735 3261885 3229774 3210071 3123371 3043778 2993614 3029599
16109 3029599 2925746 2907363 2992582 3146142 3098834 2870909 3106211 3219458 2990644 2707920
16099 2707920 2856104 3127635 3329959 3009970 2998103 2842858 3074695 3373670 3207922 2774277
16089 2774277 2835465 2897000 2618074 2786984 2982600 3153202 3009709 2861268 2963970 2801543
16079 2801543 2985891 3288505 3024872 3063556 3026833 3153572 3079214 2860649 3032376 3194620
16069 3194620 3197725 3207038 3086702 3116465 3347878 3122227 3058249 3009781 3022041 2952587 2983245
16058 2983245 2789860 2699371 2821328 2919679 3120565 3070593 2983009 3085707 3104840 3009499
$$ packed form
16131B972032o9743M8893q8755n5269O6526j08126O8230j49056N6509n6775Q0870
16120B765336o5705N0387J26928R9789K85150l2111j9703q6700p9593n0164L5985
16109C029599j03853j8383Q5219J53560m7308k27925K35302J13247k28814k82724
16099B707920J48184K71531K02324l19989j1867j55245K31837K98975j65748m33645
16089B774277O1188O1535k78926J68910J95616J70602j43493j48441J02702j62427
16079B801543J84348L02614k63633L8684l6723J26739p4358k18565J71727J62244
16069C194620L105R313j20336K9763K31413k25651o3978m8468J2260o9454L0658
16058B983245j93385r0489J21957R8351K00886m9972q7584J02698J9133r5341
$$ plain form
16048 3009499 3021745 2891260 3153103 3089083 3126758 3097699 2913173 3009662 2858341 2795617
16038 2795617 2819591 2843516 2841802 2993251 2971198 2938536 2988663 3078579 3059655 2963673 3183837
16027 3183837 3098491 3084442 3215151 3263946 3168502 3108600 3102389 3028108 3234687 3089114 3074788
16016 3074788 3201365 3161845 3041783 2982613 3079483 2816256 2866046 2925960 2936954 2966642 3075988
16005 3075988 3028598 3177880 3145377 3129582 3315627 3256339 2911561 2821071 2919828 2816618
15995 2816618 3065355 2890607 2822261 3244076 3210961 3257916 3305138 3170592 2817787 2696718
15985 2696718 2754977 2739705 2869931 2901561 2722549 2663457 2839451 3177826 3108791 3031715
15975 3031715 2950338 2831475 2984364 3046520 3060365 3159176 3046694 3022390 3096715 3175278 3067586
$$ packed form
16048C009499J2246j30485K61843o4020L7675k9059j84526R6489j51321o2724
16038B795617K3974K3925j714J51449k2053l2662N0127Q9916j8924r5982K20164
16027C183837q5346j4049J30709M8795r5444n9902o211p4281K06579j45573j4326
16016C074788J26577l9520j20062n9170R6870k63227M9790N9914J0994K9688J09346
16005C075988m7390J49282l2503j5795J86045n9288l44778r0490R8757j03210
15995B816618K48737j74748o8346M21815l3115M6955M7222j34546l52805j21069
15985B696718N8259j5272J30226L1630j79012n9092J75994L38375o9035p7076
15975C031715q1377j18863J52889O2156J3845R8811j12482k4304P4325P8563j07692
$$ plain form
15964 3067586 2815700 2856707 3067364 2901507 3045201 2994993 2924080 3219054 3233770 3182115
15954 3182115 3259680 3146752 3243903 3210525 2947768 2699062 2946839 3034275 3033017 3039318 2906713
15943 2906713 2910392 3040300 3355824 3134570 3251906 3134394 3027201 2951913 3010934 2834360
15933 2834360 2926149 3078100 3199163 3199268 3207406 3109150 3232965 3161386 3185975 3320332 3307200
15922 3307200 3363490 3242257 3016625 3024388 2974860 3040241 3043958 3002233 3206696 3253635 2903768
15911 2903768 3009618 3070821 3115096 3234437 3140193 3096854 2997904 3076099 3095814 3023502 3025175
15900 3025175 2860808 2780132 2659427 2892731 3119096 3013903 3000286 3010704 3141666 3125052
15890 3125052 3104542 3205579 3118464 3038778 3102652 3209482 3469154 3356936 3102053 2955880
$$ packed form
15964C067586k51886M1007K10657j65857J43694n0208p0913K94974J4716n1655
15954C182115P7565j12928R7151l3378k62757k48706K47777Q7436j258O301j32605
15943B906713L679J29908L15524k21254J17336j17512j07193p5288N9021j76574
15933B834360R1789J51951J21063J05Q138r8256J23815p1579K4589J34357j3132
15922C307200N6290j21233k25632P763m9528O5381L717m1725K04463M6939l49867
15911B903768J05850O1203M4275J19341r4244m3339r8950P8195J9715p2312J673
15900C025175j64367q0676j20705K33304K26365j05193j3617J0418J30962j6614
15890C125052k0510J01037q7115p9686O3874J06830K59672j12218k54883j46173
$$ plain form
15880 2955880 3045450 3117780 3169344 3102347 2971705 2933224 3042191 3114781 3246208 3241569 3009197
15869 3009197 2679359 2934424 3246079 3115386 2948668 3004445 2916631 2899862 3163622 2856199
15859 2856199 2668105 2916680 3039854 3064770 3170050 3246577 3373106 3174220 3267430 3238463
15849 3238463 3209773 3239462 3361085 3269790 2987345 3122162 3066763 3399420 3264622 3369424
15839 3369424 3125612 2955156 3021964 3090934 3086655 3250725 3226329 3161400 3236175 3158792 3252541
15828 3252541 3245498 2937120 2822479 3045388 3165612 3125401 2973409 3114279 3063812 2993723
15818 2993723 2956928 2995246 3094443 3050789 2944336 3061648 2960639 2872990 2967468 3086314
15808 3086314 2957605 2955895 3190114 3245862 3179107 2965887 2861225 2953867 3077413 2879155
$$ packed form
15880B955880Q9570P2330N1564o6997j30642l8481J08967P2590J31427m639k32372
15869C009197l29838K55065L11655j30693j66718N5777q7814j6769K63760l07423
15859B856199j88094K48575J23174K4916J05280P6527J26529j98886R3210k8967
15849C238463k8690K9689J21623r1295k82445J34817n5399L32657j34798J04802
15839C369424k43812j70456O6808O8970m279J64070k4396o4929P4775p7383R3749
15828C252541p043l08378j14641K22909J20224m0211j51992J40870n0467p0089
15818B993723l6795L8318R9197m3654j06453J17312j01009q7649R4478J18846
15808C086314j28709j710K34219N5748o6755k13220j04662R2642J23546j98258
$$ plain form
15798 2879155 2756431 2829400 3281148 3374453 3178359 3292920 3284807 3250660 3259356 2813908 3046520
15787 3046520 3438627 3173731 3099488 3164470 3136690 3306940 3264465 3116982 3187247 3275751
15777 3275751 3343062 3185792 3106840 3380021 3610607 3183459 2955829 3218528 3524677 3359443
15767 3359443 3081501 3122808 3166193 2986819 2995470 2999096 3101629 3163186 3036646 3215657 3294249
15756 3294249 3248187 3172177 3081368 2966342 3091306 3243364 3212386 3290748 3371619 3211679
15746 3211679 3099919 2851885 2599582 3101764 3166722 3237375 3172833 3227742 3202800 3235823
15736 3235823 3257861 3259874 3262566 2995544 3189827 3130255 3177670 3322812 3303346 3313140 3266909
15725 3266909 3410173 3323791 3285519 3360478 3258492 3133366 3062336 3033915 3085429 3256433
$$ packed form
15798B879155j22724P2969M51748R3305j96094J14561q113l4147Q696m45448K32612
15787C046520L92107k64896p4243O4982k7780J70250m2475j47483P0265Q8504
15777C275751O7311j57270p8952K73181K30586m27148k27630K62699L06149j65234
15767C359443k77942M1307M3385j79374Q651L626J02533O1557j26540J79011P8592
15756C294249m6062p6010r0809j15026J24964J52058l0978P8362Q0871j59940
15746C211679j11760k48034k52303N02182O4958P0653o4542N4909k4942L3023
15736C235823K2038K013K692k67022J94283n9572M7415J45142j9466R794m6231
15725C266909J43264q6382l8272P4959j01986j25126p1030k8421N1514J71004
$$ plain form
15715 3256433 2898541 2809473 3174286 3327767 3173265 3095726 3090718 3252145 3094846 2920883
15705 2920883 3049390 2812956 2978966 2907781 2844998 3020202 3190778 3311806 3365118 3355923
15695 3355923 3305753 3468752 3225968 3144286 3187555 3111851 3080009 3167649 3159619 2953080 2892349
15684 2892349 2887156 3040190 3056257 3160875 3452097 3351656 3191182 3376745 3341023 3186959
15674 3186959 3343002 3401434 3374290 3280779 3226923 3195135 3275022 3120023 2935223 3229471
15664 3229471 3172459 3006166 2892016 3164391 3221672 3042238 3000413 2797072 2835899 3233870
15654 3233870 3124093 2949397 3258079 3421204 3066181 2942056 3043491 3019159 3218161 3187407
$$ packed form
15715C256433l57892q9068L64813J53481j54502p7539n008J61427j57299j73963
15705B920883J28507k36434J66010p1185o2783J75204J70576J21028N3312r195
15695C355923n0170J62999k42784q1682M3269p5704l1842Q7640q030k06539o0731
15684B892349n193J53034J6067J04618K91222j00441j60474J85563l5722j54064
15674C186959J56043N8432k7144r3511n3856l1788P9887j54999j84800K94248
15664C229471n7012j66293j14150K72375N7281j79434m1825k03341L8827L97971
15654C233870j09777j74696L08682J63125l55023j24125J01435k4332J99002l0754
$$ [...]
##END NTUPLES=NMR SPECTRUM
##END=
