##TITLE=1H_TG-2402-x3
 200.13Hz,CDCl3 .
 8 sc
 
25.3.2026
##JCAMPDX= 6.0         $$ Bruker NMR JCAMP-DX V2.0
##DATA TYPE= NMR SPECTRUM
##DATA CLASS= NTUPLES
##ORIGIN= UXNMR, Bruker Analytische Messtechnik GmbH
##OWNER= pz
$$ XWIN-NMR		Version 3.5
$$ Wed Mar 25 15:35:09 2026 Russian Standard Time (UT+4h)  she@DPX200
##.OBSERVE FREQUENCY= 200.1313
##.OBSERVE NUCLEUS= ^1H
##.ACQUISITION MODE= SIMULTANEOUS
##.ACQUISITION SCHEME= undefined
##.AVERAGES= 8
##.DIGITISER RES= 18
##SPECTROMETER/DATA SYSTEM= spect
##.PULSE SEQUENCE= zg30
##.SOLVENT NAME= CDCl3
##.SHIFT REFERENCE= (INTERNAL, CDCl3, 0, 15.4803)
##AUDIT TRAIL= $$ (NUMBER, WHEN, WHO, WHERE, WHAT)
$$ ##TITLE= Audit trail, XWIN-NMR		Version 3.5
$$ ##JCAMPDX= 5.01
$$ ##ORIGIN= Bruker BioSpin GmbH
$$ ##OWNER= she
$$ F:/spectra/data/she/nmr/H-C/1/pdata/1/auditp.txt
$$ ##AUDIT TRAIL=  $$ (NUMBER, WHEN, WHO, WHERE, WHAT)
(   1,<2026-03-25 15:33:49.51 +0400>,<she>,<DPX200>,
      <created by zg, POWCHK disabled, PULCHK disabled
       configuration hash MD5:
       00 E9 B6 7A A2 85 ED C7 34 08 36 98 17 FE 4E 26
       data hash MD5: 16K
       D4 CE 26 73 ED 70 FD 61 82 36 3B 8F DF 40 02 D1>)
(   2,<2026-03-25 15:33:52.59 +0400>,<she>,<DPX200>,
      <Start of raw data processing
       efp BC_mod = 2 LB = 0.25 FT_mod = 6 PKNL = 1 PHC0 = -3707.51 PHC1 = 9.5923 SI = 16K 
       data hash MD5: 16K
       0D F0 44 C2 47 0C 8D 8C 54 6D 25 03 DE 15 49 EE>)
(   3,<2026-03-25 15:34:11.10 +0400>,<she>,<DPX200>,
      <pk PHC0 = -1.949231 PHC1 = 3.200001 
       data hash MD5: 16K
       2C A1 09 F2 F0 1D 52 D9 B4 6C 76 9F 2E 9E 20 72>)
(   4,<2026-03-25 15:34:14.95 +0400>,<she>,<DPX200>,
      <abs ABSG = 5 
       data hash MD5: 16K
       36 36 D6 96 41 D6 01 6B FD D3 A0 89 83 93 F0 3A>)
$$ ##END=
$$ 
$$ hash MD5
$$ 2D A3 BF 2C 74 5E 5C 78 2B DF 88 88 E6 ED 43 63
##$RELAX= 
##$RELAX= 
##$RELAX= 
##$RELAX= 
##$RELAX= 
##$RELAX= 
$$ Bruker specific parameters
$$ --------------------------
##$DU= <F:/spectra>
##$EXPNO= 1
##$NAME= <H-C>
##$PROCNO= 1
##$TYPE= <nmr>
##$USER= <she>
##$AMP= (0..31)
100 100 100 100 100 100 100 100 100 100 100 100 100 100 100 100 100 100 
100 100 100 100 100 100 100 100 100 100 100 100 100 100 
##$AQSEQ= 0
##$AQ_mod= 1
##$AUNM= <au_zg>
##$AUTOPOS= <>
##$BF1= 200.13
##$BF2= 200.13
##$BF3= 200.13
##$BF4= 200.13
##$BF5= 200.13
##$BF6= 200.13
##$BF7= 200.13
##$BF8= 200.13
##$BYTORDA= 1
##$CFDGTYP= 0
##$CFRGTYP= 5
##$CHEMSTR= <none>
##$CNST= (0..31)
1 1 145 1 1 1 1 1 1 1 1 1 1 1 1 1 1 1 1 1 1 1 1 1 1 1 1 1 1 1 1 1 
##$CPDPRG= <>
##$CPDPRG1= <>
##$CPDPRG2= <>
##$CPDPRG3= <>
##$CPDPRG4= <mlev>
##$CPDPRG5= <mlev>
##$CPDPRG6= <mlev>
##$CPDPRG7= <mlev>
##$CPDPRG8= <mlev>
##$CPDPRGB= <>
##$CPDPRGT= <>
##$D= (0..31)
0 0.7 0 0 0 0 0 0 0 0 0 0.03 0 0 0 0 0 0 0 0 0 0 0 0 0 0 0 0 0 0 0 0 
##$DATE= 1774438428
##$DBL= (0..7)
120 120 120 120 120 120 120 120 
##$DBP= (0..7)
150 150 150 150 150 150 150 150 
##$DBP07= 0
##$DBPNAM0= <>
##$DBPNAM1= <>
##$DBPNAM2= <>
##$DBPNAM3= <>
##$DBPNAM4= <>
$$ [...]
##$SUBNAM3= <"">
##$SUBNAM4= <"">
##$SUBNAM5= <"">
##$SUBNAM6= <"">
##$SUBNAM7= <"">
##$SUBNAM8= <"">
##$SUBNAM9= <"">
##$SW= 18.0517328524113
##$SWIBOX= (0..15)
0 0 2 0 0 0 0 0 0 0 0 0 0 0 0 0 
##$SW_h= 3612.71676300578
##$TD= 16384
##$TD0= 1
##$TE= 0
##$TE2= 300
##$TE3= 300
##$TEG= 300
##$TL= (0..7)
0 120 120 120 120 120 120 120 
##$TP= (0..7)
150 150 150 150 150 150 150 150 
##$TP07= 0
##$TPNAME0= <>
##$TPNAME1= <>
##$TPNAME2= <>
##$TPNAME3= <>
##$TPNAME4= <>
##$TPNAME5= <>
##$TPNAME6= <>
##$TPNAME7= <>
##$TPOAL= (0..7)
0.5 0.5 0.5 0.5 0.5 0.5 0.5 0.5 
##$TPOFFS= (0..7)
0 0 0 0 0 0 0 0 
##$TUNHIN= 0
##$TUNHOUT= 0
##$TUNXOUT= 0
##$USERA1= <user>
##$USERA2= <user>
##$USERA3= <user>
##$USERA4= <user>
##$USERA5= <user>
##$V9= 5
##$VALIST= <valist>
##$VCLIST= <CCCCCCCCCCCCCCC>
##$VD= 0
##$VDLIST= <DDDDDDDDDDDDDDD>
##$VPLIST= <PPPPPPPPPPPPPPP>
##$VTLIST= <TTTTTTTTTTTTTTT>
##$WBST= 1024
##$WBSW= 4
##$XGAIN= (0..3)
0 0 0 0 
##$XL= 0
##$YL= 0
##$YMAX_a= 107848
##$YMIN_a= -146351
##$ZGOPTNS= <>
##$ZL1= 120
##$ZL2= 120
##$ZL3= 120
##$ZL4= 120
##$ABSF1= 15.52102
##$ABSF2= -2.530829
##$ABSG= 5
##$ABSL= 3
##$ALPHA= 0
##$AQORDER= 0
##$ASSFAC= 0
##$ASSFACI= 0
##$ASSFACX= 0
##$ASSWID= 0
##$AUNMP= <proc_1d>
##$AZFE= 0.1
##$AZFW= 0.1
##$BCFW= 0
##$BC_mod= 2
##$BYTORDP= 0
##$COROFFS= 0
##$CY= -3
##$DATMOD= 1
##$DC= 0
##$DFILT= <>
##$DTYPP= 0
##$F1P= 0
##$F2P= 0
##$FCOR= 1
##$FTSIZE= 16384
##$FT_mod= 6
##$GAMMA= 0
##$GB= 0
##$INTBC= 1
##$INTSCL= 3.241238e-09
##$ISEN= 128
##$LB= 0.25
##$LEV0= 0
##$LPBIN= 0
##$MAXI= 10000
##$MC2= 0
##$MEAN= 0
##$ME_mod= 0
##$MI= 1.114404
##$NCOEF= 0
##$NC_proc= -7
##$NLEV= 6
##$NOISF1= 3.799351
##$NOISF2= 2.8
##$NSP= 0
##$NTH_PI= 0
##$NZP= 0
##$OFFSET= 15.48025
##$PC= 1
##$PHC0= -3709.459
##$PHC1= 12.7923
##$PH_mod= 1
##$PKNL= yes
##$PPARMOD= 0
##$PSCAL= 0
##$PSIGN= 0
##$REVERSE= no
##$SF= 200.130008294251
##$SI= 16384
##$SIGF1= 3
##$SIGF2= 2
##$SINO= 0.751879
##$SIOLD= 32768
##$SREGLST= <19F.Aceton>
##$SSB= 0
##$STSI= 16384
##$STSR= 0
##$SW_p= 3612.71676300578
##$SYMM= 0
##$S_DEV= 0
##$TDeff= 16384
##$TDoff= 0
##$TI= <>
##$TILT= no
##$TM1= 0
##$TM2= 0
##$TOPLEV= 0
##$USERP1= <user>
##$USERP2= <user>
##$USERP3= <user>
##$USERP4= <user>
##$USERP5= <user>
##$WDW= 1
##$XDIM= 16384
##$YMAX_p= 332680550
##$YMIN_p= -1753171
$$ End of Bruker specific parameters
$$ ---------------------------------
##NTUPLES= NMR SPECTRUM
##VAR_NAME=  FREQUENCY,     SPECTRUM/REAL,   SPECTRUM/IMAG
##SYMBOL=    X,             R,               I
##VAR_TYPE=  INDEPENDENT,   DEPENDENT,       DEPENDENT
##VAR_FORM=  AFFN,          ASDF,            ASDF
##VAR_DIM=   16384,         16384,           16384
##UNITS=     HZ,            ARBITRARY UNITS, ARBITRARY UNITS
##FACTOR=    0.220516191357247, 1,           1
##FIRST=     3098.06263266001, 0,            0
##LAST=      -514.654130345774, 0,           0
##MIN=       -514.654130345774, -1753171,    0
##MAX=       3098.06263266001, 332680550,    0
$$ Real data points
##PAGE= N=1
##DATA TABLE= (X++(R..R)), XYDATA
$$ [...]
5250A023799j41870j74073J21687J19913J6979m2234j60332K01502q4167k8999
5240H52205J59041o322p7052o332Q404l9112j47090J38770j25980k27450N7543
5229E86625J36271J3410K40143J72083j93172K64607J21275j42745J7851j35397
5219A080951j74541J25849j7556r9555K20826M1654r8123n9842l3748J42825m802
5208A123938p6977R3971j18618r3484M7054r2214J22146K51228J34303k39968
5198A151379l86796Q3740M47508J219J20861l62929p9379K54506j41963J02238
5188A190384R8766k74543L8067J09998J8914j09693K64608K26851k15658j45361
5178A202333n8340K56942j46321j15946N5045J30606K68647m5216k55943K0410
$$ y = [1023799, 881929, 707856, 829543, 949456, 966435, 924201, 763869, 965371, 881204, 852205, 1011246, 1004924, 927872, 921540, 929944, 890832, 743742, 882512, 756532, 529082, 586625, 722896, 736306, 976449, 1148532, 955360, 1219967, 1341242, 1198497, 1216348, 1080951, 906410, 1032259, 1014703, 915148, 1135974, 1177628, 1079505, 1019663, 985915, 1128740, 1123938, 1046961, 1140932, 1022314, 928830, 975884, 883670, 1005816, 1257044, 1391347, 1151379, 764583, 848323, 1295831, 1297050, 1417911, 1054982, 975603, 1230109, 1088146, 1190384, 1289150, 1014607, 1052674, 1162672, 1181586, 1071893, 1336501, 1563352, 1347694, 1202333, 1143993, 1400935, 1254614, 1138668, 1193713, 1324319, 1592966, 1547750, 1291807, 1312217]
5168A312217J06635k04040l2600K92340k5279M7468K9847N7205k13326O1485q3271
5157A348681k1112J40978n5496o2895j4815J28732j52592J12215P2604q0166k81789
5146A134345K68347K08333j92328K5539M6821J54647P8126k03230j62895J82505
5136A540210q0677j64775m100j7514K82423J07113j30631O7969J98899Q5573j22289
5125A762201J01115j3283J10562l7770l77597J55548L01014J30419l57168L579
5115A778620K39382j53330M7339J04885j02147L9225J54448K00216j79107r0470
5105B039061r0480r8917Q1377K04911K00290p4728R0678O6797m9290j83048K04852
5094B391503K86147m4233j31277q5419O9649O2229n1737j31804k00702J57971
$$ y = [1312217, 1418852, 1214812, 1182212, 1474552, 1449273, 1496741, 1526588, 1583793, 1370467, 1431952, 1348681, 1327569, 1468547, 1413051, 1350156, 1335341, 1464073, 1311481, 1423696, 1496300, 1416134, 1134345, 1402692, 1611025, 1418697, 1444236, 1491057, 1645704, 1723830, 1520600, 1357705, 1540210, 1459533, 1294758, 1290658, 1273144, 1555567, 1662680, 1532049, 1600018, 1798917, 1884490, 1762201, 1863316, 1850033, 1960595, 1922825, 1545228, 1700776, 2001790, 2132209, 1775041, 1778620, 2018002, 1864672, 1912011, 2016896, 1914749, 1953974, 2108422, 2308638, 2129531, 2039061, 1948581, 1849664, 1931041, 2135952, 2336242, 2261514, 2352192, 2418989, 2369699, 2186651, 2391503, 2677650, 2633417, 2502140, 2416721, 2486370, 2548599, 2496862, 2365058, 2164356, 2322327]
5084B322327m7882K22624J80832j71853j98049K46989L17340l26127j31962R0261
5074B504500q5575J59364R3165q8064J41714Q926q2847J15666J80963m6231j16240
5063B785341K52795L97236r8287k23662J08421J27538P9456j74519o7145K91103
5053C478277l3542J92761J97091q3978J00039J70072p8176p5507Q4050L49638
5043D300725j23071j24439J46189L28733J83616q6802j31526K21711K27079q8833
5033D853382k39898M9849K38447K5950J77034J16390n6398J55882J01873M2781
5023E465292K6251m1861P9215L1512P3634J79846J29479q9452N17096J98501N11847
5012G081360M75547L08631O46577O24419R31817O25626J27920J17868l58711k14230
$$ y = [2322327, 2274445, 2497069, 2677901, 2506048, 2307999, 2554988, 2872328, 2546201, 2414239, 2504500, 2418925, 2578289, 2671454, 2583390, 2725104, 2734030, 2651183, 2766849, 2947812, 2901581, 2785341, 3038136, 3435372, 3337085, 3113423, 3221844, 3349382, 3428838, 3254319, 3187174, 3478277, 3444735, 3637496, 3834587, 3750609, 3850648, 4020720, 3942544, 3867037, 3951087, 4300725, 4177654, 4053215, 4199404, 4528137, 4711753, 4624951, 4493425, 4715136, 4942215, 4853382, 4613484, 4663333, 4901780, 4927730, 5104764, 5221154, 5164756, 5320638, 5422511, 5465292, 5491543, 5449682, 5528897, 5560409, 5634043, 5813889, 5943368, 5853916, 6371012, 6569513, 7081360, 7556907, 7865538, 8512115, 9136534, 10068351, 10693977, 10821897, 10939765, 10581054, 10366824]
5002A0366824o81489o38658n95541m99709l50160k78460j01329k88128M2922k09764
4992F766508M7079l02264j91715N98105Q8716O3600M902J3007m2711J50179J72549
4981G367955p350j0279k12216r7108j15828L9364P7480J59740j8552j30835J68026
4970G220397J41162l87548j74002J52095k4120O9877K89128J2371R8587l18353
4960G079594n6476M7347p6656J63585k2385m8499N382J49659K09119J0065k27363
4949G233372j14906j00023R7264k7100Q1131k13048k2731n901j15421n069k27543
4938F580025K8655J4014K1704N1678p2637k24370j08103N8748J70143r8778J46115
4927F567194k5183k37088J9427J46754j62905j20456P8431J35522j62214K4630
$$ y = [10366824, 9685335, 9046677, 8451136, 7951427, 7601267, 7322807, 7221478, 6933350, 6976272, 6766508, 6813587, 6511323, 6319608, 6917713, 7006429, 7070029, 7074931, 7087938, 7045227, 7195406, 7367955, 7360605, 7350326, 7138110, 7041002, 6925174, 6964538, 7042018, 7201758, 7183206, 7052371, 7220397, 7361559, 6974011, 6800009, 6952104, 6927984, 6997861, 7286989, 7299360, 7397947, 7079594, 7023118, 7070465, 6993809, 7157394, 7135009, 7086510, 7091892, 7241551, 7450670, 7460735, 7233372, 7118466, 7018443, 7115707, 7088607, 7169738, 6956690, 6933959, 6928058, 6812637, 6807568, 6580025, 6608680, 6622694, 6644398, 6696076, 6623439, 6399069, 6290966, 6349714, 6519857, 6421079, 6567194, 6542011, 6304923, 6324350, 6471104, 6308199, 6187743, 6266174, 6401696, 6239482, 6264112]
4917F264112l31852L9035k8530K3093L15125M800k41113k0076J9251l9232Q9288
4906F093901N522J35602j61511j46026k86303K98964k2297m5095M38975R4182
4896F405914J07788M3038q3354p3639J0684M8784K21963J36477K10588K75850
4886G304093J71843m04165j7560K20019K6406L85443N0827J86111R7035j12697
4876G907355N4187r2834K63720k03073J50079K48329O5628q2152K11015J20205
4866H642459K10295M45227r9646L19535l11598K70492P8420L38096K59237J54256
4856A0306773q8071L98471K15987K62700K84388P6126R1617M8102L55251K11202
4846A2162546K76664J61341n2450L01515L48807N09390P9921O9574K68969K41092
$$ y = [6264112, 5932260, 5971295, 5942765, 5965858, 6280983, 6285783, 6044670, 6024594, 6043845, 6004613, 6093901, 6099423, 6235025, 6073514, 5927488, 5641185, 5940149, 5917852, 5872757, 6311732, 6405914, 6513702, 6556740, 6473386, 6399747, 6410431, 6459215, 6681178, 6817655, 7028243, 7304093, 7475936, 7071771, 7054211, 7274230, 7300636, 7686079, 7736906, 7923017, 8020052, 7907355, 7961542, 7868708, 8132428, 7929355, 8079434, 8327763, 8393391, 8311239, 8522254, 8642459, 8852754, 9297981, 9198335, 9517870, 9206272, 9476764, 9555184, 9893280, 10152517, 10306773, 10218702, 10617173, 10833160, 11095860, 11380248, 11456374, 11547991, 11596093, 11951344, 12162546, 12439210, 12600551, 12548101, 12849616, 13198423, 13707813, 13787734, 13857308, 14126277, 14367369]
4836A4367369J79255K50349K15060K02081J56487O277N2553K1513L00150k9092
4826A5722002k48132K0651K8873k4405j23741n9314J16763J47810J79067k15250
4816A5544324p0395o7939J36767K91113M5671N5899K06016K25628K32090j09562
4806A6489612K50808L06596O7703J81774j67549R0881K518q1916Q8499r2377j3886
4795A7122663k9412K47123j15605k68652J46632N93884K20073L85369K19988K21035
4785A8743098J97334M03191N73933K45247K89302M15874N60155M81155M98686
4776B2407975O23461N21625p9108P9855M77367J59306J32508q4996p317R3400
4766B4324076J43397R889R7886J65088o4305J85333n644J94844N45355O42843
$$ y = [14367369, 14546624, 14796973, 15012033, 15214114, 15370601, 15376878, 15429431, 15450944, 15751094, 15722002, 15473870, 15494521, 15523394, 15498989, 15375248, 15315934, 15432697, 15580507, 15759574, 15544324, 15473929, 15405990, 15542757, 15833870, 15879541, 15935440, 16141456, 16367084, 16599174, 16489612, 16740420, 17047016, 17114719, 17296493, 17128944, 17219825, 17222343, 17140427, 17228926, 17136549, 17122663, 17093251, 17340374, 17224769, 16956117, 17102749, 17696633, 17916706, 18302075, 18522063, 18743098, 18940432, 19343623, 19917556, 20162803, 20452105, 20867979, 21428134, 21909289, 22407975, 23031436, 23553061, 23473953, 23553808, 24031175, 24190481, 24322989, 24237993, 24230676, 24324076, 24467473, 24477362, 24575248, 24740336, 24676031, 24861364, 24855720, 25050564, 25595919, 26238762]
4756B6238762P33074O45635M39209P04465P21874M56440M66954O10287K81737
4747C1298437K10320J08169j18944M0268j77810q65627m14554l75069n12841n08043
4737B8684306n31136l97578n60719m38329m31241p2513k15276j14485J5998J13310
4727B6052337J29518K05355O3800j42537l8375k89463l69898m62577m52086l53397
4717B4342677p26007n12141m41770m68188o95816n36015k80583k04682k65176
4708B0212299n24515j07204O7680l484O6279r8630j01305J43237J99230j27902
4698A9725685q4027J4326q3004K16275N1818K12768N5905j46943j51073O6998
4688A9878728J09803Q9896n613J99114k411J13973L92631J32669M11350J70301
$$ y = [26238762, 26971836, 27617471, 28056680, 28761145, 29483019, 29939459, 30406413, 31016700, 31298437, 31508757, 31616926, 31497982, 31538250, 31360440, 30494813, 30080259, 29705190, 29192349, 28684306, 28153170, 27755592, 27194873, 26756544, 26325303, 26252790, 26037514, 25923029, 25939027, 26052337, 26181855, 26387210, 26451010, 26308473, 26270098, 25980635, 25610737, 25148160, 24696074, 24342677, 23616670, 23104529, 22662759, 22194571, 21498755, 20962740, 20682157, 20477475, 20212299, 19687784, 19580580, 19648260, 19644776, 19711055, 19612425, 19511120, 19654357, 19853587, 19725685, 19641658, 19655984, 19572980, 19789255, 19841073, 20053841, 20109746, 19962803, 19811730, 19878728, 19988531, 20078427, 20072814, 20271928, 20269517, 20383490, 20776121, 20908790, 21320140, 21490441]
4678B1490441L82106L35355N38592M43841J94959M18885J43847M13568M11178
4669B4772772l7601K22799K84561j86320l35761l38642n95223l33298n49589o06773
4659B2296925l93262m34259n32195m10753k68105p20178n82567k23517O1589L231
4649A8796909n13733k98187j57910m71271n09185l23647j97857l99536k34092
4640A5691491n77754k67853j59424n85766n43762o25341n37623m81386j37969
4631A1774613l81084n53900l36339k23583l34523o22304j92350j96166J12503
4622I046867j27758m06196m75267j58296o8755J55686p9203k29757J3814j63565
4612G507570k24685Q7609k22888p9514L8556k10986K1666j65718j16455j84651
$$ y = [21490441, 21872547, 22207902, 22746494, 23190335, 23385294, 23804179, 23948026, 24361594, 24772772, 24735171, 24957970, 25242531, 25056211, 24720450, 24381808, 23786585, 23453287, 22903698, 22296925, 21903663, 21469404, 20937209, 20526456, 20258351, 19538173, 18955606, 18732089, 18793678, 18796909, 18283176, 17984989, 17827079, 17355808, 16846623, 16522976, 16325119, 15925583, 15691491, 15113737, 14845884, 14686460, 14100694, 13556932, 12931591, 12393968, 11912582, 11774613, 11393529, 10839629, 10503290, 10279707, 9945184, 9322880, 9130530, 8934364, 9046867, 8919109, 8512913, 8037646, 7879350, 7810595, 7966281, 7887078, 7657321, 7671135, 7507570, 7282885, 7370494, 7147606, 7068092, 7106648, 6895662, 6917328, 6751610, 6635155, 6450504]
4602F450504K61498L0582j23180j95338m6244K93878j03732n69607j59434R3593
4592E932520L1613j50232J3573j41557R2140J65090L0798M9712J5501K26335j14680
4581F150813l2634m7257L53189J53361k6430J6053o3450L13333n036p7677O7469
4570F801734K51855J17465K53996L58905M08956K87737K93618K86401J78689L03409
4560I542765M8554N01502L03214K51828L16303M05573K07618L13412K11973r2636
4550A2010106K58405K83084K30069O0022j48958R777j59798n272J62213K8644
4540A2728292m43833l32343L7583J44053r1038j08122J14147l9717O1126K01576
4530A2271724N9909k64134J12897M03066L7124J1788J55686J03598J12671L01175
$$ y = [6450504, 6712002, 6742584, 6619404, 6424066, 6377822, 6671700, 6567968, 5998361, 5838927, 5932520, 5964133, 5813901, 5827474, 5685917, 5778057, 5943147, 5973945, 6023657, 6039158, 6265493, 6150813, 6118179, 6070922, 6424111, 6577472, 6551042, 6567095, 6503645, 6816978, 6811942, 6734265, 6801734, 7053589, 7171054, 7425050, 7783955, 8192911, 8480648, 8774266, 9060667, 9239356, 9542765, 9591319, 10092821, 10396035, 10647863, 10964166, 11369739, 11577357, 11890769, 12102742, 12010106, 12268511, 12551595, 12781664, 12841686, 12692728, 12702505, 12542707, 12537435, 12699648, 12728292, 12284459, 11952116, 11989699, 12133752, 12042714, 11934592, 12048739, 12009022, 12070148, 12271724, 12331633, 12067499, 12180396, 12583462, 12620586, 12632374, 12788060, 12891658, 13004329, 13305504]
4520A3305504j75429J65657K32509O9794N6710J20671N1188k16769j19817j03238
4510A3386780p3949k25331L7967m1389O6022l50056k44690k46832j65644l64740
4500A1778138m70490m35754k85125k72907l1822m48224l25299n94808k64763m143
4490H644803l23385l18436k82676k78460Q3827J912j46882k59600J23227q6148
4480G158182l39471l50731n5839O7724J21123o9519j95452j13015K67476O0128
4470F550606J39517j0961p253k0823k98264K25388j33967K4664j5550k1523L12931
4459F744765L79666k59189j93531q2557K69832n8289K90332j75748j2360J34191
4449G037112j34791K26205m0761k53105J03347j01742l32858O3956j35562K25110
$$ y = [13305504, 13130075, 13295732, 13528241, 13598035, 13654745, 13775416, 13826604, 13609835, 13490018, 13386780, 13312831, 13087500, 13125467, 13084078, 13150100, 12800044, 12555354, 12308522, 12142878, 11778138, 11307648, 10871894, 10586769, 10313862, 10282040, 9833816, 9508517, 8913709, 8648946, 8644803, 8321418, 8002982, 7720306, 7441846, 7525673, 7527585, 7380703, 7121103, 7244330, 7158182, 6818711, 6467980, 6412141, 6479865, 6600988, 6531469, 6336017, 6223002, 6490478, 6550606, 6690123, 6679162, 6671909, 6651086, 6352822, 6578210, 6444243, 6468907, 6453357, 6431834, 6744765, 7124431, 6865242, 6671711, 6589154, 6858986, 6800697, 7091029, 6915281, 6902921, 7037112, 6902321, 7128526, 7087765, 6834660, 6938007, 6836265, 6503407, 6567363, 6431801, 6656911]
4439F656911k14791j11611m142n5847m06506q7076K89620l79873J85462j38661
4429E733486n8939P5020K17989l86068j8951K05361j35258j12590L0270k68133
4419E282187J09930K9638K65269K71684r3275m17225j67838J7768j00212l97013
4409D800913L350J30071p1493k72428k02726L45486j07602Q4965j12267J29326
4399D727595K17569J0062p0362p7341j73765L81159L54229L15271M2744K5781
4389E752942n128k50736l62153m65641k57191j30666J04801l50945m232M27138
4379D458189K59713r345j18010l2371j43099M8258j20305N913J29447k15979J48215
4368D410626R8886k08396J09584J18555K07401K8851J81784L07130K82142N83479
$$ y = [6656911, 6442120, 6330509, 6326367, 6270520, 5864014, 5776938, 6066558, 5686685, 5872147, 5733486, 5674547, 5749567, 5967556, 5581488, 5562537, 5767898, 5632640, 5520050, 5550320, 5282187, 5392117, 5421755, 5687024, 5958708, 5865433, 5448208, 5280370, 5298138, 5197926, 4800913, 4804263, 4934334, 4862841, 4590413, 4387687, 4733173, 4625571, 4710536, 4598269, 4727595, 4945164, 4955226, 4884864, 4807523, 4633758, 5014917, 5369146, 5684417, 5727161, 5752942, 5747814, 5497078, 5134925, 4669284, 4412093, 4281427, 4386228, 4035283, 4031051, 4458189, 4717902, 4708557, 4590547, 4558176, 4415077, 4463335, 4343030, 4348943, 4478390, 4262411, 4410626, 4509512, 4301116, 4410700, 4529255, 4736656, 4765507, 4947291, 5254421, 5536563, 6120042]
4358F120042O04851R71916J281088J356404J058431R59822N46725n4873j037463
4349A1806943j256049j397641j021699q13778o74902o30315o10995k18055l4190
4340E149319o0533r8260J84180K03149k33653k65952J18773J83771J15397m42695
4330D853496K8311P680K06676p4210j36526l162J03851j10639Q6016J49900n9830
4319E051563n052M91719O8201M74848M31031L90323N02998K18739Q190j03931
4309G528629j5445j58090K55744k38060J6178K74158K44989Q30000Q68920Q59644
4299A0466667Q13707L03969k88667p49927r88172p27300n16398m62799n40300
4290G310780q8417p4306J38809k31612J22719M96993L78883r2359K57081O33161
$$ y = [6120042, 6724893, 7696809, 8977897, 10334301, 11392732, 12352554, 12899279, 12844406, 11806943, 10550894, 9153253, 8131554, 7317776, 6642874, 6012559, 5401564, 5183509, 5149319, 5088786, 4990526, 5174706, 5377855, 5144202, 4878250, 4997023, 5180794, 5296191, 4853496, 4881807, 4889487, 5096163, 5021953, 4885427, 4882265, 4986116, 4875477, 4961493, 5111393, 5051563, 5046511, 5538230, 5606431, 6081279, 6512310, 6902633, 7405631, 7624370, 7632560, 7528629, 7513184, 7355094, 7610838, 7372778, 7388956, 7663114, 7908103, 8738103, 9607023, 10466667, 11280374, 11584343, 11295676, 10545749, 9557577, 8830277, 8313879, 7851080, 7310780, 7222363, 7148057, 7286866, 7055254, 7177973, 7674966, 8053849, 7961490, 8218571, 8851732]
4280H851732J72175M79346O63569Q49675J50897J7550k77108j55314J98532M2855
4270A0993909n24288l64609l20478n66492m89377l55279m43803l16679m15157
4261G197747j37343J64404k27469o9538l64687m91569J63046J13000o704q284
4251F332603j68224j86060M2027j49422k32445r4826R1458j01495L44120j79823
4241E697913j74399J26566K4845k1740J60836r796j72455J00366j76948j0205
4231E544983N7647K17005J98854j79293j1090R9878J62554r9740j35431j28315
4221E727052N7172Q6184K67349j13668l24905J00256J16795J01135P7042J72351
4211F266763k50542k57160N5434J26094k31957K09471j723L92J42046L3500j35821
$$ y = [8851732, 9023907, 9503253, 10166822, 11016497, 11167394, 11184944, 10907836, 10752522, 10951054, 10993909, 10469621, 10105012, 9784534, 9218042, 8728665, 8373386, 7929583, 7612904, 7197747, 7060404, 7224808, 6997339, 6927801, 6563114, 6071545, 6234591, 6347591, 6340887, 6332603, 6164379, 5978319, 6020346, 5870924, 5638479, 5543653, 5635111, 5533616, 5877736, 5697913, 5523514, 5650080, 5674925, 5653185, 5814021, 5804225, 5631770, 5732136, 5555188, 5544983, 5602630, 5819635, 6018489, 5839196, 5828106, 5927984, 6090538, 5990798, 5855367, 5727052, 5784224, 5870408, 6137757, 6024089, 5699184, 5799440, 5916235, 6017370, 6094412, 6266763, 6016221, 5759061, 5814495, 5940589, 5708632, 5918103, 5916380, 5916772, 6058818, 6092318, 5956497]
4200E956497Q8348J41099N5622J93523J25550J78443k78775j4982P0313k46910
4190F268728K99054k9687o9137O5582k54071l5407J71734J24157J34940k00770
4180F475123o4427L7919J96769l4364j12740J55351J79329J5479j3366l4126P8149
4169F879096K12852J26261J92215j86479P1091O1074L45674J53878N4212P0194
4159G980068j38082j67443R248Q5570j62680l70407k77074P7313L31035J91202
4149G558750R2756k11535j79983L15502K28303m8132J57957P8800j53029M036
4139G843425J02255K65650n9729j09316J11112J30949K17566M72412m7515K12949
4129I139758O8423j25375K56570J35005P840L42092J13091k4825l8134M0778K80378
$$ y = [5956497, 6044845, 6185944, 6241566, 6435089, 6560639, 6739082, 6460307, 6445325, 6515638, 6268728, 6567782, 6538095, 6468958, 6534540, 6280469, 6245062, 6416796, 6540953, 6675893, 6475123, 6410696, 6448615, 6645384, 6611020, 6498280, 6653631, 6832960, 6848439, 6835073, 6800947, 6879096, 7091948, 7218209, 7410424, 7223945, 7295036, 7356110, 7701784, 7855662, 7909874, 7980068, 7841986, 7674543, 7683791, 7769361, 7606681, 7236274, 6959200, 7036513, 7367548, 7558750, 7651506, 7439971, 7259988, 7575490, 7803793, 7755661, 7913618, 7992418, 7839389, 7843425, 7945680, 8211330, 8151601, 8042285, 8153397, 8284346, 8501912, 8974324, 8926809, 9139758, 9208181, 9082806, 9339376, 9474381, 9482221, 9824313, 9937404, 9912579, 9874445, 9915223, 10195601]
4118A0195601K88442J15248K96274O8403K61771K63192k58407J08900K44571M53329
4108A2037324M8981k2987J4722L83202J32053J29816O08054J01084j81982J96833
4098A3447100Q5845K03867K09519J79106J17881J94298K81028M12657J25453L06981
4088A5563735K02382J41919M65204J04561J16955M43944N43907M06284M7162L53529
4078A8389582L36891M19986L16182L41697M46712N95277K80129N874L72793M39645
4068B1944768L00673O27643M67724M10352N71897K09516M14975N15524N12939
4059B5976011J80468K96781O63970M93142K09407Q38408Q66297R42859J271057
4050C1738400R36754J110601J175057P13760Q19340j9747L50882M42353R8199
$$ y = [10195601, 10484043, 10599291, 10895565, 10963968, 11225739, 11488931, 11230524, 11339424, 11583995, 12037324, 12086305, 12063318, 12078040, 12461242, 12593295, 12723111, 13331165, 13432249, 13250267, 13447100, 13532945, 13736812, 13946331, 14125437, 14243318, 14437616, 14718644, 15131301, 15256754, 15563735, 15766117, 15908036, 16373240, 16477801, 16594756, 17038700, 17582607, 17988891, 18036053, 18389582, 18726473, 19146459, 19462641, 19804338, 20251050, 20846327, 21126456, 21132330, 21505123, 21944768, 22245441, 22873084, 23340808, 23751160, 24323057, 24532573, 24947548, 25463072, 25976011, 26156479, 26453260, 27117230, 27610372, 27819779, 28658187, 29524484, 30467343, 31738400, 32675154, 33785755, 34960812, 35674572, 36493912, 36474165, 36825047, 37267400, 37365599]
4041C7365599l22868k15713l93778k74396l55609k08289m8216P0187j95478j57895
4031C5263544P1078r9365K26785k24446k28058K92910J26650K98973M19370J20103
4021C6267544K50152M60913L14990J34118J80327J00920J23357K09277L60933
4012C8402531j61616q7341J50629o5028p9822l62512j36009K70794j12926J30010
4002C7948710L23592K36805K83294O16377M92479M08578L76309O08117M84467
3993D1778728M57121O19911N95860N04644L53635N35918Q13086N30569M22112
3984D6611584K10886N27608M95038L01319J47447O3991n4678l97123m91900j52443
3974D7261729J80707l44781K8997j8678k86354k91988j45968j7641q5319l98816
$$ y = [37365599, 37042731, 36827018, 36433240, 36158844, 35803235, 35594946, 35546730, 35616917, 35421439, 35263544, 35334622, 35235257, 35462042, 35237596, 35009538, 35302448, 35429098, 35728071, 36147441, 36267544, 36517696, 36978609, 37293599, 37427717, 37608044, 37708964, 37832321, 38041598, 38402531, 38240915, 38153574, 38304203, 38239175, 38159353, 37796841, 37660832, 37931626, 37818700, 37948710, 38272302, 38509107, 38792401, 39408778, 39901257, 40309835, 40686144, 41294261, 41778728, 42235849, 42855760, 43451620, 43956264, 44309899, 44845817, 45658903, 46189472, 46611584, 46822470, 47350078, 47845116, 48146435, 48293882, 48357873, 48303195, 47906072, 47414172, 47261729, 47442436, 47097655, 47126652, 47107974, 46821620, 46529632, 46383664, 46366023, 46280704, 45881888]
3964D5881888l00201l88252m66254j40397l93397j93440k46632m59902l97110
3955D2896303n02089n91535n54934j96357n37271p11282n84766n30481m04450
3946C8283138n57450o02231m72926k53148k40219o42937n41406n37255m37388
3937C3998178k61373n66200m69209l84426l55508m31959m49126p52009p51847
3928B9576521l85687n90659p59661n67401k47899m14280n88808n79929m62088
3919B4980109n11893l54846l79337l20846n12848n41652Q7054k56894m96910m11019
3909B1280918k21741l60754k96577k50518j23589k19425j03017J11282k68392
3900A9548187l50644j05541J19748K80716J75090L44661K13013L38120N17615
$$ y = [45881888, 45581687, 45193435, 44727181, 44586784, 44193387, 43999947, 43753315, 43293413, 42896303, 42394214, 41802679, 41247745, 41051388, 40514117, 39802835, 39218069, 38687588, 38283138, 37725688, 37123457, 36650531, 36397383, 36157164, 35514227, 34972821, 34435566, 33998178, 33736805, 33170605, 32701396, 32316970, 31961462, 31529503, 31080377, 30328368, 29576521, 29190834, 28600175, 27840514, 27273113, 27025214, 26610934, 26022126, 25442197, 24980109, 24468216, 24113370, 23734033, 23413187, 22900339, 22358687, 22445741, 22188847, 21691937, 21280918, 21059177, 20698423, 20401846, 20151328, 20027739, 19808314, 19705297, 19816579, 19548187, 19197543, 19092002, 19211750, 19492466, 19667556, 20012217, 20225230, 20563350, 21080965]
3891B1080965P96804J087546R67727J488065J752189K544328K752722K769100
3883C5239446K973493K579747J370726j383263l310455l482089k724613j981771
3875B9281221j737623j218335p49460q42585P9175m98505j75364J00216J9147
3866B4257887k31049l10279l64574n03766j66292k64112o46592o69847o38714
3857B0462662j001301q10722q85888p77116n88602o98664q48013o68486o15901
3848A3567969m99201n30735k52773l37703j01919k78661j74019j60093j61009
3839A1071856j54575l93720j77134k06751j26857R1084p5090L4179r4578n7999
3829I910415r0664n0888j94283M0980L9152p9164L8856m1341K19215m7409L8179
$$ y = [21080965, 21877769, 22965315, 23933042, 25421107, 27173296, 29717624, 32470346, 35239446, 38212939, 40792686, 42163412, 40780149, 37469694, 33987605, 31262992, 29281221, 27543598, 26325263, 25575803, 24733218, 24812393, 24313888, 24138524, 24238740, 24257887, 24026838, 23716559, 23351985, 22848219, 22681927, 22417815, 21771223, 21101376, 20462662, 19461361, 18650639, 17764751, 16987635, 16399033, 15700369, 14852356, 14183870, 13567969, 13068768, 12538033, 12285260, 11947557, 11845638, 11566977, 11392958, 11232865, 11071856, 10917281, 10523561, 10346427, 10139676, 10012819, 10103903, 10028813, 10062992, 9968414, 9910415, 9819751, 9768863, 9574580, 9615560, 9654712, 9575548, 9614404, 9573063, 9792278, 9744869, 9783048]
3818I783048j81684O6790j7831p6012K5031K5459M0499k3019q471m66316J34921
3807I302415j26107O2636j68263J4959q895j50312k54927l6019j01554j04052
3797H429881m3187j48591p7588j85438R4904m5763Q9248O811J07389k45903k54471
3786G727292K4087R9003j59713l33810K83422j17879L0319N8393m9411J37128
3776G698831k66387k20534K54591o907K730N1340j37330K13097R3657j36991J31803
3765G677900K40585M5874R5910Q625K68895J63450L11663J76673k3035J5689J92336
3754I174565M02443L28574K38733j21178N14886K09130j36099j47057J821k5242
3744A0440576Q4219k6947J56609K24026K82634L68185m7229Q0480N3481K32269
$$ y = [9783048, 9601364, 9668154, 9650323, 9574311, 9599342, 9624801, 9665300, 9642281, 9633810, 9167494, 9302415, 9176308, 9238944, 9070681, 9085640, 9076745, 8926433, 8671506, 8635487, 8533933, 8429881, 8386694, 8238103, 8160515, 7975077, 8069981, 8024218, 8113466, 8120277, 8227666, 7981763, 7727292, 7751379, 7850382, 7690669, 7356859, 7640281, 7522402, 7552721, 7611114, 7561703, 7698831, 7432444, 7211910, 7466501, 7459594, 7462324, 7513664, 7376334, 7589431, 7683088, 7546097, 7677900, 7918485, 7964359, 8060269, 8068894, 8337789, 8501239, 8812902, 8989575, 8966540, 8982229, 9174565, 9577008, 9905582, 10144315, 10023137, 10538023, 10747153, 10611054, 10463997, 10465818, 10440576, 10524795, 10497848, 10654457, 10878483, 11161117, 11529302, 11482073, 11562553, 11616034, 11848303]
3734A1848303k07164L0816k7517J1931p507P0258M4728L16392L85827M80612J69546
3723A3116225l2996j00306K72084O5587P7612n2961K92330P5640n912j44034P7479
3712A3640748o7535j5214Q5280j4664k07305j72052Q0576j83782q4371j85498
3702A2876183j66831o3114J1492j13536n0984r2306o4567N0026K1564K10690K15857
3691A2834474l2886R2473J53955J61398K19747J55229K49264K83137K89105K15122
3681A4621018n388P2953J23806K07153M8665L78776J04491n0129P4397L69307
3671A5945049K58455J91938m1102J35910k64941K92811P3271k00217k58533N56
3661A6133197j02170o64878k91846j04908k27363l4685l4799m25841k45682p1765
$$ y = [11848303, 11641139, 11671955, 11644438, 11656369, 11648862, 11719120, 11763848, 12080240, 12466067, 12946679, 13116225, 13083229, 12982923, 13255007, 13320594, 13398206, 13345245, 13637575, 13713215, 13707303, 13563269, 13640748, 13573213, 13557999, 13643279, 13628615, 13421310, 13249258, 13329834, 13146052, 13061681, 12876183, 12709352, 12646238, 12657730, 12544194, 12493210, 12400904, 12336337, 12386363, 12407927, 12618617, 12834474, 12801588, 12894061, 13048016, 13209414, 13429161, 13584390, 13833654, 14116791, 14405896, 14621018, 14615630, 14688583, 14812389, 15019542, 15068207, 15446983, 15551474, 15501345, 15575742, 15945049, 16203504, 16395442, 16354340, 16490250, 16225309, 16518120, 16591391, 16391174, 16132641, 16133197, 16031027, 15366149, 15074303, 14969395, 14742032, 14707347, 14672548, 14246707, 14001025, 13929260]
3651A3929260j22302l27125p8177J52977L17666K8658k85688l24389k51833k32743
3641A2806304k25839j38746n7061l6561l5661R213j75778L0828K44988J4110N3092
3630A2488889J40470K07595k55819K51726J66935L5206K06413j65034k82603j09706
3620A2684072m4296j26379p0311k50710j76142j51159l5479j15537k24904J88564
3610A1677719l9583k30780o8177l9405J46408j22451P0953J41849m12173m5011
3600A1079349p4718j29234m6516r7484R707L17538J3476J81870L81865J23349
3590A1759202j04206j15793K22361J5424J7811K99434j9377k32979j68650J46516
3580A1819743M6732o034K51875k70126J80777L8737p1130O5262N8517k32674q4924
$$ y = [13929260, 13806958, 13479833, 13401656, 13554633, 13872299, 13900957, 13615269, 13290880, 13039047, 12806304, 12580465, 12441719, 12384658, 12348097, 12312436, 12321649, 12145871, 12176699, 12421687, 12435797, 12488889, 12629359, 12836954, 12581135, 12832861, 12999796, 13035002, 13241415, 13076381, 12793778, 12684072, 12639776, 12513397, 12443086, 12192376, 12016234, 11865075, 11829596, 11714059, 11489155, 11677719, 11638136, 11407356, 11339179, 11299774, 11446182, 11323731, 11394684, 11536533, 11124360, 11079349, 11004631, 10875397, 10828881, 10731397, 10741104, 11058642, 11072118, 11253988, 11635853, 11759202, 11654996, 11539203, 11761564, 11776988, 11794799, 12094233, 12074856, 11841877, 11673227, 11819743, 11866475, 11860441, 12112316, 11842190, 12022967, 12061704, 11990574, 12055836, 12114353, 11881679, 11796755]
3569A1796755L16049L3068J08482L7669j62988o9277O4455O5454J32969N42J22579
3558A2445757K08515J45106L8156j47047J10k59604R6276J7155L00282J67319
3548A3012025n5454k02784M05265L08271l5881O3939K04462J6152K67311M54187
3538A4437493K29281L85237J32006L36445P6107L72990J8250R9643L40897l84584
3528A6043765J68320r0353O2048L34074J99909P1048L01986M03759L10585L59268
3518A8164409L18945L12107L80331L42223L08505P59986L97134N59050J083917
3509B2626607R99435J290087J425023J110571J672332K213113K277441K757633
3501C6372242L103691L372689L975201M250062M644780M395454L973900L445081
$$ y = [11796755, 12112804, 12145872, 12254354, 12292023, 12129035, 12059758, 12124213, 12189667, 12322636, 12323178, 12445757, 12654272, 12799378, 12837534, 12690487, 12690597, 12430993, 12527269, 12544424, 12844706, 13012025, 12956571, 12753787, 13159052, 13467323, 13431442, 13495381, 13699843, 13715995, 13983306, 14437493, 14666774, 15052011, 15184017, 15520462, 15596569, 15969559, 15987809, 16087452, 16428349, 16043765, 16212085, 16121732, 16183780, 16517854, 16717763, 16788811, 17090797, 17494556, 17805141, 18164409, 18483354, 18795461, 19175792, 19518015, 19826520, 20586506, 20983640, 21542690, 22626607, 23626042, 24916129, 26341152, 27451723, 29124055, 31337168, 33614609, 36372242, 39475933, 42848622, 46823823, 51073885, 55718665, 60114119, 64088019, 67533100]
3493F7533100K345421R47374n02151k315549l124416l640207l744176l918236
3485E3581160l261098l084781k300398j907611j489783j029866n25476l40346
3477C9641801P3122L45825L92724N01198M80563P8480m03060j119117k006754
3468C7984782j719331j872373j218777q42622o55724o1698l4033L57018Q13813
3459C2751055R34560J478403J773245K038289K159120K682393L154283L189968
3451E0161316L303654L353944K751779J791005J636282N62718r20578j559061
3443F1081059k585839l119739l228503l728992l471288l260520k626785k398639
3435C6660754k038962j504549j656903j442069q68755n74772m42586k67275k19727
$$ y = [67533100, 69878521, 70825895, 70323744, 68008195, 64883779, 61243572, 57499396, 53581160, 50320062, 47235281, 44934883, 43027272, 41537489, 40507623, 39982147, 39641801, 39714923, 40060748, 40453472, 40954670, 41435233, 41513713, 41110653, 39991536, 37984782, 36265451, 34393078, 33174301, 32331679, 31675955, 31614257, 31580224, 31937242, 32751055, 33685615, 35164018, 36937263, 38975552, 41134672, 43817065, 46971348, 50161316, 53464970, 56818914, 59570693, 61361698, 62997980, 63560698, 62640120, 61081059, 58495220, 55375481, 52146978, 48417986, 44946698, 41686178, 39059393, 36660754, 34621792, 33117243, 31460340, 30018271, 29149516, 28574744, 28132158, 27864883, 27645156]
3426B7645156K30318N3942k53790k99542j16037n01638m27649m45945n31431q18567
3416B4534817o70853p57286j328999q53025r35554j032830r86085m85117l50464
3407A7134604m45781n81438n04427l67311n34550k14960l4431N3334k32849k63595
3397A4008596k43784r5046j01833J9516r2786J08754K27642K6817K0591J20655
3387A3999122L62406L27084M61933J86012O31637J027742J087527J027738J325292
3378B0436493J657315J611376K374642K511140K436260K623042K417249J003522
3370C7071039q18803k459211k801009k986573k270203j856932j790708j301129
3362B0786471r20671p25490j170811p04082o13809q07088o01870m66903l67231
$$ y = [27645156, 27875474, 27929416, 27675626, 27376084, 27260047, 26758409, 26330760, 25884815, 25353384, 24534817, 23863964, 23106678, 21777679, 20924654, 19989100, 18956270, 17970185, 17485068, 17134604, 16688823, 16107385, 15602958, 15235647, 14701097, 14486137, 14451706, 14505040, 14272191, 14008596, 13764812, 13669766, 13567933, 13587449, 13494663, 13603417, 13831059, 13857876, 13878467, 13999122, 14361528, 14688612, 15150545, 15336557, 15968194, 16995936, 18083463, 19111201, 20436493, 22093808, 23705184, 26079826, 28590966, 31027226, 33650268, 36067517, 37071039, 36252236, 33793025, 30992016, 28005443, 25735240, 23878308, 22087600, 20786471, 19865800, 19140310, 17969499, 17265417, 16651608, 15844520, 15242650, 14775747, 14408516]
3353A4408516m65252n46887m00708l27687m48593j10518j23320j93086k92935
3344A1499530O6305j79237p6431n6028k19777j30414m0445L6989m596M8373J22739
3333A1067008k02491J14630l6759j28486k3393j07856o5145J49123k3099j49828
3323A0593704j45774k66985L28796J15402J11559l29739k0258K20387q6057k07703
3313A0313332J86959K5031j39998q4762J24442M9745L9595J82327N342L9916J79455
3302A0921384P5402M7714L9090M26793J29375j76585N16791L33025K91141J73850
3292A2777980L95948N04920M36386M22555N18813P47928O83494N67781J113673
3283A8169478J129790J499003J616922K201541L021197L147106M235024M955764
$$ y = [14408516, 13943264, 13396377, 12995669, 12667982, 12219389, 12108871, 11985551, 11792465, 11499530, 11565835, 11386598, 11310167, 11254139, 11034362, 10903948, 10863503, 10900492, 10895896, 10944269, 11067008, 10864517, 10979147, 10942388, 10813902, 10790509, 10682653, 10617508, 10766631, 10743532, 10593704, 10447930, 10180945, 10509741, 10625143, 10736702, 10406963, 10386705, 10607092, 10521035, 10313332, 10500291, 10525322, 10385324, 10300562, 10425004, 10474749, 10514344, 10696671, 10702013, 10741929, 10921384, 10996786, 11044500, 11083590, 11510383, 11639758, 11463173, 11979964, 12312989, 12604130, 12777980, 13173928, 13678848, 14115234, 14537789, 15056602, 15804530, 16488024, 17055805, 18169478, 19299268, 20798271, 22415193, 24616734, 27637931, 30785037, 35020061, 39975825]
3275C9975825N145805N334655M857599R84187l401284n430028n247503m376740
3267C7842516l473823k313178j484662p80169k500N40990J275025J629094K059534
3258C5292827K606753L352464L895143M321289M587010M949595M495138L698205
3250F7198424J942506K91211j487389l415083m944243n137034m916837m782830
3242D4748725m476699l808887k978566k691435k128719j887586j673808j307159
3234B3795866j068214j127241p56815m34423r56279p09050o13029n25001j62573
3225A7443241n46233l79799M2106k11107k82193l66356p4160P182n95118K4558
3215A5062121q5320l19462m0702j43703k03050j21377m13204j28213Q9765k91910
$$ y = [39975825, 45121630, 50456285, 55313884, 56298071, 52896787, 47466759, 42219256, 37842516, 34368693, 32055515, 30570853, 29790684, 29788184, 30329174, 31604199, 33233293, 35292827, 37899580, 41252044, 45147187, 49468476, 54055486, 59005081, 63500219, 67198424, 69140930, 69432141, 67944752, 64529669, 59585426, 54448392, 49531555, 44748725, 40272026, 36463139, 33484573, 30793138, 28664419, 26776833, 25103025, 23795866, 22727652, 21600411, 20843596, 20409173, 19452894, 18743844, 18130815, 17605814, 17443241, 16897008, 16517209, 16559315, 16348208, 16066015, 15699659, 15625499, 15632681, 15037563, 15062121, 14976801, 14657339, 14616637, 14472934, 14269884, 14148507, 13735303, 13607090, 13696855, 13404945]
3205A3404945K94005M3041l40817l30568k79419n6902m10479l90453n51746l4285
3195A1347322J75537j57173j55151k52142M1331Q8634j27397o3128R8559j90064
3185A0806328q6439m5723O1482p4480j7438J05037J37303J52405l552J18867O61
3174A1154451J80907M01334O77921L10135P41380M99321L35739K84938R7707k4514
3164A4659319k25715o9444k63662l10266o46033k88590l34594n97441l16245l43427
3154A1263902k84515k04541j39343k09050k04198k99039q4372q9208j05649J31
3144I644118n8172l61613J70382K09396L15641L4763L56856L88884J07032K39789
3134A1047076k80884l78782m37667o38294m59936n20150k11676l81679l48903
$$ y = [13404945, 13698950, 13741991, 13401174, 13070606, 12791187, 12734285, 12323806, 11933353, 11381607, 11347322, 11522859, 11365686, 11210535, 10958393, 10999724, 11088358, 10960961, 10897833, 10996392, 10806328, 10719889, 10674166, 10735648, 10661168, 10643730, 10748767, 10886070, 11038475, 11034923, 11153790, 11154451, 11335358, 11736692, 12414613, 12724748, 13466128, 13965449, 14301188, 14586126, 14683833, 14659319, 14433604, 14364160, 14100498, 13790232, 13144199, 12855609, 12521015, 11923574, 11607329, 11263902, 10979387, 10774846, 10635503, 10426453, 10222255, 9923216, 9838844, 9749636, 9643987, 9644118, 9585946, 9224333, 9394715, 9604111, 9919752, 9954515, 10311371, 10700255, 10807287, 11047076, 10766192, 10387410, 9949743, 9311449, 8851513, 8331363, 8119687, 7738008, 7389105]
3125G389105j04872p4715k92630o2174N6921Q6479R1206K3768r0461o1294q2355
3114F878978J6374J06971K78447J21834l27901k26511k91537K41303k90582j57181
3104F350195P9400K4930j94746l65972j53582k40351k81735j42693l49889r4362
3094D631195j55180J50405N0465k96118J01475K16954J5850k0373o611r8577j18444
3083D471041j88543k62306j57501Q768R4872j38469k14995L4591k03107j4880
3073C429471o2672m2527j99309O6392J76926p1292j22116k9982l6314K394k62091
3062B848880k92509n6925j64230J76706J78254J71485k55177j39313l39653O0433
3052B187951K28920j63744q2719j4531r0410J84406o7212j6881K00750p6400l1424
$$ y = [7389105, 7284233, 7209518, 6916888, 6854714, 6911635, 6998114, 7089320, 7113088, 7022627, 6961333, 6878978, 6895352, 7002323, 7280770, 7402604, 7074703, 6848192, 6556655, 6797958, 6507376, 6350195, 6429595, 6454525, 6259779, 5893807, 5740225, 5499874, 5218139, 5075446, 4725557, 4631195, 4476015, 4626420, 4676885, 4380767, 4482242, 4699196, 4715046, 4694673, 4688062, 4589485, 4471041, 4282498, 4020192, 3862691, 3871459, 3966331, 3827862, 3612867, 3647458, 3444351, 3429471, 3366799, 3324272, 3124963, 3191355, 3368281, 3296989, 3174873, 3144891, 3108577, 3110971, 2848880, 2556371, 2499446, 2335216, 2511922, 2690176, 2861661, 2606484, 2467171, 2127518, 2187951, 2416871, 2253127, 2170408, 2155877, 2065467, 2249873, 2182661, 2165780, 2366530, 2290130, 2258706]
3041B258706r1656j61637k93590P8665J55744M0021o7006k53366n254K40986j99117
3030A702496J9630K24045k3253q1332J447J17734k86592L7003O2964j0324l83056
3019A380762j47082J09493o1769J40656J20585k37884K12580k74746J56040L1375
3009A430010q1757n9406j81931j31988K7581L75806P9096k27172o5072K6402q6226
2998A105343J18980j06341o03j23457J02195J33074r6795R559O1825j79961K73862
2987A297681J78825k35040j78437P3248M3436j62224r3907j60636J48716J8203
2977I29865M9881L059O177K86982k31557n7639Q324j69076L64035J90016k16240
2966A163827J68915J98789k30612l3964j08811l11953j20881J94652K52401k20075
$$ y = [2258706, 2167050, 2005413, 1711823, 1790488, 1946232, 1986253, 1919247, 1665881, 1660627, 1901613, 1702496, 1722126, 1946171, 1922918, 1841586, 1843033, 1960767, 1674175, 1711178, 1774142, 1763818, 1380762, 1233680, 1343173, 1281404, 1422060, 1542645, 1304761, 1517341, 1242595, 1398635, 1430010, 1348253, 1288847, 1106916, 974928, 1002509, 1378315, 1457411, 1230239, 1165167, 1191569, 1105343, 1224323, 1117982, 1117379, 993922, 1096117, 1229191, 1132396, 1141955, 1203780, 1023819, 1297681, 1476506, 1241466, 1063029, 1136277, 1179713, 1017489, 923582, 762946, 911662, 929865, 979746, 982805, 988982, 1275964, 1044407, 986768, 995092, 826016, 1190051, 1380067, 1163827, 1332742, 1531531, 1300919, 1266955, 1158144, 846191, 725310, 919962, 1172363, 952288]
2956I52288J0860m4149R65j35627K28418P5490k91089j14944O7353J01323j79217
2945F71671p9958j9447J27197N4757M820R036p0772P9849l1894M1806k31190K35201
2933G91076N6267j98096L9644J01186Q8584N8314m0731m29532j6806J39049j12755
2922D76200j7649L0547J30589m5006K67039K8879k36380j54844Q1189J89173J92345
2911I42082J3204j12688j81355k63945M1374J72557N2028o3222O3474j35701j20592
2900D07216j11142N5663L03186k1432P8677j09256M5965j43354j70526K25553
2890E60550k37529J56645K04497k47499J9781k94573j18821J80863L48682K18344
2880G90940j79085K2514k27117P7999K56929n1397j17625N7060J90557M1359L2307
$$ y = [952288, 963148, 918999, 919964, 784337, 1012755, 1088245, 797156, 682212, 749565, 850888, 671671, 591713, 572266, 699463, 754220, 759040, 768076, 697304, 777153, 745259, 787065, 555875, 791076, 847343, 649247, 688891, 790077, 878661, 936975, 896244, 466712, 449906, 588955, 476200, 458551, 489098, 619687, 574681, 841720, 870599, 634219, 479375, 560564, 749737, 942082, 955286, 842598, 661243, 397298, 438672, 611229, 663257, 600035, 663509, 527808, 407216, 296074, 351737, 654923, 633491, 712168, 602912, 648877, 505523, 334997, 560550, 323021, 479666, 684163, 436664, 456445, 161872, 43051, 223914, 572596, 790940, 611855, 634369, 407252, 485251, 742180, 690783, 573158, 630218, 820775, 862134, 894441]
2869H94441k31087m6133J19766o0427J3608l8278k3140j72056J81080M2277k15778
2858D64273p8495O6208L59641P7336L4103j92294M3340p5328K751j32198k02363
2847C66974o70R5774L27446k2877q1877n2554O6608K93846k30988k67070l9281
2836D55331n229m9925l6037N9944N5796K17775p7941J57833l333l3951j62185
2825E78078K97292q6324j16464l77781J93602K38059j68777k27699O3941K09263
2815F03190L5665N5138n0653m9524P0512O5237o9540R1810j30035j81374L44489
2804G84915j21066j83785O5748p4983P661K16204J20256j62584k55493L80K84017
2793F81270l0519k59929o3471J68514j9866J37931n6655n300j12663O9454Q6461
$$ y = [894441, 663354, 617221, 736987, 676560, 690168, 651890, 628750, 456694, 637774, 680051, 464273, 385778, 451986, 811627, 888963, 923066, 730772, 774112, 698784, 701535, 569337, 366974, 366304, 462078, 789524, 766647, 684770, 632216, 698824, 992670, 761682, 494612, 455331, 450102, 400177, 364140, 424084, 479880, 697655, 619714, 777547, 774214, 740263, 578078, 875370, 789046, 672582, 294801, 488403, 726462, 557685, 329986, 393927, 603190, 638855, 693993, 643340, 593816, 664328, 729565, 660025, 751835, 621800, 440426, 784915, 663849, 480064, 545812, 470829, 478490, 694694, 814950, 652366, 396873, 397253, 681270, 650751, 390822, 327351, 495865, 475999, 613930, 557275, 551975, 439312, 508766, 595227]
2782E95227J2847J37031k40740j07775p564P7031r0547J71716P3682j58409R9995
2771E62494K36361n9519k14259J11067j79329j82905K68317j8766n240P4352k6666
2760E65907r85j60256L9491M5462N8436o2573J53581j65288N4805L109l0405J23191
2748F24475j5486J86042j917p2186l1413k3422n6707p9785k09467K12841O5960
2737E98935J50601j18251j2974R7901q0533j6294j4715n4187N2450J1890p3785
2726E41038O4292J60646j29650k06834P8944N1669J1084m9797o5176J04642J88741
2715G49599k78326K0259L0587R45J91607l6621k03256J52324O5227j98490m3825
2704D50030K2925j14959K9586P5183M2616o9035L5351L0357l8558l2886j58464
$$ y = [595227, 608074, 745105, 504365, 396590, 389026, 466057, 375510, 547226, 620908, 462499, 562494, 798855, 739336, 525077, 636144, 456815, 273910, 542227, 523461, 518221, 592573, 565907, 564922, 404666, 444157, 489619, 548055, 485482, 639063, 473775, 528580, 531689, 501284, 624475, 608989, 795031, 793114, 720928, 689515, 666093, 609386, 529601, 320134, 532975, 598935, 749536, 631285, 618311, 716212, 635679, 619385, 604670, 550483, 602933, 614823, 541038, 605330, 765976, 636326, 429492, 508436, 560105, 571189, 521392, 456216, 560858, 749599, 471273, 491532, 522119, 523064, 714671, 678050, 474794, 627118, 692345, 493855, 450030, 472955, 357996, 387582, 462765, 505381, 436346, 471697, 502054, 463496, 430610, 272146]
2693B72146q4292K33694j53544k280K93206o694l9491P5609m2302O6432j03136
2682E09348K56421o9872K2498j34357q6478J91102p1495j1581K12382j86306k11164
2671D20498O0051J85470k3144k238k4019O396j01179N7540L7264K06492J81092
2660A004223l52295M4441J0030r4357J13234m2182J13162J30525n2670n0529l429
2649H20153J61998j23867Q2721j68019M885J37919r7498j9736o0114K36518k23469
2638G51491q5484J08597Q858k9342R4727K61875q8687P7116j88551j95158l3638
2627F81804J89705J69248k06221j15078q7198N1873L29880p9618J01420j05940
2617I29875n0662J4039K65882J97046p9843k56531j57863J59649M9101K74599
$$ y = [272146, 187854, 421548, 268004, 265724, 558930, 552236, 512745, 588354, 546052, 612484, 509348, 765769, 695897, 718395, 584038, 497560, 688662, 617167, 605586, 817968, 631662, 420498, 480549, 666019, 642875, 640637, 616618, 623014, 521835, 579375, 616639, 823131, 1004223, 651928, 696369, 706399, 612042, 725276, 683094, 796256, 926781, 874111, 823582, 820153, 982151, 858284, 941005, 772986, 777871, 915790, 818292, 798556, 738442, 974960, 751491, 666007, 774604, 783462, 754120, 848847, 1110722, 1022035, 1099151, 910600, 715442, 681804, 871509, 1040757, 834536, 719458, 632260, 684133, 1014013, 934395, 1035815, 929875, 879213, 893252, 1159134, 1356180, 1276337, 1019806, 861943, 1021592, 1070693, 1345292]
2607A345292K21194l2921J88096L77510K10419O4578J39623K684l70609k80272
2597A865594j63411j26628p6631j09174j58707Q5183n9543j59067K03918j22379
2587A179155L834m8378k16885K2507L20955j70818o3760L03971m8278j40875L3388
2576A174816L9288n5548J78251l47968J90239J01053n9221K35070l0326J29894
2566A555548j6523J02142l14607l7511K29255J64525k75383j49360Q2181K45213
2556A585480P0749o8952m77343r9908o7699J38514J58295R7347k21785j1047r683
2545A093968K71202q281n4987P4156j74004k6907J7498j88219J37317n2640Q3051
2534A172154J98690j55153P2118O8697J40554q8710J35184j14795j084N8551l4934
$$ y = [1345292, 1566486, 1533565, 1721661, 2099171, 2309590, 2374168, 2513791, 2516475, 2145866, 1865594, 1702183, 1575555, 1498924, 1389750, 1231043, 1316226, 1256683, 1097616, 1301534, 1179155, 1182989, 1134611, 917726, 940233, 1261188, 1090370, 1026610, 1330581, 1282303, 1141428, 1174816, 1214104, 1158556, 1336807, 988839, 1179078, 1280131, 1220910, 1455980, 1425654, 1555548, 1539025, 1641167, 1326560, 1289049, 1518304, 1682829, 1407446, 1258086, 1340267, 1585480, 1656229, 1587277, 1109934, 1010026, 942327, 1080841, 1239136, 1336483, 1114698, 1103651, 1093968, 1365170, 1356889, 1301902, 1376058, 1202054, 1175147, 1192645, 1004426, 1141743, 1089103, 1172154, 1370844, 1215691, 1287809, 1356506, 1497060, 1408350, 1543534, 1428739, 1427655, 1486206, 1451272]
2523A451272l5208n6520m2128L36541n6086j22520J44066P0064j50138o1954L1729
2512A509118j43319m1628J27041j7326j87269K6455M5390p2974K69038J83126
2502A697652n6107j85928J6715K3004j24090J55232K21488j49326j0115J70166
2492A758691j34578J92117k3061L75316O2399l43521M5008n3428J36798j526l1913
2481A982302O5790K01492k0267q9398R7037J22576J47402J0115k28584m683k30279
2470B053503J46128l2350K17380r1592j12336J19368M5323p3208M5665j7425J30895
2459B431351L1595q748j02461J31069K1271J84797K91996q3297j56842L3557k81188
2448B493100N2033j01382J67953K86881J02570p6652k77193k42538K10543J30228
$$ y = [1451272, 1416064, 1359544, 1317416, 1653957, 1597871, 1475351, 1619417, 1689481, 1539343, 1477389, 1509118, 1365799, 1324171, 1451212, 1433886, 1246617, 1273072, 1318462, 1245488, 1514526, 1697652, 1641545, 1455617, 1472332, 1495336, 1371246, 1526478, 1747966, 1598640, 1588525, 1758691, 1624113, 1816230, 1793169, 2168485, 2230884, 1887363, 1932371, 1878943, 2015741, 2014215, 1982302, 2048092, 2249584, 2229317, 2139919, 2236956, 2359532, 2506934, 2517049, 2288465, 2283782, 2053503, 2199631, 2167281, 2384661, 2293069, 2180733, 2300101, 2345424, 2272216, 2317881, 2300456, 2431351, 2462946, 2454198, 2351737, 2482806, 2504077, 2688874, 2980870, 2897573, 2740731, 2774288, 2493100, 2545133, 2443751, 2611704, 2898585, 3001155, 2924503, 2647310, 2404772, 2615315, 2745543]
2438B745543J58482N5328J03249k1264Q608P0949P3433j05929p0670o3407Q6358
2427C040680J5579L33234R956J88493r0589j79862J29527J66028K8235O3068J27318
2416C831667J59090K22356j4620O6306K12362j48469NK60540P8012J11882j66447
2405D612684M9754K29897j17710J65238L4840K0968L56013k6752l07437L27642
2395E345137o2205j39771J72770J45432J7109J26916O8107P2707L59880P7460
2385F183542M41528p9023R1617J0518K34420J11163J46784n4262K60137J72375
2375G518799J14147k17050L13142K94326M71974K02570N74060N9802K11924K44584
2365I788278N01954L11294O22020M47679N1793K01278P83448J66953R94366O05361
$$ y = [2745543, 2904025, 2959353, 3062602, 3041338, 3049946, 3120895, 3194328, 3088399, 3017729, 2954322, 3040680, 3056259, 3389493, 3399449, 3587942, 3497353, 3317491, 3447018, 3613046, 3641281, 3704349, 3831667, 3990757, 4213113, 4198493, 4264799, 4477161, 4328692, 4328697, 4589237, 4667249, 4779131, 4612684, 4662438, 4892335, 4774625, 4939863, 4974703, 4995671, 5351684, 5324932, 5017495, 5345137, 5282932, 5143161, 5315931, 5461363, 5478472, 5605388, 5673495, 5746202, 6106082, 6183542, 6625070, 6546047, 6637664, 6648182, 6882602, 6993765, 7140549, 7086287, 7346424, 7518799, 7632946, 7415896, 7729038, 8023364, 8495338, 8697908, 9271968, 9331770, 9543694, 9788278, 10290232, 10601526, 11223546, 11671225, 11723018, 11924296, 12707744, 12874697, 13869063, 14474424]
2355A4474424J471630J329219J582492J532723K487979K401590J741167j10676
2347B6910548J431452J558186L718563M758902Q574797J1825175K0400792K7196155
2339A06374570L6437922L5706798L7507027M2196868O2325907J2131458o7049925
2332B65630625n9119495m7737153l6005629k7320994k0044404j6639586j1479940
2325D7283424p621949l033596k791522j428147j363947j83889j368889k866430
2317B6625055k665297j794771j818807j411923j096618j026927j410370o81228
2309A4719114p92803p34162p21282k60514m36862k13871m52418k18406l04195
2300A0584601m13113p0265k83452L823j87247n33426j14306m35969l64352k92548
$$ y = [14474424, 15946054, 17275273, 18857765, 20390488, 22878467, 25280057, 27021224, 26910548, 28342000, 29900186, 33618749, 38377651, 46952448, 58777623, 79178415, 106374570, 142812492, 178519290, 216026317, 258223185, 320549092, 332680550, 265630625, 206511130, 158773977, 122768348, 95447354, 75402950, 58763364, 47283424, 39661475, 36627879, 33836357, 32408210, 31044263, 30860374, 29491485, 26625055, 23959758, 22164987, 20346180, 18934257, 17837639, 16810712, 15400342, 14719114, 13926311, 13192149, 12470867, 12210353, 11773491, 11559620, 11107202, 10888796, 10584601, 10171488, 10101223, 9817771, 9821594, 9634347, 9100921, 8986615, 8550646, 8186294, 7893746]
2290G893746l61886l25904j29654N8553J19151k44635J26030o3769k56821q4138
2280F730673j25417k53143k92182N1312j79490r1698k57579j30916l39791q6899
2270E024870R6727k22975n1452J57431m19670j89696K0912j52592l23068J57726
2260D098213l09048p2478j83580j33897k22921n5901O6220J36795j10663m2017
2250C170723j00730Q480J05881J43299l15766k70053k4196L24143k40190k40286
2240B561305M2213J58660Q8905j8041k00746l9253k12604O5343k38956R910n8318
2229B158418l4745k71792p6916N8949j15441K22336J77957l05560m8570J55222
2219A919858l9274k46615p3293n4073K08535K4368j5709P4863N6493r200k04332
$$ y = [7893746, 7531860, 7205956, 7076302, 7134855, 7254006, 7009371, 7135401, 7071632, 6814811, 6730673, 6605256, 6352113, 6059931, 6111243, 5931753, 5840055, 5582476, 5451560, 5111769, 5024870, 5121597, 4898622, 4847170, 5004601, 4584931, 4395235, 4416147, 4263555, 3940487, 4098213, 3789165, 3716687, 3533107, 3399210, 3176289, 3120388, 3186608, 3323403, 3212740, 3170723, 3069993, 3078473, 3184354, 3327653, 3011887, 2741834, 2717638, 3041781, 2801591, 2561305, 2603518, 2762178, 2851083, 2833042, 2632296, 2593043, 2380439, 2445782, 2206826, 2216736, 2158418, 2123673, 1851881, 1774965, 1833914, 1718473, 1940809, 2118766, 1813206, 1764636, 1919858, 1880584, 1633969, 1560676, 1506603, 1715138, 1739506, 1723797, 1798660, 1855153, 1845953, 1641621]
2208A641621M7557k5985L5041q5034l59069j7705R7013p7431K18718j2448l2363
2197A429915j38036J31090J1396p4016k08136O5314P5232j70424r8314Q8099R0176
2186A202296p2862K09337n3542P9048m26105j15121Q9719J37268J15896k1575
2176A144359j44172M5059k46332K47042J66094k47031j33851L01641J0165j6940
2166A126034k11516J53869j73183J9654M3544J02927K14994l36851K3575k12067
2156G50980j69546k01335K53888j41824L10037L8025L5728L14148l77209l04157
2146E08735J50192k4014j88003J73107J94965K8736r8217q6689k54923K9945L58646
2135G92480k0998k08618J3964J11584J1608j14059j55106K04225l3801j03378
$$ y = [1641621, 1689178, 1663193, 1698234, 1613200, 1254131, 1236426, 1333439, 1256008, 1474726, 1462278, 1429915, 1291879, 1422969, 1434365, 1360349, 1152213, 1217527, 1292759, 1122335, 1024021, 1112120, 1202296, 1129434, 1338771, 1285229, 1364277, 938172, 823051, 912770, 1050038, 1165934, 1144359, 1000187, 1045246, 798914, 1045956, 1212050, 965019, 831168, 1132809, 1142974, 1126034, 914518, 1068387, 895204, 914858, 958402, 1061329, 1276323, 939472, 963047, 750980, 581434, 380099, 633987, 492163, 802200, 840225, 875953, 1190101, 812892, 508735, 658927, 634913, 446910, 620017, 814982, 843718, 745501, 658812, 403889, 433834, 792480, 771482, 562864, 576828, 688412, 700020, 585961, 430855, 635080, 601279, 497901]
2125D97901J29424j25810j48580K12623j50645K0777l9956M4095L8729O9151k18422
2114C29287k03979K00853J13551J8110k4305k99432K45292p79j74124o0685J62743
2103C06532l1475l3876K19303N8973M7309l3514j44037J8333l32703J45085N975
2092B25905J08350J44756j07950k45865n8223q991J85301J82155l0552L981r6836
2081C02031j09703J08777J01333Q0879l05374j35314K46598J45641K02318m1875
2071E95311Q4401K13091K24765J76111J88790J24198J03669l7799j84268l92260
2061A096009k93682m62863m3558J61062n7926j80484R6592m0588j57105J72596
2051B90053k06105P6184J17890R4337P0199r6157p2659q2309O1017l35441J42046
$$ y = [497901, 627325, 501515, 352935, 565558, 414913, 435690, 395734, 439829, 478558, 547709, 329287, 125308, 326161, 439712, 457822, 433517, 134085, 379377, 378598, 204474, 143789, 306532, 275057, 241181, 460484, 519457, 566766, 533252, 389215, 407548, 74845, 219930, 225905, 334255, 479011, 371061, 125196, 66973, 57982, 243283, 425438, 394886, 398867, 302031, 192328, 301105, 402438, 483317, 177943, 42629, 289227, 434868, 637186, 595311, 679712, 892803, 1117568, 1293679, 1482469, 1606667, 1710336, 1672537, 1488269, 1096009, 802327, 339464, 295906, 456968, 399042, 218558, 315150, 274562, 117457, 290053, 83948, 160132, 278022, 372359, 442558, 346401, 273742, 191433, 252450, -82991, 59055]
2040E9055L74307j71446p7964N5520r9013k82660j833K74138k35136n2919J72129
2029A4178m5411j12366N2073L48619m5426m4397k375j26544L30594L4814j44578
2018B59181M7551j69250p992k49374j05033L83622j01460J12992l3211J19145
2008B56171j10502Q4551n5725j79028p69K43712j63919R7319j10139l1789M5459
1997G5341k17424J66203j63615J13058K31925O0093K346r6303j08890k06218J59128
1986A5644R2577r8209k91785M132L34036n2532q0471n0764J53383k72258R7423
1975a48824J37442m6289j40054k00213J66708N0022M646J39755r1452p1942K41369
1964D1168K2149o8635J8338O8365J91117M4005j81753j46503N0899j09089Q9872
$$ y = [59055, 433362, 261916, 183952, 239472, 140459, -142201, -144034, 130104, -105032, -157951, 14178, -31233, -143599, -91526, 257093, 211667, 167270, 164895, 38351, 368945, 403759, 259181, 306732, 137482, 129490, -119884, -224917, 158705, 57245, 170237, 137026, 256171, 145669, 230220, 174495, -4533, -5302, 238410, 74491, 171810, 61671, 29882, 75341, -142083, 24120, -139495, -26437, 205488, 265581, 267927, 171624, 62734, -143484, 15644, 108221, 10012, -281773, -277641, 56395, 3863, -76608, -127372, 26011, -246247, -148824, -11382, -57671, -197725, -397938, -231230, -181208, -176562, -36807, -128259, -200201, 41168, 63317, -5318, 13020, 81385, 272502, 316507, 134754, -11749, 39150, -69939, 19933]
1953A9933J72843m8551l03468k3623K11833m6671L1491l018j73869j39958L00056
1942c002N547n2985q6557j96173L68233J2711l07807K66869j748j38602j18681
1931b52195j6130K26240J6782K1433J48416k00949j06429K51649k1728j30759
1921f3670k2702J34499n9860J42018J43532l87843k2571r2697l5845J0460J21576
1910a33103q1763N1658K50726r0393j59283j23267K11798k2869N945m3477J28260
1899e768J2654r9141o2705q0017L64717J04376l52523Q5025j34675M1153o0981
1888a87885K19283j18522k1255M5382Q000J2697N5697q9348N8344M1890Q9861
1877A14144J22556j79205J59877j66117k63696J28714L8376m4206O3145J5175
$$ y = [19933, 192776, 144225, -159243, -182866, 28967, -17704, 13787, 10769, -163100, -303058, -3002, 2545, -50440, -136997, -333170, 35063, 47774, -260033, 6836, 5088, -133514, -252195, -268325, -42085, -25303, -3870, 144546, -56403, -162832, 88817, 67089, -63670, -86372, 48127, -11733, 130285, 273817, -114026, -136597, -229294, -265139, -254679, -133103, -214866, -163208, 87518, -2875, -162158, -285425, -73627, -96496, -90551, -134028, -5768, 6886, -92255, -154960, -234977, 129740, 234116, -118407, -33382, -168057, -126904, -187885, 31398, -87124, -108379, -62997, -54997, -42300, 13397, -75951, -17607, 24283, 114144, 236700, 57495, 217372, 51255, -212441, -83727, -45351, -89557, -26412, -11237]
1867a1237L162r6777K13173n3821j51367J70647j13785k99438L2174M3443J89206
1856g4620O820J35443k0747O5273L0010r9133k00193j81985J33222O7948q408
1845a46370m8792J63065j42881j57153N8744K07291n1913K15261J27388j56966
1835F7674p056P2507J63176k45493j64659R1958M5617j50857N3999L58525j62324
1824A23067l03564J54219K55383l76395j09233M23j57682K28615Q3390J7832p1463
1813a55408Q1794J28688J67580j4879J39357k06246k50220q1023K10810q3788
1803f3335o3347J42104j92815j26468J86054M1994j4861J99926k18334q9116K7655
1792a70543J72049J69073k22470p1077J9706J02055K3621J8887P2029k04544q1392
$$ y = [-11237, -8075, -104852, 108321, 54500, -96867, 73780, -40005, -339443, -307269, -263826, -74620, -67800, 67643, 46896, 112169, 142179, 43046, -157147, -339132, -205910, -137962, -146370, -195162, -32097, -174978, -332131, -273387, -66096, -118009, 97252, 224640, 67674, 60618, 133125, 296301, 50808, -113851, -21893, 23724, -127133, -73134, 285391, 123067, -180497, -26278, 229105, -147290, -256523, -256100, -413782, -185167, -101777, -83945, -155408, -73614, 55074, 222654, 207775, 347132, 140886, -109334, -190357, 20453, -63335, -126682, 15422, -177393, -303861, -117807, -75813, -90674, 109252, -109082, -198198, -170543, 1506, 170579, -51891, -122968, -103262, -1207, 22414, 41301, 113330, -91214, -172606]
1781a72606J36911J7955R8517o6731j78232Q562O9126J04854r7741L5523K69952
1770B26090l7429j94232k51442k7923R579j53582J10394N6617j02650L31066j09385
1759a42897p1578j74484L3364K40557O7081J07170R8420l8085P4527J56239l71290
1748b0976j48544n2736J45579K0329k80805l389J41877K9635J35073m7124n459
1737h6540l01034K26136N8752l2913j0959K83148J96763j43402K7154K89901k07025
1726B99981k37981j18606j43872J70570J47708L4658J50008r7091k35597o3299
1716i3521J17878J33901k26225J26849q3112j62008K841Q051m1216J30359R7174
1705A0971J0851r918L5296m3660k21221j46560j0332J17187R6644p4244L9215
$$ y = [-172606, -35695, -17740, 80777, 14046, -164186, -155624, -86498, 18356, -79385, -43862, 226090, 188661, -5571, -257013, -284936, -275357, -428939, -318545, -261928, -364578, -33512, -142897, -214475, -388959, -355595, -115038, -47957, 59213, 157633, 119548, 194075, 350314, -20976, -169520, -222256, -76677, -56348, -337153, -340542, -198665, -169030, -33957, -81081, -86540, -387574, -161438, -102686, -135599, -146558, 136590, 333353, 189951, 217105, 507006, 299981, 62000, -56606, -200478, -29908, 117800, 152458, 302466, 205375, -30222, -93521, 24357, 158258, -67967, 58882, -24230, -186238, -183397, -175346, -216562, -86203, 10971, 21822, 11904, 47200, 3540, -217681, -364241, -374573, -257386, -160742, -234986, -195771]
1694a95771J48786j11211K0390J46516k84989j60513J07074j8M4228Q8270N4427
1683a42811L33455M2208k20747L1226k20865L2672L21730l16733P1928o3054k1219
1672a52210J67705p2289m0918q0436J15730q2735j20518K66317j29549q9936K93729
1661G4890J06325j1786j77650k17158K65599K2432k2440Q2998K7149j32270k22153
1650b04064J70920j00013J19018J43326j33619P7292K25933m2945J53886j50123
1640B59611j6010l55098j70915P2322K19295O6334k6274J08762m4567P5207m5598
1629A43069l0591j47127j3562p8203K75350m6596Q64j39379J5178j48805k07462
1618c77264J56890R0614p0628j95277J42317K88640J88408p4854J49507j61063
$$ y = [-195771, -46985, -158196, -137806, 8710, -276279, -436792, -329718, -329736, -285508, -197238, -142811, 190644, 232852, 12105, 43331, -177534, -144862, 176868, -139865, -67937, -130991, -152210, 15495, -56794, -97712, -178148, -62418, -145153, -265671, 646, -128903, -218839, 74890, 181215, 169429, -8221, -225379, 40220, 62652, 40212, 123210, 150359, 18089, -204064, -33144, -133157, -14139, 129187, -4432, 72860, 298793, 255848, 409734, 259611, 243601, -111497, -282412, -210090, 9205, 75539, 49265, 158027, 113460, 188667, 143069, 112478, -34649, -48211, -126414, 148936, 102340, 103204, -36175, -20997, -169802, -377264, -220374, -129760, -200388, -395665, -253348, 35292, 223700, 148846, 298353, 137290]
1608A37290r7787m2532J68118K64343j10412m2384m19680M9240K02170O9391n6862
1597A20895K1044J91757k78101l3988J38702l15445R445M0884J42273K67588j56861
1586A48193j01739p7263j02630L7894j3561k3802k17690l3736L97438J95050p0921
1575A37233o1574k35296K25859j1410P5857j34559k95882M620R9728J6123O318
1564a72983j33800J65377K10575j96388K01173q0232j78170k36315K68933J31536
1554b0294K23043O7068r4577l03326J08304N5463P1135k3252l4600j25981j65245
1543b42262J59730J7182m30211j9557K95566Q7569l00898K41858K81703j30469
1533c9789j41141m8408J34995J39342K3869R908o7966j57908J75291K32651m4561
$$ y = [137290, 39503, -3029, 165089, 429432, 319020, 276636, -143044, -93804, 108366, 177757, 120895, 141939, 333696, 55595, 21607, 160309, -155136, -145691, -104807, 37466, 305054, 148193, 46454, -30809, -133439, -95545, -109106, -132908, -350598, -384334, 13104, 208154, 137233, 75659, -159637, 66222, 54812, 130669, -3890, -299772, -295152, -195424, -179301, -172983, -306783, -141406, 69169, -127219, 73954, -6278, -184448, -420763, -151830, -20294, 202749, 269817, 175240, -128086, -19782, 35681, 106816, 83564, 48964, -77017, -242262, -82532, -65350, -495561, -515118, -219552, -131983, -432881, -191023, 90680, -39789, -180930, -229338, -94343, 44999, 68868, 78776, 10810, -147098, 28193, 260844, 216283]
1522B16283j22899J7701R1632q0677O2304k73091k134n859k49841J13906l21283
1511e53958K31675O9688P7747P1427J92736J23070n5733j39488r564J44800o5436
1500H6964J9780j91576n4958R8575j40015J27235K5590P3n6894k04047N0059P5908
1488a63306q5395j53394J59281L43695M1793J06512l01961p3085J65785k39796
1478a99871J46550J71348m8734k01506l2682J22511J05619O6225k26107L01857
1468B05210k67017j36478J86125P9708J82636j71471m79642J34611j3734j543
1458b81595J93230L5785p8731r4832J04007N3575r1354J3691J83738J87890K5473
1447B50877j39476K1154R5053k67225P6523l1398j59557M6115n2260J52152l2752
$$ y = [216283, 93384, 111085, 202717, 122040, 184344, -88747, -90881, -96740, -346581, -232675, -553958, -322283, -252595, -174848, -103421, 89315, 212385, 156652, 17164, 7600, 152400, 86964, 106744, -84832, -139790, -41215, -181230, -53995, -28405, -28332, -85226, -289273, -239214, -163306, -248701, -402095, -242814, 100881, 142674, 249186, -52775, -125860, 39925, -199871, -53321, 118027, 69293, -132213, -164895, -42384, 63235, 129460, -96647, 205210, -61807, -198285, -12160, 67548, 250184, 78713, -400929, -266318, -280052, -281595, -88365, -52580, -131311, -226143, -122136, -68561, -159915, -146224, 37514, 225404, 250877, 111401, 132555, 227608, -39617, 36906, 5508, -154049, -107934, -160194, -8042, -40794]
1436d0794j63218K243Q4201J50493L3506K32943j86872j74029J14380j05144Q5429
1425C3138k01691J72692N3183j1974P339j54190l47874Q530J29480L65223o1413
1414g557j13100j17235l2857K35612L1919K5514j53983J29409J42904Q7241N0714
1403B78581k06003j36672j11103L84655J19446l850j38526k03090j972L2657J26081
1392A40204p1126M3471j10705o6997P1309j13700m5482J39591J03729j30595M441
1381c5860L23878j41855j95869m9346n7653K66879J84983q0031k02624j07629
1371i5127k5364j37156L61559K59275m34323J8459o0453K03563m6903K54992n2637
1360B45885p2442J59719l52268n841K18463j47998r5440k1784P8297j16802K8901
$$ y = [-40794, -204012, -201769, -117568, 32925, 66431, 299374, 112502, -61527, 52853, -52291, 33138, -168553, 4139, 57322, 45348, 52687, -101503, -449377, -440847, -311367, 53856, -7557, -120657, -237892, -270749, -35137, -3218, 22296, -131687, -2278, 140626, 227867, 278581, 72578, -64094, -175197, 209458, 328904, 325054, 186528, -16562, -18534, 14123, 140204, 69078, 112549, 1844, -65153, 6156, -107544, -153026, -13435, 90294, -40301, -35860, 288018, 146163, -49706, -99052, -156705, 110174, 295157, 215126, 12502, -95127, -120491, -257647, 103912, 363187, -71136, -52677, -113130, 90433, 43530, 298522, 245885, 173443, 333162, -19106, -24947, 193516, 45518, -49922, -71706, 6591, -110211, -81310]
1349h1310o9594j52614Q5318J12271J11899O5613k88012j60617M49052O5892j9526
1338A18372N0946k16029j07553J99640K1917M4188j4467N8237p5887j6530K1601
1327H4435N9878k97870L18684L7775j08251p5369j0948J16919J16787k73522K16375
1316A84893j27255o8546M3896n6251L4133j65851J50966K2163j5569q3482k4262
1305a05165j10041J48938J50073j05433j65108P4355M42761n6921j47668K5693
1295A51484r1615j18582r2031j44278j03423m6081K77349J46295L1454R6595J6318
1284A23485K08102r8547r5496n0616r9088p7731K32280o6741j41648n7977J59861
1273C5884l3160j75885J99543j3239k0131J36077k8161j63685l3985K23371j99427
$$ y = [-81310, -150904, -303518, -218200, -105929, 5970, 71583, -216429, -377046, 72006, 137898, 118372, 169318, -46711, -154264, 45376, 67293, 111481, 97014, 155251, 79364, 62834, 84435, 144313, -153557, 165127, 202902, 94651, 19282, 8334, 125253, 242040, -31482, 184893, 57638, -10908, 32988, -23263, 10870, -154981, -4015, 18148, 2579, -80903, -105165, -215206, -66268, 83805, -21628, -186736, -112381, 330380, 273459, 125791, 151484, 59869, -58713, -150744, -295022, -398445, -444526, -167177, -20882, 10572, 107167, 123485, 331587, 233040, 137544, 86928, -12160, -89891, 142389, 75648, -66000, -123977, 35884, 2724, -173161, 26382, 13143, -6988, 129089, 100928, -62757, -96742, 126629, -72798]
1262g2798O4915k9893p4522K65399j01475j25309j42685k8820J70026j4427n8810
1251a48399k3830k1969j36984k6924O4778N0808J64161K38202K1451r5352P262
1240I3204m1289K72285R2062n13608R1616M9335n9944K3293p2451J33962Q5046
1229A53511j37976j17072J07188K9401J1201O4242J84788j74954M6800k96094
1219a28965j25065K01590K15065j19571j80355O8849J45864J30378j41809l7582
1209B8399k26331j07128O0369O9159J27547J89801j58768m8115j39644J69885
1199c4826J41671k28256K17929J28122j37386K05934k4205K4724l06493p4936
1189h7722K35240M3745k85460m2284J12604J69787k10566k95065L39649k3029
$$ y = [-72798, -7883, -37776, -112298, 153101, 51626, -73683, -216368, -245188, -75162, -89589, -148399, -172229, -194198, -331182, -358106, -293328, -242520, -78359, 159843, 181294, 85942, 93204, 51915, 324200, 416262, -97346, -5730, 43605, -16339, 6954, -65497, 68465, 153511, 15535, -101537, 5651, 35052, 46253, 110495, 295283, 120329, 167129, -128965, -254030, -52440, 162625, 43054, -137301, -68452, 77412, 207790, 65981, 28399, -197932, -305060, -244691, -175532, -47985, 141816, -16952, -65067, -204711, -34826, 106845, -121411, 96518, 224640, 87254, 293188, 268983, 293707, -12786, -87722, 147518, 191263, -94197, -136481, -23877, 145910, -64656, -359721, -20072, -43101]
1179d3101o1444P5477J03576k48458O8540J56175P8821J08264k062k31026K74682
1168B79444M0470j05873j96701m31602J13754J79653Q6099K14431o5381n4290
1158F0004k96705j04305K32784j20136K6039l2002M05565k75381m9369K88077
1148A34571K1149J05957j20377j40978l3741k2450N7048J90235J08460k29065
1138G0809j78255P3683K47657k29760j37851R7464l41701j08399R3543K00348
1128b12462J32315J81003j40053k20993M7157L71246k8157r4851k91199m8529
1118c04523J68211l1985j5968O3774l7748J61375J5641L8355j50742l046J82184
1107H5528R0935J1452r6406j90807K34440J29783l37233q7695K34598o933l5224
$$ y = [-43101, -104545, -29068, 74508, -173950, -105410, 50765, 129586, 237850, 235788, 4762, 279444, 319914, 214041, 17340, -414262, -300508, -120855, -34756, 179675, 114294, 60004, -236701, -341006, -108222, -228358, -202319, -234321, 171244, -104137, -153506, 134571, 155720, 261677, 141300, 322, -33419, -55869, 1179, 191414, 299874, 70809, -107446, -33763, 213894, -15866, -153717, -56253, -397954, -506353, -412810, -212462, -80147, 100856, -39197, -260190, -213033, 158213, 130056, 35205, -255994, -304523, -136312, -168297, -184265, -120491, -158239, 3136, 18777, 57132, -93610, -96656, 85528, 176463, 187915, 91509, -99298, 135142, 264925, -72308, -160003, 74595, 67662, 32438]
1096C2438J47078k40906J85385J81145k23300L417r4812j18264O445P7515J76782
1085A32923r7238k53319n4271O6002K71839j2710O5092J18574j85995k71643K4153
1074a96593O2530J16701L13570j67474k6469j83928o266K58791J14002j03750
1064A81114o4003m3029J10589k1611l5122J29034p6500K0489o1768j80800j85937
1053b27544J87139k270r1754K75822r3180O592m7510O5105k2260k478J36927q8176
1041I6413p3582P065m48322K32509J51237j09456J3740J80877m7322Q7575M2986
1030A33720M2874q975J20646j94891r1544J03614N9639k98293J40946j59079J39126
1019a2217L54591k76296J1550N3420R1272j08207j70381j22963j28997K82368
$$ y = [32438, 179516, -61390, 123995, 305140, 81840, 85257, -9555, -127819, -121374, -43859, 132923, 35685, -217634, -271905, -205903, 65936, 53226, 118318, 236892, 50897, -220746, -196593, -134063, -17362, 296208, 128734, 102265, -81663, -87929, 170862, 284864, 181114, 117111, 74082, 184671, 163060, 127938, 256972, 180472, 200961, 139193, -41607, -227544, -40405, -42675, -134429, 141393, 48213, 54805, 7295, 72400, 50140, 47662, 184589, 96413, 22831, 29896, -418426, -185917, -34680, -144136, -130396, 50481, 3159, 90734, 133720, 176594, 167619, 288265, 93374, 1830, 105444, 165083, -133210, 7736, -151343, -12217, 342374, 66078, 77628, 131048, 222320, 114113, -56268, -179231, -308228, -25860]
1009b5860J63053j63927K00178j41965N0209M9532J14669k51850k8144m849J12296
998G3342l3075j73268J33346R8187j54628N0725J16119K9788r9679l8381J30310
987A32786l3439j46311J35140j14452j57556p2411k8424K52229O0079j78933K5231
976a26061J66202J06413O2564j73501J29200K22972l26386N4870k03315N2829
966c4213K47110l6467l41616J46472o3437j79547o88O0581J99650k1715P1706
955D7836J17658N7530O5637k54299J11044O3104k07550k24829J73605R2458l4326
944G868j26100k02275K22438r3400O6743J97452k62414l31731K93674K474L0031
933a95240J52113K27184K6462j49794Q9376Q4754k0941q5059J8034J23073l09801
$$ y = [-25860, 137193, -26734, 173444, 31479, 81688, 131220, 245889, -5961, -34105, -38954, 73342, 40267, -133001, 345, 98532, -56096, -5371, 110748, 140536, 40857, 2476, 132786, 99347, -46964, 88176, -26276, -183832, -256243, -284667, -32438, 27641, -151292, -126061, 40141, 146554, 209118, 35617, 164817, 387789, 61403, 116273, -87042, -34213, 212897, 176430, -165186, -18714, -82151, -261698, -262386, -201805, -2155, -23870, 47836, 165494, 223024, 288661, 34362, 145406, 208510, 960, -223869, -50264, 42194, 7868, -118232, -320507, -98069, -191469, -124726, 72726, -189688, -521419, -227745, -225271, -195240, -43127, 184057, 210519, 60725, 150101, 234855, 213914, 128855, 146889, 269962, -39839]
922c9839O9146j89815j0812l0970K38124q1587J69041q2863l02432M0968l4517
911b55556K4501O2406J40287j59739l549Q5793O2129k99667N2743K30463m691
900f4880j82147k09560Q1754J14200q2452k7782J01271K13781L7373K03432j80298
889D692P0880J85602j18176r9975P1645R1740j04509O0139J53579j41612L6469
878B10474j35031k94320o2297J87298K06911Q5011j92469J32839j80980J00188
868E7624R2794l1493J02831k59253j4357J26391k2659P2620K3218j65938J82333
857A64111r2528l34684P4034L23016k8753j57827J6483K15251J23445K095m20318
846a15675N7575J26957K87314p1901k32116k66784J75998k40264K3836K39905
$$ y = [-39839, 29307, -160508, -171320, -202290, 35834, -45753, 123288, 40425, -262007, -221039, -255556, -231055, -168649, -28362, -188101, -191650, -105857, -43728, -343395, -290652, -60189, -64880, -247027, -456587, -374833, -260633, -343085, -370867, -269596, -55815, -18442, 184990, 4692, 75572, 261174, 142998, 43023, 114668, 206408, 101899, 162038, 315617, 174005, 210474, 75443, -218877, -281174, -93876, 113035, 198046, 5577, 138416, -42564, 57624, 150418, 118925, 221756, -37497, -51854, 74537, 51878, 124498, 147716, -18222, 164111, 71583, -263101, -189067, 133949, 105196, -52631, -36148, 179103, 302548, 304643, -115675, -58100, 68857, 356171, 284270, 52154, -214630, -38632, -278896, -255060, -15155]
836a5155o3425L2434m9388o18q0644J21097L41175j86015j73310J30148M8113
825A04412n4451J49700j4061r5175k82061J05475l7417J66068K96754l28848l8321
814b7925J31928L7447k09894P8308m6131L2435r3049n2807L8461O0477O0158l6651
802b7243J23296j36921j4269J56180k85690K8139q3777J37168m714R8181k7967
791c7617K14418j80695J9495k6327M6046J5816k08818J52349Q4441L6431J04238
780B19777o5243j45069q4699J9746L12185M0870J1868j37827l76018o0429n6162
769c21001K07194M2684j00543j4605j33755K54942J40700J2709j93770j0167O3378
758e2234j53075j86061J62380j6645K00091K64739j71023j22942P9877o9943q5185
$$ y = [-15155, -78580, -46146, -95534, -96152, -176796, -55699, 285476, 99461, -73849, 56299, 104412, 49961, 199661, 185600, 90425, -191636, -86161, -123578, 42490, 339244, 10396, -27925, 104003, 141450, -68444, 9864, -36267, -3832, -96881, -149688, -111227, -50750, 9408, -27243, 96053, -40868, -55137, 101043, -184647, -156508, -240285, -103117, -107831, -9650, -37617, 176801, -3894, 15601, -10726, 35320, 51136, -157682, -5333, 79108, 115539, 219777, 154534, 9465, -75234, -55488, 256697, 297567, 309435, 171608, -204410, -264839, -321001, -113807, -71123, -171666, -186271, -320026, -65084, 75616, 88325, -105445, -115612, -52234, -205309, -391370, -228990, -245635, -45544, 219195, 48172, -74770, 5107, -64836, -150021]
747a50021r5494J46463J895J05301J83816m0787M3990m7853j58824j17136N7061
736g1589k4850k2434k7543J84437R4880j89164J03479L5051l28746j21332K42611
725a25200J54324Q5155j48432j57224M2032N0840j36219L1886K86126n4195j28962
714i9869M1998Q9687n9433P6735q4186K4428K13350j01905K710J2818j34067k3322
702d1056k37530J62136K01804K11764j31100j68113j24799j30327L2986k0411
692b44646L39196j36781J07601j8978k01216K41274j17095J06733M1363j90405
682g2954Q052l6658j06902K47164K396k09032r9498J41560L56620o5434l292k30949
670f8927J07390l8371P3962J40899n0823J2043r6902j29517J678K83583j63880
$$ y = [-150021, -245515, -99052, -97157, 8144, 191960, 151173, 195163, 147310, -11514, -128650, -71589, -96439, -118873, -146416, 38021, 132901, -56263, 47216, 82267, -246479, -367811, -125200, 29124, 114279, -34153, -191377, -149345, -98505, -234724, -202838, 83288, 29093, -99869, -57871, 31816, -27617, 49118, -35068, -10640, 202710, 100805, 103515, 116333, -17734, -41056, -278586, -116450, 85354, 297118, 166018, -2095, -126894, -257221, -224235, -244646, 94550, -42231, 65370, 46392, -154824, 86450, -30645, 76088, 117451, -72954, -64902, -101560, -208462, 38702, 41098, -167934, -267432, -125872, 230748, 165314, 162022, -68927, 38463, 92, 74054, 214953, 164130, 176173, 79271, -50246, -48568, 235015, 71135]
659G1135j86282j68767L27297R8953r4550l13291J26529P5785j50654k01009J5072
648c99782J8087Q3482L05467J26152k66115j88505K06344l3078K12952L3105j72489
637g4380j33157J97158l7594K29870J18212m980K7523j81912p3350n7787N8350
626F7953R0386j47052Q87j81285j71786N372K08331J4970R8568j58311k98679
615d70646J75396J30342n601Q4512J17626R9968L2086o0551R1135k15508N5057
604C3816q6864j39634L23584m4952L2834m4580Q484m4073N7441Q6085l09779Q1843
592d5795Q9340j53761n4443K44155j59777r5278K20234j65350L845j0579p8289
581b05698m0560J50091o973p8625k20887L04553Q5091q5012K82411m6102K28630
$$ y = [71135, -115147, -283914, 43383, 142336, 47786, -265505, -138976, -63191, -213845, -414854, -399782, -381695, -298213, 7254, 133406, -132709, -321214, -114870, -147948, 65004, 98109, -74380, -207537, -10379, -47973, 181897, 300109, 295129, 322652, 140740, 67390, 9603, 67953, 158339, 11287, 12174, -169111, -340897, -335525, -127194, -112224, -13656, -171967, -470646, -295250, -164908, -170509, -85997, 31629, 131597, 163683, 103132, 194267, -21241, 33816, -53048, -192682, 130902, 85950, 118784, 74204, 82688, 38615, 96056, 182141, -127638, -45795, 43545, -110216, -164659, 79496, -80281, -175559, 44675, -120675, -116830, -127409, -205698, -246258, -96167, -103140, -181765, -402652, -98099, -13008, -98020, 184391, 138289, 366919]
570C66919R7366k01118n0436n4261J21448k95743j29097J88017M3114j40609J84062
559A29662K6532j61642O4589p6809O2868O5952m1580m1766j38099q4096M0980
548a53409J01331r1103N5828J42721l659L4508p7606J14024q6671J82861j15755
537A03070j64249L0267J0869N4426J30714j38876J61387L6238k68190j5349J11804
526E2111L3671Q8375J5632j76759P3615n4367J23999m0138r5356J44979k02827
515c7065j8070r5566J0007L81772Q1478r7933O253j68j38008l3482j11311K17315
503A65222m1979j68133M0129K24259J03705j68615q7593m7111k918l405O7206
492H0767j0103K4947j94530N6918j08194K32229j55000O3649n7332J85214N7749
$$ y = [366919, 464285, 263167, 212731, 158470, 279918, -15825, -144922, 43095, 86209, -54400, 129662, 156194, -5448, 59141, -17668, 45200, 111152, 69572, 27806, -110293, -194389, -153409, -52078, -143181, -87353, 55368, 51709, 86217, 8611, 122635, 35964, 218825, 103070, -61179, -30912, -20043, 34383, 165097, 26221, 187608, 223846, -44344, -59693, 52111, 85782, 174157, 189789, 13030, 86645, 32278, 156277, 116139, 20783, 165762, -37065, -55135, -150701, -140694, 241078, 322556, 224623, 230876, 230708, 92700, 59218, -52093, 165222, 123243, -44890, -4761, 219498, 323203, 154588, 66995, 19884, 16966, 13561, 80767, 70664, 95611, -98919, -42001, -150195, 82034, -72966, -9317, -66649, 118565, 176314]
481A76314p6129l2955j70785J84909j81929O1241J41640k97820J65819M51023
471D21328o6853k34316J60318k33828r9867k2752Q5666P4678j10034K9580j6818
460a2898m5923P3434K1128j04113J68001r3511J34175K48229j51056r0425m7964
449I9077k6298J6889j39398O7003P8590Q0766N9255k90500p3429L42667L6058
438B50680k72613j78096M6123O7355M2301Q2533L3295J2948J03602j5928J39598
427C11798k2530q8364k73735k2079q9530O5987o807K29573j56951L4659j81547
416a99526j28996K92950J48642j70891j23061J92478l2764J88924p1867p1554
406B4335o7923m9986P0562K55301Q1567J5685j90884j42727J08552j96894K23965
$$ y = [176314, 100185, 67230, -103555, 81354, -100575, -39334, 102306, -195514, -29695, 421328, 354475, 120159, 280477, 46649, -53218, -75970, 9696, 84374, -25660, 3920, -12898, -58821, 14613, 35741, -68372, 99629, 6118, 140293, 388522, 237466, 147041, 99077, 72779, 89668, -49730, 17273, 95863, 176629, 235884, -54616, -128045, 214622, 250680, -21933, -200029, -153906, -86551, -44250, 38283, 71578, 84526, 188128, 172200, 311798, 289268, 200904, -72831, -94910, -184440, -118453, -125260, 104313, -52638, -17979, -199526, -328522, -35572, 113070, -57821, -180882, 11596, -21168, 167756, 95889, 24335, -43588, -93574, -23012, 232289, 313856, 329541, 138657, -4070, 104482, -92412, 131553]
395A31553M3737Q9596L9809l9198k945j23164J12750k3414J06813L7736j62132
384B11141j74461K08856O1005J81761n5449m56746J58990q1484o919J11798p144
373A51348M6770l0682K7168L8119M0479m0650k53415P5388N4424n7917r3648J99348
361A56732q9635l5067k1026K00570O7733n0783k2350K02402J30766m25852j94112
350h0622K29746J11J2557Q3705l4496K8678J96136j18404o8964L1257O5733k8547
338C16890k77287p343j71356K70003J24655p1752k97418j84380Q82K32232N6149
327h725j04027P9016Q3918K32791P7186k13681k27812j02831K73081o1003k7912
316AK64063N9899o1147M9869m0937p9445j49703k6297r0235K23891K7015J39448
$$ y = [131553, 175290, 264886, 304695, 265497, 262552, 139388, 252138, 228724, 335537, 373273, 211141, 36680, 245536, 306541, 488302, 432853, -23893, 135097, 53613, 46694, 158492, 151348, 198118, 167436, 194604, 232723, 273202, 232552, -20863, 54525, 108949, 51032, -42616, 156732, 67097, 32030, 11004, 211574, 279307, 228524, 206174, 408576, 539342, 113490, -80622, 149124, 149235, 161792, 245497, 211001, 239679, 435815, 317411, 248447, 279704, 345437, 316890, 39603, 32260, -139096, 130907, 255562, 183810, -113608, -297988, -297106, -64874, -8725, -112752, -33736, 50182, 282973, 360159, 146478, -81334, -184165, 88916, 27913, 1, 264064, 323963, 262816, 312685, 271748, 192303, 42600, 16303, -73932, 149959, 176974, 316422]
304C16422j45019P2770J46610m398n05727K49336J43046J11471J65912j97838
294C52585j83390j39881O9940j33783J29388K68847o1412j00475J40238L4044
284C76101k22073l88678P3847J09076J80521m9776R044K17724q7815j44588k05133
273a31750R9711K10572l1791P2867R6356J20993J31175j62885j99567J16854N6371
262C78906O3909q1781j56703J08684j11036j32347K20990P7157r1049M9723o8168
251B58285j99908J7068j0238j67772J2924K29559J39939K6738L7781j03374j27615
240A13387K40073O6548j12029j04565q3742N4409k1535k20517J43019q0072j62539
229a67563j7503J70304J87741J37178j92088J87182J69990j40455Q0129k05019
$$ y = [316422, 171403, 244173, 390783, 386385, -119342, 129994, 273040, 384511, 550423, 352585, 169195, 29314, 99254, -34529, 94859, 363706, 302294, 201819, 342057, 376101, 154028, -234650, -160803, -51727, 128794, 79018, 88062, 305786, 217971, 73383, -131750, -32039, 178533, 146742, 219609, 315965, 436958, 568133, 405248, 205681, 322535, 378906, 442815, 361034, 204331, 313015, 201979, 69632, 290622, 367779, 276730, 326453, 258285, 58377, 75445, 65207, -102565, -89641, 139918, 279857, 306595, 344376, 241002, 113387, 353460, 420008, 307979, 203414, 119672, 174081, 152546, -67971, 75048, -5024, -167563, -185066, -14762, 172979, 310157, 118069, 305251, 475241, 334786, 414915, 209896]
219B09896J12948k3428n193l7915J00006J1421N9678R0532l04586k33863J68170
208A47666L90984k1501Q8611j97708k45240k6014Q2913j11496M6243l7481K9978
197A46955L7845R9491M9213l8169k19424j36691K19709j49031j27487J26850J1843
186B1104K66339j90369J55276R4946K7346k12287p7787N6757r9452L7572K71047
175C50492j32787j63904q3875J94433O5087p1376J37472r1990J38747n7173J44730
164D29856r2858j67428l3275M4341j05547n0710l6678R2373J80238j8369j71431
153G0512J17365k7277R88k9325k41912J98854J79558j87093J03029K5502J7554
142B27755j46337j43570p983K51124l7239j72532J95608K05701k5674K60243r0429
$$ y = [209896, 322844, 299416, 294223, 256308, 356314, 367735, 427413, 517945, 213359, -20504, 147666, 538650, 517149, 605760, 408052, 162812, 136798, 219711, 108215, 154458, 116977, 146955, 184800, 284291, 333504, 295335, 75911, -60780, 158929, 9898, -117589, 9261, 21104, 287443, 97074, 252350, 347296, 374642, 162355, 84568, 141325, 41873, 79445, 350492, 217705, 53801, -30074, 164359, 229446, 158070, 295542, 203552, 342299, 285126, 429856, 336998, 169570, 136295, 180636, 75089, 24379, -12299, 80074, 260312, 241943, 70512, 187877, 160600, 161588, 132263, -109649, 89205, 268763, 81670, 184699, 210201, 227755, 81418, -62152, -70135, 180989, 143750, -28782, 166826, 372527, 346853, 607096, 516667]
131E16667j44994j37259m8820Q4872k60084R1273K48455m0008J41497j81037p8602
120A91960K1919n6102K89691R3311l4532k50399m4543J31016j38465N704K07558
109D17118k6193k35386o2977m9647M8563R7851J4591J64173M8199j13890j62584
98A39818m9152O6635j58650k9503J36560O7253o1158K33651O3032k61824L7063
87A83725k0432J02068l6207j11187q3731j22029J80216R6962J0609l2188r242
76A58564n2570j13038n9675J17751J83799k1867j7513k7992J2365J99319j05808
65B73335L4872j26305P1325J13537n2501J08921n8998K8070L6959n8656j67295
54B03264J16340J03830J04415k30386q2697K58985j00575m4210K0890J13380k5146
$$ y = [516667, 371673, 234414, 185594, 270466, 10382, 101655, 350110, 310102, 451599, 270562, 191960, 213879, 157777, 447468, 540779, 506247, 255848, 211305, 342321, 203856, 209560, 417118, 390925, 155539, 92562, 42915, 91478, 189329, 203920, 368093, 416292, 302402, 139818, 90666, 157301, -1349, -30852, 105708, 172961, 111803, 345454, 408486, 146662, 183725, 163293, 265361, 229154, 117967, 34236, -87793, 92423, 189385, 199994, 167806, 158564, 105994, -7044, -66719, 51032, 234831, 212964, 195451, 167459, 179824, 379143, 273335, 308207, 181902, 253227, 366764, 314263, 423184, 364186, 392256, 429215, 370559, 203264, 319604, 423434, 527849, 297463, 214766, 473751, 373176, 328966, 349856, 463236, 438090]
43D38090R735J43593j87179j52771k43031J79519R5657k513k10752q8724N4215
32C5839J00787R9699K2999P3605J25305q3429p3605j11210L8918n9715p2643J01362
20A97912r1906m7468J32392n1184j20836J30003J31079k00526M243j3319q1277
9a0887J37263J46284P1250j12739J06682Q5499q8351P183K2391
0C64575
$$ y = [438090, 447825, 591418, 404239, 251468, 8437, 187956, 283613, 281100, 70348, -18376, 35839, 136626, 236325, 259324, 332929, 458234, 374805, 301200, 189990, 228908, 169193, 96550, 197912, 106006, 58538, 190930, 139746, 18910, 148913, 279992, 79466, 83709, 70390, -10887, 126376, 272660, 343910, 231171, 337853, 423352, 335001, 342184, 364575]
$$ Imaginary data points
##PAGE= N=2
##DATA TABLE= (X++(I..I)), XYDATA
16383a348334J09955J3457M4232Q6781p0864N9871M6313L6385J108o1118M4438
16372a037776M5715J29643J55555J22718j92833l6840N7370J86628j33550m5200
16362g48570p5271l5034o0686J1733J27569N8423p3844n837j032P815J6545R7659
16350f80530J17041m8M6718J05959n50j13367o2344O3960j63649Q8373J93165
16339d05272j3650K2811o8156N3840P1839K08479P2623R594n7291k05429n4626
16328c65238M1283J19162J05788p3987m3997K1447R9243k1831m8935L4732Q2987
16317d9346R6719R282j38058N2895j34139j6639J36654J34522j70378n1528K09805
16306G9789r7404R9754N1224l1331m087J29472k18778J10799O4895p8752k3052
$$ y = [-1348334, -1238379, -1224922, -1180690, -1093909, -1164773, -1104902, -1058589, -1022204, -1021096, -1082214, -1037776, -992061, -862418, -706863, -584145, -776978, -813818, -756448, -569820, -703370, -748570, -823841, -858875, -919561, -907828, -780259, -721836, -795680, -801517, -802549, -794734, -778189, -680530, -563489, -563537, -516819, -410860, -411410, -524777, -587121, -523161, -686810, -598437, -405272, -418922, -396111, -464267, -410427, -338588, -130109, -57486, -47892, -105183, -310612, -365238, -323955, -204793, -99005, -172992, -216989, -195542, -96299, -118130, -167065, -132333, -49346, 47373, 56655, -81403, -28508, -162647, -179286, -42632, 91890, -78488, -130016, 79789, -17615, 82139, 133363, 102032, 97945, 227417, 8639, 119438, 184333, 105581, 82529]
16295H2529R5716j67810k38600K29992K31543J67057o0556o0509J43976q7744
16285C35594j97445J56133J47505Q4728j49429j23547M1689M7193p5466J59682
16275D26637K36469m7598j80099p7868k9979L0485j4066n3331q233J90141J38461
16264F11019k05376J74669O2533j7576O7561r8332N5514O8605m8972q0134J31484
16253G20995j54629J88113j52542P5028K12929j12201J43051q2671N3859J72995
16243A064927j18208j83316j16138P1192n1611J68981m1160J3868L82610j30834
16233A060311j27261j34910o2452J23665q2520j14932K84928R4909j76633m3189
16223H21916K11512K3307L7509m4189m193J39611J24149k98654J37618P6643J0531
$$ y = [82529, 178245, 10435, -228165, 1827, 233370, 400427, 339871, 279362, 423338, 335594, 138149, 294282, 441787, 526515, 377086, 253539, 295228, 342421, 266955, 426637, 663106, 615508, 435409, 357541, 327562, 358047, 343981, 290650, 282417, 472558, 611019, 405643, 580312, 642845, 625269, 692830, 594498, 650012, 718617, 669645, 589511, 720995, 566366, 754479, 601937, 676965, 889894, 777693, 920744, 838073, 891932, 1064927, 946719, 763403, 647265, 718457, 666846, 835827, 794667, 808535, 1191145, 1060311, 933050, 798140, 735688, 859353, 776833, 661901, 946829, 1041738, 865105, 821916, 1033428, 1056735, 1094244, 1050055, 1045862, 1185473, 1309622, 1010968, 1148586, 1225229, 1235760]
16212A235760J97845k3711J769k52658J31965q1422j40861p0178K6203J46579
16202A171291N8224r8135K5680n361k22392J14341O0163r7602K3929Q2842J29795
16191A242775j57598l0478j34772P2427M526o2781J11250K59173J93882j31782
16181A366622Q8264j8106n506j51631j62329k59650L45419k20554O528L24181
16171A313238P1356J25893j96630P7262J18010j39831J3303K22644l7708j05147
16161A462390L1314k8403k46442P2504J68673J09537j17516r0619j38981m2975
16151A179482o222J28506P1239j79203L2970K56439j19793j76816M08383n2519
16141A542466j01734m6960L0041K2697M5824j55493R7784R275Q0887j07064j79222
$$ y = [1235760, 1433605, 1409894, 1411663, 1159005, 1290970, 1209548, 1068687, 998509, 1024712, 1171291, 1229515, 1131380, 1157060, 1151699, 929307, 1043648, 1103811, 1006209, 1030138, 1112980, 1242775, 1085177, 1054699, 919927, 992354, 996880, 934099, 1045349, 1304522, 1498404, 1366622, 1454886, 1436780, 1431274, 1279643, 1117314, 857664, 1203083, 982529, 989057, 1313238, 1384594, 1510487, 1313857, 1391119, 1509129, 1369298, 1382601, 1605245, 1567537, 1462390, 1493704, 1465301, 1218859, 1291363, 1460036, 1569573, 1452057, 1361438, 1222457, 1179482, 1173260, 1301766, 1373005, 1193802, 1226772, 1483211, 1363418, 1186602, 1594985, 1542466, 1440732, 1393772, 1423813, 1446510, 1492334, 1336841, 1434625, 1443900, 1524787, 1417723, 1238501]
16130A238501J07188k25419J05454N8423N2123K10040j44174o3840R4409j33538
16120A299167k52531L39096K8729n2425K66213r0576N5799K9979P4472j45932
16110A551991r0628j59574M0989j1375p7402K07976J11221j96939Q7073l7652
16100A425680O3719N4854l1029P3762n5291L1702o3142L4680j56130K7066P3207
16089A479078l42523R6228N3814Q8734O1408p050j68598J68720J88001J11879
16079A729691r9556J41061n2879j11431k8678j02707R8972J06162m1966l61645
16069A277024K50440o1387K35007O5692k68130J24785J89875q2112j02610j89500
16059A439084N7987J55820N6898j90819p1149j0890n9772k8079K389r3129J74501
$$ y = [1238501, 1345689, 1120270, 1225724, 1284147, 1336270, 1546310, 1402136, 1338296, 1432705, 1299167, 1046636, 1385732, 1414461, 1362036, 1628249, 1537673, 1593472, 1623451, 1697923, 1551991, 1461363, 1301789, 1342778, 1331403, 1254001, 1461977, 1573198, 1376259, 1463332, 1425680, 1489399, 1544253, 1513224, 1586986, 1531695, 1563397, 1500255, 1534935, 1378805, 1405871, 1479078, 1136555, 1232783, 1286597, 1375331, 1436739, 1429689, 1261091, 1429811, 1617812, 1729691, 1630135, 1771196, 1718317, 1606886, 1578208, 1475501, 1574473, 1680635, 1638669, 1277024, 1527464, 1466077, 1701084, 1766776, 1498646, 1623431, 1813306, 1731194, 1628584, 1439084, 1497071, 1652891, 1709789, 1518970, 1447821, 1436931, 1377159, 1349080, 1351469, 1258340, 1432841]
16048A432841J8235j46603J13776O6132q6575M4612j6318J40377J09648k05386
16038A470739j66922j35408m2772K23428L3450j7494J54827R3823j93793j44648
16028A275230k31028j94306L26369J80696M7708J09075J80966k047o5945R078
16018A635796j71178Q545K05262J0460j2948k6949Q412k73868R6222J01489j72200
16007A409043N02813L3108k30668J95036n7271J29163l39285p7140K8065j61906
15997A430958j87949k6127M0772J72569K07023J07531j03436l09095j14489K85956
15987A503713j50449r8312L12570J93530n3532k12232O0940j31410j03587j88462
15977A132769K8721M73753J29778J12496j07961k58925l0060J15717J54531l11182
$$ y = [1432841, 1451076, 1304473, 1418249, 1484381, 1397806, 1442418, 1426100, 1566477, 1676125, 1470739, 1303817, 1168409, 1125637, 1349065, 1382515, 1365021, 1519848, 1613671, 1419878, 1275230, 1044202, 849896, 1176265, 1356961, 1404669, 1513744, 1694710, 1692663, 1626718, 1635796, 1464618, 1473163, 1678425, 1688885, 1675937, 1648988, 1657400, 1383532, 1479754, 1581243, 1409043, 1911856, 1944964, 1714296, 1909332, 1852061, 1981224, 1641939, 1564799, 1592864, 1430958, 1243009, 1216882, 1257654, 1430223, 1637246, 1744777, 1641341, 1332246, 1217757, 1503713, 1353264, 1254952, 1567522, 1761052, 1707520, 1495288, 1556228, 1424818, 1321231, 1132769, 1161490, 1635243, 1765021, 1877517, 1769556, 1510631, 1480571, 1596288, 1750819, 1439637]
15967A439637K92134j73073j26691K02735L0571J48763k23643J73166j35649j87231
15957A440719k29168K57779K10038R914k14733R8940Q633j982j0344K01797J34229
15946A905822j37741M5893j18614q1935k06080q1244Q8316J25534r6039j14455
15936A329457K12387J49569j48658j18683Q878K46260R1510p4388j65903K6297
15926A556726m386j25820j08967K40663n056l1888R3066j32068J57393J49756
15916A789419j41742k18883P3093K53188J2399j04302j84995L40877J74012k04564
15906A788502l37706P174o0360J42633O6496L51754k09551l19986M5932J7605
15896A492493K08853l8950k05131Q5647K2106q9674J8604Q6862r3733K63354l5892
$$ y = [1439637, 1731771, 1558698, 1432007, 1634742, 1665313, 1814076, 1590433, 1763599, 1627950, 1440719, 1211551, 1469330, 1679368, 1689282, 1474549, 1573489, 1582122, 1580140, 1569796, 1771593, 1905822, 1768081, 1813974, 1695360, 1613425, 1407345, 1326101, 1414417, 1539951, 1443912, 1329457, 1541844, 1691413, 1542755, 1424072, 1432950, 1679210, 1770720, 1696332, 1530429, 1556726, 1552340, 1426520, 1317553, 1558216, 1553160, 1521272, 1614338, 1482270, 1639663, 1789419, 1647677, 1428794, 1501887, 1755075, 1767474, 1663172, 1478177, 1819054, 1993066, 1788502, 1450796, 1457970, 1397610, 1540243, 1606739, 1958493, 1748942, 1428956, 1474888, 1492493, 1701346, 1662396, 1457265, 1542912, 1565018, 1475344, 1493948, 1580810, 1487077, 1750431, 1714539]
15885A714539p2986K55867k44178k60491K803R4158p4126q2564m3748J32833J48733
15874A570840O9898j76132j15211J5428p8961J12352j44830K00185l4627M1018
15864A459960M3415q3261n7487L0227l7255k24119J93662L08544n7791j33769
15854A442126Q0027m4858r5448N2880L10197o3505P4625j96937J89719K84179
15844B033005k60443l08379p0766J7267L35150N3748k36951k14984r3538j50716
15834A103393J60988J89543n310j76099p5177J47936M029J87285N7100j03815
15824A489873K87152j90981k13192J05999N1501K24047j20201j95551L50784K0386
15814A809817p0377k78320J24526j60665j6435l1061K40400J50608j45927O0659
$$ y = [1714539, 1641553, 1897420, 1653242, 1392751, 1395554, 1489712, 1415586, 1333022, 1289274, 1422107, 1570840, 1640738, 1464606, 1349395, 1364823, 1285862, 1398214, 1253384, 1453569, 1418942, 1459960, 1503375, 1420114, 1362627, 1392854, 1355599, 1131480, 1325142, 1633686, 1575895, 1442126, 1522153, 1477295, 1381847, 1434727, 1744924, 1681419, 1756044, 1559107, 1748826, 2033005, 1772562, 1464183, 1393417, 1410684, 1745834, 1799582, 1562631, 1347647, 1254109, 1103393, 1264381, 1453924, 1448614, 1272515, 1197338, 1345274, 1349303, 1536588, 1593688, 1489873, 1777025, 1586044, 1372852, 1478851, 1530352, 1754399, 1634198, 1438647, 1789431, 1809817, 1739440, 1461120, 1585646, 1424981, 1408546, 1377485, 1617885, 1768493, 1622566, 1683225]
15804A683225L645k5735l14115j1188K6076P6508J27068J53418j22940J2436j09091
15793A499307N1981J84026j0211k45017J06224K65711m29445k81752M08744n2309
15783A497259J55340P9234j62121M2820k12841k77J27685J72956k05703j11334
15773A383018N810K16102q1829q3756R2378j0641r3702J4022K26208J67185J29045
15762A963840l34689J45275M1449k36854K31735l7598j79135n3118Q0997m6648
15752A575254m2932L77632J06893k30921m31975j05759R6230k9569K43764P2080
15742A630697k19151j50678J1765L78048J61597p3111n2037M7315k3874N2832
15732A763403N7048j76349o9719p2629K06254L2000j05727j79826K82107O930
$$ y = [1683225, 1686870, 1661135, 1347020, 1335832, 1361908, 1438416, 1565484, 1718902, 1595962, 1608398, 1499307, 1551288, 1735314, 1725103, 1480086, 1586310, 1852021, 1422576, 1140824, 1549568, 1497259, 1652599, 1731833, 1569712, 1612532, 1399691, 1399414, 1527099, 1700055, 1494352, 1383018, 1388828, 1604930, 1523101, 1439345, 1531723, 1521082, 1427380, 1441402, 1667610, 1834795, 1963840, 1629151, 1774426, 1815875, 1579021, 1810756, 1773158, 1594023, 1540905, 1621902, 1575254, 1532322, 1909954, 2016847, 1785926, 1353951, 1248192, 1344422, 1314853, 1558617, 1630697, 1411546, 1260868, 1272633, 1650681, 1812278, 1739167, 1687130, 1734445, 1710571, 1763403, 1820451, 1644102, 1574383, 1501754, 1708008, 1740008, 1634281, 1454455, 1736562, 1743492]
15722A743492m3272J19524j21182R4184l8857j32378n1638r3372n7559K7957J31900
15711A578799J78634K5566p3047j47591q1065j14476J70235k25084K70826j49551
15701A433246k0831R7722j87528J73876K73550l75097J22195o0353n7970J5290
15691A414100J15211Q4031N6462M4836k12777k18062J68567K28450j5155R5192
15681A760855l2983j58041J728o9831n2690K03172J03628J46279k39537j39319
15671A523261J01270J12194j66850j66693J40185J16009j40633R4775K31929l0150
15661A815297l04880M1587J33956M8463k95091m6431Q3226Q7401L9315K3381j16905
$$ y = [1743492, 1700220, 1819744, 1698562, 1792746, 1753889, 1621511, 1569873, 1476501, 1418942, 1446899, 1578799, 1757433, 1782999, 1709952, 1562361, 1481296, 1366820, 1537055, 1311971, 1582797, 1433246, 1412415, 1510137, 1322609, 1496485, 1770035, 1394938, 1517133, 1456780, 1398810, 1414100, 1529311, 1613342, 1669804, 1714640, 1501863, 1283801, 1452368, 1680818, 1665663, 1760855, 1727872, 1569831, 1571559, 1501728, 1449038, 1652210, 1755838, 1902117, 1662580, 1523261, 1624531, 1736725, 1569875, 1403182, 1543367, 1659376, 1518743, 1613518, 1845447, 1815297, 1510417, 1552004, 1685960, 1734423, 1439332, 1392901, 1476127, 1563528, 1602843, 1626224, 1509319]
$$ [...]
##END NTUPLES=NMR SPECTRUM
##END=
