##TITLE=1H_TG-2402-X14
 200.13Hz,DMSO+CCl4.
 8 sc
 
1.4.2026
##JCAMPDX= 6.0         $$ Bruker NMR JCAMP-DX V2.0
##DATA TYPE= NMR SPECTRUM
##DATA CLASS= NTUPLES
##ORIGIN= UXNMR, Bruker Analytische Messtechnik GmbH
##OWNER= pz
$$ XWIN-NMR		Version 3.5
$$ Wed Apr  1 16:21:54 2026 Russian Standard Time (UT+4h)  she@DPX200
##.OBSERVE FREQUENCY= 200.1313
##.OBSERVE NUCLEUS= ^1H
##.ACQUISITION MODE= SIMULTANEOUS
##.ACQUISITION SCHEME= undefined
##.AVERAGES= 8
##.DIGITISER RES= 18
##SPECTROMETER/DATA SYSTEM= spect
##.PULSE SEQUENCE= zg30
##.SOLVENT NAME= DMSO
##.SHIFT REFERENCE= (INTERNAL, DMSO, 0, 15.488)
##AUDIT TRAIL= $$ (NUMBER, WHEN, WHO, WHERE, WHAT)
$$ ##TITLE= Audit trail, XWIN-NMR		Version 3.5
$$ ##JCAMPDX= 5.01
$$ ##ORIGIN= Bruker BioSpin GmbH
$$ ##OWNER= she
$$ F:/spectra/data/she/nmr/H-C/1/pdata/1/auditp.txt
$$ ##AUDIT TRAIL=  $$ (NUMBER, WHEN, WHO, WHERE, WHAT)
(   1,<2026-04-01 16:20:32.40 +0400>,<she>,<DPX200>,
      <created by zg, POWCHK disabled, PULCHK disabled
       configuration hash MD5:
       00 E9 B6 7A A2 85 ED C7 34 08 36 98 17 FE 4E 26
       data hash MD5: 16K
       EF DB 00 FA BD 55 C9 AE 94 55 4D 4A 4F E0 A1 B9>)
(   2,<2026-04-01 16:20:34.89 +0400>,<she>,<DPX200>,
      <Start of raw data processing
       efp BC_mod = 2 LB = 0.25 FT_mod = 6 PKNL = 1 PHC0 = -3710.203 PHC1 = 9.592311 SI = 16K 
       data hash MD5: 16K
       58 9B E6 78 F1 07 98 8C 5F 7F DA 96 59 8D CC 07>)
(   3,<2026-04-01 16:21:10.62 +0400>,<she>,<DPX200>,
      <pk PHC0 = 7.814234 PHC1 = -10.60001 
       data hash MD5: 16K
       BE 27 28 1A 8A DB C4 5E 13 9A 4A 6C B0 DE 52 5A>)
(   4,<2026-04-01 16:21:14.37 +0400>,<she>,<DPX200>,
      <abs ABSG = 5 
       data hash MD5: 16K
       76 F8 F8 5E F5 6A C2 17 39 20 CF 3C 6C 90 C8 4E>)
$$ ##END=
$$ 
$$ hash MD5
$$ 53 A3 66 19 3F AF 35 18 B0 B8 27 BB 8B A4 FB 8B
##$RELAX= 
##$RELAX= 
##$RELAX= 
##$RELAX= 
##$RELAX= 
##$RELAX= 
$$ Bruker specific parameters
$$ --------------------------
##$DU= <F:/spectra>
##$EXPNO= 1
##$NAME= <H-C>
##$PROCNO= 1
##$TYPE= <nmr>
##$USER= <she>
##$AMP= (0..31)
100 100 100 100 100 100 100 100 100 100 100 100 100 100 100 100 100 100 
100 100 100 100 100 100 100 100 100 100 100 100 100 100 
##$AQSEQ= 0
##$AQ_mod= 1
##$AUNM= <au_zg>
##$AUTOPOS= <>
##$BF1= 200.13
##$BF2= 200.13
##$BF3= 200.13
##$BF4= 200.13
##$BF5= 200.13
##$BF6= 200.13
##$BF7= 200.13
##$BF8= 200.13
##$BYTORDA= 1
##$CFDGTYP= 0
##$CFRGTYP= 5
##$CHEMSTR= <none>
##$CNST= (0..31)
1 1 145 1 1 1 1 1 1 1 1 1 1 1 1 1 1 1 1 1 1 1 1 1 1 1 1 1 1 1 1 1 
##$CPDPRG= <>
##$CPDPRG1= <>
##$CPDPRG2= <>
##$CPDPRG3= <>
##$CPDPRG4= <mlev>
##$CPDPRG5= <mlev>
##$CPDPRG6= <mlev>
##$CPDPRG7= <mlev>
##$CPDPRG8= <mlev>
##$CPDPRGB= <>
##$CPDPRGT= <>
##$D= (0..31)
0 0.7 0 0 0 0 0 0 0 0 0 0.03 0 0 0 0 0 0 0 0 0 0 0 0 0 0 0 0 0 0 0 0 
##$DATE= 1775046031
##$DBL= (0..7)
120 120 120 120 120 120 120 120 
##$DBP= (0..7)
150 150 150 150 150 150 150 150 
##$DBP07= 0
##$DBPNAM0= <>
##$DBPNAM1= <>
##$DBPNAM2= <>
##$DBPNAM3= <>
##$DBPNAM4= <>
$$ [...]
##$SUBNAM3= <"">
##$SUBNAM4= <"">
##$SUBNAM5= <"">
##$SUBNAM6= <"">
##$SUBNAM7= <"">
##$SUBNAM8= <"">
##$SUBNAM9= <"">
##$SW= 18.0517328524113
##$SWIBOX= (0..15)
0 0 2 0 0 0 0 0 0 0 0 0 0 0 0 0 
##$SW_h= 3612.71676300578
##$TD= 16384
##$TD0= 1
##$TE= 0
##$TE2= 300
##$TE3= 300
##$TEG= 300
##$TL= (0..7)
0 120 120 120 120 120 120 120 
##$TP= (0..7)
150 150 150 150 150 150 150 150 
##$TP07= 0
##$TPNAME0= <>
##$TPNAME1= <>
##$TPNAME2= <>
##$TPNAME3= <>
##$TPNAME4= <>
##$TPNAME5= <>
##$TPNAME6= <>
##$TPNAME7= <>
##$TPOAL= (0..7)
0.5 0.5 0.5 0.5 0.5 0.5 0.5 0.5 
##$TPOFFS= (0..7)
0 0 0 0 0 0 0 0 
##$TUNHIN= 0
##$TUNHOUT= 0
##$TUNXOUT= 0
##$USERA1= <user>
##$USERA2= <user>
##$USERA3= <user>
##$USERA4= <user>
##$USERA5= <user>
##$V9= 5
##$VALIST= <valist>
##$VCLIST= <CCCCCCCCCCCCCCC>
##$VD= 0
##$VDLIST= <DDDDDDDDDDDDDDD>
##$VPLIST= <PPPPPPPPPPPPPPP>
##$VTLIST= <TTTTTTTTTTTTTTT>
##$WBST= 1024
##$WBSW= 4
##$XGAIN= (0..3)
0 0 0 0 
##$XL= 0
##$YL= 0
##$YMAX_a= 263016
##$YMIN_a= -341117
##$ZGOPTNS= <>
##$ZL1= 120
##$ZL2= 120
##$ZL3= 120
##$ZL4= 120
##$ABSF1= 15.51661
##$ABSF2= -2.535239
##$ABSG= 5
##$ABSL= 3
##$ALPHA= 0
##$AQORDER= 0
##$ASSFAC= 0
##$ASSFACI= 0
##$ASSFACX= 0
##$ASSWID= 0
##$AUNMP= <proc_1d>
##$AZFE= 0.1
##$AZFW= 0.1
##$BCFW= 0
##$BC_mod= 2
##$BYTORDP= 0
##$COROFFS= 0
##$CY= -3
##$DATMOD= 1
##$DC= 0
##$DFILT= <>
##$DTYPP= 0
##$F1P= 0
##$F2P= 0
##$FCOR= 1
##$FTSIZE= 16384
##$FT_mod= 6
##$GAMMA= 0
##$GB= 0
##$INTBC= 1
##$INTSCL= 3.241238e-09
##$ISEN= 128
##$LB= 0.25
##$LEV0= 0
##$LPBIN= 0
##$MAXI= 10000
##$MC2= 0
##$MEAN= 0
##$ME_mod= 0
##$MI= 1.114404
##$NCOEF= 0
##$NC_proc= -8
##$NLEV= 6
##$NOISF1= 3.799351
##$NOISF2= 2.8
##$NSP= 0
##$NTH_PI= 0
##$NZP= 0
##$OFFSET= 15.48797
##$PC= 1
##$PHC0= -3702.389
##$PHC1= -1.007699
##$PH_mod= 1
##$PKNL= yes
##$PPARMOD= 0
##$PSCAL= 0
##$PSIGN= 0
##$REVERSE= no
##$SF= 200.130006751437
##$SI= 16384
##$SIGF1= 3
##$SIGF2= 2
##$SINO= 0.751879
##$SIOLD= 32768
##$SREGLST= <19F.Aceton>
##$SSB= 0
##$STSI= 16384
##$STSR= 0
##$SW_p= 3612.71676300578
##$SYMM= 0
##$S_DEV= 0
##$TDeff= 16384
##$TDoff= 0
##$TI= <>
##$TILT= no
##$TM1= 0
##$TM2= 0
##$TOPLEV= 0
##$USERP1= <user>
##$USERP2= <user>
##$USERP3= <user>
##$USERP4= <user>
##$USERP5= <user>
##$WDW= 1
##$XDIM= 16384
##$YMAX_p= 467686216
##$YMIN_p= -7900108
$$ End of Bruker specific parameters
$$ ---------------------------------
##NTUPLES= NMR SPECTRUM
##VAR_NAME=  FREQUENCY,     SPECTRUM/REAL,   SPECTRUM/IMAG
##SYMBOL=    X,             R,               I
##VAR_TYPE=  INDEPENDENT,   DEPENDENT,       DEPENDENT
##VAR_FORM=  AFFN,          ASDF,            ASDF
##VAR_DIM=   16384,         16384,           16384
##UNITS=     HZ,            ARBITRARY UNITS, ARBITRARY UNITS
##FACTOR=    0.220516191357247, 1,           1
##FIRST=     3099.60761114641, 0,            0
##LAST=      -513.109151859371, 0,           0
##MIN=       -513.109151859371, -7900108,    0
##MAX=       3099.60761114641, 467686216,    0
$$ Real data points
##PAGE= N=1
##DATA TABLE= (X++(R..R)), XYDATA
$$ [...]
6094A4624481M73725J849706j665885j78988J590210N70444j026784q66744m41286
6085A4928879J671412J719005o1345l22971p08754J26351J060523K89275K5491
6076A8727866O25135L38557j065299k3472J88531J412499n04651j356762J58768
6067A8501172K312231J118171L56222j211864M55337J025880r54213j007427J631587
6058B2227096R20148Q65430K01010J097539R57686J81k12957J147437J863156
6049B9066726L68395P40566J289274J346876J641877J565961J460976L69363Q12069
6040C8662083J562701J530093L100182K266989M98645L79012L09214J784722O86013
6031E0779654O02645J925006j0349O50471J518305J450992K302526P98686o58853
$$ plain form
6094 14624481 15098206 16947912 15282027 15103039 16693249 17263693 16236909 15370165 14928879
6085 14928879 16600291 18319296 18257951 17934980 17226226 17352577 18413100 18702375 18727866
6076 18727866 19353001 19691558 18626259 18602787 18791318 20203817 19699166 18342404 18501172
6067 18501172 20813403 21931574 22287796 21075932 21531269 22557149 21602936 20595509 22227096
6058 22227096 23147244 24012674 24213684 25311223 26268909 26269090 26056133 27203570 29066726
6049 29066726 29435121 30175687 31464961 32811837 34453714 36019675 37480651 37850014 38662083
6040 38662083 40224784 41754877 44855059 47122048 47620693 47999705 48308919 50093641 50779654
6031 50779654 51382299 53307305 53296956 53947427 55465732 56916724 59219250 60017936 59359083
6022E9359083K021088K504599K338575J192028J935603K033109K419886J702822
6014G5506793p2660R33522K390159J330434P87313J301368J314253r8005J78987
6005H3572164L75496Q78898j046390N36902O09386O64864p29577k523001q05879
5996H1532863J608472O35978q37116K77470Q67320J82864m18069q29961j74866
5987H2844955Q01027k53632p74242q77885j22242j295577j256752l30645j80600
5978G8554407o44274m14324k480665j806765r00360o54896j362265k460047l688110
5969F4142701p56725j462240j103673j209120k089589N62834j229725j656624
5961E5197839j239446j705925p54010p18629n84711m25598r16387k33426k247903
$$ plain form
6022 59359083 61380171 63884770 66223345 67415373 69350976 71384085 73803971 75506793
6014 75506793 75434133 76367655 78757814 80088248 80875561 82176929 83491182 83393177 83572164
6005 83572164 83947660 84826558 83780168 84317070 84926456 85591320 84861743 82338742 81532863
5996 81532863 83141335 83777313 82940197 83217667 84084987 84267851 83849782 83019821 82844955
5987 82844955 83645982 83392350 82618108 81740223 81617981 80322404 79065652 78735007 78554407
5978 78554407 77910133 77495809 75015144 73208379 72308019 71653123 70290858 67830811 64142701
5969 64142701 63385976 61923736 60820063 59610943 57521354 58084188 56854463 55197839
5961 55197839 53958393 52252468 51498458 50779829 50195118 49769520 48853133 48619707 46371804
5952D6371804j221566r99973k37517j32200r69364k200793j725366j092658j383865
5943C6408502p71832q14242k474475K58913o09660j147251j556863n72653l70853
5934B8349586q58956k050035k99519L50425m43200J326989k98435l245832n6900
5925B2774123j20062P53200j005901j002088O07162L9418J015586j036114q61903
5916B1163421m63807J36531j06398J188645N68390k488964r46112L98937m54743
5907A8995900P41624j080329j354989k49841K30882j27363l23209j159179p77216
5898A4896280p86395k109k01949J090011j570010N1760m50474l17498r22678P96320
5888A2583258K9992p04096p06079j84040Q95166P61854o9059j242198l62275k33191
$$ plain form
5952 46371804 45150238 44150265 43912748 43780548 42811184 40610391 38885025 37792367 36408502
5943 36408502 35636670 34822428 32347953 32606866 31997206 30849955 29293092 28720439 28349586
5934 28349586 27490630 25440595 25141076 25491501 25048301 26375290 26076855 22831023 22774123
5925 22774123 22654061 23407261 22401360 21399272 22006434 22045852 23061438 22025324 21163421
5916 21163421 20699614 20836145 20729747 21918392 22486782 19997818 19051706 19450643 18995900
5907 18995900 19737524 18657195 17302206 17052365 17283247 17155884 16832675 15673496 14896280
5898 14896280 14109885 14107776 13905827 14995838 13425828 13477588 13027114 12709616 11786938 12583258
5888 12583258 12613250 11909154 11203075 11019035 11914201 12676055 12606996 11364798 11002523 10769332
5878A0769332k244858J216386K78859p80226L17450j272708Q01991j171314L88128
5869H303040O01950k78742L25653q41372P2002J71809o1378m71976q35479L43260
5859G328767l70689j49250K66485j257183J131885l0493Q78460j21587j180014
5850F496381M73324Q27725m78325j302296Q67627L18628N20094q79934m99510
5841F343714O0023j35972J220450K123163m70036j327141r08209k19569O71532
5832G357955Q07815o35453k76874l91731p70543J113388K84555q46188k4505j738703
5822D879716N34472L72261P26249j003730n48134J644977J974390R57685k532863
5813G005023p77553J389182K81049r41159j64691J037376J438411k39330r46798
$$ plain form
5878 10769332 8524474 9740860 10019719 9239493 9556943 8284235 9086226 7914912 8303040
5869 8303040 8904990 8626248 8951901 8110529 8182531 8354340 8292962 7820986 6985507 7328767
5859 7328767 6958078 6808828 7075313 5818130 6950015 6919522 7797982 7676395 6496381
5850 6496381 6969705 7797430 7319105 6016809 6884436 7203064 7723158 6843224 6343714
5841 6343714 6403737 6267765 7488215 9611378 9141342 7814201 6905992 6686423 7357955
5832 7357955 8165770 7530317 7253443 6861712 6091169 7204557 7489112 6642924 6618419 4879716
5822 4879716 5414188 5786449 6512698 5508968 4960834 6605811 8580201 9537886 7005023
5813 7005023 6227470 7616652 7897701 6956542 6791851 7829227 9267638 9028308 8081510
5804H081510J062373j47672J32153N92074k57713L09599J29305o18339j10107
5795I173183J98063P25944j41196L05095j950460j669169K199562R77794N05126
5786A0323942q45787j31057J387672J434696N17658n05502P49185Q89302L7804
5777A3857913J805458J590234J576248M78569L89515L171148K337737L361748
5769B8568570L081565L068615L687620N413194O830673N500903N160086N488566
5761F6799792J866637o52058m201859p437023r225058q191855n688040m434274
5753B8836262l934815k860546k105390k164124k039257k025498l91953j362663
5745A1952016j903300r39642l16655N32700p86005n25327P78503O3528p21178
$$ plain form
5804 8081510 9143883 8996211 9128364 9720438 9462725 9772324 9901629 9283290 9173183
5795 9173183 9371246 10097190 9955994 10261089 8310629 6641460 8841022 9818816 10323942
5786 10323942 9478155 9347098 10734770 12169466 12687124 12181622 12930807 13820109 13857913
5777 13857913 15663371 17253605 18829853 19308422 19697937 22869085 25206822 28568570
5769 28568570 31650135 34718750 38406370 43819564 50650237 56151140 61311226 66799792
5761 66799792 68666429 68014371 63812512 56375489 47150431 38958576 33270536 28836262
5753 28836262 24901447 22040901 19935511 17771387 15732130 13706632 13314679 11952016
5745 11952016 10048716 9109074 8792419 9325119 8539114 8013787 8792290 8855818 8134640
5736H134640j330002N90233j518599N42309j43803O99462j313290n88594R65758
5727F038114R29316j81366N53723j383090m52462k7064p3319O71456R02763j110915
5717E867156j502683O02278K06344M60923k338740l54482R73527J707674p11392
5708D910605J82800j84768K12064m68070m52646o43304M85791L41440j91851q24660
5698C367401P3633J686215j61545n15442q90323q58475J299992l09395j745253
5689A946808N68439N60819r5955L65923q31951N60188n8253k00275N05406J245025
5679D566174j032265o92274J486365L13362j130515q14727j884028J374246J431881
5670C618219R07120L95616r38956m50127j019923Q47279n53285k68555J002808
$$ plain form
5736 8134640 6804638 7394871 5876272 6418581 6274778 6974240 5660950 5072356 6038114
5727 6038114 6967430 6786064 7339787 5956697 5504235 5477171 5403852 6075308 6978071 5867156
5717 5867156 4364473 4966751 5173095 5634018 3295278 2940796 3914323 5621997 4910605
5708 4910605 5093405 4908637 5120701 4652631 4199985 3556681 4042472 4383912 4192061 3367401
5698 3367401 3441034 5127249 4965704 4450262 3559939 2701464 4001456 3692061 1946808
5689 1946808 2515247 3076066 2980111 3346034 2514083 3074271 3016018 2815743 3321149 4566174
5679 4566174 3533909 2841635 4328000 4641362 3510847 2696120 812092 2186338 3618219
5670 3618219 4525339 4920955 3981999 3531872 2511949 3359228 2805943 2537388 3540196
5661C540196J218262J60308k161120K05809J6261p46531K567423j497318p87751
5652B515539P50541j92173J692659n39839j445682P80431Q88228K64667j556118
5643C158253K04467J025606J229355p3852o93294l48508j3466j16712r71723r01730
5633B498396q32493m2317K034416N7627k34872o91179Q10328j70577L63560Q9333
5623C882222J261371r44533o39058j617777N42029k88202o62538O75404o86578
5614A522340m74769J785046K70854j30749j437524p60776K07575m46083K32034
5605G67948K134935J542232j510639j209414J01327N02008r40542o54908q4283
5596F48664N97105L73101J062124j296923k13961q13904n5201O26188q14367J100087
$$ plain form
5661 3540196 4758458 4918766 2757646 2963455 2979716 2233185 4800608 3303290 2515539
5652 2515539 3266080 3073907 4766566 4226727 2781045 3561476 4449704 4714371 3158253
5643 3158253 3362720 4388326 5617681 5543829 4850535 4502027 4488561 4371849 3400126 2498396
5633 2498396 1665903 1623586 3658002 3715629 3480757 2789578 3599906 3429329 3792889 3882222
5623 3882222 5143593 4199060 3560002 1942225 2484254 2196052 1533514 2208918 1522340
5614 1522340 1047571 2832617 3103471 2972722 1535198 774422 981997 535914 767948
5605 767948 2902883 4445115 2934476 1725062 1826389 2328397 1387855 732947 648664
5596 648664 1245769 1618870 2680994 1384071 1170110 356206 301005 927193 112826 1212913
5586A212913Q72192K21863P1538K4899P15795l37398n97304j058883Q2750J90821
5576A399186j066269j413500K445789L51340Q06654o33301j13792j411551R70520
5567A335076j047908M45124J358517Q53011o75779P4815j081186J253627o72523
5558A842774o00474L04888M30340J125840J568901j574342j131398K65305k39779
5549A992055J324204j75044p28121K05685n34786K96033J019996o79087R22077
5540C643012N23249J90023o11272L79027l66655l97990j023441P10969M76931
5531C523853P38477j010407K47113M97337O34583j521020j4211J51028J2692r07006
5521B352439l48047O74483M79131m11670n704N10040q42926J637159Q8768r10681
$$ plain form
5586 1212913 2085105 2306968 2378506 2403405 3119200 2781802 2184498 1125615 1208365 1399186
5576 1399186 332917 -1080583 1365206 1716546 2523200 1889899 1776107 364556 1335076
5567 1335076 287168 732292 2090809 2943820 2268041 2342856 1261670 2515297 1842774
5558 1842774 1242300 1547188 1977528 3103368 4672269 3097927 1966529 2231834 1992055
5549 1992055 3316259 3141215 2413094 2618779 2083993 2380026 3400022 2720935 3643012
5540 3643012 4166261 4356284 3745012 4124039 3757384 3359394 2335953 3046922 3523853
5531 3523853 4262330 3251923 3499036 3996373 4630956 3109936 3095725 3246753 3259445 2352439
5521 2352439 2004392 2678875 3158006 2746336 2740632 3250672 2407746 4044905 4133673 3222992
5511C222992K85890k78619L98828K86021J269961K06699r22949j022576m57645
5502B988602l08970n52057j62191K099046J048090P65612j459415j297474J041873
5493D163116m36719j323290J027497L86377M86896m35821k170922M346J015681
5484B717161K38633l16416J265534r04396L83987Q98946K10572j073277o38150
5475B782594N15989j50153n81399k36001M68469k77171k03040J84472N04179P40542
5465C748481m7118n68687J42324J468112j392104j60518k46687l48922J496667
5456D091548K34488k99874Q19704l00985L8222j194411l42715J040897J274672
5447E361546q7787j649166j413840M69507J263253m54853l93987l9792p65213
$$ plain form
5511 3222992 3508882 3230263 3629091 3915112 5185073 5391772 4468823 3446247 2988602
5502 2988602 2679632 2127575 1965384 4064430 5112520 5878132 4418717 3121243 4163116
5493 4163116 3726397 2403107 3430604 3816981 4303877 3868056 1697134 1701480 2717161
5484 2717161 2955794 2639378 3904912 3000516 3384503 4283449 4494021 3420744 2782594
5475 2782594 3298583 3148430 2567031 2331030 2799499 2522328 2319288 2503760 3007939 3748481
5465 3748481 3701363 3132676 3275000 4743112 3351008 3190490 2943803 2594881 4091548
5456 4091548 4326036 4026162 4845866 4544881 4583103 3388692 3045977 4086874 5361546
5447 5361546 5273759 3624593 2210753 2680260 3943513 3488660 3094673 3054881 2289668
5438B289668Q61508J146260l40144P24261j409992K82694L51217Q09503o45346
5429D069629R84234j181982m31407M98934M57913j148430J037838k52733n07158
5420C526838l97767L19062K394293j12086k997054n65092J545324J674085M8270
5411E435873l09285L81421k23764p8851j258548n00116Q82742K345992p74638
5402E900826j271025m44388K30713L50847Q22993j110465J229328K102881M268
5393G815978j027430m34278N5624N2204m20662L62441K22893n44732m72174m4089
5383E565775k1896J345321Q01702p57868m88615j045297R49727j00155N65297
5374F813991N35300O37754Q80785j321372L8396n71606K55185P38624n10839P03340
$$ plain form
5438 2289668 3151176 4297436 3957292 4681553 3271561 3554255 3905472 4714975 4069629
5429 4069629 5053863 3871881 3440474 3939408 4397321 3248891 4286729 4033996 3526838
5420 3526838 3129071 3448133 5842426 5730340 2733286 2168194 3713518 5387603 5435873
5411 5435873 5126588 5508009 5284245 5205394 3946846 3446730 4329472 6675464 5900826
5402 5900826 4629801 4185413 4416126 4766973 5589966 4479501 5708829 7811710 7815978
5393 7815978 6788548 6354270 6409894 6462098 6041436 6403877 6626770 6082038 5609864 5565775
5383 5565775 5543879 6889200 7690902 6933034 6444419 5399122 6348849 6248694 6813991
5374 6813991 7349291 7987045 8867830 7546458 7584854 7013248 7268433 8007057 7496218 8199558
5364H199558M11814o12519J03693Q13991J503028j494137N60930j331428q039
5355H146891l01141P20506N47230m51541J245210K56407m0005m10643o49724Q13625
5345I876815j52041Q8142P56769J745699R31764j300667o78764J87875J115969
5336A2571561j866161P73351M00086Q44800P83821j29315R55012K7770p95298
5327A3565627l44850O23574P97672M5838J21270l85346K041820J4014k38538J691914
5317A7932995l01220Q93646o04280P07138J67423J10327J783932j895951M57199
5308A9251209Q10946l9133J372389l32297L78856M07334M13539j195000J7267
5299B1085110l65292l62928J998418Q90259J286363J472811p03900N86006l93707
$$ plain form
5364 8199558 8611372 7998853 8102546 8916537 10419565 8925428 9486358 8154930 8146891
5355 8146891 7845750 8566256 9113486 8661945 9907155 10163562 10123557 9712914 9063190 9876815
5345 9876815 9724774 9812916 10569685 12315384 13247148 11946481 11267717 11455592 12571561
5336 12571561 10705400 11478751 11878837 12723637 13507458 13378143 14333155 14360925 13565627
5327 13565627 13220777 13844351 14642023 14687861 14809131 14423785 16465605 16479619 16241081 17932995
5317 17932995 17631775 18525421 17921141 18628279 18795702 18906029 20689961 18794010 19251209
5308 19251209 20062155 20023022 21395411 21063114 21441970 21849304 22262843 21067843 21085110
5299 21085110 20719818 20356890 22355308 23245567 24531930 26004741 25300841 25886847 25493140
5290B5493140j86985J69462J737120J426602J22854m9554r52900K408158P26522
5281C0894419l54294R70929R0108J001701Q67179O97262L82727N19915J68954
5272C5238900R71669K693253n57228P64813J260444J054505J791848j230928J452995
5263D3440271J377451J843080J604447j93655J962209J92333J607340J124620
5255E2958096O51639J734645N92467N69230P75758P81510J141685J210382L344395
5246F3759807J261421j330319o94305J663318J508458J584100J301882M44807
5238F9499169K563247K370206J15125R12699J883466M7898K32437P02033L86933
5229G8713213J790882l69073M6689J095984J1057J227849J310116M1084L95009
$$ plain form
5290 25493140 25306155 25475617 27212737 28639339 28762193 28712639 27759739 30167897 30894419
5281 30894419 30540125 31511054 31601162 32602863 33470042 34167304 34550031 35069946 35238900
5272 35238900 36210569 38903822 38346594 39111407 40371851 41426356 43218204 41987276 43440271
5263 43440271 44817722 46660802 48265249 48071594 50033803 50226136 51833476 52958096
5255 52958096 53609735 55344380 55936847 56506077 57281835 58063345 59205030 60415412 63759807
5246 63759807 65021228 63690909 62996604 64659922 66168380 67752480 69054362 69499169
5238 69499169 72062416 74432622 74547747 75460446 77343912 77391810 77624247 78326280 78713213
5229 78713213 80504095 80135022 80181711 81277695 81288752 82516601 83826717 83867801 84262810
5220H4262810J473920Q44582q88035M22463j617971P30974P19983k77305m08613
5211H5262808m09080p5991j497172o54088O5945K85880j780009k267764J428007
5202H0358536j070482k769405J196216j110338j122742n50915j174868j496533
5194G2259469m82314j322590j506240j5042m84841L33532k428253p83939p74934
5185F4794848n84802k17791k19197j511647o99162O86428L49066j169229k819609
5176E8608905j132075M04303o7265j369457q20455j256839J190749o51253j186485
5167E3720128l87830m31143j037151K4693J294854j483557l548928m97889J480127
5158D9133304K56652q62940n23183j70210j208753j182423n27395k98830M57077
$$ plain form
5220 84262810 85736730 86581312 85693277 86115740 84497769 85228743 85948726 85671421 85262808
5211 85262808 84853728 84777737 83280565 82626477 82692422 82978302 81198293 78930529 80358536
5202 80358536 79288054 76518649 77714865 76604527 75481785 74930870 73756002 72259469
5194 72259469 71777155 70454565 68948325 68933283 68448442 68781974 66353721 65569782 64794848
5185 64794848 64210046 63992255 63773058 62261411 61562249 62248677 62597743 61428514 58608905
5176 58608905 57476830 57881133 57813868 56444411 55623956 54367117 55557866 54906613 53720128
5167 53720128 53332298 52901155 51864004 51888697 53183551 51699994 48151066 47653177 49133304
5158 49133304 49389956 48527016 48003833 47833623 46624870 45442447 44915052 44616222 45073299
5149D5073299j155084J71491k1922k29650l37055j407582j562830J658661p69826
5140D1419502J795489Q00152l045387m91429Q62845r17669k40491K85123j263493
5131C9204642K64724J06739n24704J053027n43719j021087o7129q64821J409402
5122C9017074Q02165L33922l09155n01773k38159j448609k62352j132117J78969
5113C6439965J604808M34105q88252j150284J317228L72757K635597L43745o04844
5104D0504825j664926J27207M29127r60891Q76551N67468Q77005M45273q96755
5095D0304884j46267k87627k29192J37723p47981J279953k8579Q68188K10116
5086D1361218j657800j383966j157724m995J604958O4253M27060N20782j169904
$$ plain form
5149 45073299 43918215 44089706 44067784 43838134 43501079 42093497 40530667 42189328 41419502
5140 41419502 43214991 44015143 40969756 40478327 41341172 40423503 40183012 40468135 39204642
5131 39204642 39469366 39576105 39051401 40104428 39560709 38539622 38472493 37607672 39017074
5122 39017074 39819239 40153161 39844006 39342233 39104074 37655465 37393113 36260996 36439965
5113 36439965 38044773 38478878 37590626 36440342 37757570 38130327 40765924 41109669 40504825
5104 40504825 38839899 38967106 39396233 38435342 39311893 39879361 40756366 41201639 40304884
5095 40304884 40158617 39870990 39641798 39779521 39031540 40311493 40282914 41151102 41361218
5086 41361218 39703418 38319452 37161728 37156733 38761691 38825944 39253004 39773786 38603882
5077C8603882r18945j026775j29997K320302J34253n13208j27489o88774m08556
5068C7244693j247801l54181J394913m25713J180379J747201K62168m25974j519548
5059C7856137j170736Q70602J373354N16466j026824j227592M7412Q90249J446369
5050C9575437p8426k024459N40491K308792k3372J424043j10014j304696J512900
5041D1820696l68976k42128L71152J347152J527817n76318o84953j048781J456396
5032D3602057N31999j09969l25841M13773k30621M56027j167350O60355J298420
5023D5128850p06578j199733p3598o49247m12998M95157J549555J874104p58846
5014D5246666k460337Q25690L99911j48950R2406J784428M58426J02271k9423
$$ plain form
5077 38603882 37684937 36658162 36528165 38848467 38982720 38469512 38342023 37653249 37244693
5068 37244693 35996892 35642711 37037624 36611911 37792290 39539491 39801659 39375685 37856137
5059 37856137 36685401 37556003 38929357 39445823 38418999 37191407 37238819 38129068 39575437
5050 39575437 39497011 37472552 38013043 40321835 40298463 41722506 41612492 40307796 41820696
5041 41820696 41451720 41209592 41580744 42927896 44455713 43879395 43194442 42145661 43602057
5032 43602057 44134056 44024087 43698246 44112019 43881398 44337425 43170075 43830430 45128850
5023 45128850 44422272 43222539 43148941 42499694 42086696 42581853 44131408 46005512 45246666
5014 45246666 42786329 43612019 44011930 43862980 43955386 45739814 46198240 46300511 46271088
5005D6271088j298621j219275q04577Q29439J1951o88368j008427J555257J578303
4996D5226770r47655m93572J600725K251742J596478j265796M06044L78006j96858
4987D8555884M46401j031378J24311J77408Q19857p49487N92714J058093l55614
4978D9638189P12606j735417M6307J296130N65409J192951p02720L13564O55829
4969E1982848p6363N24884o84915K65484J27397J83619q93523J49188Q38430J136630
4959E3553679r09968j926972k53902Q23851J020166J784588l59917L82731r29567
4950E3184689m74381J533132o89114M54791m86116J436927M7986j503648j043831
4941E2460435J90382K10891j003484n33389K532985J670459J285463j482894r20297
$$ plain form
5005 46271088 44972467 43753192 42948615 43778054 43790005 43101637 42093210 43648467 45226770
4996 45226770 44279115 43785543 45386268 47638010 49234488 47968692 48374736 48752742 48555884
4987 48555884 49002285 47970907 48095218 48272626 49092483 48342996 48935710 49993803 49638189
4978 49638189 50350795 48615378 48661685 49957815 50523224 51716175 51013455 51327019 51982848
4969 51982848 51906485 52431369 51746454 52011938 52139335 52322954 51429431 51578619 52417049 53553679
4959 53553679 52643711 50716739 50462837 51286688 52306854 54091442 53731525 54114256 53184689
4950 53184689 52710308 54243440 53554326 54009117 53523001 54959928 55007914 53504266 52460435
4941 52460435 52650817 52861708 51858224 51324835 53857820 55528279 56813742 55330848 54410551
4932E4410551K09587R18360K149936J827264j19222K5464l34810J617952K051982
4923F2757064K34640L89994N79866J091967L98033J326095J45442L08225J055222
4914F8286548J047234J208317O52313n77414K494662J400474k1519O12085O65325
4905G5768025J548156N99169k02010K067627J273616K667295l52273p70694J405437
4896H4004348R69232j71191k71951L88132m17575l84264J737360O87537r73910
4887H5567718q22967r37990J193921N15432k185608j091647n25914J127711k06560
4878H2634096Q33988j443775j371747j314569J57344J74979n58396q24256J14304
4869G8401968j54164J591348n28520l146239J69598L89237l4053k16807j292990
$$ plain form
4932 54410551 54620138 55538498 57688434 59515698 59396476 59421940 59087130 60705082 62757064
4923 62757064 62991704 63381698 63961564 65053531 65451564 66777659 66923101 67231326 68286548
4914 68286548 69333782 70542099 71194412 70616998 73111660 74512134 74490615 75102700 75768025
4905 75768025 77316181 77915350 77713340 79780967 81054583 83721878 83369605 82598911 84004348
4896 84004348 84973580 84802389 84530438 84918570 84500995 84116731 85854091 86541628 85567718
4887 85567718 84744751 83806761 85000682 85516114 83330506 82238859 81712945 82840656 82634096
4878 82634096 83468084 82024309 80652562 79337993 79495337 79670316 79111920 78287664 78401968
4869 78401968 78247804 79839152 79310632 76164393 76333991 76723228 76689175 76472368 75179378
4860G5179378j036437q42695n79113m61951K47126K6724R79010p68997J084342
4851G3827387n51586p35181P0848j102506O40374O12707O18717j224729N84027
4842G2740058K441674J069439O04185Q66240J718661L628665J631768K593261
4834H7293951L363917M084541L789670M160459M097001M807573L051311r32115
4826A13716308l197113m944413n259233l138182m426962m854806l149721k202635
4818H2543243k418537p46205k050178j239017k947489o16962j312584j70078k080944
4809F8961249r03731k90214o14264j041143j735958o94291K098758j654066r95974
4800F3130366j473508k41939M96810o95126m95086j926971O56842P47467j681114
$$ plain form
4860 75179378 74142941 73300246 72721133 72259182 72506308 72533032 73512042 72743045 73827387
4851 73827387 73275801 72540620 72611468 71508962 72149336 72762043 73380760 72156031 72740058
4842 72740058 75181732 76251171 76855356 77721596 79440257 83068922 84700690 87293951
4834 87293951 90657868 94742409 98532079 102692538 106789539 111597112 114648423 113716308
4826 113716308 110519195 105574782 100315549 97177367 92750405 87895599 84745878 82543243
4818 82543243 80124706 79378501 77328323 76089306 73141817 72524855 71212271 71042193 68961249
4809 68961249 68057518 67767304 67153040 66111897 64375939 63681648 65780406 64126340 63130366
4800 63130366 61656858 61414919 61911729 61216603 60721517 58794546 59451388 60198855 58517741
4791E8517741O15693o48236j84143P16012P06710n99503p84467j366q43600J030388
4781E8525229j327024p42893L165585Q8632j165075Q70334N3571J200713m71684
4772F0197388j165342M9812K300497J19237k34713L53263M67523k79025K67490
4763F2076130K071819P2356k62212K90580P30289Q65261q60120K243671J398655
4754F8626429J70090O31465p50812J828528Q76886o8928K080785J380346J570222
4745G6345011P06660J360149J086502J674652P58408K640101K865007M25691L35355
4736H8197536R13894K358234K524312R34664O60858r61810J808177K956656O51627
4727A00044148J031418K234480L88775J430088J416894J102602J100054J899557
$$ plain form
4791 58517741 59133434 58485198 58301055 59017067 59723777 59124274 58339807 58338441 57494841 58525229
4781 58525229 57198205 56455312 59620897 59709529 58544454 59414788 59468359 60669072 60197388
4772 60197388 59032046 59081858 61382355 61501592 61266879 61620142 62087665 61808640 62076130
4763 62076130 64147949 64220305 63958093 64248673 64978962 65844223 64984103 67227774 68626429
4754 68626429 68796519 69427984 68677172 70505700 71382586 71313658 73394443 74774789 76345011
4745 76345011 77051671 78411820 79498322 81172974 81931382 84571483 87436490 87862181 88197536
4736 88197536 89111430 91469664 93993976 94928640 95589498 94627688 96435865 99392521 100044148
4727 100044148 101075566 103310046 103698821 105128909 106545803 107648405 108748459 110648016
4719A10648016J629314J893330m24574R84175K366557J488596L93727J302424
4711A20281565L240713L169632O79N55408J501664J401219J486744O09969R91539
4702A33239132K390192K042111N49277O82630J464523L55499q57256O58952j206264
4693A39318796q10730N99468k99722j798253l141732j966182k564121j637284
4685A27700240k452188o56427j258824l975438l499707k002054q31581k463319
4677A10560702n408238l075579l79237j89631k460058m278148k677135j323027
4669I0769649j001665k903366j232229l683829j433830k497891m082139j256430
4661G2678270j605116k290802k096026k858396k322184j748454n13386k803908
$$ plain form
4719 110648016 112277330 114170660 113746086 114730261 117096818 118585414 118979141 120281565
4711 120281565 123522278 126691910 126692589 127247997 128749661 130150880 131637624 132247593 133239132
4702 133239132 135629324 137671435 138220712 138903342 140367865 140723364 139866108 140525060 139318796
4693 139318796 138508066 139107534 138807812 137009559 133867827 131901645 129337524 127700240
4685 127700240 125248052 124591625 123332801 119357363 115857656 113855602 113024021 110560702
4677 110560702 105152464 102076885 101697648 101508017 99047959 94769811 92092676 90769649
4669 90769649 89767984 86864618 85632389 81948560 80514730 78016839 73934700 72678270
4661 72678270 71073154 68782352 66686326 63827930 61505746 59757292 59243906 56439998
4653E6439998k638689p84225N369k70799k061075l088562k59443j542916j484667
4644D4314991p07522k59971j252056Q72277L53944j109021j354032k23433J37127
4635D0772304O97991l31779N35963L13525K197043J350311J11787K295759m76385
4626D7466519j403440j301565K93784n98562j964093j292284O4172j483935J87235
4617C9967831r98810l43686L10930L31938L8314J649947K202030M35382O22982
4608D4216858R61334J565832K222438M31795P98044J821353M71781J312486J889052
4599E5690973K818110P90850j56944p85276o66700K625915p52181o87968Q1525
4590E8958304n37931j839923k994302k3033j332470j479082j351038j614184j572216
$$ plain form
4653 56439998 53801309 53017084 53022453 52751654 50690579 47602017 47342574 45799658 44314991
4644 44314991 43607469 43347498 42095442 42967719 43321663 42212642 40858610 40635177 40772304
4635 40772304 41470295 41138516 41674479 41988004 44185047 45535358 45647145 47942904 47466519
4626 47466519 46063079 44761514 45055298 44456736 42492643 41200359 41264531 39780596 39967831
4617 39967831 38969021 38625335 38936265 39268203 39306517 40956464 43158494 43593876 44216858
4608 44216858 45178192 46744024 48966462 49398257 50196301 52017654 52489435 53801921 55690973
4599 55690973 58509083 59299933 59142989 58357713 57691013 60316928 59564747 58876779 58958304
4590 58958304 58420373 56580450 53586148 53563115 52230645 50751563 49400525 47786341 46214125
4581D6214125k792354k047209l85149r49212k082413k320482j433925k046494
4573C2156887j827084k342753j032547j389153j840862q82842j649108r40959
4565B0251579j244358m23595r96626n94901N270R93391l82214k220545p30371
4556A4657630J76367j204681N32305q22363M53777k5068K36685o72192j18369
4547A3214091j72387K68193J23432j784477l2834O09260J277697J490967j344783
4538A3649159j819597J97503j43485J249100j609000r43914P97514O86270r32427
4529A1131123K27318N52277N675j225944J280249Q24224J353103R06605j285110
4520A3769520q77013K48153K16123L77890o10384k6811k15088n7718R9432k83680
$$ plain form
4581 46214125 43421771 41374562 40989413 40040201 37957788 35637306 34203381 32156887
4573 32156887 30329803 27987050 26954503 25565350 23724488 22841646 21192538 20251579
4565 20251579 19007221 18583626 17587000 16992099 16997369 17990760 17608546 15388001 14657630
4556 14657630 14833997 13629316 14161621 13339258 13793035 13767967 14004652 13332460 13214091
4547 13214091 13041704 13309897 13433329 11648852 11616018 12225278 13502975 14993942 13649159
4538 13649159 11829562 12027065 11883580 13132680 11523680 10579766 11377280 12063550 11131123
4529 11131123 11358441 11910718 11916393 10690449 11970698 12794922 14148025 15054630 13769520
4520 13769520 12892507 13140660 13356783 13734673 13124289 13097478 12882390 12824672 12924104 12640424
4510A2640424k78529P03149r15081l34509l1336O37164j22730K39328p67275m4077
4500A1726528n00335j065616j44901k024071J165633j46417n98470L19869j625456
4491G106764K32982J413080J35379J111210j159634R8439r37408L38292L77641
4482H716745P09619j330787j94681J567055o72866j808118m60000N15042J526141
4473H568150k17742o74250j524657J101414m79553j257545J025924L32526N7638
4464F931905N00286n57217j463501l49827N0945j218803J327678L53141K67025
4455E841632j172024j54575O00334P15185R63325j435852r2751j304470j772206
4446B188598J699194J742332J65887M64852j898831r51176j014261J951555K38845
$$ plain form
4510 12640424 12361895 13065044 12149963 11815454 11784118 12421282 12298552 12537880 11770605 11726528
4500 11726528 11226193 10160577 10015676 7991605 9157238 9010821 8412351 8732220 7106764
4491 7106764 7339746 8752826 8888205 9999415 8839781 8938220 8000812 8339104 8716745
4482 8716745 9426364 8095577 7900896 9467951 8795085 6986967 6526967 7042009 8568150
4473 8568150 8350408 7676158 6151501 7252915 6773362 5515817 6541741 6874267 6931905
4464 6931905 7432191 6874974 5411473 5061646 5112591 3893788 5221466 5574607 5841632
4455 5841632 4669608 4515033 5115367 5830552 6793877 5358025 5265274 3960804 2188598
4446 2188598 3887792 5630124 5796011 6260863 4362032 3410856 2396595 4348150 4586995
4437D586995m61714k82561k19791J889841O46138r39280j329618L58144J699449
4428E947603M40893R69311r42156k038835J178603R91804n70772j834811j147676
4419B993964J965430O06325J235014p24160j636244j400302P62928K509589J726261
4410H038805M01048l79924k610690N3614J69225N93280J095090j020541j90512
4401F149395N97053k7600k036308J66289R41429P08570j29237R59191L91298j765694
4391E954386j366064N88305R03238J43166M31296J506490o9471q70473p52765
4382F468108o93677o41798J300555K031713K23503j174876j99438j386860J446875
4373G374105R20328o58568k11392j140067n7367J118315J585800O82642q32817
$$ plain form
4437 4586995 4125281 3842720 3622929 5512770 6158908 5219628 3890010 4248154 5947603
4428 5947603 6388496 7357807 6415651 4376816 5555419 6547223 5976451 4141640 2993964
4419 2993964 4959394 5565719 6800733 6076573 4440329 3040027 3802955 6312544 8038805
4410 8038805 8439853 8059929 5449239 5502853 5672078 6265358 7360448 6339907 6149395
4401 6149395 6746448 6718848 4682540 4848829 5790258 6498828 6369591 7328782 7720080 5954386
4391 5954386 4588322 5176627 6079865 6223031 6654327 8160817 8091346 7220873 6468108
4382 6468108 5774431 5132633 6433188 8464901 8688404 7513528 7314090 5927230 7374105
4373 7374105 8294433 7635865 7424473 6284406 6227039 7345354 8931154 9613796 8780979
4364H780979K88656m48637m83697J731440K6808J074704N6995J67721J120748
4355A2315717L31664q48808j49655k64239o90683m51921J088008P72983M59009
4346A2562075l04767j237924o84819j146512l60467J531536J721632k79400M8494
4337A1849848j098189K42540m89199j89141L6130q19873J358167O81473m2174
4328A1529582r01812K93057o24523N07901J6027K1837L2479K45598K78210M99972
4318A1898328N94283o49249J086662J61034q95166J240364N2998R32778K81471
4309A4703503l84722Q07019n15530J469875r15055J94088J157152o53187O83748
4300A6546891n084r06765K47713L084972j06478o49341L24769J93369K80703k144810
$$ plain form
4364 8780979 9069635 8620998 8137301 9868741 9895549 10970253 11027248 11194969 12315717
4355 12315717 12647381 11798573 11648918 11384679 10693996 10242075 11330083 12103066 12562075
4346 12562075 12257308 11019384 10334565 9188053 8827586 10359122 12080754 11801354 11849848
4337 11849848 10751659 10994199 10505000 10315859 10351989 9532116 10890283 11571756 11529582
4328 11529582 10627770 10920827 10296304 10804205 10820232 10842069 10874548 11120146 11398356 11898328
4318 11898328 12492611 11843362 12930024 13091058 12195892 13436256 13489254 14422032 14703503
4309 14703503 14318781 15125800 14610270 16080145 15165090 15359178 16516330 15863143 16546891
4300 16546891 16541807 15635042 15882755 18967727 18861249 18211908 18536677 18730046 19010749 16865939
4290A6865939j038374P60862j545734M29474k40016k57688N4233q04555J41988
4281A4366129j016737P38834m79164K5500q3660j748843Q21551L1297P31028q77580
4271A2508355j11953k78132m05436Q75795J483036r7365r67139n86946K18405
4262A2638620J342506O50971q00788m65028n97273j272599J997089J312038P17382
4253A5522918j678849j259907J074523J947980K81312N5718l94632j339575m17865
4244A3791623K05506P0700q47650K50291J923718j558262k77275n68826P51730
4235A3741555l0100p37404j337182L01718J527773m40719k88771K757869l690430
4226A1804309m91513Q64047J506029O56818j179376p97923j790096p17795n01337
$$ plain form
4290 16865939 15827565 16588427 15042693 15472167 15232151 14974463 15028696 14224141 14366129
4281 14366129 13349392 14088226 13609062 13634562 13550902 11802059 12623610 12654907 13385935 12508355
4271 12508355 12396402 12118270 11712834 12588629 14071665 13974300 13007161 12420215 12638620
4262 12638620 13981126 14632097 13831309 13366281 12769008 11496409 13493498 14805536 15522918
4253 15522918 13844069 12584162 13658685 15606665 15887977 15943695 15549063 14209488 13791623
4244 13791623 13997129 14067829 13220179 13470470 15394188 13835926 13558651 12989825 13741555
4235 13741555 13711455 12974051 11636869 11938587 13466360 13025641 12736870 15494739 11804309
4226 11804309 11312796 12176843 13682872 14339690 13160314 12362391 10572295 9854500 9353163
4217I353163K172221J672505m81488K1878j067349j34887J253976J31644K99882
4208A3221545j204345R81023N2900Q22652K89494k570428j630733N48677N30505
4199A1041290M91078Q62447j622329n69378J874838J165226j88895k177303J364983
4190A2241957O67639J55863J563451j915800J23541J764859n1141J361095m42539
4181A5468925o86230j054316M42685Q08770k97728N22362m59645j50048k57440
4172A4337335J008513L440270O78497j378833j847821J547368O3448l01596N69108
4163A8116289J300158J516777p9265q97217O65827N72431J474520q67420N12482
4154B2314582J394717N34897r2591r61139j88979L080399K072404j315113J304218
$$ plain form
4217 9353163 11525384 13197889 12716401 12738279 11670930 11536043 12790019 12921663 13221545
4208 13221545 12017200 12998223 13051123 13873775 14163269 11592841 9962108 10510785 11041290
4199 11041290 11532368 12394815 10772486 10203108 12077946 13243172 13054277 10876974 12241957
4190 12241957 12909596 13065459 14628910 12713110 12836651 14601510 14550369 15911464 15468925
4181 15468925 14782695 13728379 14171064 14979834 14682106 15204468 14744823 14594775 14337335
4172 14337335 15345848 18786118 19464615 18085782 16237961 17785329 17848777 17547181 18116289
4163 18116289 19416447 20933224 20853959 19956742 20622569 21195000 22669520 21802100 22314582
4154 22314582 23709299 24244196 24151605 23190466 23001487 26081886 28154290 26839177 28143395
4145B8143395m89976M86392J058151q6013P70889R40981J248289J464057n43351
4136C2992814M18163J351162N05953P69219m06290K45661M29442r2725J204325
4127C7417724L883657J362080K72909k86599M45338J214540R09912J467696Q28589
4118D7515846K800835K686716O87644o6722R62732O00217k9492O03857K618173
4109E8379806J458205R01116J135592J068756J231731J706690k58590J283092
4101F6906398K756055N43588L469415K021717J30461P26116Q31710K524979K385009
4092H2295448J050175J547563J114622M39345J976769L234107J377133q5004J343412
4083I4293570K698917K940714L65795R91978J339245J770257R27432K8165K006620
$$ plain form
4145 28143395 27653419 28139811 29197962 29111949 29882838 30823819 32072108 33536165 32992814
4136 32992814 33410977 34762139 35268092 36037311 35631021 35876682 36306124 36213399 37417724
4127 37417724 41301381 42663461 42936370 42649771 43095109 44309649 45219561 46687257 47515846
4118 47515846 50316681 53003397 53691041 53624319 54587051 55187268 55157776 55761633 58379806
4109 58379806 59838011 60739127 61874719 62943475 64175206 65881896 65623306 66906398
4101 66906398 69662453 70206041 73675456 75697173 75827634 76553750 77385460 79910439 82295448
4092 82295448 83345623 84893186 86007808 86447153 88423922 91658029 93035162 92950158 94293570
4083 94293570 96992487 99933201 100298996 101290974 102630219 104400476 105327908 105356073 107362693
4074A07362693J818492J476519J549942K001567J820395K573047J631778o7313
4066A20167120Q38027K086758L564014J758890K544119M204391J193233J978455
4058A38335007J640138J269182Q85653J19818K156132J260207K73620L7463J896966
4049A47874186J879436J650560q1614n20065K122749L220311K344738O71721M67215
4040A59629237K761514K47630m34204J764803J407457J093044R05388k22512N74052
4031A67726409J794374N16725P5219k11627P0042J255900Q40127Q29760k40982
4022A72655947R71458M31470j231263J66245J095591M59071j581311k174798J019051
4013A71811461R67480M37321j546471r70054J04855o0288M6978j586574n38426
$$ plain form
4074 107362693 109181185 110657704 112207646 114209213 116029608 118602655 120234433 120167120
4066 120167120 121005147 123091905 126655919 128414809 130958928 135163319 136356552 138335007
4058 138335007 139975145 141244327 142129980 142249798 144405930 145666137 145939757 145977220 147874186
4049 147874186 149753622 151404182 151322568 150802503 152925252 156145563 158490301 159162022 159629237
4040 159629237 162390751 162638381 162204177 163968980 165376437 166469481 167374869 167152357 167726409
4031 167726409 169520783 170037508 170112727 169901100 169971142 171227042 172067169 172896929 172655947
4022 172655947 173627405 174058875 172827612 172993857 174089448 174548519 172967208 170792410 171811461
4013 171811461 172778941 173216262 171669791 170699737 170804592 170744304 170791282 169204708 168666282
4004A68666282r49350O73996P34512j967583n1833r69070m48526j8279k392882
3995A63277267p00797r78521k231581j077767j305850j173888l191226j688829
3987A50928808R9350j623034j618429k432763k053677j614929j796691j554715
3979A38333920p51352j508122k981566J95960j244888j877177n94621r70088j6028
3970A28586038k068923k469664l33883K27919o27589j791963k077675Q8295l19212
3961A19213343n3412j63872j191452r88228j157771j508570j179717p3027O53542
3952A13550836j53872P26048j478103j431855k433024j688687k014099j544107
3944A03533137j165748p3658j096244j7087k158856r93168j437526k246926j156173
$$ plain form
4004 168666282 167716932 168390928 169125440 167157857 167106024 166136954 165688428 165670149 163277267
3995 163277267 162576470 161597949 159366368 158288601 156982751 155808863 152617637 150928808
3987 150928808 151028158 149405124 147786695 145353932 143300255 141685326 139888635 138333920
3979 138333920 137582568 136074446 133092880 133288840 132043952 130166775 129572154 128602066 128586038
3970 128586038 126517115 124047451 123713568 123941487 123313898 121521935 119444260 119532555 119213343
3961 119213343 119159931 118996059 117804607 116816379 115658608 114150038 112970321 112897294 113550836
3952 113550836 113396964 114123012 112644909 111213054 108780030 107091343 105077244 103533137
3944 103533137 102367389 102293731 101197487 101180400 99021544 98028376 96590850 94343924 93187751
3935I3187751q42529j724137q80621k99208j75676j207450j598800k135280m07648
3926H3916402j971299j105564M66237K49312k000867k090046j293484j322943
3918G4847748n14182k636759j949716j488168l045690j125135R8539j093466p05678
3909F2387493k517013o03225j39818k14628k45352o39818l98611j006490q1482
3900E6541056J75471m68083O16937j910725R18540J144522M29717j173644m41010
3891E5832781J96547P25099k06035J31288j066353L24653P8315K441179m31116
3882E8026358j474105J46298r75379J741287K127089K90062j795061l27937M60356
3873E8218968l94383K065342K45674M85522j323036K9842J763854K227925L05376
$$ plain form
3935 93187751 92345222 90621085 89740464 89441256 89265580 88058130 86459330 84324050 83916402
3926 83916402 81945103 80839539 81305776 81555088 79554221 77464175 76170691 74847748
3918 74847748 74333566 71696807 69747091 68258923 65213233 64088098 64186637 63093171 62387493
3909 62387493 59870480 59267255 59127437 58912809 58667457 58027639 57629028 56622538 56541056
3900 56541056 56716527 56248444 56865381 54954656 55873196 57017718 57447435 56273791 55832781
3891 55832781 56029328 56754427 56548392 56679680 55613327 55937980 56016295 58457474 58026358
3882 58026358 56552253 56698551 55723172 57464459 59591548 59881610 58086549 57758612 58218968
3873 58218968 57824585 59889927 60135601 60621123 59298087 59327929 61091783 63319708 63625084
3864F3625084P51649J564356J931663N10226K449757K309233J388741J419764
3856G5950473L87245L647780J855037K630784K959343L365264Q21825J808172
3848I3425923K195028L178582K434230O74315J616958J003722J428380K664527
3840A08621665Q06526J378449J930007Q72976J092611l82824K44013q48219L42534
3831A14057738M23095j009669j251129j800176n05350l033109j715565p90909
3823A04374926q26756j134361k315165k415281j197465j430019j055959j956278
3815I2043642j144492p42487J633511n07154j671419j043517P84175Q09333M5542
3806I0207134K1016M1921J889637K57377R34373K45344l120327O48360L91613
$$ plain form
3864 63625084 64376733 65941089 67872752 68382978 70832735 73141968 74530709 75950473
3856 75950473 76337718 79985498 81840535 84471319 87430662 90795926 91617751 93425923
3848 93425923 95620951 98799533 101233763 101908078 103525036 104528758 105957138 108621665
3840 108621665 109428191 110806640 112736647 113609623 114702234 114319410 114563423 113715204 114057738
3831 114057738 114480833 113471164 112220035 110419859 109914509 106881400 105165835 104374926
3823 104374926 103548170 102413809 100098644 97683363 96485898 95055879 93999920 92043642
3815 92043642 90899150 90156663 91790174 91283020 89611601 88568084 89352259 90161592 90207134
3806 90207134 90228150 90270071 92159708 92417085 93351458 93596802 90476475 91124835 91516448
3797I1516448K2449J533417J58311J096804J653964Q24842J29582R99550j46145
3788I7789222K44377J03670o74534L74360j327463q82324j439685m045245m84861
3779H9657517n25143l236570m869018k173614m33122j208802j931711l772405
3771G1507132k316733j004945j451513j592470j895489k136292j937312k341770
3763E6830608k352204j461501n52941k409831j249600j647032r11053J68138k277336
3754D4137248j465852Q49489K0479k447270j088638J30884Q73476n09338j037965
3745C9462513j366597L5557n38610k008519o05362N99549O19714M48220j397593
3736C5248872O02686M60416p66139m74332k360042Q5260L423526q30131j635816
$$ plain form
3797 91516448 91538897 93072314 93230625 94327429 95981393 96806235 96935817 97935367 97789222
3788 97789222 98033599 98137269 97462735 97837095 96509632 95627308 94187623 90142378 89657517
3779 89657517 89132374 85895804 81026786 78853172 78420050 77211248 75279537 71507132
3771 71507132 69190399 68185454 66733941 65141471 63245982 61109690 59172378 56830608
3763 56830608 54478404 53016903 52463962 50054131 48804531 47157499 46246446 46414584 44137248
3754 44137248 42671396 43520885 43541364 41094094 40005456 40136340 41009816 40500478 39462513
3745 39462513 38095916 38131473 37592863 35584344 34978982 35578531 36198245 36646465 35248872
3736 35248872 35851558 36311974 35545835 35071503 32711461 32796721 36220247 35390116 33754300
3727C3754300J29376M38927N02931J021810o24345j069698J875594r05704j128665
3718C3994526N71486L37619o26841K10567K471447j213100l66891n70572J31764
3709C4940005R45541J65931Q13920l48310o68701J225966j335725L71826J532990
3700C7643443l08209J47230K75805L07919j86178J039485m34478N11764j61435
3691C8835346J772379N41936o58092p66754p01417K74195R6542P9062k4681l07720
3681C9140796J281974J002321R18830J486667R1924m45763O0904J412290k23180
3672D4726763J348572K11231j479793k17939m30428K689687j604610l80165m80253
3663D4383065Q8890L65078l43109O73565N53319j143525P68443Q56489P62338
$$ plain form
3727 33754300 33883676 34322603 34825534 35847344 35222999 34153301 36028895 35123191 33994526
3718 33994526 34566012 34903631 34276790 34487357 36958804 35745704 35378813 34808241 34940005
3709 34940005 35885546 36051477 36865397 36517087 35848386 37074352 35738627 36110453 37643443
3700 37643443 37335234 37482464 37758269 38066188 37880010 38919495 38485017 38996781 38835346
3691 38835346 40607725 41149661 40491569 39724815 39023398 39297593 39394135 39473197 39448516 39140796
3681 39140796 40422770 41425091 42343921 43830588 43922512 43476749 43537653 44949943 44726763
3672 44726763 46075335 46286566 44806773 44588834 44158406 46848093 45243483 44863318 44383065
3663 44383065 44471955 44837033 44493924 45167489 45720808 44577283 45345726 46202215 46964553
3654D6964553j473117j782032J64960Q82565Q8225J74016L35749j074754o07696
3645D3672469l0122J193797M50767j202596o6721J363035j216453k47345L02203
3636D4219034q543o1361P85931R9264K385146j099658r39517k98409k56378J043314
3626D5868823O56091p27811j157038Q91035J333303q20797K17468M58005K365920
3617D9084999L39063j287365P23033O35035J243698n66376q06126q56957L5183
3608D8544187P26648o9746J622648o7740j043315m74420k99748r37837J225126
3599D9225803J501339r62174j746392l67154K98998J092120l12903K42881j298523
3590D7673995Q36834P90782k251398j05390k64711L032102J26191J82006P43296
$$ plain form
3654 46964553 45491436 43709404 43874364 44756929 44845154 45019170 45354919 44280165 43672469
3645 43672469 43642347 44836144 45286911 44084315 44017594 45380629 44164176 43916831 44219034
3636 44219034 44210491 44149130 44935061 45034325 47419471 46319813 45380296 45081887 44825509 45868823
3626 45868823 46524914 45797103 44640065 45531100 46864403 46043606 46261074 46719079 49084999
3617 49084999 49424062 48136697 48859730 49494765 50738463 50172087 49365961 48509004 48544187
3608 48544187 49270835 49201089 50823737 50755997 49712682 49238262 48938514 48000677 49225803
3599 49225803 50727142 49764968 48018576 47651422 47950420 49042540 48729637 48972518 47673995
3590 47673995 48510829 49301611 47050213 46944823 46680112 49712214 49838405 50020411 50763707
3581E0763707j482931M87368Q08890m60093L96510k67775J84444L02818J385976
3572E2118914R61702M5523m77246p49446P33909j87799K005698J272577j02266
3563E5621566J102290r39693Q4509J898917J511062l97628j089895N75078J267253
3554E9633459o84883J509021R40077L44542P05400q18430Q3749K024139m18035
3545F3319039n58754J003353N34020P31941P5959j027784J451518J406867J260570
3536F8196729q12584J774188J601349J804902J096317r46514J516220J905552
3528G6136159K971658K790049J465533J269088J166462O44047L449848J311206
3520I1204050J736199K562418L112950K042641L876631J805416M88687L695487
$$ plain form
3581 50763707 49280776 49768144 50577034 50116941 50513451 50245676 50430120 50732938 52118914
3572 52118914 53080616 53126139 52648893 51899447 52633356 52445557 54451255 55723832 55621566
3563 55621566 56723856 55784163 55868672 57767589 59278651 58881023 57791128 58366206 59633459
3554 59633459 58948576 60457597 61397674 61742216 62447616 61629186 61712935 63737074 63319039
3545 63319039 62760285 63763638 64297658 65029599 65105558 64077774 65529292 66936159 68196729
3536 68196729 67384145 69158333 70759682 72564584 73660901 72714387 74230607 76136159
3528 76136159 79107817 81897866 83363399 84632487 85798949 86442996 89892844 91204050
3520 91204050 92940249 95502667 98615617 100658258 104534889 106340305 106828992 110524479
3512A10524479K616559L457242M970782L580207M499650M668195J481570M608545
3504A40407229N606125O400091N332239N736239P487167O920813R000409Q647185
3496A95537497Q359956Q625736J0318155J4528415J3554601J3593443J4115759
3489B78633562J5537120J8404823J7611914J9848762J9206008J9471556J7446111
3482D06159856J5438881J4573576J3072293Q735143N245104K974358J487005j686355
3474D65999861l981191q959493j0872093j4809034j6691951j9364125j9741326
3467C71580648j8301823j9582210j8270783j5330240j3138387j3717768j0860341
3460B62379096r068333r867159q813293o577362n533282o726642o855163m777941
$$ plain form
3512 110524479 113141038 116598280 121569062 125149269 129648919 134317114 135798684 140407229
3504 140407229 146013354 152413445 157745684 163481923 170969090 177889903 186890312 195537497
3496 195537497 203897453 212523189 222841344 237369759 250924360 264517803 278633562
3489 278633562 294170682 312575505 330187419 350036181 369242189 388713745 406159856
3482 406159856 421598737 436172313 449244606 457979749 463224853 466199211 467686216 465999861
3474 465999861 462018670 453059177 442187084 427378050 410686099 391321974 371580648
3467 371580648 353278825 333696615 315425832 300095592 286957205 273239437 262379096
3460 262379096 253310763 243443604 234630311 228052949 222519667 215793025 208937862 204159921
3452B04159921l157632k068159l946365k174526n64564j405671J88807K04375
3444A91236186J715403L801364K117224M573300M496344M085185N388689O232723
3436B23646418O286955Q089356N934412O207475M139291M417849O013726K779122
3428B67514604L12153j962667k777042k830799m016957o244335q178347o340378
3420B35476232n720172q057546o373440o936952o719758o364792o329357n188274
3412A83785941m830321l666275l776374k823594k927208k315924k186549j547310
3404A59712386n06825j48475n09895O56043n97094m34655m21151j422312j267648
3395A55060374o23556j415502K56599j155756l001327k851475m507769k536539
$$ plain form
3452 204159921 201002289 198934130 194987765 192813239 192248675 190843004 191031811 191236186
3444 191236186 192951589 196752953 198870177 203443477 207939821 212025006 217413695 223646418
3436 223646418 229933373 238022729 243957141 250164616 254303907 258721756 264735482 267514604
3428 267514604 267826757 265864090 263087048 260256249 256239292 249994957 241816610 235476232
3420 235476232 229756060 221698514 215325074 208388122 201668364 195303572 188974215 183785941
3412 183785941 178955620 175289345 171512971 168689377 165762169 163446245 161259696 159712386
3404 159712386 159205561 159057086 158547191 159203234 158606140 158171485 157750334 156328022 155060374
3395 155060374 154436818 153021316 153277915 152122159 149120832 146269357 141761588 139225049
3387A39225049k907935k592910j468775j567064k072529k849086j683670q32428
3379A23250652m22135M76469l49247j433357o32782q29808r62163O28002P15922
3370A20441553p21691p78130Q43990O73658Q54365L33870J172558j335602J263320
3361A22747891J961207J774485K088665K273258J236782J043156L790423K135358
3353A39051225K256013K949053K247407J260350K374272L722817L903088L362514
3345A61126739L918441J742423L731667M923372M469932N374903N109404N621526
3337A96018407P733299Q027212O981126P377926O438418O630349L797459L233695
3329B46237891J874486K2151m590488n416574p650661q789770q947672r842174
$$ plain form
3387 139225049 136317114 133724204 132255429 130688365 128615836 125766750 124083080 123250652
3379 123250652 122828517 123304986 122955739 121522382 120889600 120059792 119097629 119725631 120441553
3370 120441553 119719862 118941732 119785722 120459380 121313745 121647615 122820173 121484571 122747891
3361 122747891 124709098 126483583 128572248 130845506 132082288 133125444 136915867 139051225
3353 139051225 141307238 144256291 146503698 147764048 150138320 153861137 157764225 161126739
3345 161126739 165045180 166787603 170519270 175442642 179912574 185287477 190396881 196018407
3337 196018407 203751706 211778918 218760044 226137970 232576388 239206737 243004196 246237891
3329 246237891 248112377 248134528 243544040 238127466 230476805 221687035 212739363 202897189
3321B02897189j0486904j1753537q426773o566270o583864p177132p195358m691456
3313A40015895n220834m015383k897326k199360l110596k728538o0032j051804
3305A18732022p3551j862042k385071J586964J078642O64219J13816N12443K426435
3296A20793877J517706K495910N54738L255157L460635K777810M033252M593215
3288A43482300O197924M164739M212473O075612O324626N350376O195643O945413
3280A88949106O693233O823377L674651K088481J970512P42503J145179j399176
3272B10687866l074245l075649l239809k646352k683865j398735k651000j511646
3264A90406565j278258Q43849J766985J590890K088326J788121K989563K366144
$$ plain form
3321 202897189 192410285 180656748 172229975 165663705 159079841 151902709 144707351 140015895
3313 140015895 134795061 130779678 127882352 125682992 122572396 119843858 119783826 118732022
3305 118732022 118658471 116796429 114411358 115998322 117076964 117741183 117854999 118367442 120793877
3296 120793877 122311583 124807493 125362231 128617388 132078023 134855833 138889085 143482300
3288 143482300 149680224 153844963 158057436 164133048 170457674 175808050 182003693 188949106
3280 188949106 195642339 202465716 206140367 208228848 210199360 210941863 212087042 210687866
3272 210687866 207613621 204537972 201298163 198651811 195967946 194569211 191918211 190406565
3264 190406565 189128307 189972156 191739141 193330031 195418357 197206478 200196041 202562185
3256B02562185L452649J433772l215293l693354m222110o181406o201695p922587
3248A76012161j0494873q970286j0157921r144532p379928p230126o713273n506566
3240A10414656o499298m536643l803634l718262l562569l797648j445190k649501
3232H0401911k894982j121110j743275j951322j465950l380167k476608k198827
3224F3169670j38481m13821l45291k297450l257734o51919k100109n37531j22769
3215E3304565k476346r21082j533173j365597m02739k08492m35164k038182j864124
3206D2059666r66152p08678o63587n24734j56740r60939j066447o66087q97851
3197C5448451O81119o67518o44671q87030j462686o04520J188873j433430J246533
$$ plain form
3256 202562185 206014834 207448606 204233313 200539959 196317849 190136443 183934748 176012161
3248 176012161 165517288 156547002 146389081 137244549 129864621 122634495 115921222 110414656
3240 110414656 103915358 99378715 95575081 91856819 88294250 84496602 83051412 80401911
3232 80401911 77506929 76385819 74642544 72691222 71225272 67845105 65368497 63169670
3224 63169670 63031189 62617368 62272077 59974627 56716893 56064974 53964865 53427334 53304565
3215 53304565 50828219 49907137 48373964 47008367 46605628 46397136 45961972 43923790 42059666
3206 42059666 41093514 40384836 39721249 39196515 39039775 38078836 37012389 36346302 35448451
3197 35448451 36129570 35462052 34817381 33930351 32467665 31863145 33052018 31618588 32865121
3188C2865121L84369j846250j273932n64194J705379q3531J58217L59976J820776
3179C3525931p8002j474284m03100L078551J708986K04310O3810R54158l02063
3170C7278297J458999J168350J283874J823493J800531J795437K254420o46742
3162D8216659J921439L289641q63065Q63281M96914J58297K90453k165695j769008
3153E0438916J641227J110998J740416k94017j25864q34916m24674O39202J027359
3144E4918647J003605J78860P52543K799662K175919K521254K660502L139568
3136G0150560K521489N763872M824013K815261K848388j4311n85179n151309o659901
3127G6512883p122573n982220k942704l657005l765595l798884k706793k295682
$$ plain form
3188 32865121 33249490 31403240 30129308 29565114 31270493 31186962 31345179 31705155 33525931
3179 33525931 33447929 31973645 31570545 34649096 36358082 36562392 36626202 37580360 37278297
3170 37278297 38737296 39905646 41189520 43013013 44813544 46608981 48863401 48216659
3162 48216659 50138098 53427739 52564674 53427955 53924869 54083166 54373619 52207924 50438916
3153 50438916 52080143 53191141 54931557 54637540 54511676 53676760 53252086 53891288 54918647
3144 54918647 55922252 56101112 56853655 59653317 61829236 64350490 67010992 70150560
3136 70150560 72672049 78435921 83259934 86075195 88923583 88909272 88324093 83172784 76512883
3127 76512883 69390310 63408090 60465386 56808381 53042786 49243902 46537109 44241427
3119D4241427j793893n3151j720824k420219Q2969p90912k24029j277204k05434
3110C5838730O49867L14504Q16256P07867K203425J09893r34182K05998q7724
3101C9824634l74704j008761j262206j453320k436298k765712J70367j011134
3093B9682866l903398k186843r19115R4046j460353j192562p44772j938111j131207
3084A6300551M02747r06511p63184j368799K44014o00765j260969p15495Q49606
3075A2181195O36399o68880j18438q9303j094490J028960p76816M98631J17302
3066A1714560k013334k06692k94339J95781Q55268R11412L97805k612913l61557
3057H585991j31814j401854M79404K39183J607087j81131p46991l86191r56332
$$ plain form
3119 44241427 42447534 42394383 40673559 38253340 38336309 37545397 37321368 36044164 35838730
3110 35838730 36488597 36803101 37619357 38327224 40530649 40640542 39706360 39912358 39824634
3101 39824634 39449930 38441169 37178963 35725643 33289345 30523633 30694000 29682866
3093 29682866 25779468 23592625 22673510 22767556 21307203 20114641 19369869 17431758 16300551
3084 16300551 16703298 15796787 15033603 13664804 13908818 13308053 12047084 11331589 12181195
3075 12181195 12817594 12148714 12030276 11940973 10846483 11875443 11098627 11597258 11714560
3066 11714560 9701226 9494534 9200195 9395976 10251244 11162656 11560461 8947548 8585991
3057 8585991 8454177 7052323 7531727 7770910 9377997 9196866 8449875 8063684 7107352
3048G107352O46386p36959l96771M67764k61803J612461n72161j353426j65509
3039F347334K61830J145806N7577j752167j854571P08891P64137j127725r1056
3030D460056K37818o67344M00564k64679K05375K4463j94701K56862J106518l35682
3020E229250j002704Q67341p2273P67242K53989K94409l50569j075349p35928
3011D175408J685968m65105l074739R63121J980002q73356P18935k523747J929839
3002D516326J188346j208135j105997K04281J119282J771317n11646r10102p41585
2993D322087R69747o43179o60174j651352J424270J325672r99368M17824m04225
2984D101302J000489l13316o53591r54753K40486J049626P19119n75060j499078
$$ plain form
3048 7107352 7753738 7016779 6620008 7087772 6825969 8438430 7866269 6512843 6347334
3039 6347334 6609164 7754970 7812547 6060380 4205809 4914700 5678837 4551112 4460056
3030 4460056 4697874 4030530 4431094 4166415 4371790 4396253 4201552 4458414 5564932 5229250
3020 5229250 4226546 5093887 5021614 5788856 6042845 6337254 5986685 4911336 4175408
3011 4175408 5861376 5396271 2321532 3284653 5264655 4391299 5110234 2586487 4516326
3002 4516326 5704672 4496537 3390540 3594821 4714103 6485420 5973774 5063672 4322087
2993 4322087 5291834 4648655 3988481 2337129 3761399 5087071 4087703 4505527 4101302
2984 4101302 5101791 4788475 4134884 3180131 3420617 4470243 5189362 4614302 3115224
2975C115224M42084J451200j783870l05544m83379P33039m39865q54316J163234
2966C037807O53381o68445n84454L19370P81739J140310j229947j896796O19546
2957B172511k45302N73459n77027n87395Q72348J986036j049090p43802k080340
2948C21398r6557J559179M11550J04197J009671j197651L18172J359183q26098
2939B963044r0808k158265o76708Q41736Q31768R26952j639744n20058P2224K54134
2929H04275N49222l58481k38429p29216O35628J88032M35454Q75753k107422k73677
2919b18861J425600J596201O12614j844467k44143N40421l9839K67046q45915
2910A248657P56684m34309K36037J661711J57466r13357j513200m97572q04157
$$ plain form
2975 3115224 3557308 5008508 3224638 2919094 2435715 3168754 2728889 1874573 3037807
2966 3037807 3691188 3022743 2438289 2757659 3539398 4679708 3449761 1552965 2172511
2957 2172511 1927209 2500668 1923641 1336246 2208594 4194630 3145540 2401738 321398
2948 321398 224841 1784020 2195570 2299767 3309438 2111787 2429959 3789142 2963044
2939 2963044 2872236 713971 37263 878999 1710767 2637719 997975 477917 550141 804275
2929 804275 1353497 995016 756587 27371 662999 851031 1286485 2162238 54816 -218861
2919 -218861 1206739 2802940 3415554 1571087 1326944 1867365 1827526 2094572 1248657
2910 1248657 2005341 1571032 1807069 3468780 3626246 2712889 1199689 702117 -102040
2901a02040J093393J593957l75691m39503k95694J165822m27588r96692l93752
2892H22212K30864J298446o79907j026109M46161j042044J091888J574719k01633
2883B514597o89184j688740P32538r25191l105L07150J633754m29394q07141J142069
2873A787353K20116M2791P03399o81645K86072j187714P11858J363299N43474
2864C789003q8913N72656r26489j389299J66274Q8984M43940M24422j983574m09352
2854F87652R74431L86472J669930P8012l59740j764443M7372M72138k27643L15137
2844B279318k7013R03686j929513Q24319N14221k028275J105163j06945k41501
2835A293460j93307j739775K324886J43383j289342P52890o91190J631761q67831
$$ plain form
2901 -102040 991353 2585310 2209619 1770116 1474422 2640244 2212656 1215964 822212
2892 822212 1053076 2351522 1671615 645506 1091667 49623 1141511 2716230 2514597
2883 2514597 1825413 136673 869211 -55980 -59085 248065 1881819 1452425 645284 1787353
2873 1787353 2007469 2050260 2753659 2072014 2358086 1170372 1882230 3245529 3789003
2864 3789003 3700090 4272746 3346257 1956958 2123232 2212216 2656156 3080578 1097004 687652
2854 687652 1662083 2048555 3718485 3796497 3436757 1672314 1719686 2191824 1964181 2279318
2844 2279318 2252305 3155991 1226478 2050797 2565018 536743 1641906 1534961 1293460
2835 1293460 1100153 -639622 1685264 1828647 539305 1292195 601005 2232766 1364935
2826A364935j243984K255965N70316q01438j269649p65648R46547K85507J15218
2817A457769k22682K11774j327671j14603J471920P38637N56684J8115j749559
2808A040384L70717j27593J30267R49751j273394j281769j65473K37511J355954
2799A236355o47370O41583N51367j10914k30698N35121J288005p88278P3827q00758
2789A748240j447584J960793k85475k45763j665872l14763J879589p97093l64519
2780D67553p94240L42701n96678J201517M40464n82569J300124l80493L04086
2771A702465L89385k030536O36061j063918J498889L94647J293059n3519j814198
2762I52335l87529q09239O5578O03838j012139Q57502M50995m40260p36231J71689
$$ plain form
2826 1364935 120951 2376916 2947232 2145794 876145 110497 1057044 1342551 1457769
2817 1457769 1235087 1446861 119190 4587 1476507 2215144 2771828 2789943 1040384
2808 1040384 1411101 1283508 1413775 2363526 1090132 -191637 -357110 -119599 1236355
2799 1236355 588985 1230568 1781935 1671021 1440323 1975444 3263449 2475171 2548998 1748240
2789 1748240 300656 2261449 1975974 1730211 64339 -250424 1629165 832072 467553
2780 467553 -326687 16014 -580664 620853 1061317 478748 1778872 1398379 1702465
2771 1702465 2091850 61314 697375 -366543 1132346 1526993 2820052 2766533 952335
2762 952335 564806 -244433 -178855 424983 -587156 270346 721341 281081 -455150 -283461
2752b83461J208873j085751K88409m19539J047920m38582j166828J873579l00170
2743G24450n71586J616458K50383l5768m021935j48001J484840L259972J894j594158
2733I66549p06928j43569N57392m06224j55211l86918Q58732j537412k98163J168769
2723h2983P888J266398l03478k185086K046400R12071L62885R8809j39673o18376
2713A364855k83938j47285m1994J228555r86966P64585K25313m06298l82776j166142
2703A67909N93175M5687J25026K999748q51664o40366j986402l54690J765592
2694A864015j264663k49153J483973L38859j429812j283476K35725J134335J258193
2685B087996j42829j692115l50261l0008J339431L69025o12945N96562J197037
$$ plain form
2752 -283461 925412 -160339 128070 -291469 756451 317869 -848959 1024620 724450
2743 724450 152864 1769322 2019705 1983937 -2037998 -2185999 -701159 2558813 2560707 966549
2733 966549 259621 116052 673444 267220 112009 -274909 583823 -953589 -1251752 -82983
2723 -82983 -75095 1191303 887825 -1297261 749139 1661210 2024095 2122904 1983231 1364855
2713 1364855 1080917 933632 891638 2120193 1133227 1897812 2123125 1716827 1334051 167909
2703 167909 761084 806771 931797 3931545 3079881 2439515 453113 98423 1864015
2694 1864015 599352 350199 1834172 2173031 743219 -540257 -304532 829803 2087996
2685 2087996 1945167 253052 -97209 -127217 1212214 1581239 968294 1564856 2761893
2676B761893J07032j031697j599015O5606P98767J53526j72331o52600k61504
2667A69677O05225r60090o19068R82828J805019r15367p41240j357068r5761K069232
2657I43387j27772j6278q82699k13287P85260L82258j604551q53464J631734O33158
2647F77746k94923O42505j136491l86569o68573O1446K016696m00702M22930K7195
2637I61260o73136j208923M91695J268672K37817k98710O14062r63192K36982
2628F66527q1543M80986J530406m86129r71036P70833p12878J019817k39328J235014
2618C212669N72611n86845q42694j680323P12800j359427M386J104241k211738
2609a074320J748253j91149R05530Q5776j635981M02084m54893J252536K46706
$$ plain form
2676 2761893 2868925 1837228 238213 303819 1102586 1256112 1083781 431181 169677
2667 169677 774902 -185188 -804256 178572 1983591 1068224 326984 -1030084 -1125845 943387
2657 943387 815615 799337 -83362 -296649 488611 870869 -733682 -1587146 44588 677746
2647 677746 382823 1025328 -111163 -497732 -1166305 -1104859 911837 511135 934065 961260
2637 961260 288124 -920799 -429104 839568 1077385 778675 1392737 429545 666527
2628 666527 584984 1065970 2596376 2110247 1139211 1910044 1197166 2216983 1977655 3212669
2618 3212669 3785280 3198435 2355741 675418 1388218 28791 33177 1137418 -1074320
2609 -1074320 673933 482784 1388314 1474090 -161891 240193 -214700 1037836 1284542
2600A284542l98007r90723R6261R25494J204211n40314k61953n11318R22224k274987
2590e44570l33773R8667J905978o86794j288970o98742J097564q86528k70058
2581a607226J328225l97762O54857P00628m73603L52624J90159O34330J8595M04232
2571A805059N92554k40649J38782k013395j064825P29014K88960Q40164j593616
2562e17952J343285J402246q44327q22923j696919o80300N74007J564201M08915
2553G30233L49626o89090n40077k60598J11076o6026J423154O77972K52065j513678
2543D74657P73627L87413N02118O68874m75800j255912j340821P1956M68075p25596
2533d51409o80292R00929J520490O39232l81212m46709m24884o07967j82511j46224
$$ plain form
2600 1284542 886535 -104188 -7927 917567 2121778 1581464 1319511 808193 1730417 -544570
2590 -544570 -878343 -779676 1126302 439508 -849462 -1548204 -450640 -1337168 -1607226
2581 -1607226 -279001 -676763 -21906 678722 205119 557743 747902 1382232 1400827 1805059
2571 1805059 2397613 2156964 2295746 282351 -782474 -53460 235500 1075664 -517952
2562 -517952 825333 2227579 1383252 560329 -1136590 -1816890 -1242883 321318 730233
2553 730233 1079859 390769 -149308 -409906 -298830 -364856 1058298 1736270 1988335 474657
2543 474657 1248284 1635697 2137815 2806689 2330889 1074977 -265844 -193888 274187 -451409
2533 -451409 -1131701 -230772 1289718 1928950 1547738 1101029 676145 68178 -114333 -260557
2523b60557O86269P98714J21291j309711N24104j37107L79937p57410m76928P48664
2513C17266K58547m23247l13689j65771j71822K76781O31912N48720r4460k57695
2503F06542q30236L10254O52244k11115O6706R47683N67477r49130p71364O35174
2493A024235L07638N58673j316681J427804l14725l33381Q3775M34818J84347
2484B056503M70904k02778q01940m54629O68769P08586q97485r17327K68881q03879
2474I5605J057096K247512j473921N79668J91763n09620J1401j009647R13013
2465B102870O97100J208109N12332l46855j754205k196310n14158J891648N79769
2456B180300J047287r77959L30837N81786j851362J144244j13271n40387J032874
$$ plain form
2523 -260557 425712 1224426 1345717 36006 560110 423003 802940 45530 -431398 317266
2513 317266 575813 152566 -161123 -326894 -498716 -221935 409977 958697 864237 606542
2503 606542 -223694 86560 738804 527689 594395 1542078 2109555 1160425 389061 1024235
2493 1024235 1331873 1890546 573865 2001669 1686944 1353563 1437338 1872156 2056503
2484 2056503 2527407 2324629 1522689 1068060 1736829 2445415 1547930 630603 899484 95605
2474 95605 1152701 3400213 1926292 2505960 2697723 2188103 2199504 1189857 2102870
2465 2102870 2799970 4008079 4520411 4173556 2419351 223041 -291117 1600531 2180300
2456 2180300 3227587 2249628 2580465 3162251 1310889 2455133 2341862 1801475 2834349
2447B834349K102614r50634M19371j550997o75121n32832j110003R82299J991824
2438C510870N0517P41447N50584j736564J506507K07028M71538R66993j791075
2429D477845p37832O39313O13166P3242q91544j921090J256472R02243l8744j155447
2419C217624J00168P16748M52662P01221j204003J06171p2215M54812o81276O37687
2409D429599M75852L49687n40124o77461Q1926O80223j52762p66251Q0540M08141
2399D369370Q92315k18751j06219o09660J199513J80337J81603R19008L33157
2390G140673o7594P54405M7865l15026j31642j763484j18011J939650R39163L69688
2380H795687k89558J374602O30765K67077j47825R00412J269842P46289j339669
$$ plain form
2447 2834349 4936963 3986329 4405700 2854703 2179582 1646750 536747 1519046 3510870
2438 3510870 3561387 4302834 4853418 3116854 4623361 4830389 5301927 6268920 4477845
2429 4477845 3740013 4379326 4992492 5065734 4174190 2253100 3509572 4411815 4373071 3217624
2419 3217624 3317792 4034540 4487202 5188423 3984420 4090591 4018376 4473188 3791912 4429599
2409 4429599 4905451 5255138 4715014 4037553 4119479 4799702 4646940 3880689 3961229 4369370
2399 4369370 5261685 5042934 4936715 4327055 5526568 5706905 5888508 6807516 7140673
2390 7140673 7073079 7827484 7875349 7560323 7428681 5665197 5547186 7486836 8425999 8795687
2380 8795687 8506129 9880731 10511496 10778573 10630748 11531160 12801002 13547291 12207622
2371A2207622r75366K175617J848353Q49067J495795n68893n34968j421272J550838
2362A6626793L784584R4801k10613N49143M45399J853042K212075J506878J018120
2353B7880222Q57763K851415L178645J526108K132147J339910N212788N705718
2345E0684716M331334N138852M677929O701261O432817P136816P914030R514078
2337A02531833J2004876J6063995K0727968K4556480K5595412L1112071L1151319
2330B63743954L2062098K5394649J2209270p985348k8152900m1263987m3616087
2323B12391649m0224072l0707332k3704170j8411164j3967385r094258n548113
2316G0735155o342283n820556m960155l837509j062239l628364l214867k025261
$$ plain form
2371 12207622 11232256 13407873 15256226 16105293 17601088 17032195 16497227 15075955 16626793
2362 16626793 20411377 20506178 20295565 20844708 21290107 23143149 25355224 26862102 27880222
2353 27880222 28737985 31589400 34768045 36294153 38426300 39766210 44978998 50684716
2345 50684716 55016050 60154902 64832831 71534092 77966909 85103725 93017755 102531833
2337 102531833 114536709 130600704 151328672 175885152 201480564 232592635 263743954
2330 263743954 295806052 321200701 333409971 325424623 297271723 256007736 212391649
2323 212391649 172167577 141460245 117756075 99344911 85377526 76283268 70735155
2316 70735155 64392872 58572316 53612161 49774652 48712413 45084049 41869182 39843921
2308C9843921m140740k517226j929176l650332k483676j520964p5074q99113k052548
2299B0575072q11818k133566r17642k73170l43335k28007r65975j029679L46448
2290A4218328k56736j307896q46810N05616j151214J693860j792115n21691R35485
2281A1476827j286770k9710n97239o53905J05660j906328m61083L12013j015936
2272E943529K39290p02460l67743J86139R33899r33101m30103n7605L60949O61025
2262E833819Q85020j21101m50606q63783j213791j228350N79667P02021l0193
2253D092703k51241k52225P23458p88522l12611J280102j923103j68916J875448
2244D275093j069497q06j245956r98354N71215J447239l79545j015338j70707
$$ plain form
2308 39843921 35703181 33185955 31256779 27606447 25122771 23601807 23526733 22627620 20575072
2299 20575072 19763254 17629688 16712046 16438876 16095541 15867534 14901559 13871880 14218328
2290 14218328 13961592 12653696 11806886 12312502 11161288 12855148 11063033 10541342 11476827
2281 11476827 10190057 10160347 9563108 8909203 9014863 7108535 6647452 6959465 5943529
2272 5943529 6182819 5480359 5112616 5298755 6232654 5299553 4869450 4811845 5172794 5833819
2262 5833819 6718839 6597738 6147132 5283349 4069558 2841208 3420875 4122896 4092703
2253 4092703 3841462 3589237 4312695 3524173 3211562 4491664 2568561 2399645 4275093
2244 4275093 3205596 3204790 1958834 960480 1531695 2978934 2599389 1584051 1413344
2235A413344L72223J27589J008897q96450q99186J78123P38799N36571J3686j846075
2225G47521m41094o25068J04302O93542Q43577M99700J350629J89844j458063
2216A904890L17965j92564p44729M45699N22792Q71764k51453j154215K21564
2207A941713o33221M05205n31822j135053R96864m10258r05680j78038L4426q81340
2197a297204n22791J194643O94794j605913n6131k13315L33029J158010K83783
2188c1095j112524J210351K96235m55226J76570n36547o85543l89467J254634
2179b72612P47395j096089k33979J493097r33833k16090n72446J037165J049958
2170A002566q95739j70813q41953p32790R73423J81213L00774M774K28691n86801
$$ plain form
2235 1413344 1785567 1913156 2922053 2025603 1126417 1304540 2043339 2579910 2593596 747521
2225 747521 306427 -318641 -214339 479203 1322780 1822480 3173109 3362953 1904890
2216 1904890 2222855 2030291 1285562 1731261 2254053 3125817 2874364 1720149 1941713
2207 1941713 1308492 1713697 1181875 46822 1043686 633428 -272252 -450290 -415864 -1297204
2197 -1297204 -1819995 -625352 69442 -1536471 -1592602 -1805917 -1472888 -314878 -31095
2188 -31095 -1143619 66732 362967 -92259 84311 -452236 -1137779 -1527246 -272612
2179 -272612 474783 -621306 -855285 637812 -296021 -512111 -1084557 -47392 1002566
2170 1002566 106827 -63986 -905939 -1638729 -665306 -484093 -183319 -178545 50146 -536655
2160e36655O90717r89107n70326J728090l98641o7798j25578P42281j148988l96076
2150a072081N65505N60577J212889p88196r75406k23513l1005J540709O67103
2141A456582j976362p00230l84151K037726n18572J35715Q04613j66185r43919
2132b54783j388466M52464J070175m9528j540894q07809J376131J890553K83648
2123A031491p28580k087557k2959P68897K27947j207740j976445J873170J113537
2114a008239J153243q32886j87340L53522k2328j012901L52233K97105J37413
2105g70178r7268Q37420j439161j217498J370434M87283K81259J220589j583819
2096i10939Q1997k23231l13032K135836K85281M19869p59730j557126J062847
$$ plain form
2160 -536655 154062 -835045 -1405371 322719 -75922 -143720 -269298 472983 -676005 -1072081
2150 -1072081 -506576 54001 1266890 478694 -496712 -720225 -751230 789479 1456582
2141 1456582 -519780 -1220010 -1604161 433565 -85007 50708 855321 689136 -254783
2132 -254783 -1643249 -1190785 -120610 -170138 -1711032 -2518841 -1142710 747843 1031491
2123 1031491 302911 -1784646 -1807605 -1038708 -810761 -2018501 -3994946 -2121776 -1008239
2114 -1008239 145004 -687882 -875222 -521700 -544028 -1556929 -1204696 -907591 -770178
2105 -770178 -867446 -30026 -1469187 -2686685 -1316251 -828968 -547709 672880 -910939
2096 -910939 -828942 -1052173 -1365205 770631 1055912 1475781 716051 -841075 221772
2087B21772O72932j048957j893372J17550J841215J459325k20731j753650K29146
2078c74770R53491N79017j014911M53380K0930L47737o80292r96608N67582l1755
2068a76199O47888O25102j356468N17503J179654j05075j219922j466971O80574
2059f73914J834550Q98609j7716j468317N47904m38026J54115j137782N40814
2050B40237q42294k31006Q50195k76852M72648N82150j070170J80588O72601K86714
2040H64811M7742o68115J592652K23248j021308k18654R2508J265812l50235j120323
2030G08138j310879P0609j20877J829237j071046o53539R15545J245356L5271
2021A647815r41305l20496M13326j83743m06447M95328O83305Q61826j542189
$$ plain form
2087 221772 894704 -154253 -2047625 -1930075 -88860 1370465 1149734 -603916 -374770
2078 -374770 578721 1157738 142827 596207 617137 964874 284582 -712026 -144444 -176199
2068 -176199 471689 1096791 -259677 257826 1437480 1332405 112483 -1354488 -673914
2059 -673914 1160636 2059245 2041529 573212 1121116 683090 837205 -300577 240237
2050 240237 -602057 -833063 17132 -259720 212928 795078 -275092 -94504 578097 864811
2040 864811 912553 244438 1837090 2060338 1039030 820376 912884 2178696 1828461 708138
2030 708138 -602741 -532132 -653009 1176228 105182 -548357 367188 1612544 1647815
2021 1647815 706510 386014 799340 615597 209150 704478 1387783 2249609 707420
2012G07420P33637q84169n63032J774492j421629p01453R22157q05491M74965
2003B36897q22500r23949O39621J414470L12596q95753O65078j104205p4499p07913
1993a260157P55856J827486n14474o39897j809945J162023J322254j470725M7868
1984e79711K5992o3268K280437n81407K27225o46567j157563p9007P2812q31498
1974a332555K15239l60157J306421p23162j392562j74985N9348J170106O99117
1965e33190j174351P50304J25923p72248n69370P78946R13752N09728j861042
1956a831548n72845J200067p2550N106j11062K08208J162947P0052l67056o91205
1946i99886j195441K312180k86751o96613j532176n31296J952666J715137j83061
$$ plain form
2012 707420 1441057 556888 -6144 1768348 346719 -354734 567423 -238068 236897
2003 236897 -585603 -1509552 -869931 544539 857135 -38618 626460 -477745 -552244 -1260157
1993 -1260157 -504301 1323185 808711 168814 -1641131 -479108 843146 -627579 -579711
1984 -579711 -553719 -616987 1663450 1082043 1309268 662701 -494862 -573869 -501057 -1332555
1974 -1332555 -1117316 -1477473 -171052 -894214 -2286776 -2461761 -2402413 -1232307 -533190
1965 -533190 -1707541 -957237 -831314 -1603562 -2172932 -1393986 -480234 29494 -1831548
1956 -1831548 -2404393 -1204326 -1276876 -1271770 -1382832 -1174624 -11677 58375 -308681 -999886
1946 -999886 -2195327 116853 -169898 -866511 -2398687 -2929983 -977317 737820 554759
1937E54759q04890j44115M57909j026016n28719J705293L44542j858055k36368
1928a535660M59930R59474r25028r84932J391905J882289n66203k176987m05229
1919a900441n9649J691904M26262j039024L54920k70542l15058r07669q00066
1910b819363J177484N30015l44051j725822P59303J530854j220796L0798p03753
1901b785331J60629J414729o17293j685887j298329J150797K063938J728901j348050
1892a215896o47500J421579n76074j008372J125801J01356n36479p23710R00907
1883a158388J122874j01017j505476o74K405559o09099q56137n99963p78356k64743
1873b345420Q37632l64856J679488p35871p39156J974598j6748j376822J329384
$$ plain form
1937 554759 -250131 -394246 63663 -962353 -1491072 214221 558763 -1299292 -1535660
1928 -1535660 -1075730 -116256 -1041284 -2026216 -634311 1247978 681775 -1495212 -1900441
1919 -1900441 -1960090 -268186 158076 -880948 -526028 -796570 -1111628 -2019297 -2819363
1910 -2819363 -1641879 -1111864 -1455915 -3181737 -2422434 -891580 -2112376 -2081578 -2785331
1901 -2785331 -2624702 -1209973 -1827266 -3513153 -4811482 -3660685 -1596747 132154 -1215896
1892 -1215896 -1863396 -441817 -1017891 -2026263 -900462 -799106 -1335585 -2059295 -1158388
1883 -1158388 -35514 -136531 -1642007 -1642681 762878 153779 -702358 -1302321 -2080677 -2345420
1873 -2345420 -1507788 -1872644 -193156 -929027 -1668183 306415 289667 -1087155 242229
1864B42229j29087J46029m63891k43668J472929Q30125q39900j751549p420N83719
1854a60484J616839j220489k114933K78816J017802J055823p299n22665N81356
1845E24766K62364k025255q31111J082960J63406N38640J8456j08678K09520O02437
1835D37505J78742m45298m35997K3783J002630Q28582j160552Q75757K75249j381335
1825A99066j677420O19277k68051P61149o68420j14068J037745O7721k00645o70014
1815i13660j411081J259592M88840J053810L20779Q4388J034451n89654Q1754
1806A409219k509251J191861L43513j484510J659074j12347O80048n25664r66088
1797c14145Q82133j922489K16249L04178Q06357p68744j660816J162008L58624
$$ plain form
1864 242229 113142 259171 -204720 -448388 1024541 1854666 1014766 -736783 -744203 -160484
1854 -160484 1456355 235866 -1879067 -1600251 -582449 473374 466075 -56590 524766
1845 524766 787130 -1238125 -2069236 -986276 -822870 -284230 -265774 -374452 -164932 437505
1835 437505 616247 170949 -265048 -241265 761365 1589947 429395 1305152 1580401 199066
1825 199066 -1478354 -859077 -1127128 -365979 -1034399 -1148467 -110722 -43001 -243646 -913660
1815 -913660 -2324741 -1065149 -576309 477501 798280 882668 1917119 1327465 1409219
1806 1409219 -1100032 91829 435342 -1049168 609906 497559 1177607 651943 -314145
1797 -314145 567988 -1354501 -1138252 -834074 -27717 -796461 -2457277 -1295269 -936645
1788i36645J502250J339122j014467k3021q19855k63868Q45074r31785p24606
1779a027801J458497n39504q07596n12071J905262N39832K8011j645729j173728
1770a774827J091157L337l62195L394060j321796j981502o00986k39607J094192
1761f98167j05218P02514q61035j418293K38571K77787K876592R25868j518756
1752D19863j344688l46895J085833k59878J6840J032303k76830n78790K77537
1743B5295M24331n98117j33797J681635j488973N10978M57353o67550j398676
1734a187521l04447r44477K08108J286228J7173N59171j113136j444098m21587
1725c344586J619316L17513q7258R8024m3663J129701n15279p82861J219221M13854
$$ plain form
1788 -936645 565605 1904727 890260 867239 47384 -216484 628590 -303195 -1027801
1779 -1027801 430696 -108808 -916404 -1428475 476787 1016619 1044630 -601099 -1774827
1770 -1774827 -683670 -680333 -1042528 2351532 1029736 -951766 -1552752 -1792359 -698167
1761 -698167 -803385 -100871 -961906 -2380199 -2141628 -1863841 1012751 1938619 419863
1752 419863 -924825 -1271720 -185887 -445765 -428925 603378 326548 -252242 25295
1743 25295 449626 -148491 -282288 1399347 -89626 421352 878705 211155 -1187521
1734 -1187521 -1491968 -2436445 -2228337 -942109 -924936 -365765 -1478901 -2922999 -3344586
1725 -3344586 -1725270 -1407757 -1495015 -1396991 -1440654 -310953 -826232 -1609093 -389872 23982
1715B3982K83420K49333k65170j227772r49507J769621J94717R80011k77625K69821
1705A050831j468577J6540N3027p40756j77021l83915L62249R9731q02748J084501
1695i06138N09203Q83968j049554o03434O44679L19915O98520o93974J416862
1686A220047N66336n88524L33051k197622M82184l70575J836094k40556j452550
1677d12115M23382n90917j94316m04715n10797Q43281J445564N25887j533918
1668d08664j450772m51036M98516N67045J102824l9096p27625R99701R88908r4917
1658I84884j954402j037139O91754J450367K58125q04208j390127J182328j156529
1649a774947R90172j297771J278032J178261n20191j544345j415796K217231K177360
$$ plain form
1715 23982 307402 556735 291565 -936207 -1885714 -116093 78624 1058635 781010 1050831
1705 1050831 -417746 -401206 -348179 -1088935 -1265956 -1649871 -1287622 -1187891 -1990639 -906138
1695 -906138 -396935 487033 -562521 -1165955 -521276 -201361 497159 -196815 1220047
1686 1220047 1786383 1197859 1530910 -666712 -184528 -555103 1280991 1040435 -412115
1677 -412115 11267 -579650 -773966 -1178681 -1689478 -846197 599367 1125254 -408664
1668 -408664 -1859436 -2310472 -1811956 -1244911 -142087 -181183 -908808 90893 1079801 984884
1658 984884 -969518 -2006657 -1314903 135464 393589 -410619 -1800746 -618418 -1774947
1649 -1774947 -784775 -2082546 -804514 373747 -146444 -1690789 -3106585 -889354 1288006
1640A288006j515417n29329j131234J318997p42450p10861R03761O34811K07777
1631b75939n67762M10650L77291J75355J044417r21299j293022m17414r1913J577169
1621A7533O00167p80725l53960K7583r59464M64355R15099J65625J27951P15624
1611I39788o06376n58357P5265r51284O04906L75708p26431O90800q88349J53388
1601h90942k15365J34778Q01081n26734m34K555654m38821j977421k863827L63237
1591c058794K561076J143051j05029j554699n41191K06177k08106N97837K86120
1582f73558K61411j72374o63205P76725m65229k5446O52511K47845j15964o78269
1572h55553J646108j033936n25433J171829n0908K68467j279345n64265j29373
$$ plain form
1640 1288006 -227411 -756740 -1887974 -568977 -1311427 -2022288 -1118527 -483716 -275939
1631 -275939 -843701 -433051 -55760 119595 1164012 242713 -1050309 -1467723 -1559636 17533
1621 17533 617700 -163025 -516985 -489402 -1448866 -984511 -69412 96213 224164 939788
1611 939788 333412 -224945 -149680 -1100964 -496058 -120350 -846781 -155981 -1044330 -890942
1601 -890942 -1106307 -971529 -170448 -697182 -697616 1858038 1419217 -558204 -3422031 -3058794
1591 -3058794 -497718 645333 540304 -1014395 -1555586 -1349409 -1557515 -959678 -673558
1582 -673558 -412147 -584521 -1247726 -471001 -936230 -961676 -309165 -61320 -177284 -855553
1572 -855553 790555 -243381 -768814 403015 352107 620574 -658771 -1223036 -1352409
1563a352409J458005J520769r92483j612664k28692M71938K14020R69186J45486
1554E93156J56402P29489k14130j94403m31399j384465j120082l28966J868055
1545c26343O64689m05416o18546r67084Q75552l65989L30471l10215N15853M04882
1535b02146n01238m47471K67452J459943k10613k96425J588504k326965j142839
1526a811798J536942j50076R93158o21132N10920J30874j016197J37626P18502
1517D28819Q84970j257848l98024R05511j396586J175284p55848n8784J623662
1508A151156p94140l46732m85681M52107m82767P98064K00042r11159O68211q52247
1498f03146O41516l24189P09100K14657l037667o9797J184317Q46597k37412j4221
$$ plain form
1563 -1352409 105596 1626365 633882 -978782 -1207474 -735536 -521516 447670 593156
1554 593156 749558 1479047 1264917 1070514 639115 -745350 -1865432 -2194398 -326343
1545 -326343 338346 -67070 -685616 -1652700 -777148 -1143137 -812666 -1122881 -607028 -202146
1535 -202146 -703384 -1150855 -883403 576540 365927 69502 1658006 -668959 -1811798
1526 -1811798 -274856 -424932 568226 -52906 458014 588888 -427309 -289683 428819
1517 428819 1313789 55941 -342083 563428 -833158 342126 -413722 -472506 1151156
1508 1151156 357016 10284 -475397 -23290 -506057 292007 492049 -419110 249101 -603146
1498 -603146 38370 -285819 423281 637938 -2399729 -2469526 -1285209 -438612 -676024 -690245
1488f90245J093569p02249K37538J76101P9077j35033j951951Q7939J369519p6659
1478e12394N1910q8429J20270J39176J034443j01809k338604M83143k60768J714007
1468B40945l66406k47744j8680J19582l23254p68880R46439N06955p7616M0276
1458E1617L21777j14260j3810L71830L25707q26928J40094j48142k12735J128922
1448A024072O49252n71444q57371m73292j45871J483404j210373P15272p44660
1439a31011J31294R18507n52800n17801j263650Q67969M3197R18117o23974m09344
1429f19496j3968r3848m23421P87171P16788N03658m49207O18429q17495j488953
1419a280342O59008l91822P21138n29075M07925n68704j45567M76870k29309j15983
$$ plain form
1488 -690245 403324 -298925 -61387 114714 193791 58758 -1893193 -1805254 -435735 -512394
1478 -512394 -460484 -548913 -428643 -289467 744976 643167 -1695437 -1212294 -1473062 240945
1468 240945 -125461 -373205 -391885 -272303 -595557 -1364437 -417998 88957 11341 51617
1458 51617 373394 259134 245324 617154 942861 115933 256027 107885 -104850 1024072
1448 1024072 1673324 1101880 244509 -228783 -374654 1108750 -101623 613649 -131011
1439 -131011 283 918790 365990 -151811 -1415461 -547492 -504295 413822 -210152 -619496
1429 -619496 -633464 -727312 -1150733 -363562 353226 856884 407677 1026106 208611 -1280342
1419 -1280342 -621334 -1013156 -292018 -821093 -413168 -981872 -1127439 -650569 -879878 -995861
1409i95861p9067J017356p45179k24464k91316J169929L95380m17736O25359P96362
1399A250763o2881j79916k416024R9794q2927L93237K561369J97437j683546k407384
1389b330078Q27444J356965r90507l14147K54004J508743j364879J066383p83679
1380g69751K21641J136563j066377N18658l56230L16599P75122j030047K37107
1371a6715L29792k28604q6894M86134R70396k43878r37787j39820J908944m02504
1361A639064j697157j135386K98672K895412R8986j143907L43231r7452j017477
1352A83986k30159q67485j066399J766434L66365P86650j433335J89799l95013
1343f99157k09744P2857K73645P12877L03195k851983N10408J757931J490523
$$ plain form
1409 -995861 -1074928 -57572 -802751 -1027215 -1318531 -148602 246778 -170958 454401 1250763
1399 1250763 1187882 1007966 -1408058 -1308264 -1391191 -997954 1563415 1760852 77306 -2330078
1389 -2330078 -1502634 -145669 -1136176 -1450323 -1196319 312424 -1052455 13928 -769751
1380 -769751 -548110 588453 -477924 40734 -315496 1103 776225 -253822 -16715
1371 -16715 313077 84473 -2421 483713 1454109 1210231 272444 132624 2041568 1639064
1361 1639064 -58093 -1193479 -894807 2000605 2099591 955684 1298915 1201463 183986
1352 183986 -46173 -913658 -1980057 -213623 152742 939392 -493943 -304144 -699157
1343 -699157 -908901 -836044 -562399 150478 453673 -2398310 -1887902 -129971 1360552
1334A360552k78983j104650P26425j43273N32972j054403n71001J311709M66397
1325A245745K60295l26630m94101l59654J42486j173852j77935K15512J373205
1316G05071N96978j43832q86758P59834j96665q72273L35441R27093n65164J84310
1306H44035l05023K01034Q12765p06699m41468j179983N07854m72410J335114
1297E95219Q94207j765709l80766N15334m44606K25907J086140K38236L18975
1288A282937j311503o25086J090133j20625o1944p10763L74802Q2120J381786
1279A381857K04799j160908j06036J515248j52564j257751k430845J736626K238175
1270A968601n19110l03890o15461o13925k86822N14886m40590N98836o67386r9072
$$ plain form
1334 1360552 1081569 -23081 703344 560071 1093043 38640 -532361 779348 1245745
1325 1245745 1506040 1179410 685309 325655 468141 -705711 -883646 -668134 705071
1316 705071 1302049 1158217 271459 1031293 834628 -37645 297796 1224889 659725 844035
1306 844035 539012 740046 1552811 846112 404644 -775339 -267485 -739895 595219
1297 595219 1489426 -276283 -657049 -141715 -586321 -360414 725726 963962 1282937
1288 1282937 -28566 -653652 436481 315856 253912 -456851 -82049 71 1381857
1279 1381857 1586656 425748 319712 1834960 1682396 424645 -2006200 -269574 1968601
1270 1968601 1449491 1145601 530140 -83785 -370607 144279 -296311 302525 -364861 -463933
1260d63933L122702o94179j468698n50090J360979r78969q24069J682312L63061
1251A549116j086212n87604Q9531P75626O30009J52567J50538k113038l43815
1242g83282L83026Q54605J76970j062044N8475J480001l42655j772939J448677
1233D40834m47920j285261O77494J757421L8480P7969j483870L46889O65125j194151
1223d06990M4557l79120P52460M15473p4161k64875j977554k81360J829291m05600
1213g47879O53934M69680Q50342j76451j658267L9770j132680M33462O21869J442833
1203G96613n50803j13560l00304L79494p89878m54847M3839R49058K81496j227276
1193i86168O38252J968823K68760k73573o95661j033210J33807j154468J002104
$$ plain form
1260 -463933 2658769 1964590 495892 -54198 1306781 327812 -496257 1186055 1549116
1251 1549116 462904 -124700 -35169 740457 1370466 1523033 1673571 -439467 -783282
1242 -783282 -400256 454349 631319 -430725 -372250 1107751 765096 -1007843 440834
1233 440834 -7086 -1292347 -614853 1142568 1181048 1259017 -224853 122036 787161 -406990
1223 -406990 -362433 -741553 10907 426380 352219 87344 -1890210 -2171570 -342279 -747879
1213 -747879 -93945 375735 1226077 1049626 -608641 -568871 -1701551 -1268089 -646220 796613
1203 796613 245810 132250 -168054 211440 -578438 -1033285 -989446 -40388 241108 -986168
1193 -986168 -347916 1620907 1889667 1616094 920433 -112777 21030 -1133438 -131334
1184a31334p48213Q07564J301809k49735k39231j719721K03658n26479n32004
1175a833686K057746Q91884J538336k441964j193361m58680j07196J534936M30708
1166D18723n78835J941195n0010j463863k514798J295384J489771n34820j129470
1157a126723n17277K72353N37690O6101J577652J182698n87334l168295J171123
1148e92012l03783K78056K929634l76197j285738j981709l96052K112977L89412
1139G74588j841269J255611N46120j373940M29242K7807J98451K42582N43057
1130H02249k58305q96023j59717j466135O57314Q33471J521105l10811l15939
1121D07209j496679O82645J944489m78929q24361j169471R98707K088628m90719
$$ plain form
1184 -131334 -879547 -71983 1229826 980091 740860 -978861 -775203 -1301682 -1833686
1175 -1833686 224060 1115944 2654280 212316 -981045 -1439725 -1546921 -11985 418723
1166 418723 -160112 1781083 1731073 267210 -2247588 -952204 537567 2747 -1126723
1157 -1126723 -1644000 -1371647 -833957 -767856 809796 1992494 1405160 -1763135 -592012
1148 -592012 -895795 -617739 2311895 1935698 649960 -1331749 -1727801 385176 774588
1139 774588 -1066681 188930 735050 -638890 -209648 -181841 16610 259192 802249
1130 802249 543944 -352079 -511796 -1977931 -1320617 -487146 1033959 723148 407209
1121 407209 -1089470 -406825 1537664 1058735 234374 -935097 63610 2152238 1661519
1112A661519q96276o15398j692650L40920J364502J024331n76571J90438j799402
1103i98587n93450K333502j3635J162778j466480j304021K54344J925006N79441
1094A878898P2584p67620r7853n85868n47686Q1903O01970j010506J83624J040812
1084H50258K03603j439291M67469o17820J373218r23711L66069O88818k38499
1075G30114p15165l01174K180046j18180j676473o93862M87669K39448P74884
1066I07307r59077m38040J175056J549363j340087j673566L12368J559545j98985
1057H93884J751j190027j283490P49279J405576q05054j991460J302384P94774
1048a22383q40150k7169R172Q70554N45921p23128J44025N26106K97899n24739
$$ plain form
1112 1661519 765243 149845 -1542805 -1201885 162617 1186948 610377 800815 -998587
1103 -998587 -1592037 741465 727830 1890608 424128 -879893 -625549 1299457 1878898
1094 1878898 1951482 1183862 1086009 500141 -47545 34358 636328 -374178 -190554 850258
1084 850258 1053861 -385430 82039 -535781 837437 -86274 279795 968613 730114
1075 730114 14949 -286225 1893821 1775641 99168 -594694 -107025 132423 907307
1066 907307 -51770 -489810 685246 2234609 894522 -779044 -466676 1092869 893884
1057 893884 895635 -294392 -1577882 -828603 576973 -228081 -2219541 -917157 -122383
1048 -122383 -962533 -989702 -980530 -109976 435945 -287183 -143158 382948 680847 156108
1038A56108m69818P56852N92530j49308j497892q2103j01492O62033J403343o85135
1028E85118k099152N16349Q37044J393965j101988j032348K03630p7343K201411
1019A426686k10530N38472J1588k989862Q99754O56888Q07219r91262p82814O61453
1009B7592Q05192j391400N56274R10265P75475j059075j075367Q27613R07152
1000A283721J40822l58997Q3810n79639M80350j806620q42873J890206O85926
991I76706m8425p8290n43314M54079K61145m72168j594123o36873J548694P05822
981E73253j57138o35319q44887Q98151M86371K78808J92834j597778Q11497P67838
971G73630o92278n96458j082053J587713k84570M27264Q38870j299061Q4447j057763
$$ plain form
1038 156108 -313710 443142 1035672 886364 -611528 -693631 -795123 -133090 1270253 585118
1028 585118 -1514034 -997685 -160641 1233324 131336 -901012 -697382 -774725 1426686
1019 1426686 1216156 1754628 1766216 -1223646 -323892 332996 1140215 148953 -633861 27592
1009 27592 832784 -558616 -2342 907923 1683398 624323 -451044 376569 1283721
1000 1283721 1424543 1065546 1149356 569717 1050067 -756553 -1599426 290780 976706
991 976706 928281 849991 306677 760756 1021901 549733 -1044390 -1681263 -132569 573253
981 573253 416115 -219204 -1064091 -165940 320431 599239 792073 -805705 5792 773630
971 773630 81352 -515106 -1597159 -9446 -294016 133248 972118 -326943 -242496 -1300259
961a300259Q50069l46294j50703J13065m84591J236824o04010J991866k8253j380978
951a03264p67599j175748J458979J150108K50751P96689m03526q8623l25705L32684
941A124746j076548j251446n26490K400825J99521m68729P12107j234064K8893
932i1185J452359r63760J63792j71561o2699N81732K0m4668o00075Q58602n51597
921E70960p89329O9075P82729J744445k356053P24262K118063j507900j111481
912B44771j557880R46840J868701l05458q00398J05880M71621j385683o65767
903a077373M5668p23352J25338k52316P82385O20451Q23481k64099j468883p44999
893b133699P02312j29063O80766O06615l03564J012995O3301l66726P82595J25340
$$ plain form
961 -1300259 -450190 -796484 -947187 -834122 -1318713 -81889 -685899 1305967 1277714 -103264
951 -103264 -870863 -2046611 -587632 562476 813227 1609916 1206390 1117767 792062 1124746
941 1124746 48198 -1203248 -1729738 671087 870608 401879 1113986 -120078 -91185
932 -91185 1361174 397414 561206 389645 326946 908678 908698 864030 263955 1122557 570960
921 570960 -218369 -149294 633435 2377880 21827 746089 2864152 1356252 244771
912 244771 -1313109 -366269 1502432 1196974 396576 502456 974077 -411606 -1077373
903 -1077373 -1031705 -1755057 -1629719 -1882035 -1099650 -479199 344282 80183 -1388700 -2133699
893 -2133699 -1431387 -1560450 -879684 -273069 -576633 436362 499663 132937 915532 1040872
883A040872j135520j025899k1099P39084Q14331L89183j26102L65567o65611J20339
873D95145p40496p62566R14864O62214N5362n60625k195O86981L57510Q14599
863A920793j797608o95322O6959n03743J179746J85558Q29420p28240k47665J385681
853A595579o20794k97965q46637j94355J212097n75868p86837r35596J713841
844B63465l14738N44815J8052l84384K66313j95323n89555l63231k67063K623530
834A601881Q63457K3342j489791j39215n25641q60708q99232J551660J594314
825A720067r92763n64729k17101k78063P94874j313792J62645k18378l30718J473277
815B35319L67131k59262k313213M93100N87050P67027P26680j053498L61076J787116
$$ plain form
883 1040872 -94648 -1120547 -1141646 -402562 411769 800952 674850 1040417 374806 495145
873 495145 -245351 -1007917 -93053 569161 624523 63898 61703 748684 1106194 1920793
863 1920793 123185 -572137 -505178 -1008921 170825 356383 1185803 457563 209898 1595579
853 1595579 974785 676820 -169817 -364172 847925 272057 -514780 -1450376 263465
844 263465 -51273 493542 511594 127210 393523 198200 -391355 -754586 -1021649 1601881
834 1601881 2465338 2488680 998889 859674 334033 -526675 -1425907 125753 1720067
825 1720067 727304 162575 -54526 -332589 462285 -851507 -688862 -907240 -1237958 235319
815 235319 602450 343188 -1970025 -1476925 -889875 -122848 603832 -449666 -88590 1698526
805A698526O86556o12232k817505M14960J098322M69042p11776l48052k24407
796c46566o5439O71101L18282j44682J303511k558533J28980j91053J193288M36588
786G45477j146568p45483p6861J829876r5512j99798j32687q54381P99806M8409
776A72278N10715j98516j579410l66103Q98243J94563q90935N64012P68806j291094
$$ plain form
805 1698526 2385082 1772850 -1044655 -629695 468627 937669 225893 -122159 -346566
796 -346566 -412005 259096 577378 432696 1736207 -822326 -693346 -884399 308889 745477
786 745477 -401091 -1146574 -1223435 606441 510929 311131 178444 -675937 123869 172278
776 172278 682993 484477 -1094933 -1461036 -562793 -368230 -1259165 -695153 73653 -1217441
$$ [...]
##END NTUPLES=NMR SPECTRUM
##END=
