##TITLE=1H_TG-2402-X13
 200.13Hz, DMSO_CCl4 .
 8 sc
 
1.1.2026
##JCAMPDX= 6.0         $$ Bruker NMR JCAMP-DX V2.0
##DATA TYPE= NMR SPECTRUM
##DATA CLASS= NTUPLES
##ORIGIN= UXNMR, Bruker Analytische Messtechnik GmbH
##OWNER= pz
$$ XWIN-NMR		Version 3.5
$$ Wed Apr  1 15:15:13 2026 Russian Standard Time (UT+4h)  she@DPX200
##.OBSERVE FREQUENCY= 200.1313
##.OBSERVE NUCLEUS= ^1H
##.ACQUISITION MODE= SIMULTANEOUS
##.ACQUISITION SCHEME= undefined
##.AVERAGES= 8
##.DIGITISER RES= 18
##SPECTROMETER/DATA SYSTEM= spect
##.PULSE SEQUENCE= zg30
##.SOLVENT NAME= DMSO
##.SHIFT REFERENCE= (INTERNAL, DMSO, 0, 15.4869)
##AUDIT TRAIL= $$ (NUMBER, WHEN, WHO, WHERE, WHAT)
$$ ##TITLE= Audit trail, XWIN-NMR		Version 3.5
$$ ##JCAMPDX= 5.01
$$ ##ORIGIN= Bruker BioSpin GmbH
$$ ##OWNER= she
$$ F:/spectra/data/she/nmr/H-C/1/pdata/1/auditp.txt
$$ ##AUDIT TRAIL=  $$ (NUMBER, WHEN, WHO, WHERE, WHAT)
(   1,<2026-04-01 15:13:37.70 +0400>,<she>,<DPX200>,
      <created by zg, POWCHK disabled, PULCHK disabled
       configuration hash MD5:
       00 E9 B6 7A A2 85 ED C7 34 08 36 98 17 FE 4E 26
       data hash MD5: 16K
       D3 81 D3 4A 07 80 09 7E DE 45 C7 95 49 F8 77 BF>)
(   2,<2026-04-01 15:13:39.92 +0400>,<she>,<DPX200>,
      <Start of raw data processing
       efp BC_mod = 2 LB = 0.25 FT_mod = 6 PKNL = 1 PHC0 = -3706.655 PHC1 = 4.792311 SI = 16K 
       data hash MD5: 16K
       19 8D C2 CE C9 EC FE B8 D7 79 CA 26 86 15 D7 06>)
(   3,<2026-04-01 15:14:10.73 +0400>,<she>,<DPX200>,
      <pk PHC0 = -6.838652 PHC1 = 6.599999 
       data hash MD5: 16K
       8E 8B 10 58 54 41 E1 0E C9 90 0A B4 F3 56 25 08>)
(   4,<2026-04-01 15:14:17.01 +0400>,<she>,<DPX200>,
      <abs ABSG = 5 
       data hash MD5: 16K
       96 D9 77 5F D0 2D 13 A2 59 5A 98 AD 3D B5 EE 93>)
$$ ##END=
$$ 
$$ hash MD5
$$ 4B 0E 39 94 D4 CA FC 37 9B 73 D5 17 AA DC 80 64
##$RELAX= 
##$RELAX= 
##$RELAX= 
##$RELAX= 
##$RELAX= 
##$RELAX= 
$$ Bruker specific parameters
$$ --------------------------
##$DU= <F:/spectra>
##$EXPNO= 1
##$NAME= <H-C>
##$PROCNO= 1
##$TYPE= <nmr>
##$USER= <she>
##$AMP= (0..31)
100 100 100 100 100 100 100 100 100 100 100 100 100 100 100 100 100 100 
100 100 100 100 100 100 100 100 100 100 100 100 100 100 
##$AQSEQ= 0
##$AQ_mod= 1
##$AUNM= <au_zg>
##$AUTOPOS= <>
##$BF1= 200.13
##$BF2= 200.13
##$BF3= 200.13
##$BF4= 200.13
##$BF5= 200.13
##$BF6= 200.13
##$BF7= 200.13
##$BF8= 200.13
##$BYTORDA= 1
##$CFDGTYP= 0
##$CFRGTYP= 5
##$CHEMSTR= <none>
##$CNST= (0..31)
1 1 145 1 1 1 1 1 1 1 1 1 1 1 1 1 1 1 1 1 1 1 1 1 1 1 1 1 1 1 1 1 
##$CPDPRG= <>
##$CPDPRG1= <>
##$CPDPRG2= <>
##$CPDPRG3= <>
##$CPDPRG4= <mlev>
##$CPDPRG5= <mlev>
##$CPDPRG6= <mlev>
##$CPDPRG7= <mlev>
##$CPDPRG8= <mlev>
##$CPDPRGB= <>
##$CPDPRGT= <>
##$D= (0..31)
0 0.7 0 0 0 0 0 0 0 0 0 0.03 0 0 0 0 0 0 0 0 0 0 0 0 0 0 0 0 0 0 0 0 
##$DATE= 1775042016
##$DBL= (0..7)
120 120 120 120 120 120 120 120 
##$DBP= (0..7)
150 150 150 150 150 150 150 150 
##$DBP07= 0
##$DBPNAM0= <>
##$DBPNAM1= <>
##$DBPNAM2= <>
##$DBPNAM3= <>
##$DBPNAM4= <>
$$ [...]
##$SUBNAM3= <"">
##$SUBNAM4= <"">
##$SUBNAM5= <"">
##$SUBNAM6= <"">
##$SUBNAM7= <"">
##$SUBNAM8= <"">
##$SUBNAM9= <"">
##$SW= 18.0517328524113
##$SWIBOX= (0..15)
0 0 2 0 0 0 0 0 0 0 0 0 0 0 0 0 
##$SW_h= 3612.71676300578
##$TD= 16384
##$TD0= 1
##$TE= 0
##$TE2= 300
##$TE3= 300
##$TEG= 300
##$TL= (0..7)
0 120 120 120 120 120 120 120 
##$TP= (0..7)
150 150 150 150 150 150 150 150 
##$TP07= 0
##$TPNAME0= <>
##$TPNAME1= <>
##$TPNAME2= <>
##$TPNAME3= <>
##$TPNAME4= <>
##$TPNAME5= <>
##$TPNAME6= <>
##$TPNAME7= <>
##$TPOAL= (0..7)
0.5 0.5 0.5 0.5 0.5 0.5 0.5 0.5 
##$TPOFFS= (0..7)
0 0 0 0 0 0 0 0 
##$TUNHIN= 0
##$TUNHOUT= 0
##$TUNXOUT= 0
##$USERA1= <user>
##$USERA2= <user>
##$USERA3= <user>
##$USERA4= <user>
##$USERA5= <user>
##$V9= 5
##$VALIST= <valist>
##$VCLIST= <CCCCCCCCCCCCCCC>
##$VD= 0
##$VDLIST= <DDDDDDDDDDDDDDD>
##$VPLIST= <PPPPPPPPPPPPPPP>
##$VTLIST= <TTTTTTTTTTTTTTT>
##$WBST= 1024
##$WBSW= 4
##$XGAIN= (0..3)
0 0 0 0 
##$XL= 0
##$YL= 0
##$YMAX_a= 399227
##$YMIN_a= -520425
##$ZGOPTNS= <>
##$ZL1= 120
##$ZL2= 120
##$ZL3= 120
##$ZL4= 120
##$ABSF1= 15.4472
##$ABSF2= -2.60465
##$ABSG= 5
##$ABSL= 3
##$ALPHA= 0
##$AQORDER= 0
##$ASSFAC= 0
##$ASSFACI= 0
##$ASSFACX= 0
##$ASSWID= 0
##$AUNMP= <proc_1d>
##$AZFE= 0.1
##$AZFW= 0.1
##$BCFW= 0
##$BC_mod= 2
##$BYTORDP= 0
##$COROFFS= 0
##$CY= -3
##$DATMOD= 1
##$DC= 0
##$DFILT= <>
##$DTYPP= 0
##$F1P= 0
##$F2P= 0
##$FCOR= 1
##$FTSIZE= 16384
##$FT_mod= 6
##$GAMMA= 0
##$GB= 0
##$INTBC= 1
##$INTSCL= 3.241238e-09
##$ISEN= 128
##$LB= 0.25
##$LEV0= 0
##$LPBIN= 0
##$MAXI= 10000
##$MC2= 0
##$MEAN= 0
##$ME_mod= 0
##$MI= 1.114404
##$NCOEF= 0
##$NC_proc= -7
##$NLEV= 6
##$NOISF1= 3.799351
##$NOISF2= 2.8
##$NSP= 0
##$NTH_PI= 0
##$NZP= 0
##$OFFSET= 15.48687
##$PC= 1
##$PHC0= -3713.494
##$PHC1= 11.39231
##$PH_mod= 1
##$PKNL= yes
##$PPARMOD= 0
##$PSCAL= 0
##$PSIGN= 0
##$REVERSE= no
##$SF= 200.130006971751
##$SI= 16384
##$SIGF1= 3
##$SIGF2= 2
##$SINO= 0.751879
##$SIOLD= 32768
##$SREGLST= <19F.Aceton>
##$SSB= 0
##$STSI= 16384
##$STSR= 0
##$SW_p= 3612.71676300578
##$SYMM= 0
##$S_DEV= 0
##$TDeff= 16384
##$TDoff= 0
##$TI= <>
##$TILT= no
##$TM1= 0
##$TM2= 0
##$TOPLEV= 0
##$USERP1= <user>
##$USERP2= <user>
##$USERP3= <user>
##$USERP4= <user>
##$USERP5= <user>
##$WDW= 1
##$XDIM= 16384
##$YMAX_p= 368071398
##$YMIN_p= -766872
$$ End of Bruker specific parameters
$$ ---------------------------------
##NTUPLES= NMR SPECTRUM
##VAR_NAME=  FREQUENCY,     SPECTRUM/REAL,   SPECTRUM/IMAG
##SYMBOL=    X,             R,               I
##VAR_TYPE=  INDEPENDENT,   DEPENDENT,       DEPENDENT
##VAR_FORM=  AFFN,          ASDF,            ASDF
##VAR_DIM=   16384,         16384,           16384
##UNITS=     HZ,            ARBITRARY UNITS, ARBITRARY UNITS
##FACTOR=    0.220516191357247, 1,           1
##FIRST=     3099.38736344851, 0,            0
##LAST=      -513.329399557275, 0,           0
##MIN=       -513.329399557275, -766872,     0
##MAX=       3099.38736344851, 368071398,    0
$$ Real data points
##PAGE= N=1
##DATA TABLE= (X++(R..R)), XYDATA
$$ [...]
5094C1986093J02940k52428J45871R2776M0530l51218J53432K9447j74213Q2689
5084C1855919q6516l01011k56507J43485M9840m72825j1378L7995m18458k59492
5074C0281052l49130m7398j31370j63164j75593J2241k22912k58191l44223M5855
5064B8647167J23096p7620k57560k44327K38217j42123N0052K01863J52456l3204
5054B8658017J72788J07823N5405R9660M73020L25190O3125K88043M92035Q8378
5044C0823484n7796J30959K35238K58911L26249J54456M46167N48062J02700K25980
5034C3194410L09684J0833J11835n5677K4941J31256J26825J52505m423k107M5692
5023C4045774j81007j42163J08286J67183j85383m5012R3594j04006j82567j06664
$$ plain form
5094 31986093 32089033 31836605 31982476 32075252 32115782 31764564 31917996 31947443 31773230 31855919
5084 31855919 31769403 31468392 31211885 31355370 31405210 30932385 30921007 30959002 30540544 30281052
5074 30281052 29931922 29884524 29753154 29589990 29414397 29426638 29203726 28945535 28601312 28647167
5064 28647167 28770263 28692643 28435083 28190756 28428973 28286850 28336902 28538765 28691221 28658017
5054 28658017 28830805 28938628 28994033 29093693 29566713 29891903 29955028 30243071 30735106 30823484
5044 30823484 30765688 30896647 31131885 31390796 31717045 31871501 32317668 32865730 32968430 33194410
5034 33194410 33504094 33514927 33626762 33571085 33596026 33727282 33854107 34006612 34002189 34000082 34045774
5023 34045774 33864767 33722604 33830890 33998073 33812690 33767678 33861272 33757266 33574699 33468035
5013C3468035M0020Q8328K153J27065l16623l2588K50430j60679r0169J20256
5003C3496228J4015j610r3426O6008L0926J23294K76622K36803K24202J07122
4993C4480184J23744K03342P43359K87070J01513O1587n683k87516M9506J75432
4983C5932538j60765j29471j6402L7761j35991K12327J41970K54659M32523L36505
4973C6905654K84428Q0310l6857M12933L74398k9521l0635N0300J96605M2814
4963C8250429J84363k22304k68826j50617k05922J03024N1109k37278M8621P5321
4953C7627920K12807Q728J31714J48171l03121q0322M213J45214L9562Q8790L58542
4942C8382218M2499j33879J0797p3644M8230J06112J88867p6539J91397L57872
$$ plain form
5013 33468035 33508055 33596383 33598536 33725601 33408978 33376390 33626820 33466141 33375972 33496228
5003 33496228 33510243 33508633 33415207 33481215 33512141 33635435 33912057 34148860 34373062 34480184
4993 34480184 34603928 34807270 35550629 35837699 35939212 36000799 35995116 35707600 35757106 35932538
4983 35932538 35771773 35642302 35625900 35663661 35527670 35739997 35881967 36136626 36569149 36905654
4973 36905654 37190082 37270392 37233535 37646468 38020866 37991345 37960710 38011010 38207615 38250429
4963 38250429 38434792 38212488 37943662 37793045 37587123 37690147 37741256 37503978 37552599 37627920
4953 37627920 37840727 37849455 37981169 38129340 37826219 37745897 37750110 37895324 37934886 38023676 38382218
4942 38382218 38424717 38290838 38301635 38227991 38276221 38382333 38571200 38494661 38686058 39043930
4932C9043930Q617L09022M54151J80872K65509N21290P47775L45642K94665P55895
4922D2927368M64579O40193N99731N80134O25554P67826N36496O91149P23837
4913D8556867N65426Q24720P27302O56795Q87895R32220R23913J102864P72122
4904E5950124Q91816R52255R55531J012917R46349O62812R20680R07441O31143
4895F3831068N27355L49081J12398L32883K2322j92632q1441j90405k45218k79725
4885F4185686J5771k88968o88849m68287j71950k85594m35875k52249p8354l70593
4875F1160738k67409l35159l04607l43341N126k61491m16332m97379m68472o66243
4865E7605431m99236n19164o60750l85243m68679n19189n48843k25461j64635
$$ plain form
4932 39043930 39052547 39361569 39815720 39996592 40262101 40783391 41531166 41876808 42171473 42927368
4922 42927368 43391947 44032140 44631871 45212005 45837559 46605385 47141881 47833030 48556867
4913 48556867 49122293 49947013 50674315 51331110 52219005 53151225 54075138 55178002 55950124
4904 55950124 56841940 57794195 58749726 59762643 60708992 61371804 62292484 63199925 63831068
4895 63831068 64358423 64707504 64819902 65152785 65175107 64982475 64901034 64710629 64465411 64185686
4885 64185686 64201457 63912489 63223640 62755353 62583403 62297809 61861934 61609685 61531331 61160738
4875 61160738 60893329 60558170 60253563 59910222 59915348 59653857 59237525 58740146 58271674 57605431
4865 57605431 57106195 56587031 55926281 55541038 55072359 54553170 54004327 53778866 53614231
4856E3614231m09853j85115K0557l81707p8357j47295J20031m7171m96714p3066
4846E1935541j9338l6487K38267M39429K21416N28680K14860M88996J222415J088468
4836E6322247J742901K415414L211122M722583P186365Q573639Q530010N934057
4828I8638338J331271k666135n236449o303214o093096n214869m447660m010532
4820F5997654k765036k169891j779544j237154j293885j032464j170631j010876
4812E3538173r38191q89115r75195q04375r38804p55761q84807r09433n60781
4803D5881711m52671p44160q00953m67755m73011k20574o54111l00401l12345
4794D1455730l78904m53700j78351k48495l71165j74883k08416j92877k79215
$$ plain form
4856 53614231 53204378 53019263 53039820 52658113 52579756 52432461 52552492 52505321 52008607 51935541
4846 51935541 51916203 51879716 52117983 52557412 52778828 53307508 53522368 54011364 55233779 56322247
4836 56322247 58065148 60480562 63691684 68414267 75600632 84174271 92704281 98638338
4828 98638338 99969609 97303474 92067025 85763811 79670715 74455846 70008186 65997654
4820 65997654 63232618 61062727 59283183 58046029 56752144 55719680 54549049 53538173
4812 53538173 52599982 51710867 50735672 49931297 48992493 48236732 47351925 46442492 45881711
4803 45881711 45429040 44684880 43883927 43416172 42943161 42722587 42068476 41768075 41455730
4794 41455730 41076826 40623126 40444775 40196280 39825115 39650232 39441816 39248939 38969724
4785C8969724L1342m7935p4818j74708p0467r5384j05648j29961j15376O3856
4775C8250625M91155J60115J09290L84755K39247N8777N00378M68354N64598L98142
4765D1625436J94861O37750O28897M27173O00867O49200M44317N92256N50631
4756D6351388P12349L52177N18782M79601Q14798R62030P72549O40057O63474
4747E2267205J137829R36304P59382J150185R81408J003616J035350Q47348R86717
4738F1105344J092685J160201J100522J493302R25204R50630J344248J201272
4730G0373408R47826J150182J265362J176804J018335Q30485R51922J070225Q27427
4721G9611976J039611Q50600Q55669J098210R20302J010408Q98027J089711J216089
$$ plain form
4785 38969724 39001066 38953131 38878313 38703605 38633138 38537754 38432106 38302145 38186769 38250625
4775 38250625 38741780 38901895 39011185 39395940 39635187 39693964 40194342 40662696 41227294 41625436
4765 41625436 41820297 42458047 43086944 43514117 44114984 44764184 45208501 45800757 46351388
4756 46351388 47063737 47415914 47934696 48414297 49229095 50191125 50963674 51603731 52267205
4747 52267205 53405034 54341338 55100720 56250905 57232313 58235929 59271279 60118627 61105344
4738 61105344 62198029 63358230 64458752 65952054 66877258 67827888 69172136 70373408
4730 70373408 71321234 72471416 73736778 74913582 75931917 76762402 77714324 78784549 79611976
4721 79611976 80651587 81502187 82357856 83456066 84376368 85386776 86284803 87374514 88590603
4712H8590603J345670J269881J505203J608797J559721J524707J791142J884073
4704A01079797J781291J556759J433933J233386J349847P87005N90210J99162
4696A10011390q1490j26945n32810o15167q33265j250025j616838j687014j687276
4687A01580560j758467j889957k117870j845416k184625j815397j658444j801439
4679H6508945j885431j926491j825152j779955j935972j827402j681303j505061
4671G2142178j970619j952471j909162j969395j963522k078082j979535k266498
4663E6052894k041861k119812k024167j990588j776698j890496j827399j613158
4655D0768715j379709j583333j362645j215524j111361j245787j098526n92704
$$ plain form
4712 88590603 89936273 91206154 92711357 94320154 95879875 97404582 99195724 101079797
4704 101079797 102861088 104417847 105851780 107085166 108435013 109222018 109812228 110011390
4696 110011390 109929900 109802955 109270145 108654978 107821713 106571688 104954850 103267836 101580560
4687 101580560 99822093 97932136 95814266 93968850 91784225 89968828 88310384 86508945
4679 86508945 84623514 82697023 80871871 79091916 77155944 75328542 73647239 72142178
4671 72142178 70171559 68219088 66309926 64340531 62377009 60298927 58319392 56052894
4663 56052894 54011033 51891221 49867054 47876466 46099768 44209272 42381873 40768715
4655 40768715 39389006 37805673 36443028 35227504 34116143 32870356 31771830 31179126
4647C1179126n89632q54259l81712m93789o66260m29180j35471o5389j42299l39248
4637B7081887j23423k52527M9601J8106O09175Q32892M89015P43264J498671J733170
4627C2679831J626784Q64990m5173o28431j370287j605925j463091j213061j175945
4618B7669692q90625n00124k17836j10580L34634N86392P90676R81521P93508
4609B9437258J094610P28457J183730J130707J132203J445027J576006J790163
4601C9518161J253272J123415J048171R39818O39285Q21778J101775J321895Q58770
4592D8626340K58078l4424m26785j156150j284959r18787j271019j037878o40548
4583D2113868j871361j714005j874423k234937j593658j716873j833018j493410
$$ plain form
4647 31179126 30589494 29735235 29353523 28859734 28193474 27764294 27628823 27563434 27421135 27081887
4637 27081887 26958464 26705937 26755538 26773644 27382819 28215711 28704726 29447990 30946661 32679831
4627 32679831 34306615 35171605 35126432 34498001 33127714 31521789 30058698 28845637 27669692
4618 27669692 26779067 26278943 26061107 25950527 26285161 26871553 27662229 28643750 29437258
4609 29437258 30531868 31260325 32444055 33574762 34706965 36151992 37727998 39518161
4601 39518161 40771433 41894848 42943019 43882837 44522122 45343900 46445675 47767570 48626340
4592 48626340 48884418 48849994 48423209 47267059 45982100 45063313 43792294 42754416 42113868
4583 42113868 40242507 38528502 36654079 34419142 32825484 31108611 29275593 27782183
4575B7782183j419681j585495j707568j501217k057424j636094j075946j246764
4567A5551994r70272r30039q22341o96849m11825m25712n54835m76187k60201
4558A0003733j92483k34323k00197k09926j5665j57216j09758k93203m5614J80381
4548H725729j08887k50803m3983l1497k07238j72522k0746J96809O1649k03213
4538G945298k3818j786J4280K22046k0108j06751n5414P5018K12620p4213p7006
4527H110166L24057J96119K04320Q8484k05931p2759L8139K09392J18593K90154
4517I300734j85659J94413N2754l8723K49825P1287K1297L33801r3264m24076
4507I482389k7317k14382j44306l20129j46846k49084n6578j63100k19230l43339
$$ plain form
4575 27782183 26362502 24777007 23069439 21568222 19510798 17874704 16798758 15551994
4567 15551994 14581722 13651683 12829342 12132493 11720668 11294956 10740121 10263934 10003733
4558 10003733 9811250 9576927 9376730 9166804 9151139 8993923 8884165 8590962 8545348 8725729
4548 8725729 8616842 8366039 8322056 8290559 8083321 7910799 7890053 8086862 8148511 7945298
4538 7945298 7921480 7919694 7933974 8156020 8135912 8029161 7973747 8048765 8261385 8187172 8110166
4527 8110166 8434223 8630342 8834662 8923146 8717215 8644456 8682595 8891987 9010580 9300734
4517 9300734 9115075 9309488 9362242 9323519 9573344 9644631 9665928 9999729 9906465 9482389
4507 9482389 9455072 9240690 9096384 8776255 8629409 8380325 8323747 8160647 7941417 7598078
4497G598078m53873j37254M3049j04521n37836r486L6769j45480q8552j68484
4487F032410q3653J46594R1545l00539l236q9323K6705K67341r2869j56068j22450
4476E716457r5758k16560J48582J7700l46091n27363l63335J7498j78678r2461
4466D079991Q2803l34798j50907m01443j06419L63198l8037j30981p5148j48721
4456C139538q3996l3164L2599J40287J4729J48760k34782J22199o9940m01737
4446B774493M6043K02312r3356n3849r0490K56725K33076N292k84615o5319R3472
4435C023784L41053k84924L2673k12883j49043k41998K32755L56359J30417j5154
4425C213039l11394l5101R0782m46252K13175M17545l16738R8963L6203O2775
$$ plain form
4497 7598078 7144205 7006951 7050000 6945479 6407643 6398157 6434926 6289446 6200894 6032410
4487 6032410 5948757 6095351 6186896 5886357 5883121 5793798 5820503 6087844 5994975 5838907 5716457
4476 5716457 5620699 5404139 5552721 5570421 5224330 4696967 4333632 4351130 4172452 4079991
4466 4079991 4162794 3827996 3677089 3275646 3169227 3532425 3494388 3363407 3288259 3139538
4456 3139538 3055542 3022378 3054977 3195264 3209993 3358753 3123971 3246170 3176230 2774493
4446 2774493 2820536 3022848 2929492 2875643 2785153 3041878 3274954 3280246 2995631 2930312 3023784
4435 3023784 3364837 3079913 3112586 2899703 2750660 2508662 2741417 3097776 3228193 3213039
4425 3213039 2901645 2866544 2957326 2511074 2724249 3141794 2825056 2924019 2960222 3022997
4415C022997M623k57905P201J24777J5010m3000J05692P8900K2809m1540J59597
4404C199161L8905r5539O82797n2298l6130j69967K04407m6659j05223k00381
4394C419073J19993l18m3469K0164K85779j22032j71230J57313J55422O9175P654
4383C897524q3376L4387J07593M1910p6501o8629K73348J53657j55337J53428
4373D278004J06286m566J05315J93892J82785L1141J19410O3075N79652J90859
4363E845853L62777N40471L34944L08188L03164M15490j05481k67447J46395L2059
4353G916413j39266k52929m100K30096k6501j51613m5184n4998R7744j64333j78097
4342G227232P9598J18975j7307q8302Q5541k38049J34494m2202j16172M10451
$$ plain form
4415 3022997 3027620 2769715 2776916 2901693 2916703 2873703 2979395 3058295 3081104 3039564 3199161
4404 3199161 3238066 3142527 3825324 3773026 3736896 3566929 3771336 3724677 3619454 3419073
4394 3419073 3539066 3538748 3495279 3515443 3801222 3679190 3507960 3665273 3820695 3889870 3897524
4383 3897524 3814148 3848535 3956128 3998038 3921537 3852908 4126256 4279913 4124576 4278004
4373 4278004 4384290 4379724 4485039 4678931 4861716 4892857 5012267 5075342 5654994 5845853
4363 5845853 6208630 6749101 7084045 7392233 7695397 8110887 8005406 7737959 7884354 7916413
4353 7916413 7777147 7524218 7520118 7750214 7723713 7572100 7526916 7471918 7569662 7405329 7227232
4342 7227232 7306830 7425805 7408498 7320196 7405737 7167688 7302182 7259980 7143808 7554259
4332G554259L584J05000O3447j66602K5965K62457k3687j00157j67808j48636
4322G407822J12730m2019K72425L64880O8520R3183J83603J64692L74456J50716
4312I151008M02112J92542L48298K51745N3169J69121M36772M80917J06957L13382
4302A1906023L93437M75234L96790L75000n4267k78327J85013J21271k92476k68717
4292A2958981l10470j09080l16507M53k44351j96364j76642l14473j08498l73460
4282A0809589l81290m06836k93784q9659k62725l84338q2058K49462O7967L9173
4272I265501k30946l43905N3328K70262N1140P0428l9239R3152J66570K53545
4262I609836J82021Q0015Q2603J09241J89003K37262J31893p6314J83118K7404
$$ plain form
4332 7554259 7557843 7662843 7726290 7559688 7585653 7848110 7824423 7724266 7556458 7407822
4322 7407822 7520552 7478533 7750958 8115838 8184358 8277541 8461144 8625836 9000292 9151008
4312 9151008 9553120 9745662 10093960 10345705 10398874 10567995 11004767 11485684 11592641 11906023
4302 11906023 12299460 12774694 13171484 13546484 13492217 13213890 13398903 13520174 13227698 12958981
4292 12958981 12648511 12539431 12222924 12223377 11979026 11782662 11606020 11291547 11183049 10809589
4282 10809589 10428299 10021463 9727679 9638020 9375295 8990957 8908899 9158361 9226328 9265501
4272 9265501 9034555 8690650 8743978 9014240 9065380 9135808 9096569 9189721 9356291 9609836
4262 9609836 9791857 9871872 9954475 10063716 10252719 10489981 10621874 10545560 10728678 10756082
4252A0756082K27819M7172k892l8526o9923j79977K84636K9715j18465l16898
4242A0618743k09684J3471j67114j16248l2200j09411j98985R511k07714q5797
4232I514572l4209k41097k77654l3366k01042k24079j80932q5242l31977j18630
4222G786344J19830m9281m3761N281K25520J6967r4592j14040J47818J68098j65692
4211H002492k46081Q2491k04355k99821j9040K61092M7451j00687o1180L270R9615
4200G565247K35876r065j69164M4557N4522n8529J81719j51786Q3750N02862j07775
4189H172214j32168l1546J95153L91458K11125j85445N6035O4448j08837K18137
4179H850574K07993J54867N7888j19734K23605Q6926L82801K75967R1993O4354
$$ plain form
4252 10756082 10983901 11031073 11028181 10989655 10919732 10739755 11024391 11054106 10935641 10618743
4242 10618743 10409059 10422530 10255416 10139168 10106968 9997557 9798572 9808083 9600369 9514572
4232 9514572 9480363 9239266 8961612 8928246 8727204 8503125 8322193 8236951 7904974 7786344
4222 7786344 7906174 7856893 7813132 7818413 8043933 8060900 7966308 7852268 8000086 8168184 8002492
4211 8002492 7756411 7838902 7634547 7334726 7315686 7576778 7624229 7523542 7462362 7465632 7565247
4200 7565247 7801123 7792058 7622894 7667451 7721973 7663444 7845163 7693377 7777127 8279989 8172214
4189 8172214 8040046 8008500 8203653 8595111 8806236 8620791 8676826 8741274 8632437 8850574
4179 8850574 9058567 9213434 9271322 9151588 9375193 9462119 9844920 10120887 10212880 10277234
4169A0277234L09804L05070N2481J98610K53747K76089m2223K38467L48593K21903
4159A2439775N95479n9919N10964L5657L28333O77568K26175L13446L30293K90307
4149A5688078P4564M83084N08108O13549L89450O19842J22669Q0426N14923M44173
4139A9538866N74733K90675L35900K59971L08576N97769O05435K04391L57425
4130B3073741R64566P04149O80001Q36273P85540N56349P98950Q00978R05515
4121C0106062O34955J073343J012772N54054J019589Q64169R27806J001898J225190
4112C8419838J156398P96452Q07881R56436O68653P16909P40834Q89656Q51942
4103D6004999P43129Q26867R98587Q26241J285811J237444J018402J268256J216114
$$ plain form
4169 10277234 10587038 10892108 10944589 11143199 11396946 11673035 11630812 11869279 12217872 12439775
4159 12439775 13035254 12975335 13486299 13521956 13850289 14527857 14754032 15067478 15397771 15688078
4149 15688078 15762642 16245726 16753834 17367383 17756833 18376675 18499344 18579770 19094693 19538866
4139 19538866 20113599 20404274 20740174 21000145 21308721 21906490 22511925 22716316 23073741
4130 23073741 24038307 24742456 25422457 26258730 27044270 27600619 28399569 29200547 30106062
4121 30106062 30741017 31814360 32827132 33381186 34400775 35264944 36192750 37194648 38419838
4112 38419838 39576236 40372688 41180569 42137005 42805658 43522567 44263401 45153057 46004999
4103 46004999 46748128 47574995 48573582 49399823 50685634 51923078 52941480 54209736 55425850
4094E5425850J454477J312851J466125J155458J535496J451439J214541J103606
4086F6119843J251604J382491Q01989J225172J212622J092856J195529J079452
4078G5361558J239859J069887J052795J402550J178484J329373J233476R30475
4070H4798457J231874J264311J199740J354439J065526J449386J561701J839027
4062I5764461K290634K225732K926625K072140J507095J041315O61381N4902K70750
4053A08815035L33248O03612J038799J348777J502840J384138J476217J499401
4045A18002067J113368J164098J195794J254975J400509J249839J015713J139006
4037A27535369J370509R12823P45382R18311J166732J024726R99424J079537J156326
$$ plain form
4094 55425850 56880327 58193178 59659303 60814761 62350257 63801696 65016237 66119843
4086 66119843 67371447 68753938 69555927 70781099 71993721 73086577 74282106 75361558
4078 75361558 76601417 77671304 78724099 80126649 81305133 82634506 83867982 84798457
4070 84798457 86030331 87294642 88494382 89848821 90914347 92363733 93925434 95764461
4062 95764461 98055095 100280827 103207452 105279592 106786687 107828002 108489383 108544285 108815035
4053 108815035 109148283 109751895 110790694 112139471 113642311 115026449 116502666 118002067
4045 118002067 119115435 120279533 121475327 122730302 124130811 125380650 126396363 127535369
4037 127535369 128905878 129818701 130564083 131482394 132649126 133673852 134673276 135752813 136909139
4028A36909139Q21306Q80167P27793P9277K66751M8766j29694N1485O5334K02233
4018A39922557J53369o9931l00208K29729L94360M53014M91213N63641O47594
4009A42485338R10384J387397J439061J667348J424774J282932K019665K286642
4001A54903541L020537L687493M476636N326958M674490K998135J305872q71142
3993A79522520k156280k804609l385038l050216k020406q08601O13422K034529
3985A67945321K711070L113085K893188J754031R36583P9839j187283j511892
3977A76733942j897334j654228j181819l90068R46291K954829N957327R185848
3969A90654788J1871406J2299949R688915M335761j755735p291713j0793559j1759477
$$ plain form
4028 136909139 137730445 138610612 139338405 139417682 139684433 139733199 139603505 139654990 139720324 139922557
4018 139922557 140075926 140005995 139705787 139935516 140329876 140782890 141274103 141837744 142485338
4009 142485338 143395722 144783119 146222180 147889528 149314302 150597234 152616899 154903541
4001 154903541 157924078 161611571 166088207 171415165 176089655 179087790 180393662 179522520
3993 179522520 177366240 174561631 171176593 168126377 166105971 165297370 165910792 167945321
3985 167945321 170656391 173769476 176662664 178416695 179353278 179433117 178245834 176733942
3977 176733942 174836608 173182380 172000561 171610493 172556784 175511613 181468940 190654788
3969 190654788 202526194 214826143 224515058 228850819 227095084 219803371 209009812 197250335
3961A97250335j0640499q983627o387284m599985k957041j117507K22912J249228
3953A64036532J127341J77528j127242k862511m350256n514387o433551o228826
3945A38824628o035599m657492l120496j630170r652O10220J552897J180333L37494
3936A27052163j500253l390281m846039n364957n592127n117238m507779m141371
3928I2592118l665832l316336k828704k691975j884588j597361j827130j857157
3920G2923035k177656k295921k686168k772402k004855j903394k021334j587737
3912E5473568j007359j281881j002893n11101l78320K0887j91136k70940l56853
3903E0493972o12278r34270j011881p11754q84852m31797n00038l56958l22832
$$ plain form
3961 197250335 186609836 177626209 171238925 166638940 163681899 162564392 162787304 164036532
3953 164036532 165163873 165341401 164214159 161351648 157001392 151487005 145053454 138824628
3945 138824628 132789029 128131537 125011041 123380871 123371219 123981439 125534336 126714669 127052163
3936 127052163 125551910 122161629 117315590 111950633 106358506 101241268 96733489 92592118
3928 92592118 88926286 85609950 82781246 80089271 78204683 76607322 74780192 72923035
3920 72923035 70745379 68449458 65763290 62990888 60986033 59082639 57061305 55473568
3912 55473568 54466209 53184328 52181435 51670334 51292014 51312901 51121765 50850825 50493972
3903 50493972 49881694 48947424 47935543 47223789 46338937 45907140 45407102 45050144 44727312
3894D4727312m7425J47079m4022J70499M9387j23365J75222k20992p8921J83207
3884D4937981L3281k22828p1038m91600j87815j22421j6251k11649l42157l61370
3874D2944133l43507R0347P8343k28040j12753Q9404K93547K81857O51061P01931
3864D4446323N84813Q82088Q71697J183012J583800J528022J512310J918267J813122
3855E6323454J973349J866689K025216K186548J789458J800164K041303J764972
3847G1771153J612871J323262J427035J226276J500195J455598J710826J484178
3839H3511394J272580J430554J398361J450825R19789N11117L79906P2385l98436
3830I0548475o26786r42494j387231j263698j675550j943033j686044j963357
$$ plain form
3894 44727312 44679887 44826966 44782944 44953443 45002830 44879465 45054687 44833695 44754774 44937981
3884 44937981 44971262 44748434 44677396 44185796 43997981 43875560 43859309 43647660 43305503 42944133
3874 42944133 42600626 42690973 42769316 42541276 42428523 42517927 42811474 43093331 43744392 44446323
3864 44446323 45031136 45913224 46784921 47967933 49551733 51079755 52592065 54510332 56323454
3855 56323454 58296803 60163492 62188708 64375256 66164714 67964878 70006181 71771153
3847 71771153 73384024 74707286 76134321 77360597 78860792 80316390 82027216 83511394
3839 83511394 84783974 86214528 87612889 89063714 89983503 90494620 90874526 90946911 90548475
3830 90548475 89921689 88979195 87591964 86328266 84652716 82709683 81023639 79060282
3822G9060282k003311j429229j603243j846148j263009j252830j209521j120730
3814F7332261q51560o21937m44661j52695k64770j08930M411J86085M36197j08855
3804F5405546J06910Q4513m2330K72239q7848J28348P48186O19173Q18493R71324
3794F9024554Q05842R80798J029478J044480J157502P83301O57369M17478r5425
3785G5805377k94067r33635q92683j207128j745176j680285j643073j764061j547685
3776F4097584j748759j533197k131850k194864j612168j935294k030226j812943
3768D9098283j582116j579877j643074j519159j820824j491478j393296j296103
3760C6772356j364161j181795r92503j129920p65274q49118q09420p37638p93818
$$ plain form
3822 79060282 77056971 75627742 74024499 72178351 70915342 69662512 68452991 67332261
3814 67332261 66480701 65858764 65414103 65261408 64996638 64887708 64892119 65078204 65514401 65405546
3804 65405546 65512456 65596969 65554639 65826878 65739030 65867378 66615564 67234737 68053230 69024554
3794 69024554 69830396 70811194 71840672 72885152 74042654 74825955 75483324 75900802 75805377
3785 75805377 75511310 74577675 73684992 72477864 70732688 69052403 67409330 65645269 64097584
3776 64097584 62348825 60815628 58683778 56488914 54876746 52941452 50911226 49098283
3768 49098283 47516167 45936290 44293216 42774057 40953233 39461755 38068459 36772356
3760 36772356 35408195 34226400 33233897 32103977 31338703 30489585 29680165 28942527 28148709
3751B8148709n21936n36400o00843k61596o90561m42768k55800k73977l49855
3742B4214973l75004j25131j51111j70053q8888m81825J11108N9815O3381L48959
3732B3406224L81854l05837p5180J25183R7382O3712L68737K56805l4115l00137
3722B3984628j44898N2546J73386L26191j75775J00240l6121K8769J47366k9008
3712B4427324R0469K5392M10321J88421o9497J1886K43009J77464J62540K46424
3702B5913753J68851J33390K39069J24412O5344M09061o6919L75621R5691J98106
3692B7656379J07097K06085o5976K83022K6375L99650K28674m1086K97021M1648
3682B9138889J67852M25335L19219L85657M78568K64771L04447K89026K83733
$$ plain form
3751 28148709 27626773 27090373 26489530 26227934 25537373 25094605 24838805 24564828 24214973
3742 24214973 23839969 23714838 23563727 23393674 23304786 22822961 22934069 22993884 23057265 23406224
3732 23406224 23788078 23482241 23407061 23532244 23629626 23693338 24062075 24318880 24284765 23984628
3722 23984628 23839730 23892276 24065662 24391853 24216078 24316318 24280197 24308966 24456332 24427324
3712 24427324 24517793 24543185 24953506 25141927 25072430 25084316 25327325 25504789 25667329 25913753
3702 25913753 26082604 26215994 26455063 26579475 26644819 27053880 26986961 27362582 27458273 27656379
3692 27656379 27763476 27969561 27903585 28186607 28212982 28612632 28841306 28800220 29097241 29138889
3682 29138889 29306741 29732076 30051295 30436952 30915520 31180291 31484738 31773764 32057497
3673C2057497M26597O53155J70593M0816J06049M1564m16520K18761J3821k38042
3663C3074291p2094j34047n5998p5218J10879j93903J5644L36930M37167J28429
3653C3572080J15895j17207o2339P7452q1175R649k9852k81424m35937j26763
3643C2640379k23588j42888j08717j60787M3647j92521o7790l8049n3094j03468
3633C1593124n6956M1466J1163r1179k37395k8167j0897j94148J9737L28635N05519
3622C1880902j53988J9373L44184K70256J38600J48019M05859j1595L17613K41996
3612C3601219K86206K59634K64740N1178J54771o4900j76704P2813r8784j22011
3602C4228162n2026l69517j35174l50134m11645j94072k63785k89137o37493p43302
$$ plain form
3673 32057497 32484094 33137249 33307842 33348658 33454707 33496271 33079751 33298512 33312333 33074291
3663 33074291 33002197 32868150 32812152 32736934 32847813 32653910 32669554 33006484 33443651 33572080
3653 33572080 33687975 33570768 33508429 33585881 33504706 33514355 33484503 33203079 32767142 32640379
3643 32640379 32416791 32273903 32165186 32004399 32048046 31855525 31787735 31749686 31696592 31593124
3633 31593124 31536168 31577634 31588797 31497618 31260223 31232056 31221159 31027011 31046748 31375383 31880902
3622 31880902 31726914 31746287 32090471 32360727 32499327 32647346 33053205 33041610 33359223 33601219
3612 33601219 33887425 34147059 34411799 34462977 34617748 34552848 34376144 34448957 34350173 34228162
3602 34228162 34176136 33806619 33671445 33321311 32909666 32715594 32451809 32162672 31525179 30781877
3592C0781877n37839m62823k26234k02327n00387n23876j98802j39086j38034
3583B7852469j77281j22248J10303j48291k60450J71028P8791p4145K70528R4422
3573B7795126L36417K53258L29692K84484J94814K60593J79325M07887K96755
3564C0338351J05693J19999J68713L02810L32540J28826J80020K38438L74591
3555C2289981J92251K74884R4761k6243R9349k56216J05924k77672p4458k2139
3545C2400422m69404J20335J24906j17936j08343j62606j65003M72688J46094
3536C2241153L68620O55427M41511L45278L48350L47773Q29270P56425P99768
3527C7133575P83889O09530O81517R89160O64937L73984Q16351P31110J457797
$$ plain form
3592 30781877 30244038 29781215 29554981 29352654 28852267 28328391 28129589 27990503 27852469
3583 27852469 27675188 27552940 27663243 27514952 27254502 27425530 27504321 27430176 27700704 27795126
3573 27795126 28131543 28384801 28714493 28998977 29193791 29454384 29633709 30041596 30338351
3564 30338351 30444044 30564043 30732756 31035566 31368106 31496932 31676952 31915390 32289981
3555 32289981 32482232 32757116 32851877 32825634 32924983 32668767 32774691 32497019 32422561 32400422
3545 32400422 31931018 32051353 32176259 32058323 31949980 31787374 31622371 32095059 32241153
3536 32241153 32609773 33265200 33706711 34051989 34400339 34748112 35577382 36333807 37133575
3527 37133575 37917464 38526994 39208511 40197671 40862608 41236592 42052943 42784053 44241850
3518D4241850J050050R25030J341873J251800J165284J341914J412242J777506
3510E4507549J699132J830618J871415K107993J907188K115591K258718K336707
3502G0634911K828028K752117L261722L584534L865596M445058N377788N989652
3494A02739406O396882P347585Q680167R729233J0969774J2352154J3787075J5639428
3486A87641704J6563228J6510539J6425115J5074042J2944800J0624128Q318707
3479B84102263O710520N528897M657310M126613K774849P11584k585402o075590
3471B99951044r700946j2987940j5261037j6715434j6342958j5654579j4984610
3464A98303540j3509767j1825482j0526614r193372q117491p129568o273809n360388
$$ plain form
3518 44241850 45291900 46216930 47558803 48810603 49975887 51317801 52730043 54507549
3510 54507549 56206681 58037299 59908714 62016707 63923895 66039486 68298204 70634911
3502 70634911 73462939 76215056 79476778 83061312 86926908 91371966 96749754 102739406
3494 102739406 109136288 116483873 125164040 134893273 145863047 158215201 172002276 187641704
3486 187641704 204204932 220715471 237140586 252214628 265159428 275783556 284102263
3479 284102263 290812783 296341680 300998990 305125603 307900452 308612036 306026634 299951044
3471 299951044 290250098 277262158 262001121 245285687 228942729 213288150 198303540
3464 198303540 184793773 172968291 162441677 153248305 145130814 138001246 131727437 126367049
3456A26367049m729368l919945l773942k996134k580312k179128j717194o76601
3448A03794425m63374J57596N67730J244168J514267K178009K885882L209837
3440A15088540M142994M730621N719753O482183O922843P833365Q285626Q631630
3432A67837555Q361885P831183O909550N360618M000125J932609m828k181456
3424B00047241l402316m847371n900631o575993o877437o975077o915013o635491
3416A51917912o303520o274778n526309n413062m940748m059767l484808l064712
3408A12850208k408271j957664j561190j237440q00194m92023j57117o442M93065
3399A04722932Q09197N99348O34334O20524K25477o7282o93845j378305j595807
$$ plain form
3456 126367049 121637681 117717736 113943794 110947660 108367348 106188220 104471026 103794425
3448 103794425 103331051 103488647 104056377 105300545 106814812 108992821 111878703 115088540
3440 115088540 119231534 123962155 129681908 136164091 143086934 150920299 159205925 167837555
3432 167837555 176199440 184030623 190940173 196300791 200300916 202233525 202228697 200047241
3424 200047241 196644925 191797554 185896923 179320930 172443493 165468416 158553403 151917912
3416 151917912 145614392 139339614 133813305 128400243 123459495 119399728 115914920 112850208
3408 112850208 110441937 108484273 106923083 105685643 104885449 104393426 104236309 104229867 104722932
3399 104722932 105532129 106131477 106765811 107386335 107611812 107544530 106850685 105472380 103876573
3390A03876573j854707j862764k498186k912349k176263k252538k019316j525235
3382H6775215j242428q19670r44742p35413r71456p90061l55181n94328l94048
3373G9927888l12694m63840j46399k36799q8079j77881k8917q7931o0319O86728
3363G9011757P70783P88763J028390J127589R87662J031494J214823J824862J592285
3354H9378408J738681J700282J819475J968471J913395J852479J751380J802133
3346A03924704K011365K274577K412784K742582L091853L555397M231309N057904
3338A29302475N617609O686663P724024Q756332R451857R108607R303413Q809036
3330A94760016O796023M433692J165552k022521m693052p208050q979631r996256
$$ plain form
3390 103876573 102021866 100159102 97660916 94748567 92572304 90319766 88300450 86775215
3382 86775215 85532787 84713117 83768375 83032962 82061506 81271445 80916264 80321936 79927888
3373 79927888 79615194 79151354 79004955 78768156 78680077 78502196 78473279 78385348 78325029 79011757
3363 79011757 79782540 80571303 81599693 82727282 83714944 84746438 85961261 87786123 89378408
3354 89378408 91117089 92817371 94636846 96605317 98518712 100371191 102122571 103924704
3346 103924704 105936069 108210646 110623430 113366012 116457865 120013262 124244571 129302475
3338 129302475 134920084 141606747 149330771 158087103 167538960 176647567 185950980 194760016
3330 194760016 201556039 205989731 207155283 205132762 200439710 193231660 184252029 174255773
3322A74255773j0443418j0388526r911840r436712q413686p524407o723256o307831
3314A05106097n584226m189447m026842l669800k795511k422131j868144j238563
3306G9311433j234948q72515j016031p50094j46444k00425j84890j4827J39427
3297G5030686N57320P03417J057489J263381J622545J785180K377366K533999
3289H6931383L016473L486366L937131M420093N002945N564117O390524O713022
3281A25462054O744865P151111P093864O890304N773633M203236L241115J771892
3273A68332074J84164j390332k814269l337194m139473l974108m024110l442777
3265A45393975k687373k219965r08981O9509J449097K515111L684696M694947
$$ plain form
3322 174255773 163812355 153423829 143511989 134075277 125661591 118137184 111413928 105106097
3314 105106097 99521871 95332424 91305582 87635782 84840271 82418140 80549996 79311433
3306 79311433 78076485 77203970 76187939 75437845 75291401 75090976 74906086 74891259 75030686
3297 75030686 75588006 76291423 77348912 78612293 80234838 82020018 84397384 86931383
3289 86931383 89947856 93434222 97371353 101791446 106794391 112358508 118749032 125462054
3281 125462054 132206919 139358030 146451894 153342198 159115831 163319067 166560182 168332074
3273 168332074 168516238 167125906 164311637 160974443 156834970 152860862 148836752 145393975
3265 145393975 142706602 140486637 139577656 139647165 141096262 143611373 147296069 151991016
3257A51991016N007328N149533M249496K688012O22642j766350m328696o545892
3249A57067089q106226r148921r381371r306646q850931p988465p348956o685830
3241I0249743n846995n412866m614383m057368l613695l200411k680305k781424
3233E8042296k617007k010702k280572j467749j642175j436636j269726j239355
3225D4078374j003716j125423r94372j128385j287737j054770r71885q08731j011435
3216C4691920r69228j043954r75051o62501q75901q68924r02594r59406q64280
3207B6570081r62228p99599n04388o31731p93231l78033o13578o10801p07336
3198B0569156n22290q1948k94257l41397l88712l55814l38521l09103p36079k96580
$$ plain form
3257 151991016 156998344 162147877 166397373 169085385 169708027 167941677 163612981 157067089
3249 157067089 148960863 139811942 130430571 121123925 112272994 104284529 96935573 90249743
3241 90249743 84402748 78989882 74375499 70318131 66704436 63504025 60823720 58042296
3233 58042296 55425289 53414587 51134015 49666266 48024091 46587455 45317729 44078374
3225 44078374 43074658 41949235 40954863 39826478 38538741 37483971 36512086 35703355 34691920
3216 34691920 33722692 32678738 31703687 31041186 30165285 29296361 28393767 27434361 26570081
3207 26570081 25607853 24808254 24303866 23672135 22878904 22500871 21887293 21276492 20569156
3198 20569156 20046866 19964918 19670661 19329264 18940552 18584738 18246217 17937114 17201035 16904455
3188A6904455l19618j69041n60689j00640J459n45737m54615Q6635j71282J23740
3178A4794667K5856n89442j9907k94850j90580K448n7907N8524j3065j76449K42007
3167A3781302J10431k9727J28391J13360J87747J31293o7066k92659O4069p4238
3157A4052903j60260j17729j85758k07207j37201J45696l9957Q8705O8312p984
3147A3499520j62741k78474k10116J38199Q0161P6651j20282L69538K696J51665
3137A3546817P25104O11823J151811P22372N78946L99473J960n14194q80715r12577
3127A5430820j016025r82614p29510m09102o70118m64866m86797m21040j21946
3118A0128802k85429J3799k07767n42980j07140J53125n311l9540p8689j81239
$$ plain form
3188 16904455 16584837 16415796 15855107 15754467 15755926 15210189 14755574 14842209 14670927 14794667
3178 14794667 14820523 14231081 14211174 13916324 13725744 13728192 13670285 13728809 13715744 13539295 13781302
3167 13781302 13891733 13862006 13990397 14103757 14291504 14422797 14355731 14063072 14127141 14052903
3157 14052903 13892643 13774914 13589156 13381949 13244748 13390444 13350487 13439192 13507504 13499520
3147 13499520 13336779 13058305 12848189 12986388 13066549 13143200 13022918 13392456 13395152 13546817
3137 13546817 14271921 14883744 16035555 16757927 17336873 17736346 17738306 17224112 16343397 15430820
3127 15430820 14414795 13432181 12702671 12293569 11623451 11158585 10671788 10250748 10128802
3118 10128802 9843373 9857172 9649405 9106425 8999285 9152410 9147099 9107559 9028870 8847631
3108H847631J20816Q7420o0799j20928J70856J89550k3996j12134j99684m3741
3098H854991k06344m00938l59798l68721l25556k47177J92920m55866l41575M2750
3088F384686m96127l98687k115j76840n3730J3132j60638J09686m4810k58275
3078D916282j44996L15374r3170k07604k66906j52017M6966l05497J73310K21592
3068D503334j62893k9994L22036k10149J9006J73794k37137m23150j05833k1202
3058C827812K4244J9408k25591K04357p3401k11362L67795j82975j24511R4564
3048C720340j59654r0553n3628L51881k219r7416Q0348j96049r8498K58751r0858
3037C622445l48195p7949j5417q9458J08603j82004o7888k61867q1588k69510
$$ plain form
3108 8847631 8968447 9055867 8995068 8874140 9044996 9234546 9210550 9098416 8898732 8854991
3098 8854991 8648647 8247709 7887911 7519190 7193634 6946457 7139377 6683511 6341936 6384686
3088 6384686 5888559 5489872 5487757 5310917 5257187 5270319 5109681 5219367 5174557 4916282
3078 4916282 4771286 5086660 4993490 4785886 4518980 4366963 4413929 4108432 4281742 4503334
3068 4503334 4340441 4310447 4632483 4422334 4441340 4615134 4377997 3954847 3849014 3827812
3058 3827812 3852056 3871464 3645873 3850230 3776829 3565467 3933262 3750287 3625776 3720340
3048 3720340 3560686 3470133 3416505 3768386 3766167 3668751 3749099 3553050 3454552 3713303 3622445
3037 3622445 3274250 3196301 3180884 3091426 3200029 3018025 2950137 2688270 2606682 2337172
3027B337172j7105K96021j43895j20664J35976k10955r104j06655r9396K17363
3017B278758R1709j33191J01846Q5400J35426p797k7026m22032o0518M896J9965
3006B067436j17628O0260K47381j48281k47496J99979J83582o7436j89635J07527
2996B095689L76995k80902m0309J04458o808K8702k00780N4551J02276j25385
2986B108487k6100r438J35901J02285j38258j03804L7117P933J03993k07661j02068
2975A908387j06328L41136k3254j83956Q7671O1572j33366p6571J14759p6233
2965A913817j20572J29325J90383K4856r931o8852J9154k89061k34931J71840
2955A726028j85810p8147o6409L1238p6355j44670J29123k44165J67459J19487
$$ plain form
3027 2337172 2320067 2616088 2472193 2351529 2487505 2276550 2267446 2160791 2061395 2278758
3017 2278758 2370467 2237276 2339122 2424522 2559948 2552151 2525125 2103093 2042575 2047471 2067436
3006 2067436 1949808 2010068 2257449 2109168 1861672 2061651 2245233 2177797 1988162 2095689
2996 2095689 2472684 2191782 2151473 2255931 2249123 2277825 2077045 2131596 2233872 2108487
2986 2108487 2082387 2072949 2208850 2311135 2172877 2069073 2106190 2114123 2218116 2010455 1908387
2975 1908387 1802059 2143195 2119941 1935985 2023656 2085228 1951862 1875291 1990050 1913817
2965 1913817 1793245 1922570 2112953 2137809 2127878 2059026 2078180 1789119 1554188 1726028
2955 1726028 1540218 1462071 1395662 1426900 1350545 1205875 1334998 1090833 1258292 1377779
2945A377779q9064j7688J15228j54528q1570K29928j09111k43423p1908J4314
2935I69957J69978Q5914k37544R2051j35129j3499k44469K51584k04648R0497
2925H24692K3074j74226K5734n5242J48798J02255L474j4974j30507j29565j58245
2914D65268K22678O7432J6976j84560O9647K12173L2618k9417j94182J29781Q537
2903H16951j52158k23027K10849L1016M8624J89449j95175R4604j28941k9448
2893F62744J51188Q8272n7251k83981j14794Q7281p0174k44282p2101J20696K31553
2882D99151N294J42802q7406r6314J27385R4519j27124N3812O6493J343O278k99265
2870C86968r7608K14038k2843p7406Q5162M7276N8879Q6625q658j43851k1791
$$ plain form
2945 1377779 1288715 1271027 1386255 1231727 1150157 1380085 1270974 1027551 955643 969957
2935 969957 1139935 1225849 988305 1080356 945227 931728 687259 938843 734195 824692
2925 824692 847766 673540 699274 644032 792830 895085 898559 883585 753078 623513 465268
2914 465268 687946 755378 772354 587794 657441 869614 902232 872815 678633 808414 816951
2903 816951 664793 441766 652615 683631 732255 921704 726529 821133 692192 662744
2893 662744 813932 902204 844953 560972 446178 533459 463285 219003 146902 267598 499151
2882 499151 504445 647247 559841 463527 590912 685431 558307 612119 678612 679955 686233 386968
2870 386968 289360 503398 480555 403149 488311 535587 594466 681091 672433 528582 506791
2859E06791P9889J98558k40438r7944L45726p2523n2189o2150j81196K04672J61958
2848G91154j50633J72412J1702k85834n4751K43974k013j39423K27255J37964
2838I51807r1007k89088L7299J89627r1604K00524r466k30870k25462K19262K6865
2827F87887n4206r4746N8182l342j41415j18580J71825m8392K89657k83837j1912
2816D51121R4107r6109L9954k67970J83722K90683r9367R9428O4654J85309K2389
2805I67921k39370k16017Q8534J1269k0849J23920p561m026m1696k07338J20784
2794E75571J5420N553k06027J69943P0584j12474J02631j33174J18027j67680
2784D38374L5678j57805o1707j34696L466j2065J15158K21516k69871n9759J51722
$$ plain form
2859 506791 586680 785238 544800 446856 792582 720059 667870 605720 424524 629196 791154
2848 791154 640521 812933 824635 538801 484050 728024 726011 586588 813843 951807
2838 951807 860800 571712 609011 798638 707034 907558 898092 667222 441760 661022 687887
2827 687887 633681 538935 597117 593775 452360 333780 505605 457213 746870 463033 451121
2816 451121 545228 449119 489073 221103 404825 695508 596141 695569 760223 945532 967921
2805 967921 728551 512534 601068 612337 591488 715408 707847 703821 662125 454787 575571
2794 575571 590991 596544 390517 560460 631044 518570 621201 488027 606054 438374
2784 438374 474052 316247 254540 119844 123310 111245 226403 447919 178048 118289 270011
2773B70011k7154l55830Q7903Q0392q9655J16143K33012K6249j90486j13491j0814
2762B6280L14748K8816p2798Q618o207l75548J47907J65203J95659k53352j77718
2751A608Q7710J99687J64610J86446N6893m2562j35845n4494q9989o8797J02020
2740D07287o1609r5546K06152p7790o7953k0192K33240q6760q5479j8696J44726
2729D77380j61894J75468m8807n1256k1242k10093L09484J738j28168j61803J08732
2718B89539j64763m4196j23449J12530M2140J80035j50060J13652k037j32323
2708A21068K41782k00182R7987k22476J55518J84651j66777J38631J08134K55480
2698G13816K4002j55691j03298j28441J87566N6006j1886J3345l9961l2811J7419
$$ plain form
2773 270011 242857 -112973 -25070 55322 -34333 81810 314822 341071 150585 37094 26280
2762 26280 341028 369844 297046 305664 299457 -76091 71816 237019 432678 179326 1608
2751 1608 89318 289005 453615 640061 696954 654392 518547 464053 374064 305267 407287
2740 407287 345678 250132 456284 378494 310541 290349 523589 436829 351350 332654 477380
2729 477380 315486 490954 442147 390891 369649 159556 469040 470778 342610 180807 289539
2718 289539 124776 80580 -42869 69661 111801 291836 141776 255428 253391 121068
2708 121068 362850 162668 260655 38179 193697 378348 211571 350202 458336 713816
2698 713816 737818 582127 478829 350388 537954 593960 582074 595419 555458 522647 540066
2687E40066n2243K330l6482o1786J9032r0014K11564N6886k82139n3214M10599
2676F64599j22517q6807R2236q7485k44680n0940N10849l16267l13194J17932
2666A63726l8703K39470k2553j82672p2737R830K25454l5068J00098M4421l52885
2655G8381j14535L2063J70300n4379K4522j472k9914K82p4441n9828k09565j52059
2643c90645M32769J14515p1816J11325n8014K10202j17847K7614J51011N9326
2633D68440r1564k82735P7518N2053R2992p5446r3311J15160j30451R4243K31310
2622D58209n5284Q3976O002j3041k39936J00096k5224j5675L17726L2912j54210
2611D95551q7515J18227j27723o9900K24812q0173j01157Q255R0307R7983l9627
$$ plain form
2687 540066 487823 490153 453671 391885 410917 320903 532467 589353 307214 254000 664599
2676 664599 542082 455275 547511 460026 215346 164406 675255 358988 45794 163726
2666 163726 125023 364493 341940 159268 86531 96361 321815 286747 386845 431266 78381
2655 78381 -36154 -4091 166209 111830 136352 134880 104966 105248 30807 -29021 -238586 -390645
2643 -390645 42124 156639 84823 196148 138134 348336 230489 258103 409114 468440
2633 468440 376876 94141 171659 223712 316704 241258 147947 263107 132656 226899 458209
2622 458209 402925 486901 492903 479862 239926 340022 314798 299123 616849 649761 495551
2611 495551 408036 526263 398540 328640 553452 473279 372122 380377 470684 568667 529040
2600E29040N1723O29582K34779M19218q201m858j73783l24964J95119k66467j55068
2589A126120k07680j2146k20195Q5821O4649k42656K08239L6910l9504j7108k52603
2578E29847P1910K39178J20930J23028l90602k05303K9802j83029j61920R5749
2568B69590O6744N0184J6391J0362J07205k26149P9850N5393J4239j65738K0049
2557B98120k42443k36187Q724L20624J53461J38155q8969j25950J14637N1245
2547C91417k47203K1J52052r964o6127J56009m6158O6641j20197m1090J06338
2536C41739o1624K84457k31132p2674j36127K00526l7797k8558j27934K15789
2526C46665q8515J09894K1461R1474j73428k82662J56845J94990L0511j27981
$$ plain form
2600 529040 580763 1210345 1445124 1864342 1856141 1851283 1677500 1352536 1547655 1281188 1126120
2589 1126120 918440 906294 686099 771920 836569 593913 802152 839062 799558 782450 529847
2578 529847 601757 840935 961865 1084893 694291 488988 518790 335761 173841 269590
2568 269590 336334 386518 402909 413271 520476 294327 374177 429570 443809 278071 298120
2557 298120 55677 -180510 -171786 148838 302299 440454 351485 225535 340172 391417
2547 391417 144214 144235 296287 286323 220196 376205 330047 396688 276491 235401 341739
2536 341739 280115 564572 333440 260766 124639 325165 287368 258810 130876 346665
2526 346665 258150 368044 389505 480979 307551 24889 181734 376724 407235 279254
2516B79254l9378M016l3311n0651R7532Q5226N4826L0181K7994k6425J2035j01600
2504C39699K2882J90132L3478L0242N5148n7586J61177k10823l26862r3405J92515
2493C36597r7805J74487j20995J26037r3134q5529K10609q6186l2003M3272r4560
2482B80790K33390j35932O7527J11612J14595K67367k55537J4717r586n2228q4567
2471E52148N2839K38512J11323K5157K6596r2795j11311k2004n2951J70717J7239
2460I15470M486r6993N2017J03204o4991j3081J94114Q5719j37419J33889K84602
2449A461017j97895n2634k29067j90928M6374M8493J77480L3480l19869l6725
2439G39726R0958K16418n8627J13605q073l29077k6561r8941N5825j08020R07
$$ plain form
2516 279254 239876 243892 210581 159930 257462 342688 397514 427695 455689 429264 441299 339699
2504 339699 362581 552713 586191 616433 671581 613995 775172 564349 237487 144082 336597
2493 336597 238792 413279 292284 418321 325187 239658 450267 364081 332078 375350 280790
2482 280790 514180 378248 445775 557387 671982 939349 683812 698529 688943 636715 552148
2471 552148 604987 843499 954822 979979 1006575 913780 802469 780465 727514 898231 915470
2460 915470 919956 822963 874980 978184 913193 900112 1094226 1179945 1042526 1176415 1461017
2449 1461017 1263122 1210488 981421 790493 836867 885360 1062840 1096320 776451 739726
2439 739726 830684 1047102 988475 1102080 1094007 764930 738369 639428 695253 587233 588140
2428E88140o7968J47078N2108J75842j00982J56914J89542J55668j4780K22971
2418A504533J15222M07006j89114M7819J15095J48820O8443j60326p5434K17038
2408B199102Q1434j92287J64245r9540J83039L80763M7456k60580J3778K09510
2398B726920j22369j14391L9508k05981j62009r975r7230J38564m1887J53889
2388B305039K16033J07264L53246K12398K77085J01015N06685J09112o4872R6707
2378D219712M5110M64973J79330J83422M44660L32065J92272M92380L86121o2426
2368F877619J83524P9730N25600K99121r602J70740M87269O24187O37862L79521
2358A0255571J18215L17586M90302O61603N01106O48685R21575R00962J367065
$$ plain form
2428 588140 520172 667250 719358 895200 794218 951132 1140674 1296342 1281562 1504533
2418 1504533 1619755 2026761 1837647 1885466 2000561 2149381 2217824 2057498 1982064 2199102
2408 2199102 2280536 2088249 2252494 2152954 2335993 2716756 2764212 2503632 2517410 2726920
2398 2726920 2604551 2490160 2529668 2323687 2161678 2151703 2054473 2193037 2151150 2305039
2388 2305039 2521072 2628336 2981582 3193980 3471065 3572080 4078765 4187877 4123005 4219712
2378 4219712 4264822 4729795 4909125 5092547 5537207 5869272 6061544 6553924 6940045 6877619
2368 6877619 7061143 7140873 7666473 7965594 7955992 8126732 8614001 9238188 9876050 10255571
2358 10255571 10373786 10691372 11181674 11843277 12344383 12993068 13914643 14815605 16182670
2349A6182670J387337K163587K908901L416201L371140K998946K637322K228490
2341C7294594K115255K340471L298588M929663P572485J1051556J5879770K2889479
2333A07371861L5300187N3129762O6075039O1388230L8151366O654953k1854007
2326C46217391m6371702n2066873m5229459l8562302l1318307k5076739j8267136
2319H9324873j3475446r956774p449579n215163m459947l885028m237113l988931
2311C6656892l444558k945508k558608j997433j947356j799172j488780j265178
2303A9210299j160295j223123r28926j050859j227072p72715n05989o84313m29689
2294A1227318m09671l59787m22132n67338l55639k67292p21491k28127k03680
$$ plain form
2349 16182670 17570007 19733594 22642495 26058696 29429836 32428782 35066104 37294594
2341 37294594 39409849 41750320 45048908 49978571 57551056 68602612 84482382 107371861
2333 107371861 142672048 195801810 261876849 323265079 361416445 368071398 346217391
2326 346217391 299845689 247778816 202549357 163987055 132668748 107592009 89324873
2319 89324873 75849427 65892653 58443074 53227911 48767964 44882936 40645823 36656892
2311 36656892 33212334 30266826 27708218 25710785 23763429 21964257 20475477 19210299
2303 19210299 18050004 16826881 15897955 14847096 13620024 12847309 12341320 11657007 11227318
2294 11227318 10817647 10457860 10035728 9468390 9112751 8845459 8123968 7895841 7692161
2285G692161l71691j6277r0864j61880J00290j77327k93090l43226R9480J43653
2275F581229o9504m56506j14465J84958k98332j69550P022J1265q0477j18666
2265E476974J0137K54280k2649n40504n82993n06017k77259N3272j52824k78727
2255C433690k81967P3859J13524j48256J32025L40624j58413m55499j9303p745
2245C022539o5715O48k53060J86249m66489J62404J19263j39652j40138P4811
2235B500860N0883J7712M7993l9426j17881J47074K88044k37505J2683k43435
2225B427002M2209J5303k4583j44268J2511K1932k72346l4796p6177k34761j9175
2214A712851k539k37857M2661j94405M1169j04859j34959O8459m06414k6473k8877
$$ plain form
2285 7692161 7320470 7304193 7213329 7051449 7151739 6974412 6681322 6338096 6437576 6581229
2275 6581229 6511725 6055219 5940754 6125712 5827380 5657830 5664852 5676117 5595640 5476974
2265 5476974 5487111 5741391 5718742 5178238 4595245 4089228 3811969 3865241 3712417 3433690
2255 3433690 3151723 3225582 3339106 3190850 3322875 3663499 3505086 3049587 3030284 3022539
2245 3022539 2956824 2957472 2704412 2890661 2424172 2586576 2705839 2566187 2426049 2500860
2235 2500860 2551743 2569455 2617448 2578022 2460141 2607215 2895259 2657754 2670437 2427002
2225 2427002 2469211 2484514 2459931 2315663 2328174 2350106 2077760 2042964 1966787 1732026 1712851
2214 1712851 1710312 1472455 1515116 1320711 1361880 1257021 1122062 1190521 784107 757634 728757
2203G28757q532J10372J53544p5404L14015J96426l81737o6753k6688J94777K9279
2192A168056j01449L0883k91314J70276K65977j28694j72887Q4002N09411m9855
2182A484406k59410Q60k69221M4386L53832J0918j67461j79621p2591L8851J19620
2171A104569j36680j39334J68883O5887j35542j25647o235M9814J8442k0082j69634
2160F74441J32269K07153m51509k31918j00657O2778k2670J38351J77101o1865
2150E23474j91934J00268K04530J79154j57927M9787L692n8910K2518n7700O9462
2139F86414L8898l7270J4000J08867o2526k10247j65075o5945l343K67243N3657
2128F24673k4662m4141J43527q8105j43465j08085k240k4126P9748j10480k4265
$$ plain form
2203 728757 720225 830597 984141 908737 1222752 1419178 1037441 970688 944000 1138777 1168056
2192 1168056 1066607 1097490 806176 976452 1242429 1113735 940848 1024850 1534261 1484406
2182 1484406 1224996 1225856 956635 1001021 1354853 1365771 1198310 1018689 946098 984949 1104569
2171 1104569 967889 828555 997438 1063325 927783 802136 795901 845715 864157 844075 674441
2160 674441 806710 1013863 562354 330436 229779 292557 269887 408238 585339 523474
2150 523474 331540 431808 636338 815492 657565 707352 711044 652134 674652 616952 686414
2139 686414 725312 688042 702042 810909 748383 538136 373061 307116 303773 571016 624673
2128 624673 600011 555870 699397 611292 467827 359742 357502 333376 413124 302644 278379
2117B78379R2670K100O9297j5060N4768k0880j5843J0446l512k60174p7434j6227
2105I8530l8297J25335k1095J12943j4645j82116j76820K2047J92798K22328P3628
2094D14636k38171j70267O0672K17521j62240j98247r9458N4314K61339J7775
2084A57874q9943O2361o8198k03483L7059O3201J45472Q2659k38239R6690P8501
2073A23954m0686J10246L9237J34521J25785J03420K98037n6772m859j08155L22064
2062A046792M09544K80458J92995J1691j34799m3632j85619l54203l35317k22718
2052F65192k97004O7555M4739m1443q6111K7679K28232Q0986l69602k37273J70804
2041B53754J56661N930k84445j81207p3151K74001j26960M6199j5309j29688n5386
$$ plain form
2117 278379 371049 373149 442446 427386 482154 461274 445431 455877 452365 192191 114757 98530
2105 98530 60233 185568 164473 277416 262771 80655 -96165 -74118 118680 341008 414636
2094 414636 176465 6198 66870 284391 122151 -76096 -175554 -121240 140099 157874
2084 157874 67931 130292 62094 -141389 -104330 -41129 104343 187002 -51237 45453 123954
2073 123954 83268 193514 232751 367272 493057 596477 894514 837742 832883 724728 1046792
2062 1046792 1456336 1736794 1929789 1941480 1806681 1763049 1577430 1223227 887910 665192
2052 665192 368188 435743 480482 439039 352928 380607 608839 689825 320223 82950 253754
2041 253754 410415 416345 131900 -49307 -122458 151543 24583 70782 55473 -74215 -129601
2030a29601O9916k5635J45812m4547P1718L0707J16243k83213j38462k74478K49367
2019b12173K22336J4233M9832j45928R8228Q9883j3254m4419j19630o3759J64129
2008C9478m1618l8559Q9187J01460q8707k3912l3707k20249o4792L2326J91597
1997e7496J22250o0682l8459J4852j8605k03585J19311J45582k19361m3435m5492
1986b85120J50990N8817j21463P2912p1937n743Q9637J36067n1548L4542j58544
1975a51390k99140J66999r9487R8987N3994k5839J99206r5488p4235J43495O7655
1964a5243N1701J2883j06734R3870l2900j09920k3827J57394k37494k65856K01273
1953b74853K75662j70664k938N5343O897m7452j22294J50159N7353j90727J62996
$$ plain form
2030 -129601 -59685 -85320 60492 15945 87663 118370 234613 -48600 -187062 -461540 -212173
2019 -212173 10163 24396 74228 -71700 26528 116411 103157 58738 -60892 -124651 39478
2008 39478 -2140 -40699 48488 149948 61241 37329 3622 -216627 -281419 -249093 -57496
1997 -57496 64754 4072 -34387 -19535 -38140 -241725 -122414 23168 -196193 -239628 -285120
1986 -285120 -134130 -75313 -196776 -123864 -195801 -201544 -111907 24160 -27388 7154 -151390
1975 -151390 -450530 -283531 -383018 -284031 -230037 -255876 -56670 -152158 -226393 -82898 -15243
1964 -15243 36458 49341 -57393 36477 3577 -106343 -130170 27224 -210270 -476126 -274853
1953 -274853 809 -169855 -172793 -117450 -110553 -158005 -280299 -130140 -72787 -263514 -100518
1942a00518p89j73768l8338n3627L3083J15501P3209l6688M7884j7392j4300p0036
1930b35779p5502l7273R439K01533M1018j36374K31005L4691L6121l9671J0144
1919C9352J38184J7453k00092J59375p4182k3091Q9060j49285R5k00561J95742
1908g950J31261p3114j64045J51944k20266O9330K49480K57677k56933j97103
1898e9719K23319j46407R4852R6887r5536j34630K72548j01255l74145o2242R3528
1887a92800K10739J99425J3812k31069J66048J6491j71692Q8493J40405j07556
1877A32296P8759k53651J25103j39650J849P7995k41411L7730J19299k29566K3118
1866b68129K31591j11177J19648K1908O4587O9531j79669l1556K91609p7057m4574
$$ plain form
1942 -100518 -101307 -275075 -313413 -367040 -333957 -218456 -145247 -181935 -134051 -151443 -165743 -235779
1930 -235779 -311281 -348554 -339115 -137582 -96564 -232938 -1933 32758 68879 29208 39352
1919 39352 177536 194989 -5103 154272 80090 56999 146059 -3226 -3131 -203692 -7950
1908 -7950 123311 50197 -113848 38096 -182170 -112840 136640 394317 137384 -59719
1898 -59719 163600 17193 112045 208932 113396 -21234 251314 150059 -224086 -286328 -192800
1887 -192800 17939 217364 231176 107 166155 182646 10954 99447 239852 132296
1877 132296 211055 -42596 82507 -57143 -55294 22701 -218710 -180980 -61681 -291247 -268129
1866 -268129 -36538 -147715 -28067 -6159 58428 127959 -51710 -83266 208343 131286 86712
1855H6712j20634q4112l3405j10084J89386o7132J09101k1163j25540J17318J18763
1844E9210j13241k50550J41243P8890j90104L08746j0047j25233k2751J9623J35270
1833C1056O5236j09517q2206K31753r1911r3543j56510r9279K30635J32828M7328
1822A05870j17840k93043k2586n3220K65455J4390J05606J00808m5061O5829K4703
1811A50911j612K09771j79451M5881j16462p5154L8667O0911p1859j03439M1358
1800d78N9971k16247r4616J23145r4474M3759J74043j03619M6088K70262J60561
1789C68395j56205k77562k1480J07138j40565J91865j28999j30548j50687J13732
1779b24916J34653J7688O1629j3756M4288L2460k8716k4703o61n6344l84484J53391
$$ plain form
1855 86712 -33922 -118034 -151439 -261523 -72137 -139269 -30168 -51331 -176871 -59553 59210
1844 59210 -54031 -304581 -163338 -84448 -274552 34194 24147 -101086 -123837 -104214 31056
1833 31056 96292 -13225 -95431 136322 44411 -49132 -205642 -304921 -74286 58542 105870
1822 105870 -11970 -305013 -327599 -380819 -115364 -100974 4632 105440 60379 126208 150911
1811 150911 149299 359070 179619 225500 109038 33884 72551 133462 61603 -41836 -478
1800 -478 59493 -156754 -251370 -128225 -222699 -178940 -4897 -108516 -62428 207834 368395
1789 368395 212190 -65372 -86852 20286 -120279 71586 -57413 -187961 -338648 -224916
1779 -224916 -90263 -72575 -10946 -24702 19586 52046 23330 -1373 -2034 -58378 -442862 -289471
1767b89471L2106K91880K04750l13061k70636J34511J37917N5554J36845p1022
1757D9373L0709O9611j35654j54879J6464o0198K07813N2349r0934k68507j32136
1746d15989J2291K73557p9565m2944K27330K9460j57250q046p1658K05050m6399
1735g4163j08472j88901J69792k15137K17217J6227Q8856N3841j50303J53103
1725c7940J15064j43542J10772q7426r6968Q9149j13015O1313J8356m5024J07387
1714b1874Q6318J02919n472p9296n4605J5189p4899Q2946j40634O1744l5430j23961
1702a87055O3997J02811K2305J5366L6665j20714Q502n7746K8782j31858J33103
1691h5842k8273o5804P0155L9297j52080k11643K9092O4510K11498J57694K22353
$$ plain form
1767 -289471 -257365 34515 239265 -73796 -344432 -209921 -72004 -16450 120395 49373
1757 49373 80082 149693 14039 -140840 -124376 -184574 23239 75588 -15346 -283853 -415989
1746 -415989 -403698 -130141 -209706 -252650 -25320 4140 -153110 -161156 -232814 -27764 -74163
1735 -74163 -182635 -371536 -201744 -416881 -199664 -183437 -94581 -40740 -191043 -37940
1725 -37940 77124 -66418 44354 -43072 -140040 -50891 -163906 -102593 -84237 -129261 -21874
1714 -21874 64444 167363 161891 82595 27990 43179 -31720 51226 -89408 -27664 -63094 -187055
1702 -187055 -123058 -20247 2058 17424 54089 -66625 -58123 -115869 -87087 -218945 -85842
1691 -85842 -114115 -179919 -109764 -70467 -222547 -434190 -405098 -340588 -129090 28604 250957
1680B50957p0211o7761M5432j72298m1804m7178Q8595j46329k13098L43441l6911
1669f7165k98857m2827K17544J27717j2826l931q5788O6297l27764K82695R7720
1658d7185K04671j1528q2794k09871j15347J90269K3514m3021q3953K905L26394
1647A54054J6612k26207j38297L03175L7452k28262n7669j29030l5863O3175J78374
1636f2486N6058j72049Q6193n2236J44546j23472j53494L09175j72600L257J34
1625a36974p4792j40728M99403n279o4283l5223k16197k00715O4811J52912K9118
1614a27947J3999O4747j84674K1545J32444J05885p0708k2611M202Q921k9987
1603h4184p5805j79853L01256J59717l7296J58516j60111k60943J72662K59008
$$ plain form
1680 250957 180746 112985 158417 -13881 -55685 -102863 -14268 -160597 -373695 -30254 -67165
1669 -67165 -366022 -408849 -191305 -63588 -76414 -80345 -166133 -99836 -427600 -144905 -47185
1658 -47185 157486 145958 63164 -146707 -262054 -71785 -48271 -91292 -175245 -172340 154054
1647 154054 170666 -55541 -193838 109337 146789 -81473 -139142 -268172 -304035 -240860 -62486
1636 -62486 -6428 -178477 -92284 -144520 26 -123446 -276940 32235 -140365 -137108 -136974
1625 -136974 -211766 -352494 146909 141630 77347 42124 -174073 -374788 -309977 -157065 -127947
1614 -127947 -113948 -49201 -233875 -212330 -79886 25999 -44709 -67320 -63118 -54197 -84184
1603 -84184 -159989 -339842 -38586 121131 83835 242351 82240 -178703 -6041 252967
1593B52967J10908j97278k53810m8606jJ09076J95965j02295j5294O2010k39697
1582a26055J94546k4603J75603j34931J35128L7652R1406k84275j41977M1820
1572c5686L47412j57944j39563n263l33375K1718J37225J1099J46351K09274K7323
1561B28571M3418r661l37845R9124m8227R0326j87777J21776q0542J46281K4835
1550I0279o0163N6636l13502J31798P2581l8574P8651q8027r7617K15947J7583
1539F5592l4304k6907K07907L7082l64898k35242L46142o9753J23044k2685J54279
1528A80257m0139l17454j4569K50916m0300J81254j84624P6124N4342r2864l7267
1517A5676l5958J39449p8583n27j2657k30331k35895J12490r2307r1873L0821
$$ plain form
1593 252967 363875 166597 -87213 -135819 -135820 -26744 169221 66926 51632 113642 -126055
1582 -126055 68491 43888 219491 84560 219688 257340 348746 64471 -77506 -35686
1572 -35686 311726 153782 14219 8956 -324419 -302701 -165476 -154377 -8026 201248 228571
1561 228571 271989 262328 -75517 23607 -24620 65706 -122071 -295 -80837 65444 90279
1550 90279 30116 86752 -226750 -94952 -22371 -60945 17706 -70321 -167938 48009 65592
1539 65592 31288 4381 212288 249370 -115528 -350770 -4628 -74381 48663 25978 180257
1528 180257 140118 -177336 -191905 59011 18711 199965 15341 91465 145807 52943 15676
1517 15676 -20282 119167 40584 40057 27400 -202931 -438826 -326336 -418643 -510516 -479695
1506d79695R4516M730M0449o0978J46052k7624J29878K69435o2971k07681j82040
1495c35929K7758K51700J62239o2498J55925q9017k08160J11743K72266R0223
1485C76250j80560k09395L8144J28934Q3824j27892Q4302o8386J25320K1084k88469
1474a6844p9448K24914r5697n5660l0706l4510j8828Q4666J25369K16393j22945
1463A96704K5572k28568r7177k18374r5867K02954j5666J18641n7600J30006R4805
1452E5430n4152l9878N2048j26684J02806r257O0036j88637Q7890Q2475O1766
1441H3843j84831J23311L3266j41352M3314r9455K41061J11687j37477M7384Q5795
1430B06546q9980J28423j3155l38807j63748O9662K8748R0073O0580K2562J34605
$$ plain form
1506 -479695 -385179 -380449 -340000 -400978 -254926 -282550 -152672 116763 53792 -153889 -335929
1495 -335929 -308171 -56471 105768 43270 199195 110178 -97982 13761 286027 376250
1485 376250 195690 -13705 24439 153373 237197 109305 193607 125221 250541 271625 -16844
1474 -16844 -96292 128622 32925 -22735 -53441 -87951 -106779 -22113 103256 319649 196704
1463 196704 222276 -6292 -103469 -321843 -417710 -214756 -230422 -111781 -169381 -39375 55430
1452 55430 1278 -38600 13448 -113236 -10430 -19687 40349 -148288 -60398 22077 83843
1441 83843 -100988 22323 55589 -85763 -42449 -141904 99157 210844 73367 120751 206546
1430 206546 116566 244989 231834 -106973 -270721 -201059 -172311 -82238 -21658 904 135509
1419A35509J79508k86853p8209J08007l99585r790R8615J32327P9100P8765M6748
1408H4142j50835J52631r398K72002m36853k52406J9138l15820K28335J68893
1398b40171j86481J99517J76142o8984L04745q5216j67813K2306K19835m08672
1388b34792q8629J34099Q1092J37696j22577N6102m127J00969j57523l8740K53434
1377A17004Q3936m5609R8080l03161r2681m6937L2506K5880j38557k29972k9459
1366e28970M57186j5861K62057j37617K61332l6804j60796K0908k69352k31413
1356c79330M15874K21587k30284J04372J09060n05700K09813K5775l32473L40164
1346b1142N2630p5587m5817K41555j97965N4074r865J09659q3644o9972R079l3547
$$ plain form
1419 135509 315017 28164 -50045 57962 -341623 -351413 -252798 -120471 -41371 37394 84142
1408 84142 -66693 85938 76540 348542 -88311 -340717 -321579 -637399 -409064 -240171
1398 -240171 -426652 -227135 -50993 -119977 184768 99552 -68261 -45955 173880 -234792
1388 -234792 -323421 -189322 -108230 29466 -93111 -37009 -41136 59833 -97690 -136430 117004
1377 117004 200940 155331 253411 -49750 -142431 -189368 -156862 -130982 -269539 -499511 -528970
1366 -528970 -71784 -87645 174412 36795 298127 261323 100527 121435 -147917 -379330
1356 -379330 36544 258131 27847 132219 241279 -264421 -54608 -28833 -361306 -21142
1346 -21142 31488 -44099 -89916 151639 -46326 7748 -2117 107542 23898 -46074 -36995 -70542
1334g0542J20486J07701K4113k2203q7310J65825j4998k35587l8262Q4084M8379
1323H1686k50124J03665J41794l99934Q0523J10093q6451J36323o473J38727J49604
1312A99433J80818j53255j37980j08785p3463L2110O0630r1538R190R2729J12742
1301A22631O5774j23969j04965K1319j16810J820r135o532p6044Q5322N5081J96323
1289A10815n295j22640r9185L4075n2099j16580j03364L7230k8460o2895K44667
1278a63731n9630J10874j65354m6843J96209j07030k7270K93959L4361j50652
1268h5107R0917p2846q2240J59000M1062j0047j61540N0588P4902M3669j99798
1257a51440q5279j69082J73290J77289L179m4315j41593M72452k19563j86975
$$ plain form
1334 -70542 49944 157645 181758 159555 72245 238070 223072 -12515 -50777 33307 81686
1323 81686 -168438 -64773 77021 -322913 -242390 -132297 -218748 -82425 -88898 49829 199433
1312 199433 380251 226996 89016 -19769 -93232 -61122 -492 -92030 -82840 9889 122631
1301 122631 188405 64436 -40529 -19210 -136020 -134200 -143335 -149867 -225911 -140589 -85508 110815
1289 110815 105520 -17120 -116305 -82230 -134329 -250909 -354273 -317043 -345503 -408398 -163731
1278 -163731 -223361 -112487 -277841 -324684 -128475 -235505 -262775 31184 65545 -85107
1268 -85107 5810 -67036 -149276 9724 50786 40739 -120801 -70213 4689 48358 -151440
1257 -151440 -236719 -405801 -232511 -55222 -52043 -96358 -237951 234501 14938 -172037
1247a72037M8765j54196j33817J02243J15506L1407J66313J0045Q5640p9756R6645
1236A16758K3634n8534k72580J71867K5338m2008O8405j9188Q7724j66416J55202
1225I0202n4341k92344K75293P9074j03452K02487k6502o3035j2675j47058K25431
1214A73080k8938Q6420j16245j16444J93878j73943L1184K06440j89562P0736
1204A36606k42775l368K1256J76384q8913j41233K8920K61240k26211l71037M0492
1193d08639Q7162J56362m979k76171P7441K12118Q9001M06305j75879k1724q7942
1182E3055k04655m4527M4446L47660J11328j82313o4644j41655J1511R5183j97618
1171a72229J5989K44078k91914j1931m582J53650J33980N9849k12012K36194L4759
$$ plain form
1247 -172037 -123272 -277468 -411285 -309042 -193536 -162129 4184 14229 99869 20113 116758
1236 116758 140392 81858 -190722 -18855 6483 -35525 32880 13692 101416 -65000 90202
1225 90202 35861 -256483 18810 97884 -5568 196919 170417 107382 94707 -52351 173080
1214 173080 144142 230562 114317 -2127 191751 17808 48992 255432 65870 136606
1204 136606 -106169 -109537 -88281 88103 -810 -142043 -113123 148117 -78094 -449131 -408639
1193 -408639 -321477 -165115 -170094 -446265 -368824 -156706 -67705 338600 162721 140997 53055
1182 53055 -151600 -196127 -151681 195979 307307 124994 60350 -81305 -69794 25389 -172229
1171 -172229 -156240 87838 -204076 -216007 -220589 -66939 67041 126890 -85122 151072 185831
1160A85831O4981k56489k51943J312K3759K01847O5450j51908N9400J86707n0216
1149G8731k05173p509K45790J48982l69115P4520P5466j48329M99K04084J43388
1138B41334k6298m3112k34836J34932n2669k4248q3068P5240K16819j68062K96942
1127C32974Q0143k05390l40348j19418J96098L8176J73558R4992j12506j64412
1117b6133P7729o0867j58167M2222J61945K12964j88966j7758M5513p9532j64598
1106a55648j0037K94437q9030M9952J20862j84855j85268K18104m1235j94251
1096a76969N5859K57774O7626k54109J63235O6221q5728j33486O9393j20883p6500
1085a67567n5225l3466K07772k5673M135j8301r7492m4543M0067j35766R4927
$$ plain form
1160 185831 250812 -5677 -257620 -256308 -232549 -30702 34748 -117160 -57760 128947 78731
1149 78731 -126442 -133951 111839 260821 -108294 -33774 41692 -106637 -106138 97946 241334
1138 241334 215036 171924 -62912 72020 19351 -4897 -87965 -12725 204094 36032 332974
1127 332974 413117 207727 -132621 -252039 -55941 -17765 155793 250785 138279 -26133
1117 -26133 51596 -9271 -167438 -125216 36729 249693 60727 42969 88482 8950 -155648
1106 -155648 -165685 128752 39722 89674 210536 25681 -159587 58517 17282 -176969
1096 -176969 -121110 136664 204290 -49819 113416 179637 93909 -39577 29816 -91067 -167567
1085 -167567 -222792 -256258 -48486 -74159 -70024 -88325 -185817 -230360 -190293 -326059 -231132
1074b31132J07304q4324P6388q166L2809J72737N4719P0774j19220k15560J35069
1063h602K1206n6799j41126J90065Q5514j49976J67255k05137O9776J71485j51815
1052h154k5767L58847j53147J20472k76158k6960L8912J15575j44115p9201O4476
1041a5220j16819k10067n1933J23647N9790L7117l0418n8135J56594J238k29759
1030c33965Q3351j0256k1699J22854J8844j23826k032J40069J99662J8477M0054
1019A31533J92q1023K00875j97491j4282J85844n6430m7839j30870J30172k45
1008A20436J10793j70245R5126M2879j3311k8912j47236J80392j07159p9120n9724
997e6081k08019J46627J36887o3539k05786J01154l0452j64687K87637K33222
$$ plain form
1074 -231132 -123828 -208152 -131764 -139930 -107121 65616 120335 191109 71889 -143671 -8602
1063 -8602 12604 -44195 -185321 4744 90258 -59718 107537 -97600 -27824 143661 -8154
1052 -8154 -33921 324926 171779 292251 16093 -10867 28045 143620 -495 -79696 -15220
1041 -15220 -132039 -342106 -394039 -270392 -210602 -173485 -203903 -262038 -105444 -104206 -333965
1030 -333965 -250614 -260870 -282569 -159715 -140871 -264697 -266729 -126660 73002 91479 131533
1019 131533 131725 50702 251577 54086 39804 225648 169218 121379 -9491 120681 120436
1008 120436 231229 60984 156110 198989 185678 156766 9530 189922 82763 3643 -56081
997 -56081 -264100 -117473 19414 -44125 -249911 -148757 -179209 -343896 -56259 176963
987A76963k92574q8177R9502J9890N9572k02631O5551k7711l9252J90019j21658
976a60506O6711Q9337j74414m4386K79074J00293k5913q8256r281j8559j6547
965b447R1995K22091J14882k93534p1360J19275o8929j7532k32674J85303L4632
954H1702k17802K09978M5003k07208K339k6439J11146K7230L2516m9124l50783
943c41442K35507K25775N3507j64806J17635k9945j8761k6161J80406j09749r8045
932B3921J21272j51283J60322k18432j06385K38789j26842J09568J625k18926
922a66371J18515k50674J8689j1878l5135j52036Q2411J71307j55761J96912Q1735
911a02286M0537j4509Q5094l59576K38611M15660L861M4497j80189j78451q4579
$$ plain form
987 176963 -115611 -203788 -104286 -84396 -24824 -227455 -161904 -189615 -228867 -38848 -160506
976 -160506 -93795 -4458 -178872 -223258 55816 156109 130196 41940 32659 14100 -2447
965 -2447 89548 311639 426521 132987 61627 180902 111973 94441 -138233 47070 81702
954 81702 -136100 73878 118881 -88327 -85988 -112427 -1281 25949 58465 9341 -341442
943 -341442 -105935 119840 173347 8541 126176 96231 77470 51309 231715 121966 23921
932 23921 145193 -6090 154232 -64200 -170585 68204 -58638 50930 52555 -166371
922 -166371 -47856 -298530 -279841 -291719 -326854 -478890 -396479 -225172 -380933 -184021 -102286
911 -102286 -61749 -76258 8836 -350740 -112129 303531 307392 351889 171700 -6751 -91330
900i1330k09673Q2654L33353j48177J67937J71697L8357k79718N2449J2443J09065
889B39057q7244j21512J96482K7362Q8796J1154R4963r4219j36378j88714j46602
878a16855m3158j20776O0547K65689j88105Q5759J19250n3268K14844k35517o9599
867h1189N9326j59048J0355K679J05930j58564n9235J86360k72612K1848J49167
856a94983k3564O1514n8678J08888P3890j72591J36672l0328J23688j3027J42757
845A54238j10965R9605k1190j21009J67312J22353q3489k31395j03049K19423
835I1834J16925j00675q8443J74246J35965J6424j72281n23M8581J60851l4252
824C48652m11239L0653j72552M0639Q766r6179M5890K86147j13229L1297Q9797
$$ plain form
900 -91330 -301003 -218349 115004 -33173 134764 306461 344818 65100 117549 129992 239057
889 239057 151813 30301 226783 254145 342941 354095 449058 354839 218461 29747 -116855
878 -116855 -160013 -280789 -220242 45447 -142658 -56899 62351 9083 223927 -11590 -81189
867 -81189 -21863 -180911 -170556 -167877 -61947 -220511 -279746 -93386 -365998 -344150 -194983
856 -194983 -218547 -157033 -215711 -106823 -32933 -205524 -68852 -99180 24508 11481 154238
845 154238 43273 142878 121688 679 167991 290344 206855 -24540 -127589 91834
835 91834 208759 108084 19641 193887 329852 346276 173995 173472 222053 382904 348652
824 348652 -62587 -31934 -204486 -163847 -155081 -251260 -205370 80777 -32452 -1155 88642
813H8642K07299j18295n44283N4861K16215j00136j09249N382Q2884l1161O9502
802a78339J62432J97531L838q9334j10017J70661j31682J15607L4905Q1040j28652
791A27990k13512p0206L21789O7436n1663J28421q53k54760j13206K31754m1073
780A32117J2587M1034l6211K76966p8131r0721J7113k56774k897R2530r7643R2687
768A02657j19068p2135L20070o9581l14481r0458K3887K31339j24288m1264N1842
757a01480p2287P06j86300L5124J42466q3194q9555J44742M0047j66131J11628
746b24234O710L43476P0585m13897J22905M4173P0453j57857j02433l54107J80650
735d13576M53379J51540k87648J88628J69897k99761o020J522J13078J70384j76880
$$ plain form
813 88642 295941 177646 -366637 -311776 -95561 -195697 -304946 -299564 -216680 -247841 -178339
802 -178339 -15907 181624 185462 96128 -13889 156772 25090 140697 175602 256642 127990
791 127990 -85522 -155728 166061 233497 181834 310255 309402 54642 -58564 173190 132117
780 132117 144704 185738 149527 426493 348362 257641 274754 17980 15083 107613 9970 102657
768 102657 -16411 -88546 231524 161943 -152538 -242996 -219109 12230 -112058 -153322 -101480
757 -101480 -173767 -173061 -359361 -324237 -181771 -264965 -354520 -209778 -169731 -335862 -224234
746 -224234 -217524 125952 196537 -217360 -94455 -50282 20171 -137686 -240119 -594226 -413576
735 -413576 39803 191343 -96305 92323 262220 -37541 -43561 -42039 71039 241423 64543
724F4543K39998O6596L4126j66412J05540O1465j14288n1070n9294k5372J4700
713A70532k25127k13881j5139J40683K56930k00368K6556M7191j24917J74773
703C7233j48602j72573j65598K38776R5756j5146j4788R2057q6682j02823K05725
692c6665O7189n5968k68475J0947K4797L4666J98416K80084r4057j54225p7165
681g0456J67294J80596j52979j97436r0605l3099K15766j33359M2700J38721L9537
670A06680J93136k5784K1411J5217M1419j24341r4176P615L4554Q4899J25425
659C86055j99627J4377L8763O2051k48923j12032Q7928o3568K49239N3071J1650
648B78984j67634o0248L8716J07319j75705n2534J44870J32678k40751j30904
$$ plain form
724 64543 304541 371137 405263 238851 344391 405856 291568 240498 181204 155832 170532
713 170532 -54595 -268476 -283615 -142932 113998 -86370 -59814 -12623 -137540 37233
703 37233 -111369 -283942 -449540 -210764 -115008 -130154 -144942 -52885 -139567 -242390 -36665
692 -36665 30524 -25444 -293919 -282972 -258175 -223509 -25093 254991 160934 6709 -70456
681 -70456 96838 277434 124455 -72981 -163586 -196685 19081 -114278 -71578 67143 106680
670 106680 299816 274032 295443 310660 352079 227738 133562 141177 175731 260630 386055
659 386055 186428 200805 239568 301619 52696 -59336 28592 -34976 214263 267334 278984
648 278984 111350 51102 89818 197137 21432 -31102 113768 246446 5695 -125209
638a25209J54508r4058j39171j2296m6925J39854J49001m845N1028k0441q5612
627c4166K02880l13933J70296J27081k04128J07735j01050J59438j5362j09960
617a1169j4127J05872q0271q4360J45513j66277K9229J72488j52608J1193K80362
606B35845o9101j22587J67947R4636k72440k29525J88025L00806k09063q3594
596I49j02136J29988j65859k21902K38351Q8576R5133p3128k456J28492j70328
585e4320j28797k39531k07040L71691k4013K7256J04678j58525N2747K13877n4604
574i6581r4446L9369j09996L6476M8623K22682j64247J1722J69207j7055j73032
563a27278J04337K66360j47870J45613L2301j2353q5265m1952j24814j16148K17228
$$ plain form
638 -125209 29299 -64759 -203930 -216226 -263151 -123297 25704 20859 71887 51446 -34166
627 -34166 168714 -145219 25077 152158 -51970 55765 -45285 114153 98791 -11169
617 -11169 -25296 80576 305 -84055 61458 -104819 -75590 96898 -55710 -44517 235845
606 235845 166744 44157 212104 306740 34300 -195225 -7200 293606 84543 949
596 949 -101187 28801 -137058 -358960 -120609 -32033 63100 -10028 -12484 116008 -54320
585 -54320 -183117 -422648 -629688 -257997 -282010 -254754 -150076 -308601 -255854 -41977 -96581
574 -96581 -191027 -151658 -261654 -225178 -176555 46127 -118120 -106398 62809 45754 -127278
563 -127278 -22941 243419 95549 241162 273463 261110 175845 133893 9079 -107069 110159
552A10159J90244j88738J37940j2891j9483k63836j97214j11706K44708Q081K64722
541A61986K38457j72267j27737n3926n6852j81877M3624K4409K10211n2844k16898
530a83714K45945k1888K08656K28265j43365j05089k72762K5479p7711q0799r6607
519b73590K7351J5671m7842k2688K28982K79631k35716k48966K67055J32940J90616
508C13444K32490k25325l88384L6877L44716k78617O8418M0665M8070K46829k91084
497A48099J91038M8872j86872q6940K8517K6674K3318k43496K0060J27761N557
486A02588J75110j90126k52442j11230K35434J75254k56923L5995J40036r0190
476c6494j42589n8556J08652j5799J05207j0711j67912K53032K193j35149J29948
$$ plain form
552 110159 300403 111665 249605 236714 217231 -46605 -243819 -355525 -110817 -102736 161986
541 161986 400443 228176 100439 46513 -10339 -192216 -148592 -124183 86028 33184 -183714
530 -183714 62231 40343 248999 477264 333899 228810 -43952 -18473 -96184 -176983 -273590
519 -273590 -246239 -230568 -278410 -301098 -72116 207515 -28201 -277167 -10112 122828 313444
508 313444 545934 320609 -67775 -30898 313818 35201 103619 144284 192354 439183 148099
497 148099 339137 388009 201137 114197 142714 169388 192706 -50790 -30730 97031 102588
486 102588 277698 87572 -164870 -276100 -40666 134588 -122335 -86340 53696 -36494
476 -36494 -179083 -237639 -128987 -144786 -39579 -50290 -218202 34830 37023 -98126 31822
465C1822L2110n1175m4920p6478Q7276L48722k28957L9687j75269j64806l0276
454b32264K1741L06996K31447Q0080p51235N7629Q3771M8307K64524p0364K3200
443F3832J23674k0455k26677N5396l0390j1132K39612l1601k2879n6009K33718
432C17089k39020J27023K18536l10291k15996L5091J95708j34963J13183k3606
422H2754J24976j9093J35565j48744j11357K7053K05657r6464l33321M6472J98636
411A12134m0573j88146K32343L571k8880k8631q2815J15265J14484r9393J51359
400B60718l0262n5479J1807l0780q0746J67760j82636k96612J44808K46514K30796
389C85888j04112o7068k23551j41565J59038J90220j51188N7838k33101K11058
$$ plain form
465 31822 63932 12757 -32163 -108641 -21365 327357 98400 138087 -37182 -201988 -232264
454 -232264 -210523 96473 327920 408000 -343235 -285606 -201835 -153528 110996 40632 63832
443 63832 187506 167051 -59626 -4230 -34620 -45752 193860 162259 139380 83371 317089
432 317089 78069 205092 423628 113337 -102659 -67568 128140 -6823 106360 82754
422 82754 207730 188637 324202 175458 64101 91154 296811 200347 -132974 -86502 112134
411 112134 71561 -116585 115758 119329 90449 61818 -20997 94268 208752 109359 260718
400 260718 230456 174977 186784 156004 75258 243018 60382 -236230 -91422 155092 385888
389 385888 281776 214708 -8843 -150408 8630 198850 47662 105500 -127601 83457
379H3457J93183j09325p8569R2192L8523J9022j11325j79114r4967Q2696J02977
368C8750L3873j16978j45525M92929j8281k55376k8834M0500j45577J524K46666
357A43671P2885J4180m2948k24616J71673K70948k21716k09060r862j4755J2125
346c7475l7354r4392K20731J62076k24864J49237m4327k383P5275M4570J89234
335D00328j22411l63260M7335O4995k1607J70171L3649O2155k26128K5692L6090
324A07009k21772m5853K88081J88658j480r2564j09046J4978J27160l5239R6461
313C16393J02749j82019M7722k44678j02126R9032K41704J2098j47456r0631M28331
302D81119O1709o39135J22611j0132k64064K96725J78481n1863j22909J74856
$$ plain form
379 83457 276640 167315 88746 180938 219461 238483 127158 -51956 -146923 -64227 38750
368 38750 72623 -44355 -189880 303049 284768 29392 558 41058 -104519 -102995 143671
357 143671 216556 230736 187788 -36828 134845 405793 184077 -24983 -34845 -49600 -37475
346 -37475 -74829 -169221 51510 213586 -11278 137959 93632 91249 166524 211094 400328
335 400328 277917 -85343 -38008 26987 5380 175551 209200 271355 45227 70919 107009
324 107009 -114763 -160616 127465 316123 314643 222079 113033 128011 255171 219932 316393
313 316393 419142 237123 284845 40167 -61959 37073 278777 290875 143419 52788 481119
302 481119 542828 -96307 26304 16172 -247892 48833 227314 175451 52542 227398
292B27398j13233k38639r650k2600K43322J80209p9345p7216q4245K62106K2693
281C10800k02336N5241J78340J12612j80046k23694J85650J33438k50836K01545
271C20714N7191j53488L7833p0825j03015j10854R6835J99837l8366k26018j11955
260a02111l5570J53302k27384j5943L5376j46592L85575j16256M4393o8591P6511
249a7290J68006q2087N1365j34425R194J54223k13105K81779R8123j84603R335
238A40515k04503J34590P0512l26624l4320J23054N8143k6330j24578N3069M7478
227h8994K49198J02944K17124J6443l05187p5910Q1646j12936j26585K75231J03079
216C36053j51443K0078K16124J36469k31601p9721N4708O5006j15570j96400N419
$$ plain form
292 227398 114165 -124474 -134124 -156724 86598 266807 187462 110246 26001 288107 310800
281 310800 108464 163705 342045 454657 274611 50917 236567 370005 119169 320714
271 320714 377905 224417 262250 191425 88410 -22444 74391 274228 235862 9844 -102111
260 -102111 -137681 15621 -211763 -227706 -192330 -338922 46653 -69603 -25210 -93801 -17290
249 -17290 150716 68629 119994 -14431 -5237 148986 -64119 217660 315783 131180 140515
238 140515 -63988 70602 141114 -185510 -219830 -96776 -38633 -64963 -189541 -136472 -88994
227 -88994 160204 263148 480272 496715 191528 115618 197264 84328 -42257 232974 336053
216 336053 184610 204688 420812 557281 325680 245959 300667 365673 250103 53703 59122
205E9122J47295o9375k80571p502j6527J13360j18199r5895K68645K38861L3054
194B72268O6911p9206Q0470o3586L1575j25587J31322l5482l1019o814j84912
183E5940K5905j28720J19353K36063k5695R4640m151k69947k96299K90038O0679
172A57806L7350J43339l01588L5277q0736m1345J27513j14614J4209P8750L99655
161D55616L6226k66629J7670j26423j9846O1764O5752m1009j85002q3876l5311
150a21068L0248K05212k87J32814k76521P537J75430R0297J9417o1292k00303
139A484K56749J40168j18727j53503n1061j19896J38674J88206j87754L1647l43126
128b17139K21161K75813J19879j25914m3954k08784j12425R649J25097M8072j41750
$$ plain form
205 59122 206417 137042 -143529 -151031 -167558 -54198 -172397 -268292 353 239214 272268
194 272268 339179 259973 340443 276857 308432 182845 314167 278685 247666 240852 55940
183 55940 81845 -46875 72478 308541 282846 377486 373335 103388 -192911 97127 157806
172 157806 195156 338495 36907 72184 -8552 -49897 77616 -36998 -22789 55961 455616
161 455616 491842 225213 242883 116460 96614 158378 224130 183121 -1881 -85757 -121068
150 -121068 -90820 114392 114105 246919 -29602 -22065 153365 243662 263079 201787 1484
139 1484 258233 398401 279674 126171 75110 -44786 93888 282094 94340 125987 -217139
128 -217139 4022 279835 399714 273800 229846 21062 -91363 -81714 43383 91455 -50295
117e0295L6690J18666J37026k68735J9800K1657J32709j62994k03983K0433Q5046
106a13980N1034J53786j8810M5322j95654J4031K49176q2699L1631p905J12527
95B38459M2532k15909L6993q4488j17524l8002M7683M2880K38712O7370j56062
84A02644j17036L44185o4757J5497j6321q8111Q2319J24784j5631N117O8008k31578
72B09120M4419O836R1470j41372L9836Q7772o5955K8945J32851j67615o398k8860
60B31049R2047K53421k35362l53376P1886P0814J10811J5120j69122J021k44913
49a56604p2217J53372J88243J40750k590j05825m4972k6550M7366J4660j90880
38e5247J76158q0945k0856N5188P2635j21483n5960K5377j00759J09897Q7501
$$ plain form
117 -50295 -13605 105061 242087 -26648 -6848 14809 147518 -15476 -219459 -199026 -113980
106 -113980 -62946 90840 72030 117352 -78302 -64271 184905 102206 133837 125932 238459
95 238459 280991 65082 102075 17587 -99937 -137939 -90256 -47376 191336 258706 102644
84 102644 -14392 329793 265036 280533 264212 176101 258420 383204 367573 372690 440698 209120
72 209120 253539 260375 351845 210473 250309 338081 272126 301071 433922 266307 259909 231049
60 231049 323096 576517 341155 -12221 59665 130479 241290 256410 87288 88309 -156604
49 -156604 -228821 -75449 112794 253544 250954 145129 100157 73607 120973 135633 -55247
38 -55247 120911 39966 19110 74298 146933 25450 -30510 -5133 -105892 4005 91506
27I1506j50412J27885m6827n9663N6949r005O3635K00776M6827o5560m4993o6853
15A44265J02261j81756J4323O3505q7903j1015J00681K0963J52961N0504j60997
4B07792N9930j18526m2188k1514
0H5494
$$ plain form
27 91506 -58906 68979 22152 -37511 19438 10433 74068 274844 321671 256111 211118 144265
15 144265 246526 64770 79093 142598 54695 43680 144361 165324 318285 368789 207792
4 207792 267722 149196 107008 85494
0 85494
$$ Imaginary data points
##PAGE= N=2
##DATA TABLE= (X++(I..I)), XYDATA
16383c556701J01167J45088L9601k8817o6789K78961J05496K0146J23339L3037
16373b805472j2186N8392m7260K577K07946J78345R1188J1238j38556J80233K03852
16362b069703j6111n8972m7039J70872R0223l1496P8117j00925K30458k1248n9419
16351a835243J63246O6392p7397P9721K64305O5511L7943J3204o8994p3216J45694
16340a218834N6563J13394J94549P1940N6005k74950K14000k2096n8557K03997
16330f63989N8237L0057P2442K71345Q0800j39513J10235J64033N3437j1092J16625
16319A42617L1133J9100j6592Q4166l9053p9847O2321J663J24448L6608m1833
16308C24731Q7038K33233m14M0732o555k3333j963R5126K62289l5404j5470Q2575
$$ plain form
16383 -3556701 -3455534 -3310446 -3270845 -3299662 -3366451 -3087490 -2981994 -2961848 -2838509 -2805472
16373 -2805472 -2817658 -2759266 -2806526 -2803949 -2596003 -2417658 -2326470 -2315232 -2453788 -2273555 -2069703
16362 -2069703 -2085814 -2144786 -2191825 -2020953 -1930730 -1962226 -1884109 -1985034 -1754576 -1775824 -1835243
16351 -1835243 -1671997 -1605605 -1683002 -1603281 -1338976 -1273465 -1235522 -1222318 -1291312 -1364528 -1218834
16340 -1218834 -1162271 -1048877 -854328 -782388 -726383 -1001333 -787333 -809429 -867986 -663989
16330 -663989 -605752 -575695 -503253 -231908 -151108 -290621 -180386 -16353 37084 25992 142617
16319 142617 173750 192850 176258 260424 221371 141524 203845 205508 329956 366564 324731
16308 324731 411769 645002 644588 685320 678765 655432 653469 748595 1010884 975480 960010 1042585
16296A042585J39264p1479J31255p434j40451R1191J24463M1686j22K9428N4426
16285A434812k5107J04815O2164j23700R2681j49404K50544R4903J2021j04165
16275A649564K65525J19555k2951J93976j51922K881J83047l04J47006K0615J9570
16264B426562l67817O45j0164K35484K23557j9247J92979J55528P477k99496n879
16253B539629J74934p1935K23662J42994N9756m0052J334q1553O4341R8050j78615
16242B932545j83379M8540L47650m2027R5933q0527O570J46963J5079k08225q530
16231C070592J86620P8474p7902k8075M2562J49505j31913l3976J87907J82575
16221C626369m436Q1942P901j00724J07661r0690j26541J40287R5826k39725J26984
$$ plain form
16296 1042585 1181849 1110370 1241625 1234191 1093740 1184931 1309394 1351080 1350958 1380386 1434812
16285 1434812 1409705 1514520 1576684 1452984 1545665 1396261 1646805 1741708 1753729 1649564
16275 1649564 1915089 2034644 2011693 2205669 2053747 2056628 2239675 2239371 2386377 2406992 2426562
16264 2426562 2058745 2059390 2049226 2284710 2508267 2489020 2681999 2837527 2845004 2545508 2539629
16253 2539629 2714563 2642628 2866290 3009284 3069040 3028988 3030322 2948769 3013110 3111160 2932545
16242 2932545 2749166 2797706 3145356 3103329 3199262 3118735 3125305 3272268 3287347 3079122 3070592
16231 3070592 3257212 3335686 3257784 3229709 3272271 3421776 3289863 3255887 3443794 3626369
16221 3626369 3621933 3703875 3711776 3611052 3718713 3628023 3501482 3641769 3737595 3497870 3624854
16210C624854L15276o2700j90370J04940J90879k0864j59726K37302J51093j50489
16200D040195j24479K25014k9447r5941O6017P2850J31925k12337j9730K4434
16190D078501R5864R6118M6034j21790J13649l8534j03559O215J81142l2803l7549
16179D283288k3370K08512l28346K83546L74583j54012k74810N9526j65309j2059
16169D251549J55383J92771J74310k27626J96866K4922K579j02972k15220K60462
16159D713024R4345r9123J2270N7679J38621p8842J9889j01965J98549M0537R02
16148D995886k42926J41302J13957j20275K6465N1909j98947K21251J54212j46557
16138D996277j83303j58392R876L13863m304p1064J27279Q6175j06746J79778
$$ plain form
16210 3624854 3940130 3877430 3687060 3792000 3982879 3962015 3802289 4039591 4190684 4040195
16200 4040195 3915716 4140730 4111283 4015342 4081359 4154209 4286134 4073797 4054067 4078501
16190 4078501 4174365 4270483 4316517 4194727 4308376 4269842 4166283 4172498 4353640 4320837 4283288
16179 4283288 4259918 4468430 4140084 4423630 4798213 4644201 4369391 4428917 4263608 4251549
16169 4251549 4406932 4599703 4774013 4546387 4743253 4768175 4770754 4667782 4452562 4713024
16159 4713024 4807369 4708246 4720516 4778195 4916816 4837974 4857863 4755898 4954447 4994984 4995886
16148 4995886 4752960 4894262 5008219 4887944 4914409 4966318 4767371 4988622 5142834 4996277
16138 4996277 4812974 4654582 4664458 4978321 4974017 4902953 5030232 5116407 5009661 5189439
16128E189439l8217K8060j70921k84946J73063K03605l9040j24837j9938K7687
16118D943955J4160j51410K15698m7656j09676J47352K10196R1172m9133k06893
16108E057765p1649J30760J75062m9996l26480N6978K18382K01287n5947j55528
16098E180634N3197m6253L7825r2235k7756J31550p2440J19978J66597k07618
16088E243479l28904r5281K11681J57703L0151j31967J60308N7676K0118k28077
16078E096887m2546j88764Q2363L12762r9388l1434m8110R1525k0376J5994n3237
16067E115676J02734k08449l13577p5198K62188N4664k80264P9890J00010k54083
16057D583591L64912M58593r9767r1955J12817j17264l6854k1296j60346J07558
$$ plain form
16128 5189439 5151222 5179282 5008361 4723415 4896478 5100083 5061043 4936206 4916268 4943955
16118 4943955 4958115 4806705 5022403 4974747 4865071 5012423 5222619 5313791 5264658 5057765
16108 5057765 4986116 5116876 5291938 5241942 4915462 4972440 5190822 5392109 5336162 5180634
16098 5180634 5233831 5187578 5225403 5133168 5105412 5236962 5164522 5284500 5451097 5243479
16088 5243479 4914575 4819294 5030975 5188678 5218829 5086862 5247170 5304846 5324964 5096887
16078 5096887 5054341 4865577 4947940 5260702 5161314 5129880 5081770 5173295 5152919 5168913 5115676
16067 5115676 5218410 5009961 4696384 4621186 4883374 4938038 4657774 4737664 4837674 4583591
16057 4583591 4948503 5407096 5307329 5215374 5328191 5210927 5174073 5152777 4992431 5099989
16047E099989J62998L677k42323K2305p232K42477O081K09452M0056j08034p0717
16036E358729N4591j88777n0038Q4636n0147N2795J06404Q2281j14942J3150j34968
16025E213714j23592P5493j9305K20973m6583j34198P53K86422l0181r3593j33658
16014E216245J31464M93530j34459k52314k93177o3892N5077Q5911p6363R2448
16004E254470j71784P7297Q2491k62323K95775J64149q1729J94774j6531k40229
15994E296360K5079j05206L5556J27100J63964O7186j93105K3852K2272j60957
15984E302101J25263j3743p7431O0952J1938J08186l18900o8143J4893o4670K55903
15973E336349N7984M1074O6162j06018M0600j93537n8803P8159O5194J13695q4128
$$ plain form
16047 5099989 5262987 5266664 5024341 5046646 5039414 5281891 5287972 5497424 5537480 5429446 5358729
16036 5358729 5413320 5224543 5174505 5259141 5208994 5261789 5368193 5450474 5335532 5348682 5213714
16025 5213714 5090122 5165615 5146310 5367283 5320700 5186502 5187255 5473677 5443496 5349903 5216245
16014 5216245 5347709 5841239 5706780 5454466 5161289 5097397 5152474 5238385 5162022 5254470
16004 5254470 5082686 5159983 5242474 4980151 5275926 5440075 5358346 5553120 5536589 5296360
15994 5296360 5321439 5216233 5251789 5378889 5542853 5610039 5416934 5440786 5463058 5302101
15984 5302101 5427364 5413621 5336190 5397142 5409080 5517266 5198366 5130223 5145116 5080446 5336349
15973 5336349 5394333 5435407 5501569 5395551 5436151 5242614 5183811 5261970 5327164 5440859 5356731
15962E356731k22213j55113J17032R5605k5409M6378r8985n5489k6111j14851
15952D917575K86880K80177Q0559j14279L8521Q1594r9728J62423n1374L8126
15942E620474j63226q2617m809Q1590k52671r9546K07964J29544j31076q452j29320
15931E167855J63829j69518J25320Q7855q4490J50653m6987N5872K86990k200
15921E735179l09454J14253l03799m2430j15093o3233J91037R9491J17984j36546
15911E287389N4230J76171K4769p7690j31289j80533J22403J93806r0362P6706
15901E455600l1395O24q2986J21658j56280r8637K41836n1881r3280J8738k27014
15890E096983j13482J96604K6339q03J45186J0155j74243j16752J91037L71096
$$ plain form
15962 5356731 5134518 4979405 5096437 5192042 5166633 5213011 5114026 5058537 5032426 4917575
15952 4917575 5204455 5484632 5565191 5450912 5489433 5571027 5471299 5633722 5582348 5620474
15942 5620474 5457248 5374631 5369822 5451412 5198741 5099195 5307159 5436703 5305627 5297175 5167855
15931 5167855 5331684 5162166 5287486 5375341 5290851 5441504 5394517 5450389 5737379 5735179
15921 5735179 5425725 5539978 5236179 5193749 5078656 5015423 5206460 5305951 5423935 5287389
15911 5287389 5341619 5517790 5542559 5464869 5333580 5153047 5275450 5469256 5378894 5455600
15901 5455600 5424205 5424829 5341843 5463501 5307221 5208584 5450420 5398539 5305259 5323997 5096983
15890 5096983 4983501 5180105 5206444 5205641 5350827 5360982 5186739 5069987 5261024 5632120
15880E632120j3704k74953M3858K5905R7374k32778L7654q9790o5542J02263Q6943
15869E349350J47999J66456k51775P2798n0828J00199n089k08193j05491M7876
15859E263302J51840k29441J72052K16618p8242j64558n8337J90625r88l43054
15849E119817K96718L75457q1542l38184k67528J43532J02708l31551R3578K99991
15839E412996J63530J8815j10972j31274Q6732R7669k3856M3559k0902j03080
15829E433217J43039m3596p3136k40268J0985K18908J94158p2589r7216L6394
15819E509896j18395l013K24389O7080J49670j32779k81806J96474l7482j61959
15809E412075J02189J92894q1022j28120p2196J44275j11024j09822j63402K72661
$$ plain form
15880 5632120 5618416 5343463 5387321 5413226 5510600 5277822 5315476 5225686 5160144 5262407 5349350
15869 5349350 5497349 5663805 5412030 5484828 5434000 5534199 5529110 5320917 5215426 5263302
15859 5263302 5415142 5185701 5357753 5574371 5496129 5331571 5273234 5463859 5462871 5119817
15849 5119817 5416535 5791992 5710450 5372266 5104738 5248270 5350978 5019427 5113005 5412996
15839 5412996 5576526 5595341 5484369 5353095 5439827 5537496 5513640 5557199 5536297 5433217
15829 5433217 5576256 5532660 5459524 5219256 5230241 5449149 5643307 5570718 5473502 5509896
15819 5509896 5391501 5388488 5612877 5679957 5829627 5696848 5415042 5611516 5574034 5412075
15809 5412075 5514264 5707158 5626136 5498016 5425820 5570095 5459071 5349249 5185847 5458508
15799E458508J03965p6750R8042j48138j12370n0647J67217Q3212O7121R1284
15789E681444l5000q8107j85530J39212k10315j5908K8030K5133J51560j17873
15779E372646j88081m4999N7181L05988Q9928k96694l0769K9213K45747P4068
15769E614228l8710J20289q5280j41113j47200j63003J68983O2227L4648Q7604
15759E512673j93234J1178n7058j32833K90798k20062j46988l5312J26405J71702
15749E327269J96757l44871J06224N3096R4560K53884m3523J4028k64409j06893
15739E286122K39415r841J08792k03516j10189R1392J70095k6210J43702M287
15729E694049k97360o6867J50970J76750J50542n7389k49435K3826j69283l99422
$$ plain form
15799 5458508 5562473 5485723 5583765 5435627 5323257 5272610 5439827 5523039 5590160 5681444
15789 5681444 5646444 5558337 5372807 5512019 5301704 5285796 5313826 5338959 5490519 5372646
15779 5372646 5184565 5139566 5196747 5502735 5592663 5295969 5265200 5294413 5540160 5614228
15769 5614228 5575518 5695807 5610527 5469414 5322214 5159211 5328194 5390421 5425069 5512673
15759 5512673 5319439 5330617 5273559 5140726 5431524 5211462 5064474 5029162 5155567 5327269
15749 5327269 5524026 5179155 5285379 5338475 5433035 5686919 5643396 5657424 5393015 5286122
15739 5286122 5525537 5515696 5624488 5420972 5310783 5402175 5572270 5546060 5689762 5694049
15729 5694049 5396689 5329822 5480792 5657542 5808084 5750695 5501260 5525086 5355803 4956381
15719D956381K58676K05332m9469N3379l7519K8024k80695O0866O6922L8143J69530
15708E469570Q7505j50727p8495P0504L32732l11070j42525M0835J26016O3510
15698E507855L7512l13987K84149L7605q8433j34566J77737O8684j0845k1569
15688E544142k345j15461p1403K72057P892l33039o466L5150M6086L2895j14543
15677E294965j15826K46516l3766q4446K25435K5371n3893R2322J62935j05455
15667E654158j77140j3428L07579k65013L30965j75442k56256J64633j36226o9054
15657E364776K50325M1280k6372p7443j5591r3763p901k10461J26307J25824J27320
15646E604301J14436n955j70933j32896K65141r265r231L2183j36387j10090N8353
$$ plain form
15719 4956381 5215057 5420389 5370920 5424299 5386780 5414804 5134109 5194975 5261897 5300040 5469570
15708 5469570 5557075 5406348 5327853 5398357 5731089 5420019 5277494 5318329 5444345 5507855
15698 5507855 5545367 5231380 5515529 5553134 5464701 5330135 5507872 5576556 5565711 5544142
15688 5544142 5541797 5426336 5354933 5626990 5634882 5301843 5295377 5330527 5376613 5409508 5294965
15677 5294965 5179139 5425655 5391889 5307443 5532878 5558249 5504356 5596678 5759613 5654158
15667 5654158 5477018 5463590 5771169 5506156 5837121 5661679 5405423 5570056 5433830 5364776
15657 5364776 5615101 5656381 5630009 5552566 5536975 5443212 5435311 5224850 5351157 5476981 5604301
15646 5604301 5718737 5712782 5541849 5408953 5674094 5664829 5655598 5687781 5551394 5441304 5499657
15635E499657k7400k4040J63645j03191Q4758o1220j77123n0412K43369K25897
$$ plain form
15635 5499657 5472257 5448217 5611862 5508671 5593429 5532209 5355086 5304674 5548043 5773940
$$ [...]
##END NTUPLES=NMR SPECTRUM
##END=
