##TITLE=1H_TG-2402-X12
 200.13Hz, DMSO-d6.
 8 sc
 
1.1.2026
##JCAMPDX= 6.0         $$ Bruker NMR JCAMP-DX V2.0
##DATA TYPE= NMR SPECTRUM
##DATA CLASS= NTUPLES
##ORIGIN= UXNMR, Bruker Analytische Messtechnik GmbH
##OWNER= pz
$$ XWIN-NMR		Version 3.5
$$ Wed Apr  1 13:25:13 2026 Russian Standard Time (UT+4h)  she@DPX200
##.OBSERVE FREQUENCY= 200.1313
##.OBSERVE NUCLEUS= ^1H
##.ACQUISITION MODE= SIMULTANEOUS
##.ACQUISITION SCHEME= undefined
##.AVERAGES= 8
##.DIGITISER RES= 18
##SPECTROMETER/DATA SYSTEM= spect
##.PULSE SEQUENCE= zg30
##.SOLVENT NAME= CDCl3
##.SHIFT REFERENCE= (INTERNAL, CDCl3, 0, 15.4847)
##AUDIT TRAIL= $$ (NUMBER, WHEN, WHO, WHERE, WHAT)
$$ ##TITLE= Audit trail, XWIN-NMR		Version 3.5
$$ ##JCAMPDX= 5.01
$$ ##ORIGIN= Bruker BioSpin GmbH
$$ ##OWNER= she
$$ F:/spectra/data/she/nmr/H-C/1/pdata/1/auditp.txt
$$ ##AUDIT TRAIL=  $$ (NUMBER, WHEN, WHO, WHERE, WHAT)
(   1,<2026-04-01 13:22:52.39 +0400>,<she>,<DPX200>,
      <created by zg, POWCHK disabled, PULCHK disabled
       configuration hash MD5:
       00 E9 B6 7A A2 85 ED C7 34 08 36 98 17 FE 4E 26
       data hash MD5: 16K
       60 E6 36 81 04 63 E5 A3 C5 99 24 F6 B5 5D 6C F1>)
(   2,<2026-04-01 13:22:54.56 +0400>,<she>,<DPX200>,
      <Start of raw data processing
       efp BC_mod = 2 LB = 0.25 FT_mod = 6 PKNL = 1 PHC0 = -3707.631 PHC1 = 8.5923 SI = 16K 
       data hash MD5: 16K
       A7 23 28 E0 87 8A 91 85 6F A3 43 A1 02 F4 22 6C>)
(   3,<2026-04-01 13:23:15.79 +0400>,<she>,<DPX200>,
      <pk PHC0 = -1.623451 PHC1 = 1.4 
       data hash MD5: 16K
       83 C4 24 95 CA 6F AE 9B D9 D9 5F F8 2E 53 10 B2>)
(   4,<2026-04-01 13:23:22.25 +0400>,<she>,<DPX200>,
      <abs ABSG = 5 
       data hash MD5: 16K
       AC 26 49 0B 90 62 87 7D FA 4A 95 A8 CD 47 95 5F>)
$$ ##END=
$$ 
$$ hash MD5
$$ 91 BA D9 2C 5B E0 6A 55 74 03 84 28 3E C1 16 EF
##$RELAX= 
##$RELAX= 
##$RELAX= 
##$RELAX= 
##$RELAX= 
##$RELAX= 
$$ Bruker specific parameters
$$ --------------------------
##$DU= <F:/spectra>
##$EXPNO= 1
##$NAME= <H-C>
##$PROCNO= 1
##$TYPE= <nmr>
##$USER= <she>
##$AMP= (0..31)
100 100 100 100 100 100 100 100 100 100 100 100 100 100 100 100 100 100 
100 100 100 100 100 100 100 100 100 100 100 100 100 100 
##$AQSEQ= 0
##$AQ_mod= 1
##$AUNM= <au_zg>
##$AUTOPOS= <>
##$BF1= 200.13
##$BF2= 200.13
##$BF3= 200.13
##$BF4= 200.13
##$BF5= 200.13
##$BF6= 200.13
##$BF7= 200.13
##$BF8= 200.13
##$BYTORDA= 1
##$CFDGTYP= 0
##$CFRGTYP= 5
##$CHEMSTR= <none>
##$CNST= (0..31)
1 1 145 1 1 1 1 1 1 1 1 1 1 1 1 1 1 1 1 1 1 1 1 1 1 1 1 1 1 1 1 1 
##$CPDPRG= <>
##$CPDPRG1= <>
##$CPDPRG2= <>
##$CPDPRG3= <>
##$CPDPRG4= <mlev>
##$CPDPRG5= <mlev>
##$CPDPRG6= <mlev>
##$CPDPRG7= <mlev>
##$CPDPRG8= <mlev>
##$CPDPRGB= <>
##$CPDPRGT= <>
##$D= (0..31)
0 0.7 0 0 0 0 0 0 0 0 0 0.03 0 0 0 0 0 0 0 0 0 0 0 0 0 0 0 0 0 0 0 0 
##$DATE= 1775035371
##$DBL= (0..7)
120 120 120 120 120 120 120 120 
##$DBP= (0..7)
150 150 150 150 150 150 150 150 
##$DBP07= 0
##$DBPNAM0= <>
##$DBPNAM1= <>
##$DBPNAM2= <>
##$DBPNAM3= <>
##$DBPNAM4= <>
$$ [...]
##$SUBNAM3= <"">
##$SUBNAM4= <"">
##$SUBNAM5= <"">
##$SUBNAM6= <"">
##$SUBNAM7= <"">
##$SUBNAM8= <"">
##$SUBNAM9= <"">
##$SW= 18.0517328524113
##$SWIBOX= (0..15)
0 0 2 0 0 0 0 0 0 0 0 0 0 0 0 0 
##$SW_h= 3612.71676300578
##$TD= 16384
##$TD0= 1
##$TE= 0
##$TE2= 300
##$TE3= 300
##$TEG= 300
##$TL= (0..7)
0 120 120 120 120 120 120 120 
##$TP= (0..7)
150 150 150 150 150 150 150 150 
##$TP07= 0
##$TPNAME0= <>
##$TPNAME1= <>
##$TPNAME2= <>
##$TPNAME3= <>
##$TPNAME4= <>
##$TPNAME5= <>
##$TPNAME6= <>
##$TPNAME7= <>
##$TPOAL= (0..7)
0.5 0.5 0.5 0.5 0.5 0.5 0.5 0.5 
##$TPOFFS= (0..7)
0 0 0 0 0 0 0 0 
##$TUNHIN= 0
##$TUNHOUT= 0
##$TUNXOUT= 0
##$USERA1= <user>
##$USERA2= <user>
##$USERA3= <user>
##$USERA4= <user>
##$USERA5= <user>
##$V9= 5
##$VALIST= <valist>
##$VCLIST= <CCCCCCCCCCCCCCC>
##$VD= 0
##$VDLIST= <DDDDDDDDDDDDDDD>
##$VPLIST= <PPPPPPPPPPPPPPP>
##$VTLIST= <TTTTTTTTTTTTTTT>
##$WBST= 1024
##$WBSW= 4
##$XGAIN= (0..3)
0 0 0 0 
##$XL= 0
##$YL= 0
##$YMAX_a= 480396
##$YMIN_a= -609475
##$ZGOPTNS= <>
##$ZL1= 120
##$ZL2= 120
##$ZL3= 120
##$ZL4= 120
##$ABSF1= 15.49788
##$ABSF2= -2.553969
##$ABSG= 5
##$ABSL= 3
##$ALPHA= 0
##$AQORDER= 0
##$ASSFAC= 0
##$ASSFACI= 0
##$ASSFACX= 0
##$ASSWID= 0
##$AUNMP= <proc_1d>
##$AZFE= 0.1
##$AZFW= 0.1
##$BCFW= 0
##$BC_mod= 2
##$BYTORDP= 0
##$COROFFS= 0
##$CY= -3
##$DATMOD= 1
##$DC= 0
##$DFILT= <>
##$DTYPP= 0
##$F1P= 0
##$F2P= 0
##$FCOR= 1
##$FTSIZE= 16384
##$FT_mod= 6
##$GAMMA= 0
##$GB= 0
##$INTBC= 1
##$INTSCL= 3.241238e-09
##$ISEN= 128
##$LB= 0.25
##$LEV0= 0
##$LPBIN= 0
##$MAXI= 10000
##$MC2= 0
##$MEAN= 0
##$ME_mod= 0
##$MI= 1.114404
##$NCOEF= 0
##$NC_proc= -7
##$NLEV= 6
##$NOISF1= 3.799351
##$NOISF2= 2.8
##$NSP= 0
##$NTH_PI= 0
##$NZP= 0
##$OFFSET= 15.48466
##$PC= 1
##$PHC0= -3709.255
##$PHC1= 9.9923
##$PH_mod= 1
##$PKNL= yes
##$PPARMOD= 0
##$PSCAL= 0
##$PSIGN= 0
##$REVERSE= no
##$SF= 200.130007412505
##$SI= 16384
##$SIGF1= 3
##$SIGF2= 2
##$SINO= 0.751879
##$SIOLD= 32768
##$SREGLST= <19F.Aceton>
##$SSB= 0
##$STSI= 16384
##$STSR= 0
##$SW_p= 3612.71676300578
##$SYMM= 0
##$S_DEV= 0
##$TDeff= 16384
##$TDoff= 0
##$TI= <>
##$TILT= no
##$TM1= 0
##$TM2= 0
##$TOPLEV= 0
##$USERP1= <user>
##$USERP2= <user>
##$USERP3= <user>
##$USERP4= <user>
##$USERP5= <user>
##$WDW= 1
##$XDIM= 16384
##$YMAX_p= 412800480
##$YMIN_p= -1863834
$$ End of Bruker specific parameters
$$ ---------------------------------
##NTUPLES= NMR SPECTRUM
##VAR_NAME=  FREQUENCY,     SPECTRUM/REAL,   SPECTRUM/IMAG
##SYMBOL=    X,             R,               I
##VAR_TYPE=  INDEPENDENT,   DEPENDENT,       DEPENDENT
##VAR_FORM=  AFFN,          ASDF,            ASDF
##VAR_DIM=   16384,         16384,           16384
##UNITS=     HZ,            ARBITRARY UNITS, ARBITRARY UNITS
##FACTOR=    0.220516191357247, 1,           1
##FIRST=     3098.94515032356, 0,            0
##LAST=      -513.771612682218, 0,           0
##MIN=       -513.771612682218, -1863834,    0
##MAX=       3098.94515032356, 412800480,    0
$$ Real data points
##PAGE= N=1
##DATA TABLE= (X++(R..R)), XYDATA
$$ [...]
$$ plain form
6161 6335923 6391474 6472198 6634908 6834896 6272010 6171830 6142162 6423857 6271339 6329425
6151 6329425 6554873 6482279 6179039 6276901 6509365 6370452 6377956 6506054 6317820 6318162 6420702
6140 6420702 6577217 6805346 7233385 7399655 7519388 8048732 8007179 7982972 8145586 8229276
6130 8229276 8297714 8305276 8200849 8286570 8094911 7992706 8021399 8035394 8016536 8222923 8269377
6119 8269377 8543629 8719823 8665700 8593871 8798694 8891242 9007127 9110796 9537939 10028163
6109 10028163 10128797 10562000 10600693 11178233 11575544 12068005 12181909 12087743 12404484 12484271
6099 12484271 12641139 12840338 12894803 12964219 13292750 13223848 13032582 12986226 13126657 13319685
6089 13319685 13478927 13259210 13529332 13850041 13939640 14304579 14609335 15009593 14949782 15169816
$$ packed form
6161F335923N5551Q0724J62710J99988n62886j00180k9668K81695j52518N8086
6151F329425K25448p2594l03240R7862K32464j38913P504J28098j88234L42J02540
6140F420702J56515K28129M28039J66270J19733N29344m1553k4207J62614Q3690
6130H229276O8438P562j04427Q5721j91659j02205K8693J3995j8858K06387M6454
6119H269377K74252J76194n4123p1829K04823R2548J15885J03669M27143M90224
6109A0028163J00634M33203L8693N77540L97311M92461J13904r4166L16741P9787
6099A2484271J56868J99199N4465O9416L28531o8902j91266m6356J40431J93028
6089A3319685J59242k19717K70122L20709Q9599L64939L04756M00258n9811K20034
$$ plain form
6079 15169816 15301433 15281138 15101682 15516454 15727944 15576376 15490577 15480669 15509248 15284654
6069 15284654 15576227 15739794 16018026 16073604 16282728 16655550 17167219 17725547 17801630 18216223
6059 18216223 18214101 18519529 18977535 19721624 20262511 20404259 21052103 21719694 22427819 23348712
6049 23348712 24054389 24568679 25519739 26630592 27864106 29303551 30453985 31491498 32660201
6040 32660201 34168476 35481469 37002534 38431290 39635688 41043808 42449725 43715170
6032 43715170 44780053 45727911 46672646 47724324 48438405 49197872 49810116 50603774 51474634
6023 51474634 52392977 53600121 54714707 56022907 57479906 58727216 60397273 61666574
6015 61666574 62781876 64085106 65168207 66247807 67250316 67788229 68122838 68181681 68404882
$$ packed form
6079A5169816J31617k0295j79456M14772K11490j51568q5799r908K8579k24594
6069A5284654K91573J63567K78232N5578K09124L72822N11669N58328P6083M14593
6059A8216223k122L05428M58006P44089N40887J41748O47844O67591P08125R20893
6049B3348712P05677N14290R51060J110853J233514J439445J150434J037513J168703
6040C2660201J508275J312993J521065J428756J204398J408120J405917J265445
6032D3715170J064883R47858R44735J051678P14081P59467O12244P93658Q70860
6023E1474634R18343J207144J114586J308200J456999J247310J670057J269301
6015F1666574J115302J303230J083101J079600J002509N37913L34609N8843K23201
$$ plain form
6006 68404882 68401907 68592842 68620957 68767574 68755005 68695308 68867749 68871596 69009891 69577588 69920966
5995 69920966 69933239 70453611 71008221 71540380 71932134 72196621 72613166 73058582 73315625 73839452
5985 73839452 73795043 74076771 74411672 74314781 74094942 73854255 73447899 73135520 72686593 71765979
5975 71765979 70626192 69206329 67566318 66415391 65268464 63715537 62381149 61167165
5967 61167165 59473892 57848772 56509426 55126552 53765639 52527570 51221158 50184237
5959 50184237 48978532 47818981 47213254 46241556 45347648 44547405 43902603 43145105 42582398
5950 42582398 41779652 41027316 40300517 39280665 38004373 37123665 36215865 35165352 34186510
5941 34186510 33294791 32302322 31243089 30253592 28985301 27914127 26707943 25577414 24735814
$$ packed form
6006F8404882k975J90935K8115J46617j2569n9697J72441L847J38295N67697L43378
5995F9920966J2273N20372N54610N32159L91754K64487M16545M45416K57043N23827
5985G3839452m4409K81728L34901r6891k19839k40687m06356l12379m48927r20614
5975G1765979j139787j419863j640011j150927j146927j552927j334388j213984
5967F1167165j693273j625120j339346j382874j360913j238069j306412j036921
5959E0184237j205705j159551o05727r71698q93908q00243o44802p57498n62707
5950D2582398q02746p52336p26799j019852j276292q80708r07800j050513r78842
5941C4186510q91719r92469j059233r89497j268291j071174j206184j130529q41600
$$ plain form
5932 24735814 24083696 23187428 22313907 21974149 21684719 20792669 20463891 19861095 19516821
5923 19516821 19046511 18593766 18521330 18293373 18256093 18161869 18004664 18021918 17952375 17995688
5913 17995688 18265549 18166996 18099603 17920342 17756081 17328077 17065016 16895312 16431226 15828435
5903 15828435 15316321 14568561 14317847 13837845 13359943 12679838 12396834 12068054 11699488
5894 11699488 11344866 11279251 11265245 11194461 10960560 10648842 10224981 10153450 10441004 10235491
5884 10235491 10531533 10860017 11083879 11260051 11020282 10850817 10914619 10689495 10141025 9806092
5874 9806092 9566175 9236123 9002022 8573290 8137592 7965101 7899643 7799139 7739090 7408556
5864 7408556 7103439 6924424 7064538 7278177 7194330 7162193 7157017 6973130 7191068 6917640
$$ packed form
5932B4735814o52118q96268q73521l39758k89430q92050l28778o02796l44274
5923A9516821m70310m52745p2436k27957l7280r4224j57205J7254o9543M3313
5913A7995688K69861r8553o7393j79261j64261m28004k63061j69704m64086o02791
5903A5828435n12114p47760k50714m80002m77902o80105k83004l28780l68566
5894A1699488l54622o5615j4006p0784k33901l11718m23861p1531K87554k05513
5884A0235491K96042L28484K23862J76172k39769j69465O3802k25124n48470l34933
5874I806092k39917l30052k34101m28732m35698j72491o5458j00504o0049l30534
5864G408556l05117j79015J40114K13639q3847l2137n176j83887K17938k73428
$$ plain form
5854 6917640 7143497 7273721 7455786 7649341 7421533 7291449 7497621 7367253 7101953 7082632
5844 7082632 7198194 7168070 7559796 7936460 8345269 9161321 9675245 9773558 10090666 10455625
5834 10455625 10651223 10756673 10822158 10636602 10767004 10708139 10393543 10418857 10162758 10134495
5824 10134495 9912110 9595079 9258818 8867985 8815201 8754707 9043804 9194238 9171864 9269764
5814 9269764 9430515 9936126 10511315 10909377 11397057 12010214 12791686 13515288 14061148 14758918
5804 14758918 14783167 14686652 14675408 14459460 14133811 14005374 13813693 13806143 13716712 13512303
5794 13512303 13292471 12961584 12825944 12340220 11719704 11486449 11336401 11302288 11311536 11492160
5784 11492160 11448525 11485028 11930538 12525700 13034091 13563119 14229413 15286567 16391087
$$ packed form
5854F917640K25857J30224J82065J93555k27808j30084K06172j30368k65300j9321
5844G082632J15562l0124L91726L76664M08809Q16052N13924R8313L17108L64959
5834A0455625J95598J05450O5485j85556J30402n8865l14596K5314k56099k8263
5824A0134495k22385l17031l36261l90833n2784o0494K89097J50434k2374R7900
5814I269764J60751N05611N75189L98062M87680O13157P81472P23602N45860O97770
5804A4758918K4249r6515j1244k15948l25649j28437j91681p550q9431k04409
5794A3512303k19832l30887j35640m85724o20516k33255j50048l4113R248J80624
5784A1492160m3635L6503M45510N95162N08391N29028O66294J057154J104520
$$ plain form
5775 16391087 17572326 18567443 19480048 20357499 21043085 22089101 23997700 26466621 30293160
5766 30293160 37053860 47257655 60889712 76518586 86441429 82827479 72867095 62921857
5758 62921857 53594564 44866480 36847734 30285377 24849682 20889139 17703255 15859567
5750 15859567 14220082 12936551 11856412 11482341 10849374 10490701 10304245 9975690 9476858
5741 9476858 9330937 9232315 8760053 8474899 8321075 8392148 7939904 7753831 7672839 7514407
5731 7514407 7342581 7211544 7277097 7612095 7714049 7491210 7729398 7733230 7784895 7654553
5721 7654553 7680597 7913820 7650755 7609282 7801795 7917171 7935230 8108649 8165520 8342302
5711 8342302 8375700 8710534 8558481 8628866 8844730 8817297 8923120 9216538 9312542 9709510
$$ packed form
5775A6391087J181239R95117R12605Q77451O85586J046016J908599K468921L826539
5766C0293160O760700J0203795J3632057J5628874R922843l613950r960384r945238
5758F2921857r327293q728084q018746o562357n435695l960543l185884j843688
5750A5859567j639485j283531j080139l74071o32967l58673j86456l28555m98832
5741I476858j45921r8622m72262k85154j53824P1073m52244j86073q0992j58432
5731G514407j71826j31037O5553L34998J01954k22839K38188L832N1665j30342
5721G654553K6044K33223k63065m1473J92513J15376J8059J73419N6871J76782
5711H342302L3398L34834j52053P0385K15864k7433J05823K93418R6004L96968
$$ plain form
5701 9709510 9745294 10040060 10175780 10343453 10277638 10260507 10384646 10268931 10599260 10579693
5691 10579693 10835768 11145591 11281090 11280471 11442147 11910414 11944717 11759203 12066550 12347806
5681 12347806 12599029 12739362 12843030 13150656 13360404 13565774 14093403 14682404 15306805
5672 15306805 15957475 16514050 17058559 17597593 17977213 18422437 18901685 19510866 20276646
5663 20276646 21059207 21950459 23000920 24075819 24926422 25997789 27306188 28515408 29759253
5654 29759253 31241278 33310488 35428775 38114347 40791842 43195597 46260346 50533379
5646 50533379 56474480 64886200 74469392 83162463 88637922 91180258 92173647 91658244
5638 91658244 89828235 87085251 84423520 82227842 81045073 81344639 82943068 84403071
$$ packed form
5701I709510L5784K94766J35720J67673o5815j7131J24139j15715L30329j9567
5691A0579693K56075L09823J35499o19J61676M68267L4303j85514L07347K81256
5681A2347806K51223J40333J03668L07626K09748K05370N27629N89001O24401
5672A5306805O50670N56575N44509N39034L79620M45224M79248O09181P65780
5663B0276646P82561Q91252J050461J074899Q50603J071367J308399J209220J243845
5654B9759253J482025K069210K118287K685572K677495K403755L064749M273033
5646E0533379N941101Q411720R583192Q693071N475459K542336R93389n15403
5638I1658244j830009k742984k661731k195678j182769K99566J598429J460003
$$ plain form
5630 84403071 86300915 88793486 91648028 94856003 98731693 102921538 106786576 109558076
5622 109558076 111611764 113883220 116852083 121188948 127858857 137227359 150233560 167036629
5614 167036629 186334717 203342796 210021957 204983808 193816392 180880019 167075847
5607 167075847 153546822 142110794 132949723 125871522 120974419 116735756 112029501 107160078
5599 107160078 102402179 98401604 94722542 91484417 88529583 85983248 83116475 80236211
5591 80236211 78051789 76948690 77318004 79172221 81957380 84904820 88080484 91323746
5583 91323746 93152664 90790413 84023037 75547509 67195238 59538783 52976608 47726053
5575 47726053 43187836 38788915 35086533 31977498 29427420 27029964 25726926 24272366
$$ packed form
5630H4403071J897844K492571K854542L207975L875690M189845L865038K771500
5622A09558076K053688K271456K968863M336865O669909R368502J3006201J6803069
5614A67036629J9298088J7008079O679161n038149j1167416j2936373j3804172
5607A67075847j3529025j1436028r161071p078201m897103m238663m706255m869423
5599A07160078m757899m000575l679062l238125k954834k546335k866773k880264
5591H0236211k184422j103099L69314J854217K785159K947440L175664L243262
5583I1323746J828918k362251o767376q475528q352271p656455o562175n250555
5575D7726053m538217m398921l702382l109035k550078k397456j303038j454560
$$ plain form
5567 24272366 23219428 22201349 21238399 20359589 19011794 18110095 17046529 15997579 15184388
5558 15184388 14686224 14350615 13692372 12883686 12204631 11621646 11033923 10581783 10238258
5549 10238258 9873140 9583996 9510841 9125183 8883325 8713188 8620036 8593917 8704857 8907279
5539 8907279 8636305 8736073 8653729 8265155 8016500 8303633 8239310 8221575 8230290 8302580 8074330
5528 8074330 8073596 8243303 8004411 7728099 7492062 7184232 7066582 6674451 6360664 6392900
5518 6392900 5967944 5829483 5963174 6076667 5971814 5786110 5805863 5945495 5938386 5802109
5508 5802109 5694229 5654432 5285372 5502762 5441235 5397954 5139390 5016721 5037362 5324502
5498 5324502 5089837 5117518 5225799 5060802 5077809 4905297 4798689 4673108 4371964 4357904
$$ packed form
5567B4272366j052938j018079r62950q78810j347795r01699j063566j048950q13191
5558A5184388m98164l35609o58243q08686o79055n82985n87723m52140l43525
5549A0238258l65118k89144p3155l85658k41858j70137r3152k6119J10940K02422
5539H907279k70974R9768q2344l88574k48655K87133o4323j7735Q715P2290k28250
5528H074330p34J69707k38892k76312k36037l07830j17650l92131l13787L2236
5518F392900m24956j38461J33691J13493j04853j85704J9753J39632p109j36277
5508E802109j07880l9797l69060K17390o1527m3281k58564j22669K0641K87140
5498E324502k34665K7681J08281j64997J7007j72512j06608j25581l01144j4060
$$ plain form
5488 4357904 4389841 4059573 4173191 4164954 4260662 4271390 4044256 3936443 3797440 3860782 3779168
5477 3779168 3871090 3893488 3878861 3859838 3750734 4061044 4128047 4018493 4104610 4095461 4090303
5466 4090303 4188880 4012147 4279900 4202154 4230717 4070072 4046905 4210731 4207360 4253314 4169406
5455 4169406 4019789 4088619 4394253 4372235 3993389 4061735 4198300 4186469 4292277 4258760
5445 4258760 4289449 4471600 4351612 4261209 4217935 3960638 4054433 4191526 4508354 4258224
5435 4258224 4212684 4245735 4169808 4487193 4459250 4413357 4438136 4488495 4397968 4409138 4347783
5424 4347783 4654068 4936489 5115315 4775440 4620066 4571487 4697647 4814132 4749955 4692936
5414 4692936 4504169 4609547 4731191 4884875 5076385 5235849 5176548 5014505 4842770 4865684
$$ packed form
5488D357904L1937l30268J13618q237R5708J0728k27134j07813j39003O3342q1614
5477C779168R1922K2398j4627j9023j09104L10310O7003j09554Q6117r149n158
5466D090303R8577j76733K67753p7746K8563j60645k3167J63826l371M5954q3908
5455D169406j49617O8830L05634k2018l78846O8346J36565j1831J05808l3517
5445D258760L0689J82151j19988r0403m3274k57297R3795J37093L16828k50130
5435D258224m5540L3051p5927L17385k7943m5893K4779N0359r0527J1170o1355
5424D347783L06285K82421J78826l39875j55374m8579J26160J16485o4177n7019
5414D692936j88767J05378J21644J53684J91510J59464n9301j62043j71735K2914
$$ plain form
5404 4865684 4924329 4998735 4934613 4856539 5118963 5385115 5362714 5213917 5276031 5397618 5401507
5393 5401507 5332135 5404190 5348231 5384870 5546988 5567532 5611345 5572333 5756838 5717249 5741940
5382 5741940 5718885 5788532 5775292 5702502 5906789 5812446 5884832 5815416 5699819 5884115 5872465
5371 5872465 5948993 6141151 6348149 6664508 6614079 6448144 6407085 6449578 6394824 6678724
5361 6678724 6823347 6828994 7074840 7492373 7552172 7496072 7241567 7289656 7595333 7681215 7685993
5350 7685993 7523831 7856290 7987926 8055960 8114085 8031419 7976934 8264163 8688830 8445561
5340 8445561 8370334 8667047 8979311 9161848 9126342 9158642 9267073 9443001 9625996 9745306
5330 9745306 9770941 10028108 10201821 10414667 10383463 10492144 10585923 10655674 10745196 10886636
$$ packed form
5404D865684N8645P4406o4122p8074K62424K66152k2401j48797O2114J21587L889
5393E401507o9372P2055n5959L6639J62118K0544M3813l9012J84505l9589K4691
5382E741940k3055O9647j3240p2790K04287r4343P2386o9416j15597J84296j1650
5371E872465P6528J92158K06998L16359n0429j65935m1059M2493n4754K83900
5361F678724J44623N647K45846M17533N9799n6100k54505M8089L05677Q5882M778
5350G685993j62162L32459J31636O8034N8125q2666n4485K87229M24667k43269
5340H445561p5227K96713L12264J82537l5506L2300J08431J75928J82995J19310
5330I745306K5635K57167J73713K12846l1204J08681R3779O9751Q9522J41440
$$ plain form
5320 10886636 10921227 10940041 11343293 11666004 11691419 11963692 12266167 12587259 12717642 13346920
5310 13346920 13642797 13695651 13802102 13838770 13910762 14009069 14082561 14355466 14771061 14903007
5300 14903007 15273920 15288525 15825769 16219795 16404312 16517857 16533548 16952208 17439715 17974692
5290 17974692 18245029 18251169 18721652 19055438 19273877 19913779 20441654 21077429 21546191 21932084
5280 21932084 22079271 22324740 22615780 23020108 23284378 23720490 23990248 24414270 24651557
5271 24651557 25152307 25877224 26472733 26901769 27432092 27767251 28341554 29154268 29815926
5262 29815926 30282061 30719022 31763879 32361320 32768527 33516907 34259227 34986058 36086130
5253 36086130 36784331 37612014 38537745 39188768 39767562 40315930 41129358 41872020 42885124
$$ packed form
5320A0886636L4591J8814M03252L22711K5415K72273L02475L21092J30383O29278
5310A3346920K95877N2854J06451L6668P1992R8307P3492K72905M15595J31946
5300A4903007L70913J4605N37244L94026J84517J13545J5691M18660M87507N34977
5290A7974692K70337O140M70483L33786K18439O39902N27875O35775M68762L85893
5280B1932084J47187K45469K91040M04328K64270M36112K69758M24022K37287
5271B4651557N00750P24917N95509M29036N30323L35159N74303Q12714O61658
5262B9815926M66135M36961J044857N97441M07207P48380P42320P26831J100072
5253C6086130O98201Q27683R25731O51023N78794N48368Q13428P42662J013104
$$ plain form
5244 42885124 43888530 44921321 45790341 46283741 47384641 48492187 49644425 50341113 50896262
5235 50896262 51711332 52942469 53970317 54717624 55365180 56516080 57208279 58069406 58962939
5226 58962939 59630627 60291159 60958762 61495500 62199216 62889801 63457349 63919125 64662295
5217 64662295 65240041 65539779 65760388 65861116 65989634 66290561 66522020 66347543 66241753
5208 66241753 66418125 66457955 66277885 66192013 66281865 66036730 65554893 65183050 64904416 64528780
5198 64528780 64386170 64183733 63801312 63607747 63077725 62711989 62240495 61882072 61369808
5189 61369808 60729750 60306273 59943318 59423378 58973104 58457567 58160399 57815731 57093725
5180 57093725 56496054 55951510 55500680 55024660 54587495 54247513 53716135 53322113 52816962
$$ packed form
5244D2885124J003406J032791Q69020M93400J100900J107546J152238O96688N55149
5235E0896262Q15070J231137J027848P47307O47556J150900O92199Q61127Q93533
5226E8962939O67688O60532O67603N36738P03716O90585N67548M61776P43170
5217F4662295N77746K99738K20609J00728J28518L00927K31459j74477j05790
5208F6241753J76372L9830j80070q5872Q9852k45135m81837l71843k78634l75636
5198F4528780j42610k02437l82421j93565n30022l65736m71494l58423n12264
5189F1369808o40058m23477l62955n19940m50274n15537k97168l44668p22006
5180E7093725n97671n44544m50830m76020m37165l39982n31378l94022n05151
$$ plain form
5171 52816962 52580977 52223508 51546741 51459398 50795174 50179088 49888521 49343046 48885530 48388898
5161 48388898 48209270 47454730 46936030 46622603 46175410 45696042 45329295 44842984 44204877
5152 44204877 43919958 43300395 43110203 42844716 42340959 41926691 41346611 41026737 40621057
5143 40621057 40174020 39664165 39187389 39098286 38725150 38501818 38355522 37887787 37501113 37159569
5133 37159569 36853970 36554690 36389464 36080562 36070533 35805458 35766229 35519765 35206940 35060420
5123 35060420 35072700 34939844 35024128 35256594 35320053 35023499 34746075 34882911 34762318 34965862
5113 34965862 34960714 35189951 35435958 35380886 35253585 35132936 35294145 35313458 35232464 35540700
5103 35540700 35665990 35779385 35737345 36018036 35955684 35468751 35393265 35729337 36114446 35730987
$$ packed form
5171E2816962k35985l57469o76767q7343o64224o16086k90567n45475m57516m96632
5161D8388898j79628p54540n18700l13427m47193m79368l66747m86311o38107
5152D4204877k84919o19563j90192k65487n03757m14268n80080l19874m05680
5143D0621057m47037n09855m76776q9103l73136k23332j46296m67735l86674l41544
5133C7159569l05599k99280j65226l08902j0029k65075l9229k46464l12825j46520
5123C5060420J2280j32856Q4284K32466O3459k96554k77424J36836j20593K03544
5113C4965862n148K29237K46007n5072j27301j20649J61209J9313q0994L08236
5103C5540700J25290J13395m2040K80691o2352m86933p5486L36072L85109l83459
$$ plain form
5093 35730987 35448101 35504764 35828404 35859361 35706169 35677675 35826588 35777851 35539639 35331509
5083 35331509 35098941 34785222 34544892 34180478 34270131 34202478 34149870 34055845 33830254 33599395
5073 33599395 33707820 33686396 33284418 33273798 33334057 33379243 33139468 33227642 33065642 32767572
5063 32767572 32616084 32853592 32983482 32847600 33032510 33183868 33353096 33537503 33564611 33727097
5053 33727097 33888249 34211320 34491847 34751237 35244784 35405067 35381796 35456509 36010983 36266520
5043 36266520 36598627 36956617 37014207 37333061 37459288 37813720 38007092 37975202 38048341 38342219
5033 38342219 38517604 38584906 38824855 38710760 38427331 38276240 38316775 38414421 38673484 38796087
5023 38796087 38898594 38806966 38475914 38546266 38592441 38767979 38760103 38758139 38665727 38777409 38604511
$$ packed form
5093C5730987k82886N6663L23640L0957j53192k8494J48913m8737k38212k08130
5083C5331509k32568l13719k40330l64414Q9653o7653n2608r4025k25591k30859
5073C3599395J08425k1424m01978j0620O0259M5186k39775Q8174j62000k98070
5063C2767572j51488K37508J29890j35882J84910J51358J69228J84407K7108J62486
5053C3727097J61152L23071K80527K59390M93547J60283k3271P4713N54474K55537
5043C6266520L32107L57990N7590L18854J26227L54432J93372l1890P3139K93878
5033C8342219J75385O7302K39949j14095k83429j51091M0535R7646K59063J22603
5023C8796087J02507r1628l31052P0352M6175J75538p876j964r2412J11682j72898
$$ plain form
5012 38604511 38713436 38772987 38698135 38722348 38953095 38668430 38606355 38681175 38919930 39295398
5002 39295398 39275264 38976600 38926109 39403598 39510423 39580830 39864027 39990709 40325730 40868002
4992 40868002 41309736 41658350 42167701 42561615 42407916 42327667 42322828 42391369 42292892 42465439
4982 42465439 42481870 42380905 42592364 43034850 43193961 43334038 43489996 43904603 44029102 44123595
4972 44123595 44468157 44792710 45100662 45419315 45391557 45383033 45495981 45553319 45514296 45480403
4962 45480403 45653495 45840650 45830413 45674162 45641039 45926099 46064515 45882147 45824818 46046944
4952 46046944 46277750 46503563 46437159 46255887 46388445 46660209 46808854 46986642 47160762 47051087
4942 47051087 47313791 47727424 48045549 48007205 48171657 48339209 48332624 48484114 48734743 49166847
$$ packed form
5012C8604511J08925N9551p4852K4213K30747k84665o2075P4820K38755L75468
5002C9295398k0134k98664n0491M77489J06825P0407K83197J26682L35021N42272
4992D0868002M41734L48614N09351L93914j53699q0249m839O8541r8477J72547
4982D2465439J6431j00965K11459M42486J59111J40077J55958M14607J24499R4493
4972D4123595L44562L24553L07952L18653k7758q524J12948N7338l9023l3893
4962D5480403J73092J87155j0237j56251l3123K85060J38416j82368n7329K22126
4952D6046944K30806K25813o6404j81272J32558K71764J48645J77788J74120j09675
4942D7051087K62704M13633L18125l8344J64452J67552o585J51490K50629M32104
$$ plain form
4932 49166847 49364562 49788708 50208804 50423596 50851742 51282059 52113964 52674827 53275635
4923 53275635 53949079 54726440 55404997 56066412 56780444 57534918 58234599 59073840 59989671
4914 59989671 60721020 61236093 62226646 63299988 63953669 64658483 65682344 66915709 67542884
4905 67542884 68419214 69255839 70262911 70933225 71822141 72564759 73045920 73551579 74122205
4896 74122205 74814918 74950232 75000890 75216944 75092101 74953387 74769014 74457510 73849875 73154466
4886 73154466 72636858 72277609 71925583 71395065 70842283 70097289 69724957 69490917 69138745
4877 69138745 68589805 68236384 67848017 67301462 66930943 66559331 66208923 65873209 65561057
4868 65561057 65231229 65059951 64594126 63830154 63116113 62832611 62525413 62019141 61572096
$$ packed form
4932D9166847J97715M24146M20096K14792M28146M30317Q31905N60863O00808
4923E3275635O73444P77361O78557O61415P14032P54474O99681Q39241R15831
4914E9989671P31349N15073R90553J073342O53681P04814J023861J233365O27175
4905F7542884Q76330Q36625J007072O70314Q88916P42618M81161N05659N70626
4896G4122205O92713J35314N0658K16054j24843j38714j84373l11504o07635o95409
4886G3154466n17608l59249l52026n30518n52782p44994l72332k34040l52172
4877F9138745n48940l53421l88367n46555l70519l71612l50408l35714l12152
4868F5561057l29828j71278m65825p63972p14041k83502l07198n06272m47045
$$ plain form
4859 61572096 61100630 60476638 60168279 59998002 59911752 60357464 60437892 60033583 59984509 59766708
4849 59766708 59430941 59022159 58853638 59261860 59386696 59632554 59698822 60594672 61289740 61960942
4839 61960942 62789547 63651946 64738447 66270430 68272213 71107888 76012145 83149115
4831 83149115 93406371 105578589 115357269 114790084 107727660 100506772 93632772 87309699
4823 87309699 81705390 77180765 73508131 70478519 68187645 66926309 65720798 64856232
4815 64856232 64144111 63410019 62516774 61892298 61078883 60057402 59178998 58575784 57719790
4806 57719790 56855393 56161401 55184489 54270998 53736872 53096707 52388504 51763301 51401623
4797 51401623 51076812 50638455 50229530 50053417 49972339 49603982 49529692 49266748 49057297 48660857
$$ packed form
4859F1572096m71466o23992l08359j70277q6250M45712Q0428m04309m9074k17801
4849E9766708l35767m08782j68521M08222J24836K45858O6268Q95850O95068O71202
4839F1960942Q28605Q62399J086501J531983K001783K835675M904257P136970
4831H3149115J0257256J2172218R778680n67185p062424p220888o874000o323073
4823H7309699n604309m524625l672634l029612k290874j261336j205511q64566
4815F4856232p12121p34092q93245o24476q13415j021481q78404o03214q55994
4806E7719790q64397o93992r76912r13491n34126o40165p08203o25203l61678
4797E1401623l24811m38357m08925j76113q1078l68357p4290k62944k09451l96440
$$ plain form
4787 48660857 48634533 48395376 47983470 47867094 48119977 48032425 47793237 47833894 47766781 47805730
4777 47805730 47890366 48084552 48261024 48562355 48800667 48996665 49090489 49118931 49485060 49964268
4767 49964268 50485283 50903016 51178108 51680487 51949130 52429455 52963029 53307469 53778419
4758 53778419 54497662 54909267 55849214 56424888 56970442 57660454 58406658 59171888 59825714
4749 59825714 60524125 61642315 62495444 63351921 64338521 65381111 66353690 67575295 68675940
4740 68675940 69744310 70770977 72034314 73249324 74485479 75618226 76705567 77923739
4732 77923739 79071620 80225114 81376703 82567763 83807810 85189058 86205792 87307435
4724 87307435 88516361 89845183 90640670 91810478 92832455 94053613 95393234 96403577
$$ packed form
4787D8660857k6324k39157m11906j16376K52883q7552k39188M0657o7113L8949
4777D7805730Q4636J94186J76472L01331K38312J95998R3824K8442L66129M79208
4767D9964268N21015M17733K75092N02379K68643M80325N33574L44440M70950
4758E3778419P19243M11605R39947N75674N45554O90012P46204P65230O53826
4749E9825714O98411J118190Q53129Q56477R86600J042590R72579J221605J100645
4740F8675940J068370J026667J263337J215010J236155J132747J087341J218172
4732G7923739J147881J153494J151589J191060J240047J381248J016734J101643
4724H7307435J208926J328822P95487J169808J021977J221158J339621J010343
$$ plain form
4716 96403577 97619564 99032727 100582531 102156000 103757805 105398154 107032713 109055788
4708 109055788 110769747 112574042 114456558 116385490 117794990 119361261 120829783 122337827
4700 122337827 123442765 124215524 125089208 125325897 125461018 125009943 124294015 123996733 123078149
4691 123078149 121942936 120953969 119526226 118001751 116268083 114445880 112506304 110531459
4683 110531459 108709239 106587242 104485110 102244053 100012683 97844773 95712291 93244571
4675 93244571 91167187 88846458 86748498 84426469 81992036 79548214 77324452 74972769
4667 74972769 72679824 70629915 68400506 66173042 63993301 61639418 59452230 57548429
4659 57548429 55233478 53346688 51365311 49144823 47462472 45729845 43873381 42418167
$$ packed form
4716I6403577J215987J413163J549804J573469J601805J640349J634559K023075
4708A09055788J713959J804295J882516J928932J409500J566271J468522J508044
4700A22337827J104938P72759Q73684K36689J35121m51075p15928k97282r18584
4691A23078149j135213r88967j427743j524475j733668j822203j939576j974845
4683A10531459j822220k121997k102132k241057k231370k167910k132482k467720
4675I3244571k077384k320729k097960k322029k434433k443822k223762k351683
4667G4972769k292945k049909k229409k227464k179741k353883k187188j903801
4659E7548429k314951j886790j981377k220488j682351j732627j856464j455214
$$ plain form
4651 42418167 40879585 39582839 38311609 37226056 36086133 35304655 34208895 33391548
4643 33391548 32734512 32106618 31462314 30856106 30368285 30379512 29824710 29911488 29756188 29762396
4633 29762396 29892141 30182561 30800153 31869074 33300160 34681872 36506789 37577184 37293119
4624 37293119 35836359 34064469 32896423 31554434 29858442 28373693 27594421 27142390
4616 27142390 26796348 26757637 26943050 27598179 28332864 29306079 30456279 31589835 32515243
4607 32515243 33633060 34550545 35804323 37242573 38686309 40628948 42357013 43710062
4599 43710062 44776449 45097291 45758220 46561061 47640965 48945078 50234133 50833202 50623542
4590 50623542 49613819 48724602 47400064 46063898 44946423 44312278 43655346 42119936 40153389
$$ packed form
4651D2418167j538582j296746j271230j085553j139923p81478j095760q17347
4643C3391548o57036o27894o44304o06208m87821J1227n54802Q6778j55300O208
4633B9762396J29745K90420O17592J068921J431086J381712J824917J070395k84065
4624C7293119j456760j771890j168046j341989j695992j484749p79272m52031
4616B7142390l46042l8711J85413O55129P34685R73215J150200J133556R25408
4607C2515243J117817R17485J253778J438250J443736J942639J728065J353049
4599D3710062J066387L20842O60929Q02841J079904J304113J289055N99069k09660
4590E0623542j009723q89217j324538j336166j117475o34145o56932j535410j966547
$$ plain form
4581 40153389 37991248 35774862 33451347 31546226 30068030 28580627 26960576 25307431
4573 25307431 23878320 22068573 20221910 18537864 17140950 15920585 14783591 14004850
4565 14004850 13359140 12911975 12224411 11438804 11277079 11254816 10848148 10501727 10144232 10219491
4555 10219491 9993453 9812243 9691243 9705138 9452069 9246412 9436380 9459463 9328742 9602612
4545 9602612 9315970 9120642 9178154 9295792 9308034 9117210 9312576 9467074 9399105 9208111
4535 9208111 9251602 9153948 9181385 9423364 9254361 9118553 9267891 9243078 9430008 9768835
4525 9768835 10037450 10174103 10097058 10062962 10407303 10603437 10523992 10639059 10234874 10165924
4515 10165924 10207410 10612925 10867005 11021614 11148653 10987722 10994548 11046605 10919820 10466844
$$ packed form
4581D0153389k162141k216386k323515j905121j478196j487403j620051j653145
4573B5307431j429111j809747j846663j684046j396914j220365j136994p78741
4565A4004850o45710m47165o87564p85607j61725k2263m06668l46421l57495P5259
4555A0219491k26038j81210j21000J3895k53069k05657J89968K3083j30721K73870
4545I602612k86642j95328N7512J17638J2242j90824J95366J54498o7969j90994
4535I208111M3491r7654K7437K41979j69003j35808J49338k4813J86930L38827
4525I768835K68615J36653p7045l4096L44341J96134p9445J15067m04185o8950
4515A0165924M1486M05515K54080J54609J27039j60931O826N2057j26785m52976
$$ plain form
4505 10466844 9984564 9857807 9618981 9242858 9212458 8787753 8759640 8364615 7972104 7940394
4495 7940394 7800029 7779703 7645622 7636016 7431544 7235361 6969401 6795840 6631522 6513508
4485 6513508 6642795 6537775 6568732 6649614 6660201 6531660 6630685 6684237 6721027 6504790 6162066
4474 6162066 6181974 6161199 5875199 5554265 5369437 5403276 5053388 4790675 4603502 4402473
4464 4402473 4247486 4102533 4255599 4345501 4192021 4038118 3732280 3936767 4117972 3996726
4454 3996726 3526018 3650103 4028840 4097427 4006383 3782482 3661849 3604899 3759826 3725658
4444 3725658 3630969 3627965 3673890 3833259 3813151 3762483 3740534 3694055 3778279 3770875 3631581
4433 3631581 3779504 4034080 3964774 4153062 4006340 3863104 3748411 3735048 3795653 3813907
$$ packed form
4505A0466844m82280j26757k38826l76123l0400m24705k8113l95025l92511l1710
4495G940394j40365k0326j34081r606k04472j96183k65960j73561j64318j18014
4485F513508J29287j05020L0957Q0882J0587j28541R9025N3552L6790k16237l42724
4474F162066J9908k0775k86000l20934j84828L3839l49888k62713j87173k01029
4464D402473j54987j44953J53066Q9902j53480j53903l05838K04487J81205j21246
4454C996726m70708J24085L78737O8587r1044k23901j20633n6950J54927l4168
4444C725658r4689l004M5925J59369k0108n0668k1949m6479Q4224p404j39294
4433C631581J47923K54576o9306J88288j46722j43236j14693j3363O0605J8254
$$ plain form
4423 3813907 3755383 3785728 3978814 3667348 3737287 3821376 4165191 4164369 3869627 3804773 3967226
4412 3967226 3929756 3804248 3994805 4074039 3969123 3946536 4395341 4396571 4393268 4386373 4582405
4401 4582405 4566370 4495503 4541771 4679811 4655494 4746680 4966673 4887812 4907389 4862162 4847289
4390 4847289 5235467 5237740 4944331 5089519 5085148 5097874 5124278 5073737 5293701 5512376 5638943
4379 5638943 5484662 5583952 5723377 5834401 5876535 6060881 6173022 6319769 6225882 6445465
4369 6445465 6963622 7359069 7572091 7644585 7796177 8152941 8693606 9038209 9265008 9644832
4359 9644832 10160336 10760371 10715105 10783729 10498127 10266588 9988180 9814697 9924321 9794713
4349 9794713 9625655 9407579 9497990 9589152 9397635 9203039 9255385 9255399 9240996 9135177 9181740
$$ packed form
4423C813907n8524L0345J93086l11466O9939Q4089L43815q22k94742o4854J62453
4412C967226l7470j25508J90557P9234j04916k2587M48805J230l303o895J96032
4401D582405j6035p0867M6268J38040k4317R1186K19993p8861J9577m5227j4873
4390D847289L88178K273k93409J45188m371J2726K6404n0541K19964K18675J26567
4379E638943j54281R9290J39425J11024M2134J84346J12141J46747r3887K19583
4369F445465N18157L95447K13022P2494J51592L56764N40665L44603K26799L79824
4359I644832N15504O00035m5266O8624k85602k31539k78408j73483J09624j29608
4349I794713j69058k18076R0411R1162j91517j94596N2346J4j4403j05819M6563
$$ plain form
4338 9181740 8994705 9029634 8899876 8767467 8912371 9250744 9307179 9293392 9547333 9769353
4328 9769353 9779596 9904712 9964511 10006098 10035723 10243073 10447863 10557647 10560701 10716394 10756996
4317 10756996 10775836 11119004 11487474 11785817 11916210 12235175 12776705 13153292 13396362 13487242
4307 13487242 13633253 13976036 14435193 14737061 15160196 15435703 15892127 16085817 16240344
4298 16240344 16346211 16441919 16334476 16025679 15843938 15737188 15551786 15478197 15242704 15012899
4288 15012899 14781351 14380560 14097735 13786608 13261666 12795320 12845324 12434023 12180933 12109801
4278 12109801 12299662 12212792 12163923 11960588 11899320 12099561 12023637 11789585 11744263 12218097
4268 12218097 12181786 12339508 12539541 12568650 12747782 13083918 13074326 13292929 13308693 13502084
$$ packed form
4338I181740j87035L4929j29758j32409J44904L38373N6435j3787K53941K22020
4328I769353J0243J25116N9799M1587K9625K07350K04790J09784L054J55693M0602
4317A0756996J8840L43168L68470K98343J30393L18965N41530L76587K43070R0880
4307A3487242J46011L42783M59157L01868M23135K75507M56424J93690J54527
4298A6240344J05867R5708j07443l08797j81741j06750j85402p3589k35493k29805
4288A5012899k31548m00791k82825l11127n24942m66346N0004m11301k53090p1132
4278A2109801J89861q6870m8869k03335o1268K00241p5924k34052m5322M73834
4268A2218097l6311J57722K00033K9109J79132L36136r592K18603J5764J93391
$$ plain form
4258 13502084 13768606 14038404 14222863 14190982 14495493 14299908 14400410 14364166 14326640 14678751
4248 14678751 14658639 14644247 14574856 14295329 14037882 14014001 13943171 13889934 13681139 13417865
4238 13417865 13327659 13147271 12896025 12896880 12591684 12170843 12301059 12261439 12374413 12075790
4228 12075790 11722930 11210072 11031697 10999511 10922653 10877690 10840070 10715669 10949598 11117325
4218 11117325 11160019 11120420 11292581 11201372 11345320 11337485 11292458 11374500 11176416 10987451 10662198
4207 10662198 10907696 10870298 10906832 11129381 11226729 11256122 11453827 11563895 11802369 11844036
4197 11844036 11799834 11777511 11880948 12025055 11635664 11771841 12158166 12005327 12214013 12543879
4187 12543879 12608011 12958785 13055855 13180534 13067589 13242931 13291920 13598698 13803417 14031890
$$ packed form
4258A3502084K66522K69798J84459l1881L04511j95585J00502l6244l7526L52111
4248A4678751k0112j4392o9391k79527k57447k3881p0830n3237k08795k63274
4238A3417865r0206j80388k51246Q55l05196m20841J30216l9620J12974k98623
4228A2075790l52860n12858j78375l2186p6858m4963l7620j24401K33929J67727
4218A1117325M2694l9599J72161r1209J43948p835m5027Q2042j98084j88965l25253
4207A0662198K45498l7398L6534K22549R7348K9393J97705J10068K38474M1667
4197A1844036m4202k2323J03437J44107l89391J36177L86325j52839K08686L29866
4187A2543879O4132L50774R7070J24679j12945J75342M8989L06778K04719K28473
$$ plain form
4177 14031890 14349530 14339764 14345985 14714268 14781908 14959496 15209512 15673384 15924288 16058132
4167 16058132 16523231 16577243 16702219 17079729 17187439 17508462 17841310 18273826 18712050 18956693
4157 18956693 19565605 19860188 20378383 20790500 21396502 21836799 22426254 22410606 22949365 23626297
4147 23626297 24007018 24277453 24576260 24897544 25476294 25979949 26580797 27204972 27929504
4138 27929504 28513342 28979866 29383522 29915403 30535990 31314671 32084371 32733204 33151887
4129 33151887 33867576 34599041 35239711 36123750 36935929 37758866 38865724 39808155 40628715
4120 40628715 41643075 42533449 43665939 44921651 45917565 46945919 48155716 49640624
4112 49640624 51047231 52062502 52937696 53720098 54367676 55100997 56410811 57390048 58304796
$$ packed form
4177A4031890L17640r766O221L68283O7640J77588K50016M63872K50904J33844
4167A6058132M65099N4012J24976L77510J07710L21023L32848M32516M38224K44643
4157A8956693O08912K94583N18195M12117O06002M40297N89455j5648N38759O76932
4147B3626297L80721K70435K98807L21284N78750N03655O00848O24175P24532
4138B7929504N83838M66524M03656N31881O20587P78681P69700O48833M18683
4129C3151887P15689P31465O40670Q84039Q12179Q22937J106858R42431Q20560
4120D0628715J014360Q90374J132490J255712R95914J028354J209797J484908
4112D9640624J406607J015271Q75194P82402O47578P33321J309814R79237R14748
$$ plain form
4103 58304796 59052049 60229735 61386035 62459265 63792759 65243915 66588895 67996781
4095 67996781 69610873 71321516 72994126 74600151 75943625 77260008 78758389 80158635
4087 80158635 81861805 83379573 84694467 86027691 87198781 88482147 89755720 91077069
4079 91077069 92585182 93861613 95314430 96616805 98192009 99950720 101368523 102722615
4071 102722615 104149841 105719898 107486136 108933849 110478649 112095101 113468911 115688642
4063 115688642 118138259 121147833 124122707 126901749 128730350 129360058 129762605 129918761
4055 129918761 130012064 130679763 131408552 132349482 133576496 135261029 137133876 138785524 140609966
4046 140609966 142321134 144005598 145518799 146748276 148308568 149803211 151410447 152703858
$$ packed form
4103E8304796P47253J177686J156300J073230J333494J451156J344980J407886
4095F7996781J614092J710643J672610J606025J343474J316383J498381J400246
4087H0158635J703170J517768J314894J333224J171090J283366J273573J321349
4079I1077069J508113J276431J452817J302375J575204J758711J417803J354092
4071A02722615J427226J570057J766238J447713J544800J616452J373810K219731
4063A15688642K449617L009574K974874K779042J828601O29708M02547J56156
4055A29918761R3303O67699P28789R40930J227014J684533J872847J651648J824442
4046A40609966J711168J684464J513201J229477J560292J494643J607236J293411
$$ plain form
4038 152703858 154039012 155377336 156601075 157874147 159420878 160716301 162063916 163733294
4030 163733294 165182834 166665425 167836326 168781856 169297945 169362663 169140308 169023034 168842482
4021 168842482 168673768 168362771 168681792 168873543 169183875 169572123 170164713 171136212 171640376
4012 171640376 172545838 173732232 175144619 176694898 178390005 180761670 183529705 185992168
4004 185992168 188525884 190971149 194132876 198563650 204763945 212584459 221492733 229659949
3996 229659949 233717054 233684592 231495783 227447855 222239116 216963836 212291702 209769286
3988 209769286 209310291 211525566 215895781 221549441 227727938 232955083 236054006 236960107
3980 236960107 236176556 234632645 232435574 229576047 226789521 224307207 223118746 224136213
$$ packed form
4038A52703858J335154J338324J223739J273072J546731J295423J347615J669378
4030A63733294J449540J482591J170901R45530N16089O4718k22355j17274j80552
4021A68842482j68714l10997L19021J91751L10332L88248N92590R71499N04164
4012A71640376R05462J186394J412387J550279J695107K371665K768035K462463
4004A85992168K533716K445265L161727M430774O200295P820514Q908274Q167216
3996B29659949M057105l2462k188809m047928n208739n275280m672134k522416
3988B09769286m58995K215275M370215N653660O178497N227145L098923R06101
3980B36960107p83551j543911k197071k859527k786526k482314j188461J017467
$$ plain form
3972 224136213 228440696 238177030 253865135 275038267 298768208 316908603 319888485
3965 319888485 309445679 292839682 274032454 255775505 239803032 227131636 217858494
3958 217858494 211767516 208308635 206912447 207568461 209988018 212874623 214406491 212892849
3950 212892849 208869478 202066351 193036078 182937155 172827313 163858299 157425421 153767929
3942 153767929 152252942 153251756 155663717 159024369 162317653 163579247 160624262 153286297
3934 153286297 144963153 136733190 128584836 121548532 115421646 110100158 105239905 100489796
3926 100489796 96068041 92476248 89991987 88591235 87301142 85158230 81636622 78069854
3918 78069854 74945473 72066835 69423706 67317165 65711391 63993744 62768550 61596975
$$ packed form
3972B24136213M304483R736334J5688105K1173132K3729941J8140395K979882
3965C19888485j0442806j6605997j8807228j8256949j5972473j2671396r273142
3958B17858494o090978l458881j396188O56014K419557K886605J531868j513642
3950B12892849m023371o803127r030273j0098923j0109842q969014o432878l657492
3942A53767929j514987R98814K411961L360652L293284J261594k954985p337965
3934A53286297q323144q229963q148354p036304o126886n321488m860253m750109
3926A00489796m421755l591793k484261j400752j290093k142912l521608l566768
3918G8069854l124381k878638k643129k106541j605774j717647j225194j171575
$$ plain form
3910 61596975 61011374 60884802 60955846 60889827 60965279 60467790 59910569 59015076 57641865 56379236
3900 56379236 55384662 54299315 53624498 53552110 53054171 52832435 52810655 52557343 52469077 52510396
3890 52510396 52565136 52760434 53029707 53186673 53162664 53089030 53025855 52868994 52362412 52261197
3880 52261197 51891640 51331312 51053177 50943166 50387895 49849944 49536241 49659331 49441353
3871 49441353 49340886 49538797 49675956 50314832 50808528 51403345 52290582 52953868 53955028
3862 53955028 55274867 56620982 58165421 59780444 61746919 63871841 66252623 68491728
3854 68491728 70815466 73539124 76313017 78603308 80768780 82862166 84910461 86816436
3846 86816436 88551779 90134979 91766142 93692525 95267347 96984411 98531063 100271732
$$ packed form
3910F1596975n85601j26572P1044o6019P5452m97489n57221q95493j373211j262629
3900E6379236r94574j085347o74817p2388m97939k21736k1780k53312q8266M1319
3890E2510396N4740J95298K69273J56966k4009p3634o3175j56861n06582j01215
3880E2261197l69557n60328k78135j10011n55271n37951l13703J23090k17978
3871D9441353j00467J97911J37159O38876M93696N94817Q87237O63286J001160
3862E3955028J319839J346115J544439J615023J966475K124922K380782K239105
3854F8491728K323738K723658K773893K290291K165472K093386K048295J905975
3846H6816436J735343J583200J631163J926383J574822J717064J546652J740669
$$ plain form
3838 100271732 101949068 103100960 104328862 105467345 105965695 105971619 105727822 105030378 104152118
3829 104152118 102834102 100979254 99323621 97058115 94747342 92369970 90053161 88052936
3821 88052936 86097322 84013031 81944997 80373640 78844709 77681977 76508831 75643944
3813 75643944 75101059 74808426 74339185 74062624 74308579 74598434 74632011 75101056 75566341 75671471
3803 75671471 75796567 75971919 76126090 76564491 76690979 76809987 77801967 78877788 79677995
3794 79677995 81100651 82244453 83721659 85077337 86237777 86840089 87177551 87363845 87226036
3785 87226036 86767019 85859331 84436989 82600191 80639230 78804531 76677444 74448098
3777 74448098 72285109 70017802 67768954 65412253 63270874 61033962 58681910 56277561
$$ packed form
3838A00271732J677336J151892J227902J138483M98350N924k43797o97444q78260
3829A04152118j318016j854848j655633k265506k310773k377372k316809k000225
3821H8052936j955614k084291k068034j571357j528931j162732j173146q64887
3813G5643944n42885k92633m69241k76561K45955K89855L3577M69045M65285J05130
3803G5671471J25096J75352J54171M38401J26488J19008R91980J075821Q00207
3794G9677995J422656J143802J477206J355678J160440O02312L37462J86294j37809
3785H7226036m59017r07688j422342j836798j960961j834699k127087k229346
3777G4448098k162989k267307k248848k356701k141379k236912k352052k404349
$$ plain form
3769 56277561 54060589 52177774 50339910 48659740 47155012 45165138 43401719 42004470
3761 42004470 40680697 39149133 37935620 36721423 35725196 34542170 33898168 33219641 32397055
3752 32397055 31602995 30949476 30387055 29900280 29309130 29079763 28883634 28401434 27881511
3743 27881511 27315383 26868046 26767211 26975493 26870350 26678535 26479161 26325815 26178847
3734 26178847 26458949 26767116 26780196 26825406 26922143 27092394 27191040 27201623 27236727 27469546
3724 27469546 27813693 27940158 28153655 28223260 28260878 28449753 28540259 28723105 28893073 29028559
3714 29028559 29087462 29266472 29442500 29610645 29577682 29803866 30069087 30396428 30525278 30761249
3704 30761249 30853511 31108774 31494233 31816279 32133943 31937140 32056316 32562034 32811732 32950494
$$ packed form
3769E6277561k216972j882815j837864j680170j504728j989874j763419j397249
3761D2004470j323773j531564j213513j214197r96227j183026o44002o78527q22586
3752C2397055p94060o53519n62421m86775n91150k29367j96129m82200n19923
3743B7881511n66128m47337j00835K08282j05143j91815j99374j53346j46968
3734B6178847K80102L08167J3080M5210R6737J70251R8646J0583L5104K32819
3724B7469546L44147J26465K13497O9605L7618J88875R0506J82846J69968J35486
3714B9028559N8903J79010J76028J68145l2963K26184K65221L27341J28850K35971
3704C0761249R2262K55263L85459L22046L17664j96803J19176N05718K49698J38762
$$ plain form
3694 32950494 33059589 33337395 33295498 33530679 33602261 33863318 34033561 34039031 34428832 34586292
3684 34586292 34830799 35152123 35419209 35635451 36082122 36435884 36856561 37591146 38003184
3675 38003184 38151773 38654422 39138309 39531107 39880314 40422489 40293717 40159761 40464540
3666 40464540 40588253 40382535 40342755 40374397 40303800 40133543 40160773 39921298 39832301 40176413
3656 40176413 40631319 40741238 40544761 40403098 40565725 40555325 40570004 40428638 40599699 40573913
3646 40573913 40075294 39935298 39812184 39720989 39468222 39314264 39112862 38897241 38994407 39060161
3636 39060161 38728941 38581890 38901529 38846813 38830846 38698827 38730662 38701662 38823006 38623488
3626 38623488 38223117 38450990 38689292 38878175 38816862 38907865 39388402 39609491 39965335 40464158
$$ packed form
3694C2950494J09095K77806m1897K35181P1582K61057J70243N470L89801J57460
3684C4586292K44507L21324K67086K16242M46671L53762M20677P34585M12038
3675C8003184J48589N02649M83887L92798L49207N42175j28772j33956L04779
3666D0464540J23713k05718l9780L1642p0597j70257K7230k39475q8997L44112
3656D0176413M54906J09919j96477j41663J62627j0400J4679j41366J71061k5786
3646D0573913m98619j39996j23114r1195k52767j53958k01402k15621R7166O5754
3636C9060161l31220j47051L19639n4716j5967j32019L1835k9000J21344j99518
3626C8623488m00371K27873K38302J88883o1313R1003M80537K21089L55844M98823
$$ plain form
3616 40464158 40791174 41062084 41483268 41721947 41821187 41891795 42045219 41946069 41827557 41817603
3606 41817603 41799696 41760579 41685657 41572256 41446329 41260391 41000643 40661513 40221869 39846882
3596 39846882 39752729 39291384 38823054 38464837 38049829 37563694 37216525 36823180 36401342 36262048
3586 36262048 36128087 36219837 35978914 35919889 35978389 36015077 35876534 35860162 36196223 36481661
3576 36481661 36574680 36778184 36935987 37127144 37341871 37511764 37732967 38170460 38498518 38835403
3566 38835403 38986616 39316358 39557590 39800702 40093745 40393748 40389025 40780585 41003662 41148876
3556 41148876 41718687 42086626 42376312 42507831 42725719 42983952 42816136 42941553 43104323
3547 43104323 43344316 43417643 43287979 43158467 43381622 43498440 43439796 43857778 44332758 44597132
$$ packed form
3616D0464158L27016K70910M21184K38679R9240P0608J53424r9150j18512r954
3606D1817603j7907l9117p4922j13401j25927j85938k59748l39130m39644l74987
3596C9846882r4153m61345m68330l58217m15008m86135l47169l93345m21838j39294
3586C6262048j33961R1750k40923n9025N8500L6688j38543j6372L36061K85438
3576C6481661R3019K03504J57803J91157K14727J69893K21203M37493L28058L36885
3566C8835403J51213L29742K41232K43112K93043L00003m723L91560K23077J45214
3556D1148876N69811L67939K89686J31519K17888K58233j67816J25417J62770
3547D3104323K39993P3327j29664j29512K23155J16818n8644M17982M74980K64374
$$ plain form
3537 44597132 44785985 45017752 45551446 46151690 46526565 47249959 47968893 48578457 49616012
3528 49616012 50336219 51010143 51756676 52601872 53375222 54471931 55214596 55880703 56933291
3519 56933291 58047782 59545995 60627057 61823914 63430710 65048603 66924311 68670308
3511 68670308 70841183 73043800 75346796 77538707 80159882 82785057 85744540 89231267
3503 89231267 92840039 96801703 100565585 105183464 110388237 116036729 122188717 129255024
3495 129255024 136902431 145244522 154656284 165422313 177417712 191292633 206642826
3488 206642826 223660170 242183755 262346797 282715780 302416955 320843493 336493864
3481 336493864 348792481 358084669 364622917 369363530 371861895 371262442 367020678 358897057
$$ packed form
3537D4597132J88853K31767N33694O00244L74875P23394P18934O09564J037555
3528D9616012P20207O73924P46533Q45196P73350J096709P42665O66107J052588
3519E6933291J114491J498213J081062J196857J606796J617893J875708J745997
3511F8670308K170875K202617K302996K191911K621175K625175K959483L486727
3503H9231267L608772L961664L763882M617879N204773N648492O151988P066307
3495A29255024P647407Q342091R411762J0766029J1995399J3874921J5350193
3488B06642826J7017344J8523585K0163042K0368983J9701175J8426538J5650371
3481C36493864J2298617R292188O538248M740613K498365n99453m241764q123621
$$ plain form
3473 358897057 346716237 330988328 313293934 294521893 275185822 256021432 237935905
3466 237935905 221173840 206349042 193263403 181750922 172149235 163659440 156322720
3459 156322720 150002033 144442613 139484885 135394265 131673331 128397208 125888188 123933735
3451 123933735 122317358 121508850 121192281 121865342 123127343 124903474 127546360 130922446
3443 130922446 135021413 139880627 145394276 151532113 158501605 166362540 174844363 183700265
3435 183700265 192545484 201285244 209814116 217204735 223121791 227234040 229211748 229140515
3427 229140515 227132553 223023552 217499651 211152289 204322834 196838939 189173634 181894118
3419 181894118 174738047 167795077 161062785 154663873 148924435 143726447 138998467 134784947
$$ packed form
3473C58897057j2180820j5727909j7694394j8772041j9336071j9164390j8085527
3466B37935905j6762065j4824798j3085639j1512481r601687q489795p336720
3459A56322720o320687n559420m957728m090620l720934l276123k509020j954453
3451A23933735j616377q08508l16569O73061J262001J776131K642886L376086
3443A30922446M098967M859214N513649O137837O969492P860935Q481823Q855902
3435A83700265Q845219Q739760Q528872P390619N917056M112249J977708p1233
3427B29140515k007962m109001n523901o347362o829455p483895p665305p279516
3419A81894118p156071o942970o732292o398912n739438n197988m727980m213520
$$ plain form
3411 134784947 131187736 128190971 125829473 123833316 122556897 121566870 120991619 120913953 121386202
3402 121386202 121927073 122555250 123305744 123940535 124147268 124198564 123910026 122893940 121195564
3393 121195564 119359462 117278190 114807518 112077124 109511726 107058426 104667377 102413057
3385 102413057 100233596 98417353 97069637 95835293 94628401 93937210 93652178 93354545
3377 93354545 92909156 92487836 91967379 91474090 91034251 90670358 90646649 90315220 90315133 90534938
3367 90534938 90545335 91017118 91564167 92176024 92929274 94088475 95487076 96978293 98664001
3358 98664001 100728504 102826853 104774570 106753966 109157338 111815613 114166335 116520345
3350 116520345 118994216 121486149 124278104 127171097 129998280 133588075 137257806 141202863
$$ packed form
3411A34784947l597211k996765k361498j996157j276419r90027n75251p7666M72249
3402A21386202N40871O28177P50494O34791K06733N1296k88538j016086j698376
3393A21195564j836102k081272k470672k730394k565398k453300k391049k254320
3385A02413057k179461j816243j347716j234344j206892o91191k85032k97633
3377I3354545m45389m21320n20457m93289m39839l63893k3709l31429q7K19805
3367I0534938J0397M71783N47049O11857P53250J159201J398601J491217J685708
3358I8664001K064503K098349J947717J979396K403372K658275K350722K354010
3350A16520345K473871K491933K791955K892993K827183L589795L669731L945057
$$ plain form
3342 141202863 145845128 151183669 156996560 163859528 171382752 179979209 189563440 199982766
3334 199982766 210856397 221348756 230707117 237795521 241851512 242173144 238503062 231676616
3326 231676616 221847371 210020803 197781758 185345195 172899799 161033627 150536991
3319 150536991 140753303 132286114 124912920 118492032 112691118 107425642 103262435 99806408
3311 99806408 96616845 94483864 92633812 90954691 89993960 89567035 89303077 89128227 88932511
3302 88932511 88920367 89338720 89833260 90972949 92388999 93763461 95538038 97549738 99998949
3293 99998949 103187995 106555959 110381473 114539131 119471597 124787107 130608123 137067286
3285 137067286 143881486 151106713 158265292 165067289 171307196 176777249 181039903 183842282
$$ packed form
3342A41202863M642265N338541N812891O862968P523224Q596457R584231J0419326
3334A99982766J0873631J0492359R358361P088404M055991L21632l670082o826446
3326B31676616r829245j1826568j2239045j2436563j2445396j1866172j0496636
3319A50536991r783688q467189p373194o420888n800914n265476m163207l456027
3311I9806408l189563k132981j850052j679121r60731m26925k63958j74850j95716
3302H8932511j2144M18353M94540J139689J416050J374462J774577K011700K449211
3293I9998949L189046L367964L825514M157658M932466N315510N821016O459163
3285A37067286O814200P225227P158579O801997O239907N470053M262654K802379
$$ plain form
3277 183842282 185161444 185079895 183553954 180899607 177662152 173626448 168870758 164564542
3269 164564542 160731385 157287944 154553686 153078318 152391868 152988122 154845773 158349704
3261 158349704 162469712 167552278 173417099 179529453 184908222 188743197 190165706 188445828
3253 188445828 184088862 176822984 167829939 157836273 146906496 135910026 125310797 115803489
3245 115803489 107338702 99583730 92259905 86232206 80689665 75684231 71660420 68004891
3237 68004891 64838371 61855724 59142131 56779477 54806166 52886814 51151345 49532778
3229 49532778 48185668 46877002 45579776 44229870 43123742 42261189 41322279 40340112 39403344
3220 39403344 38333806 37441161 36389916 35421721 34538211 33696983 32905066 31759650 30455421
$$ packed form
3277A83842282J319162q1549j525941k654347l237455m035704m755690m306216
3269A64564542l833157l443441k734258j475368o86450N96254J857651L503931
3261A58349704M120008N082566N864821O112354N378769L834975J422509j719878
3253A88445828m356966p265878q993045r993666j0929777j0996470j0599229r507308
3245A15803489q464787p754972p323825o027699n542541n005434m023811l655529
3237F8004891l166520k982647k713593k362654j973311j919352j735469j618567
3229D9532778j347110j308666j297226j349906j106128q62553r38910r82167r36768
3220C9403344j069538q92645j051245r68195q83510q41228p91917j145416j304229
$$ plain form
3211 30455421 29642328 28709455 27934389 26961291 25906306 25334885 24537804 23567948 22812074
3202 22812074 22528764 21616655 21010620 20613571 19929815 19446352 19135322 18793905 18060610
3193 18060610 17735526 17498080 17190262 16937582 16554855 16165462 16145177 16001898 15402868 14958857
3183 14958857 15088590 14747893 14390271 14463080 14179123 13934939 14085461 13898481 13800042 13584435
3173 13584435 13572348 13844610 13835173 13936033 14116100 14239554 14174660 14151947 14430187 14650243
3163 14650243 15078538 15095571 14897173 15011805 14925125 14960097 14719077 14606608 14667577 14489187
3153 14489187 14178329 14085416 14242994 14421849 14112913 13967219 14196515 14273243 14165920 14244458
3143 14244458 14501205 14550505 14469595 14505948 14731180 15255562 16401131 17672073 18732984
$$ packed form
3211C0455421q13093r32873p75066r73098j054985n71421p97081r69856p55874
3202B2812074k83310r12109o06035l97049o83756m83463l11030l41417p33295
3193A8060610l25084k37446l07818k52680l82727l89393k0285j43279n99030m44011
3183A4958857J29733l40697l57622P2809k83957k44184J50522j86980r8439k15607
3173A3584435j2087K72262r437J00860J80067J23454o4894k2713K78240K20056
3163A4650243M28295J7033j98398J14632q6680L4972k41020j12469O0969j78390
3153A4489187l10858r2913J57578J78855l08936j45694K29296P6728j07323P8538
3143A4244458K56747M9300q0910L6353K25232N24382J145569J270942J060911
$$ plain form
3134 18732984 19996657 20686340 20452375 19487570 18552892 17228494 15853371 14822259 13856773
3125 13856773 13325251 12387375 11735130 11176537 10942495 10585710 10167142 10059960 10073367 9756524
3115 9756524 9631641 9539800 9533537 9535943 9040808 8834212 8996969 9263596 9543689 9578234 9483191
3104 9483191 9586798 9584805 9608903 9681958 9724297 9268190 8898114 8421718 7754295 7518457
3094 7518457 7273361 6909193 6700408 6397905 5952945 6012930 5847137 5797227 5590632 5482330
3084 5482330 5346806 5197362 5292666 5292551 5079803 4755913 4830524 4487103 4512645 4580517 4367381
3073 4367381 4427042 4676024 4569621 4331376 4224214 4190400 4281529 4092885 3948620 4001964
3063 4001964 3901318 4076981 4024658 3920473 3730871 3614137 3588630 3731721 3687927 3512549
$$ packed form
3134A8732984J263673O89683k33965r64805r34678j324398j375123j031112r65486
3125A3856773n31522r37876o52245n58593k34042l56785m18568j07182J3407l16843
3115I756524j24883r1841o263K406m95135k06596J62757K66627K80093L4545r5043
3104I483191J03607j993K4098P3055M2339m56107l70076m76396o67423k35838
3094G518457k45096l64168k08785l02503m44960N9985j65793m9910k06595j08302
3084E482330j35524j49444R5304j15k12748l23890P4611l43421K5542O7872k13136
3073D367381N9661K48982j06403k38245j07162l3814R1129j88644j44265N3344
3063D001964j00646J75663n2323j04185j89602j16734k5507J43091m3794j75378
$$ plain form
3053 3512549 3518742 3607826 3783067 3939227 3900809 3682726 3706898 3690700 3934408 3992574 3986023
3042 3986023 4011434 3732873 3301655 3197894 3224134 3061405 3012353 2826933 2762461 2691960
3032 2691960 2966988 2572766 2556327 2496421 2344098 2435768 2516947 2386155 2199646 2169867
3022 2169867 2113866 2271536 2424354 2395137 2305768 2247562 2142285 1963771 1874772 2117916
3012 2117916 2019827 2033173 1894491 1847348 2046655 2035204 2427541 2392872 1906650 1732085
3002 1732085 1814315 1797764 1854756 1916539 1938063 2126407 2027438 2075005 1993949 2243988 2381641
2991 2381641 2226515 2169522 2359162 2482506 2307317 2187417 2340435 2371064 2183094 1951158
2981 1951158 1922315 1957737 2010348 2024287 1922772 1860879 2013608 2205828 2197000 2143103 1863746
$$ packed form
3053C512549O193Q9084J75241J56160l8418k18083K4172j6198K43708N8166o551
3042C986023K5411k78561m31218j03761K6240j62729m9052j85420o4472p0501
3032B691960K75028l94222j6439n9906j52323R1670Q1179j30792j86509k9779
3022B169867n6001J57670J52818k9217q9369n8206j05277j78514q8999K43144
3012B117916r8089J3346j38682m7143J99307j1451L92337l4669m86222j74565
3002A732085Q2230j6551N6992O1783K1524J88344r8969M7567q1056K50039J37653
2991B381641j55126n6993J89640J23344j75189j19900J53018L0629j87970k31936
2981A951158k8843L5422N2611J3939j01515o1893J52729J92220q828n3897k79357
$$ plain form
2970 1863746 1881197 2005636 2026086 1707257 1522822 1836628 1776450 1712105 1619740 1835590
2960 1835590 1640982 1401116 1284822 1078282 863062 907421 925818 838712 847876 955860
2950 955860 900108 1067724 925213 802824 1013031 1007128 1133883 948287 897424 771523
2940 771523 843502 960774 949605 626075 764296 921661 915059 895162 716847 687988 728085
2929 728085 1039722 900701 792943 717259 705710 559945 745987 856717 840435 906079
2919 906079 873369 850174 844899 726596 657834 804356 779895 808442 564839 861562 951919
2908 951919 822936 743178 707488 821600 940403 772885 681710 781520 813453 943840 712007
2897 712007 554893 732216 1048913 1068533 981936 932977 831098 503054 724170 735177
$$ packed form
2970A863746J7451J24439K0450l18829j84435L13806o0178o4345r2365K15850
2960A835590j94608k39866j16294k06540k15220M4359J8397q7106R164J07984
2950I55860n5752J67616j42511j22389K10207n903J26755j85596n0863j25901
2940G71523P1979J17272j1169l23530J38221J57365o602j9897j78315k8859M0097
2929G28085L11637j39021j07758p5684j1549j45765J86042J10730j6282O5644
2919I06079l2710k3195n275j18303o8762J46522k4461K8547k43603K96723R0357
2908I51919j28983p9758l5690J14112J18803j67518r1175R9810L1933J30387k31833
2897G12007j57114J77323L16697J9620q6597m8959j01879l28044K21116J1007
$$ plain form
2887 735177 754081 732913 689170 651015 559909 411883 545301 483700 333966 469399 367915
2876 367915 531001 818083 790127 417695 341242 342127 585983 649169 681398 518047 428629
2865 428629 246635 82854 149748 279637 372237 228193 180925 425165 686424 570499
2855 570499 246740 359684 422097 417876 366912 255302 278185 541820 512222 371589 275513
2844 275513 179108 449347 838981 697692 494057 695185 840368 902287 730019 539672
2834 539672 182291 244311 379390 229795 283348 148824 415908 383791 338144 641031
2824 641031 620226 310033 327816 135374 321993 236104 408201 486570 390120 507881 368210
2813 368210 294716 396643 358479 350559 435272 546824 625249 294817 418950 296439 275727
$$ packed form
2887G35177J8904k1168m3743l8155r1106j48026J33418o1601j49734J35433j01484
2876C67915J63086K87082k7956l72432p6453Q85K43856O3186L2229j63351q9418
2865D28629j81994j63781O6894J29889R2600j44044m7268K44240K61259j15925
2855E70499l23759J12944O2413m221n0964j11610K2883K63635k9598j40633r6076
2844B75513r6405K70239L89634j41289k03635K01128J45183O1919j72268j90347
2834E39672l57381O2020J35079j49595N3553j34524K67084l2117m5647L02887
2824F41031k0805l10193J7783j92442J86619q5889J72097P8369r6450J17761j39671
2813C68210p3494J01927l8164p920Q4713J11552P8425l30432J24133j22511k0712
$$ plain form
2802 275727 458793 454335 204167 486396 514126 483785 576369 526757 624778 554803 535719
2791 535719 495459 153394 201714 543846 306069 191449 206500 265952 302175 395732 394762
2780 394762 37536 -53938 88208 -269982 -71552 235044 20812 -141489 -161741 4824
2770 4824 40600 259498 252324 -131535 -302567 32019 9748 114897 -95284 -278796 -26404
2759 -26404 -82690 -25937 72490 -45446 7968 -129084 -50838 104998 9528 107922 53579
2748 53579 98233 36576 -5613 86222 -41389 167785 201436 164627 191468 66394 180959
2737 180959 104405 84135 133547 -22187 204156 243700 205820 1512 -139309 175697 413330
2726 413330 458577 362937 201357 232130 360281 492047 476366 331063 77526 -90344
$$ packed form
2802B75727J83066m458k50168K82229K7730l0341R2584m9612R8021o9975j9084
2791E35719m0260l42065M8320L42132k37777j14620J5051N9452L6223R3557r70
2780C94762l57226r1474J42146l58190J98430L06596k14232j62301k0252J66565
2770D824L5776K18898p174l83859j71032L34586k2271J05149k10181j83512K52392
2759b6404n6286N6753R8427j17936N3414j37052P8246J55836r5470R8394n4343
2748E3579M4654o1657m2189R1835j27611K09174L3651l6809K6841j25074J14565
2737A80959p6554k0270M9412j55734K26343L9544l7880k04308j40821L15006K37633
2726D13330M5247r5640j61580L0773J28151J31766j5681j45303k53537j67870
$$ plain form
2716 -90344 48412 318399 234719 28952 52824 82504 -269837 -109986 -62721 -336279 -198311
2705 -198311 11831 -123814 -129004 -216544 -37561 18577 26105 238397 401036 -164880 -198782
2694 -198782 -60240 -88523 105377 169298 110722 -88115 -72745 120305 206640 164321 229898
2683 229898 -34352 -50755 68241 42143 -86336 10808 58862 173708 166842 274323 211727
2672 211727 390361 106154 172438 -22074 -92852 -10759 206919 107276 198142 246460 48589
2661 48589 116401 46434 -11033 12782 119250 -23678 41064 377259 198947 68214 186825
2650 186825 172671 -40552 -38301 306765 301124 325081 29015 -296012 -307413 -88826 -92083
2639 -92083 -119383 -159791 -124507 221385 169964 70591 102428 305419 224281 157075 207043
$$ packed form
2716i0344J38756K69987q3680k05767K3872K9680l52341J59851M7265k73558J37968
2705a98311K10142j35645n190q7540J78983N6138P528K12292J62639n65916l3902
2694a98782J38542k8283J93900O3921n8576j98837J5370J93050Q6335m2319O5577
2683B29898k64250j6403J18996k6098j28479R7144M8054J14846o866J07481o2596
2672B11727J78634k84207O6284j94512p0778Q2093K17678r9643R0866M8318j97871
2661D8589O7812o9967n7467K3815J06468j42928O4742L36195j78312j30733J18611
2650A86825j4154k13223K251L45066n641K3957k96066l25027j1401K18587l257
2639i2083k7300m0408L5284L45892n1421r9373L1837K02991q1138o7206M9968
$$ plain form
2628 207043 341375 66888 77467 550027 457766 180542 48784 102101 383999 571487
2618 571487 779443 602541 354325 347385 322669 349070 504166 138866 -216233 148920
2608 148920 120194 400129 563762 497768 417867 532247 896052 1068345 1279151 1580202
2598 1580202 1924787 2252986 2083685 1898798 1800535 1443541 1368522 1271956 997567 733158
2588 733158 623214 692849 520528 383392 529123 651678 796197 617694 398430 389028
2578 389028 290824 260315 78027 219068 450316 693648 625925 520377 350860 365792
2568 365792 470575 454311 410811 673144 700151 733335 597809 600185 694161 605397 618347
2557 618347 397387 506447 159460 417406 609742 279332 246708 77663 76744 273643
$$ packed form
2628B07043J34332k74487J0579M72560r2261k77224j31758N3317K81898J87488
2618E71487K07956j76902k48216o940k4716K6401J55096l65300l55099L65153
2608A48920k8726K79935J63633o5994p9901J14380L63805J72293K10806L01051
2598A580202L44585L28199j69301j84887r8263l56994p5019r6566k74389k64409
2588G33158j09944O9635j72321j37136J45731J22555J44519j78503k19264r402
2578C89028r8204l0509j82288J41041K31248K43332o7723j05548j69517J4932
2568C65792J04783j6264m3500K62333K7007L3184j35526K376R3976q8764J2950
2557F18347k20960J09060l46987K57946J92336l30410l2624j69045r19J96899
$$ plain form
2547 273643 194435 374887 346534 341966 589204 885469 723751 372604 580397 400065
2537 400065 442934 262501 251757 260525 -171 61491 217140 349628 587502 631671 483996
2526 483996 366085 123239 204869 364533 158419 291840 384259 410343 485688 723577
2516 723577 415030 283188 268956 314993 281523 129738 484870 644510 745439 641335
2506 641335 393565 607575 721586 685154 682054 609733 543708 657042 570466 706772 799532
2495 799532 563372 457626 666359 974474 668275 537583 365665 275540 460899 634875
2485 634875 613132 656828 704821 799644 980467 944897 826739 953239 894928 795125 784716
2474 784716 905943 899943 787133 982714 1171522 1299617 1475899 1380547 1246834 1161858
$$ packed form
2547B73643p9208J80452k8353m568K47238K96265j61718l51147K07793j80332
2537D00065M2869j80433j0744Q768k60696O1662J55649J32488K37874M4169j47675
2526D83996j17911k42846Q1630J59664k06114J33421R2419K6084P5345K37889
2516G23577l08547j31842j4232M6037l3470j51785L55132J59640J00929j04104
2506F41335k47770K14010J14011l6432l100p2321o6025J13334q6576J36306R2760
2495G99532k36160j05746K08733L08115l06199j30692j71918r0125J85359J73976
2485F34875k1743M3696M7993R4823J80823l5570j18158J26500n8311r9803j0409
2474G84716J21227o000j12810J95581J88808J28095J76282r5352j33713q4976
$$ plain form
2464 1161858 937883 965423 1082961 1106156 964006 772938 901566 1014518 1014522 1166924 1010754
2453 1010754 901838 918507 971899 1061931 702487 609317 626491 903888 1039369 1067495 1189232
2442 1189232 1529005 1451164 1183726 1169889 1473623 1482954 1368835 1437664 1720046 1943776
2432 1943776 2022908 1702577 1608805 2080515 2158906 2080835 2041493 2199155 2222273 1996397 2153055
2421 2153055 2245560 2131272 2249884 2288686 2379914 2295600 2208491 2205952 2052778 2341912 2219874
2410 2219874 2302559 2477117 2430691 2588168 2588547 2853661 2979755 2870848 2854689 2788082 3067169
2399 3067169 3163535 3286985 3391959 3596803 3714005 3832368 3921879 4253713 4581711 4553183
2389 4553183 4682215 4797775 4616195 4580520 4767538 4754700 4799240 4968264 5317634 5607005
$$ packed form
2464A161858k23975K7540J17538K3195j42150j91068J28628J12952MJ52402j56170
2453A010754j08916J6669N3392R0032l59444r3170J7174K77397J35481K8126J21737
2442A189232L39773p7841k67438j3837L03734R331j14119O8829K82382K23730
2432A943776P9132l20331r3772M71710P8391p8071l9342J57662K3118k25876J56658
2421B153055R2505j14288J18612L8802R1228q4314q7109k539j53174K89134j22038
2410B219874Q2685J74558m6426J57477L79K65114J26094j08907j6159o6607K79087
2399C067169R6366J23450J04974K04844J17202J18363Q9511L31834L27998k8528
2389D553183J29032J15560j81580l5675J87018j2838M4540J69024L49370K89371
$$ plain form
2379 5607005 5857837 5799266 5570072 5505419 6009029 6401823 6837863 6977799 6798855 6734146
2369 6734146 7341928 7671053 8144598 8156945 8377051 8956582 9080146 9709278 10406451 10765777
2359 10765777 11474706 12278152 12550529 12938612 13647330 14104098 14689844 15094197 16268312
2350 16268312 17417231 19217106 22196433 25702928 29895069 34138529 37389377 40022044
2342 40022044 42758031 46209718 50084402 55437154 62419024 72446638 86562608 108134983
2334 108134983 141375337 194018848 271238053 362883713 412800480 395118050 352307730
2327 352307730 303083403 248773036 197207064 155642770 122787117 98049850 79953917
2320 79953917 66125888 56051281 49712791 46057433 44506700 42485721 39429266 36325606
$$ packed form
2379E607005K50832n8571k29194o4653N03610L92794M36040J39936j78944o4709
2369F734146O07782L29125M73545J2347K20106N79531J23564O29132O97173L59326
2359A0765777P08929Q03446K72377L88083P08718M56768N85746M04353J174115
2350A6268312J148919J799875K979327L506495M192141M243460L250848K632667
2342D0022044K735987L451687L874684N352752O981870J0027614J4115970K1572375
2334A08134983L3240354N2643511P7219205R1645660M9916767j7682430m2810320
2327C52307730m9224327n4310367n1565972m1564294l2855653k4737267j8095933
2320G9953917j3828029j0074607o338490l655358j550733k020979l056455l103660
$$ plain form
2312 36325606 33381144 30632249 27991989 25529061 23644085 21641020 19876680 18479393
2304 18479393 17319640 16091257 14985323 14289927 13473476 12693520 12374674 12470832 12240652
2295 12240652 11793270 11260023 10476015 10077233 9829456 9578734 9172519 8974797 9060577 8804647
2285 8804647 8556448 8557579 8070041 7773066 7376650 7191496 6977453 6737715 6629569 6463404
2275 6463404 6314809 5875743 5683910 5391064 5162605 5057693 5064140 4795982 4773005 4832581
2265 4832581 4920994 4831756 4589002 4274607 4292064 4507909 4240693 4276941 4054859 3837580
2255 3837580 3786727 3607678 3572754 3329954 3268019 3330345 3202726 3236536 3225727 3412431 2955799
2244 2955799 2851157 2716336 2560158 2665448 2406588 2251229 2123014 2128022 2066040 1895303
$$ packed form
2312C6325606k944462k748895k640260k462928j884976k003065j764340j397287
2304A8479393j159753j228383j105934o95396q16451p79956l18846R6158k30180
2295A2240652m47382n33247p84008l98782k47777k50722m06215j97722Q5780k55930
2285H804647k48199J131m87538k96975l96416j85154k14043k39738j08146j66165
2275F463404j48595m39066j91833k92846k28459j04912O447k68158k2977N9576
2265D832581Q8413q9238k42754l14395J7457K15845k67216L6248k22082k17279
2255C837580n0853j79049l4924k42800o1935O2326j27619L3810j0809J86704m56632
2244B955799j04642j34821j56178J05290k58860j55359j28215N008o1982j70737
$$ plain form
2234 1895303 1706199 1692676 1905157 1970553 1950752 1755209 1474799 1511760 1339673 1287439
2224 1287439 1488689 1764414 1523773 1668997 1776448 1983241 1845053 1912509 2123187 2453974
2214 2453974 2236153 2048329 1867180 1917224 1634574 1632565 1556260 1275190 1255285 1283652 1371727
2203 1371727 1262148 1089816 1007614 1139753 1337441 1255340 1055499 903813 830094 798772
2193 798772 770727 648712 475609 478693 200604 415167 619255 790396 802109 786778 750787
2182 750787 597316 696097 891343 802776 887742 745908 491424 621050 766972 729678
2172 729678 891380 753046 527753 367315 628911 865637 531434 184667 121608 36237
2162 36237 162967 454213 247908 177881 280303 367159 180078 206743 295126 520309 663589
$$ packed form
2234A895303j89104j3523K12481O5396j9801j95543k80410L6961j72087n2234
2224A287439K01250K75725k40641J45224J07451K06793j38188O7456K10678L30787
2214B453974k17821j87824j81149N0044k82650k009p6305k81070j9905K8367Q8075
2203A371727j09579j72332q2202J32139J97688q2101j99841j51686p3719l1322
2193G98772k8045j22015j73103L084k78089K14563K04088J71141J1713j5331l5991
2182G50787j53471R8781J95246q8567Q4966j41834k54484J29626J45922l7294
2172G29678J61702j38334k25293j60438K61596K36726l34203l46767o3059q5371
2162C6237J26730K91246k06305p0027J02422Q6856j87081K6665Q8383K25183J43280
$$ plain form
2151 663589 629742 500710 234283 194574 369082 459700 333659 225311 221405 47141 -12821
2140 -12821 265565 372345 554841 503924 520146 307027 65053 -70521 398436 316282
2130 316282 288289 345145 296690 197643 215588 85360 255214 331420 206876 131874 -85453
2119 -85453 107486 223986 82250 -33430 -182660 -126613 17838 78040 234371 -2297
2109 -2297 149925 -35988 -95806 -109667 -8876 74734 -66593 150614 86480 -178140 82084
2098 82084 54465 15107 -2324 -237304 -314205 62216 289310 143120 264759 183440 42609
2087 42609 -366016 -343758 -120928 -96655 -58250 83840 241456 -176995 -148568 92284 300639
2076 300639 479320 375037 264632 232437 236751 -25025 -72651 175018 240720 234484 417440
$$ packed form
2151F63589l3847j29032k66427l9709J74508R0618j26041j08348l906j74264n9962
2140a2821K78386J06780J82496n0917J6222k13119k41974j35574M68957q2154
2130C16282k7993N6856m8455r9047J7945j30228J69854P6206j24544p5002k17327
2119h5453J92939J16500j41736j15680j49230N6047J44451O0202J56331k36668
2109b297J52222j85913n9818j3861J00791Q3610j41327K17207o4134k64620K60224
2098H2084k7619l9358j7431k34980p6901L76421K27094j46190J21639q1319j40831
2087D2609m08625K2258K22830K4273L8405J42090J57616m18451K8427K40852K08355
2076C00639J78681j04283j10405l2195M314k61776m7626K47669O5702o236J82956
$$ plain form
2065 417440 497743 648433 987976 1262616 1709757 2205526 1850791 1514097 1565338 1170361
2055 1170361 777857 753143 649208 498169 298647 230294 60634 266997 332243 217221
2045 217221 102928 -45424 -118516 -74356 -11755 7525 257892 201029 146751 16389 -182383
2034 -182383 -258550 -76904 -1912 31112 -53081 54064 -116189 -189545 -64318 91726 178206
2023 178206 -17616 -251775 -101810 -33870 211082 122414 274639 72186 -222214 -302765
2013 -302765 -223359 -147911 -30602 22243 30997 95810 -27160 87539 85984 303417 139888
2002 139888 -206569 -258264 -95375 79717 218217 36791 -213939 43235 78827 -54705
1992 -54705 -143741 80499 173948 111825 -145861 -102433 -125075 -88983 -117929 -175480 -161747
$$ packed form
2065D17440Q0303J50690L39543K74640M47141M95769l54735l36694N1241l94977
2055A170361l92504k4714j03935j51039j99522o8353j69660K06363O5246j15022
2045B17221j14293j48352p3092M4160O2601J9280K50367n6863n4278j30362j98772
2034a82383p6167J81646P4992L3024q4193J07145j70253p3356J25227J56044Q6480
2023A78206j95822k34159J49965O7940K44952q8668J52225k02453k94400q0551
2013c02765P9406P5448J17309N2845Q754O4813j22970J14699j555K17433j63529
2002A39888l46457n1695J62889J75092J38500j81426k50730K57174L5592j33532
1992e4705q9036K24240R3449o2123k57686M3428k2642L6092k8946n7551J3733
$$ plain form
1981 -161747 -188686 -242705 -188651 -248036 -217052 33482 -33167 -23966 -142791 -172765 -368640
1970 -368640 -259865 -228950 -9588 -73986 -86330 -82436 -21746 -30689 21220 -234923 -241252 -91497
1958 -91497 -16980 -80069 -136091 -41967 254752 127352 240140 44212 -156565 -25807 -252891
1947 -252891 -284159 -416495 -209712 -206684 -150973 -7071 -126887 -222007 -190570 -326578 -311202
1936 -311202 -221800 -45901 13971 52653 23982 -173458 121340 160733 292168 100696 31982
1925 31982 41637 -40966 -7490 -31169 -118320 -11595 -314801 -257749 -221969 -299770 -135746
1914 -135746 -176379 -267384 -387782 -364036 -194454 139882 193926 -207496 -180704 -16308 -231332
1903 -231332 -208194 10092 -34679 -240448 -265837 -180464 -193994 -289303 -29999 -180361 -164727
$$ packed form
1981a61747k6939n4019N4054n9385L0984K50534o6649R201j18825k9974j95875
1970c68640J08775L0915K19362o4398j2344L894O0690q943N1909k56143o329J49755
1958i1497P4517o3089n6022R4124K96719j27400J12788j95928k00777J30758k27084
1947b52891l1268j32336K06783L028N5711J43902j19816r5120L1437j36008J5376
1936c11202Q9402J75899N9872L8682k8671j97440K94798L9393J31435j91472o8714
1925C1982R655q2603L3476k3679q7151J06725l03206N7052L5780p7801J64024
1914a35746m0633r1005j20398K3746J69582L34336N4044m01422K6792J64396k15024
1903b31332K3138K18286m4771k05769k5389Q5373j3530r5309K59304j50362J5634
$$ plain form
1892 -164727 -151362 -104532 124615 160823 -23392 -168262 -151072 -15520 -212786 -83655
1882 -83655 -60425 -18957 -146957 -30464 228215 -73675 -212847 94174 201986 -47938
1872 -47938 -83583 15735 -371801 -377208 -391535 -245175 -169094 -144633 57178 -273840 -317715
1861 -317715 -328191 -224246 -115356 -265411 -26283 -23949 -333827 -451485 -583092 -354340
1851 -354340 -477991 -300717 -182228 -293066 -344603 -197040 -13225 -93551 -199289 -353377
1841 -353377 -167704 -49954 -158492 -307700 -377682 44244 317132 -145680 -155355 -287704
1831 -287704 -446858 -307360 -36765 66127 63335 -229022 -259616 -226285 -20326 -81428 -188137
1820 -188137 -171818 52482 -101636 -90437 108331 20961 59965 -52224 83976 -86946
$$ packed form
1892a64727J3365M6830K29147L6208j84215j44870J7190J35552j97266J29131
1882h3655K3230M1468j28000J16493K58679l01890j39172L07021J07812k49924
1872d7938l5645R9318l87536n407j4327J46360P6081K4461K01811l31018m3875
1861c17715j0476J03945J08890j50055K39128K334l09878j17658j31607K28752
1851c54340j23651J77274J18489j10838n1537J47563J83815q0326j05738j54088
1841c53377J85673J17750j08538j49208o9982M21926K72888m62812r675j32349
1831b87704j59154J39498K70595J02892k792k92357l0594L3331K05959o1102j06709
1820a88137J6319K24300j54118J1199J98768q7370L9004j12189J36200j70922
$$ plain form
1810 -86946 -84664 -55936 60164 -135045 -41433 -257365 -300088 -213370 -230806 14671 212041
1799 212041 84589 126349 72760 143425 336012 458043 337815 59751 85135 26006 20647
1788 20647 -72956 -80193 -41154 -116676 -122016 -136361 -154410 -252938 -62010 121126 179219 54574
1776 54574 -220682 -345472 -404740 -195141 -194241 -163103 -342955 -313109 -269031 -198875 -31964
1765 -31964 -162609 -146125 -183917 -165793 -46704 -161468 -234999 -174136 -320906 -200773 -138405
1754 -138405 -44706 24930 165689 -2982 -136396 -46252 -182424 -83335 -176862 -289716 -37583
1743 -37583 246971 142081 -125862 -101406 -133952 -443758 -610898 -382896 -123743 -13835
1733 -13835 -100033 -136546 -26314 -238758 -386827 -358950 -314489 -250942 201715 273258 37719
$$ packed form
1810h6946K282K8728J16100j95209R3612k15932m2723Q6718j7436K45477J97370
1799B12041j27452M1760n3589P0665J92587J22031j20228k78064K5384n9129n359
1788B0647r3603p237L9039p5522n340j4345j8049r8528J90928J83136N8093j24645
1776E4574k75256j24790n9268K09599R00L1138j79852K9846M4078P0156J66911
1765c1964j30645J6484l7792J8124J19089j14764p3531O0863j46770J20133O2368
1754a38405R3699O9636J40759j68671j33414R0144j36172R9089r3527j12854K52133
1743c7583K84554j04890k67943K4456l2546l09806j67140K28002K59153J09908
1733a3835q6198l6513J10232k12444j48069K7877M4461O3547M52657P1543k35539
$$ plain form
1722 37719 40240 -39863 9702 51494 69847 -117248 -354936 -226769 34360 199250 171867
1711 171867 80620 -63055 -30845 -117 61173 -207840 -368028 -197633 -253642 -347522 -331747
1700 -331747 -57597 313183 209408 -74893 14945 -249619 -203512 -104682 -110348 -171530 -154826
1689 -154826 -44343 -46650 116116 387714 242430 -101084 42872 8106 -123358 -85594
1679 -85594 -11986 -11668 -313884 -478381 -159821 -253519 -281378 -325718 -650734 -495607 -429183
1668 -429183 -224898 -257151 -259486 -256619 -113165 63275 -87926 -242832 -232872 -144967 -324441
1657 -324441 -228577 -331651 -161278 -36975 -151459 -297727 21761 -159245 -299629 -126008
1647 -126008 -46428 -132501 -178335 -66468 54372 162378 -44480 -412798 -391188 -90700
$$ packed form
1722C7719K521q0103M9565M1792J8353j87095k37688J28167K61129J64890k7383
1711A71867r1247j43675L2210L0728O1290k69013j60188J70395n6009r3880J5775
1700c31747K74150L70780j03775k84301Q9838k64564M6107R8830n666o1182J6704
1689a54826J10483k307J62766K71598j45284l43514J43956l4766j31464L7764
1679h5594P3608L18l02216j64497L18560r3698k7859m4340l25016J55127O6424
1668d29183K04285l2253k335K867J43454J76440j51201j54906R960Q7905j79474
1657c24441R5864j03074J70373J24303j14484j46268L19488j81006j40384J73621
1647a26008P9580q6073m5834J11867J20840J08006k06858l68318K1610L00488
$$ plain form
1637 -90700 -152408 -1157 -123193 -158180 5935 -195702 -289668 -34738 -198268 -191912 153395
1626 153395 128671 253447 99434 -6350 223111 121636 -60826 -226840 -84457 -237264
1616 -237264 -286447 -21783 -68680 -287255 166224 -83098 -23196 12897 17518 -165013 -317549
1605 -317549 30222 -43229 -73700 -134774 -265137 -232244 -28498 -95357 -51602 -64181 -34518
1594 -34518 -287278 -417669 -289447 13859 188137 -11025 -82226 -91962 35719 -225365
1584 -225365 -61970 118591 -91237 -229420 -291508 -91016 21655 -168500 -328111 -87501
1574 -87501 -85955 -277627 -226921 -117576 -125944 138737 121228 -65163 -270966 -251430 -3768
1563 -3768 89600 62118 131926 -77021 -156466 -359458 -147642 -40596 -126326 -80174 -41662
$$ packed form
1637i0700o1708J51251j22036l4987J64115k01637r3966K54930j63530O356L45307
1626A53395k4724J24776j54013j05784K29461j01475j82462j66014J42383j52807
1616b37264m9183K64664m6897k18575M53479k49322N9902L6093M621j82531j52536
1605c17549L47771p3451l0471o1074j30363L2893K03746o6859M3755j2579K9663
1594c4518k52760j30391J28222L03306J74278j99162p1201r736J27681k61084
1584b25365J63395J80561k09828j38183o2088K00492J12671j90155j59611K40610
1574h7501J546j91672N0706J09345q368K64681j7509j86391k05803J9536K47662
1563c768R3368k7482O9808k08947p9445k02992K11816J07046q5730M6152L8512
$$ plain form
1552 -41662 -276178 -74356 46283 133942 98742 -92301 -89061 59394 2410 -378381 -259666
1541 -259666 35370 166137 170951 -38390 -116131 -254337 -227932 762 111744 60630 88469
1530 88469 33714 -88424 -112220 47681 135477 279255 178354 -200942 35734 373414
1520 373414 136732 -79840 -123103 -217737 -57859 -59783 -260195 -459955 -239155 -208258 -85586
1509 -85586 23163 9051 68628 211277 -67584 14901 -51507 121963 109202 101803 50199
1498 50199 -31115 -27681 -140181 -259310 -120811 -8794 88379 97248 -97073 -106548 -106787 -62823
1486 -62823 -111632 -107144 -228228 -371279 -193943 -132842 -212061 -359548 -55523 131197 -114241
1475 -114241 -83223 193929 208573 215112 150043 -183548 -203441 -106745 -99673 -330784 -170047
$$ packed form
1552d1662k34516K01822J20639Q7659l5200j91043L240J48455n6984l80791J18715
1541b59666K95036J30767M814k09341p7741j38206K6405K28694J10982n1114K7839
1530H8469n4755j22138k3796J59901Q7796J43778j00901l79296K36676L37680
1520C73414k36682k16572m3263r4634J59878j924k00412j99760K20800L0897J22672
1509h5586J08749j4112N9577J42649k78861Q2485o6408J73470j2761p399n1604
1498E0199q1314L434j12500j19129J38499J12017R7173Q869j94321r475k39M3964
1486f2823m8809M488j21084j43051J77336O1101p9219j47487L04025J86720k45438
1475a14241L1018K77152J4644O539o5069l33591j9893R6696P072k31111J60737
$$ plain form
1464 -170047 -100303 -284471 -223197 -151908 -154477 -451669 -590358 -193970 63297 -278738 -283166
1453 -283166 -33886 -371763 -428644 125904 149315 174388 138499 -4312 23405 177069 136264
1442 136264 14035 57405 32868 87975 34650 183698 54764 47477 29510 -9861 107266
1431 107266 -31037 -311703 -398544 -355515 -41692 -239373 -292623 -185822 868 126172
1421 126172 -48110 -172079 -212529 -213246 -239398 83761 -34291 73091 -58916 -127138 -112111
1410 -112111 -5766 56469 -9985 93178 -48437 -27192 38207 256789 61489 168894
1400 168894 168094 13502 -79445 -213083 122641 246687 158753 146992 55080 48580 -214470
1389 -214470 -268470 -164021 -89785 -245254 -242120 -194951 -146332 -254409 -187099 -155026 -210413
$$ packed form
1464a70047O9744j84168O1274P1289k569k97192j38689L96388K57267l42035m428
1453b83166K49280l37877n6881N54548K3411K5073l5889j42811K7717J53664m0805
1442A36264j22229M3370k4537N5107n3325J49048j28934p287j7967l9371J17127
1431A07266j38303k80666q6841M3029L13823j97681n3250J06801J86690J25304
1421A26172j74282j23969m0450p17k6152L23159j18052J07382j32007o8222J5027
1410a12111J06345O2235o6454J03163j41615K1245O5399K18582j95300J07405
1400A68894q00j54592r2947j33638L35724J24046q7934j1761r1912o500k63050
1389b14470n4000J04449P4236j55469L134M7169M8619j08077O7310L2073n5387
$$ plain form
1378 -210413 -79520 -150365 -184690 -316109 -291202 -88921 -322082 -17666 -63336 -56023 120189
1367 120189 -28533 163088 236054 -21163 -43457 98635 -12708 48594 -61785 297579
1357 297579 385933 142692 -86865 -255002 -319658 -277964 -38438 103225 -26215 -59193
1347 -59193 -193563 -303242 -245468 -62236 17890 -238380 -191150 -3658 -337937 -264634 72716
1336 72716 -72074 42814 14626 -82373 10438 137467 238211 -76835 -78676 -91500 -144432
1325 -144432 -144918 28089 63228 133105 122901 35816 42523 40471 54033 193294 182404 3836
1313 3836 -261380 -204680 -47297 164844 164247 28511 -48539 49975 246130 -51149 100759
1302 100759 190127 44197 39372 -205424 -562622 -362386 -90830 -34361 -258523 78800
$$ packed form
1378b10413J30893p0845l4325j31419K4907K02281k33161L04416m5670P313J76212
1367A20189j48722J91621P2966k57217k2294J42092j11343O1302j10379L59364
1357B97579Q8354k43241k29557j68137o4656M1694K39526J41663j29440l2978
1347e9193j34370j09679N7774J83232Q0126k56270M7230J87492l34279P3303L37350
1336G2716j44790J14888k8188r6999R2811J27029J00744l15046j841j2824n2932
1325a44432m86J73007L5139O9877j0204q7085O707k052J3562J39261j0890j78568
1313C836k65216N6700J57383K12141n97j35736p7050R8514J96155k97279J51908
1302A00759Q9368j45930m825k44796l57198K00236K71556N6469k24162L37323
$$ plain form
1292 78800 203869 52288 -829 49185 53053 130311 47154 -231124 -146598 -65516 -36492
1281 -36492 -39197 9106 205729 -9663 28586 146511 44760 -764 -25676 -162246 19623
1270 19623 61613 -39204 -15457 -173258 -223576 -103711 -208971 -220137 -59962 -65698 18508
1259 18508 -34539 144500 135091 167797 47094 -5342 39990 -63326 -144516 -90247 -161532
1248 -161532 -244242 -361352 -78427 59715 111422 140380 221178 119877 -7207 -128941
1238 -128941 -88299 266198 277335 80491 39427 90065 -4388 7121 -51317 -191864 210686
1227 210686 51568 127308 168180 -26071 -114932 19150 56289 5366 -120242 -128277 -68566
1216 -68566 -373282 -289668 -176205 247415 297811 220349 143648 101659 76351 -254784 -463460
$$ packed form
1292G8800J25069j51581n3117N0014L868P7258q3157k78278Q4526Q1082K9024
1281c6492k705M8303J96623k15392L8249J17925j01751m5524k4912j36570J81869
1270A9623M1990j00817K3747j57801n0318J19865j05260j1166J60175n736Q4206
1259A8508n3047J79039r409L2706j20703n2436M5332j03316q1190N4269p1285
1248a61532q2710j17110K82925J38142N1707K8958Q0798j01301j27084j21734
1238a28941M0642L54497J1137j96844m1064N0638r4453J1509n8438j40547M02550
1227B10686j59118P5740M0872j94251q8861J34082L7139n0923j25608q035N9711
1216f8566l04716Q3614J13463M23620N0396p7462p6701m1989k5308l31135k08676
$$ plain form
1205 -463460 -288404 -315884 -413314 -102344 -5880 -187754 -207540 -102250 65245 -91596
1195 -91596 -227473 -58926 -118611 -120323 239767 115749 6312 123129 146663 -26887 -102907
1184 -102907 -109195 16633 90925 93400 -73215 -84771 -145984 -121371 179322 264466 -59527
1173 -59527 -64679 39888 127162 87339 -81132 -256243 -200565 5261 -103259 -90880 -30164
1162 -30164 -44524 -263039 -232345 -129355 -128829 -163510 -244626 -335118 -314334 -281560 -169422 -217684
1150 -217684 -213119 -71143 -297628 -416192 -90692 -80983 117766 75161 -126087 -137563 -300916
1139 -300916 -112609 32139 11214 106379 77839 58702 69901 145955 26792 11771 256469
1128 256469 129139 81327 241507 34126 -75973 85726 -84498 8094 -229846 -347230
$$ packed form
1205d63460J75056k7480r7430L10970R6464j81874j9786J05290J67495j56841
1195i1596j35877J68547n9685j712L60090j24018j09437J16817K3534j73550p6020
1184a02907o288J25828P4292K475j66615j1556o1213K4613L00693Q5144l23993
1173e9527n152J04567Q7274l9823j68471j75111N5678K05826j08520J2379O0716
1162c0164j4360k18515L0694J02990N26l4681q1116r0492K0784L2774J12138m8262
1150b17684M565J41976k26485j18564L25500R709J98749m2605k01248j1476j63353
1139c00916J88307J44748k0925R5165k8540j9137J1199P6054j19163j5021K44698
1128B56469j27330m7812J60180k07381j10099J61699j70224R2592k37940j17384
$$ plain form
1118 -347230 -250666 -14846 -71144 34546 -12562 -326720 -386259 -342543 -362053 -3095 143182
1107 143182 -57318 168100 134326 95373 254206 278161 214561 453795 611849 726029
1097 726029 342280 -225988 83733 106573 142069 208314 141179 38540 -273839 -13408
1087 -13408 -102101 -43 151122 -26769 -52210 12467 -78870 -367827 -15205 97872 -71767
1076 -71767 -117610 -169646 -171088 -110494 -102642 -140173 -189051 -244213 23081 33968 207670 282454
1064 282454 252915 100512 341234 116130 -153792 42399 335408 -34172 -218896 158175
1054 158175 262889 277037 -33032 77129 156157 247677 332784 8273 81696 186232 -7290
1043 -7290 29552 30074 142436 -184222 -70132 291084 254413 313039 291294 115618 33904
$$ packed form
1118c47230R6564K35820n6298J05690m7108l14158n9539M3716j9510L58958J46277
1107A43182k00500K25418l3774l8953J58833K3955o3600K39234J58054J14180
1097G26029l83749n68268L09721K2840L5496O6245o7135j02639l12379K60431
1087a3408q8693J02058J51165j77891k5441O4677r1337k88957L52622J13077j69639
1076g1767m5843n2036j442O0594P852l7531m8878n5162K67294J0887J73702P4784
1064B82454k9539j52403K40722k25104k69922J96191K93009l69580j84724L77071
1054A58175J04714J4148l10069J10161P9028R1520Q5107l24511P3423J04536j93522
1043g290L6842N22J12362l26658J14090L61216l6671N8626k1745j75676q1714
$$ plain form
1032 33904 85014 -174729 -70649 -169110 -125901 -238008 -146945 17156 -167838 -95656 -232406
1021 -232406 -351171 -270809 -178248 -16187 -150612 83235 218020 -316548 -272514 -195173
1011 -195173 -23683 54399 52753 -256360 -185330 -104015 -183978 25205 -113673 -250106 -209880
1000 -209880 -167410 -325190 -184496 -44360 -68607 -207613 -54362 -23700 28326 8110 -70561
989 -70561 -19009 -71049 -295645 -205350 -33563 -17835 -43525 -273465 148345 234117 37569
978 37569 103108 228214 124246 17983 -306601 -366360 59796 209415 147819 -26867 -11650
967 -11650 -245265 -292176 -172078 -20654 -41446 112333 63867 235904 45748 -118509 -212852
956 -212852 -183835 -179002 -236538 -219513 -307361 -41205 -215399 -84990 78382 -58420 -127261
$$ packed form
1032C3904N1110k59743J04080r8461M3209j12107R1063J64101j84994P2182j36750
1021b32406j18765Q0362R2561J62061j34425K33847J34785n34568M4034P7341
1011a95173J71490P8082j646l09113P1030Q1315p9963K09183j38878j36433M0226
1000b09880M2470j57780J40694J40136k4247j39006J53251L0662N2026k0216p8671
989g0561N1552n2040k24596R0295J71787J5728k5690k29940M21810Q5772j96548
978C7569O5539J25106j03968j06263l24584n9759M26156J49619o1596j74686J5217
967a1650k33615m6911J20098J51424k0792J53779m8466J72037j90156j64257r4343
956b12852K9017M833n7536J7025q7848K66156j74194J30409J63372j36802o8841
$$ plain form
945 -127261 39279 263254 346734 -91938 -224236 -111791 13616 32830 -18709 -159919
935 -159919 -88476 -90290 159273 139233 128253 89284 182887 311961 177412 314279 299824
924 299824 70513 77788 205205 227304 -60738 -93954 74174 206476 214980 258216 253378
913 253378 372551 310006 122438 -32861 102098 176591 135778 87974 -27084 148386 237759
902 237759 58739 -56691 -26493 -274527 -395429 37301 42542 -248506 -188281 -359670 -116063
891 -116063 44810 -235201 42532 109535 137024 85880 -1783 41829 108147 71345 69502
880 69502 -146472 -414740 -251785 -164974 -212110 -236785 -108920 -271471 -154692 -57143 -1847
869 -1847 132818 231379 173846 176538 -107967 -176029 39433 11065 83530 -28718 -25269 -2872
$$ packed form
945a27261J66540K23975Q3480m38672j32298J12445J25407J9214n1539j41210
935a59919P1443j814K49563k0040j0980l8969R3603J29074j34549J36867j4455
924B99824k29311P275J27417K2099k88042l3216J68128J32302Q504M3236m838
913B53378J19173o2545j87568j55299J34959P4493m0813m7804j15058J75470Q9373
902B37759j79020j15430L0198k48034j20902M32730N241k91048O0225j71389K43607
891a16063J60873k80011K77733O7003K7489n1144q7663M3612O6318l6802j843
880F9502k15974k68268J62955Q6811m7136k4675J27865j62551J16779R7549N5296
869a847J34665R8561n7533K692k84505o8062K15462k8368P2465j12248L449K2397
$$ plain form
857 -2872 -49141 -42600 -78695 -71440 85898 26992 -16458 187335 47403 -67577 -303570 -240548
845 -240548 -215765 55310 61733 97234 38377 -88546 -22884 121672 112093 281157 293459
834 293459 154037 -132922 -117030 32727 97245 -131053 -44558 145033 398502 202261
824 202261 41482 -24292 108478 284465 170974 -166402 -135719 390306 454411 477268 331341
813 331341 59922 -109731 202345 210003 168981 -173173 -176221 -197978 159980 90194 -95618
802 -95618 80022 199453 6998 -131553 116374 42026 82965 116545 134463 431887 414166
791 414166 249539 197802 -24720 -87346 -50015 137518 -89501 -183580 -223219 -234290 -198734
780 -198734 -165803 388568 355001 31176 -28601 77116 18389 20175 164439 33502 25303
$$ packed form
857b872m6269O541l6095P255J57338n8906m3450K03793j39932j14980k35993O3022
845b40548K4783K71075O423L5501n8857j26923O5662J44556r579J69064J2302
834B93459j39422k86959J5892J49757O4518k28298Q6495J89591K53469j96241
824B02261j60779o5774J32770J75987j13491l37376L0683N26025O4105K2857j45927
813C31341k71419j69653L12076P658m1022l42154l048k1757L57958o9786j85812
802i5618J75640J19431j92455j38551K47927p4348M0939L3580J7918K97424j7721
791D14166j64627n1737k22522o2626L7331J87533k27019r4079l9639j1071L5556
780a98734L2931N54371l3567l23825n9777J05717n8727J786J44264j30937q199
$$ plain form
769 25303 -116812 92552 249851 396578 177339 160977 27846 -298791 2358 -128827
759 -128827 -109692 -87528 -15230 -104843 -147474 -88649 56759 347027 395554 143528 -42195
748 -42195 128109 401857 34012 3445 442999 217620 -140363 46824 44467 -42098 232206
737 232206 212819 -102938 -125564 -196997 -34595 30316 154766 157280 80937 2080 203657
726 203657 165443 15198 25327 -179399 -232298 28362 147667 174627 99054 244547 192432
715 192432 107985 30967 181193 221653 90398 90768 112471 30985 19435 89956 -131257 21800
703 21800 31773 83658 80664 229115 73270 10977 57138 -231659 -230114 -235156 -249947 80886
691 80886 296949 276165 177831 40539 -7454 6922 94171 312844 282402 124719 145773
$$ packed form
769B5303j42115K09364J57299J46727k19239j6362j33131l26637L01149j31185
759a28827J9135K2164P2298q9613m2631N8825J45408K90268M8527k52026j85723
748d2195J70304K73748l67845l0567M39554k25379l57983J87187k357q6565K74304
737B32206j9387l15757k2626p1433J62402O4911J24450K514p6343p8857K01577
726B03657l8214j50245J0129k04726n2899K60660J19305K6960p5573J45493n2115
715A92432q4447p7018J50226M0460j31255L70K1703q1486j1550P0521k21213J53057
703B1800R973N1885k994J48451j55845o2293M6161k88797J545n042j4791L30833
691H0886K16063k0784r8334j37292m7993J4376Q7249K18673l0442j57683K1054
$$ plain form
680 145773 4733 115739 200536 74340 60793 -94452 110511 70536 108283 13275 150741
669 150741 339525 83030 -16098 20 49803 75795 54508 181927 -613 223022 118435
658 118435 -66618 75720 160543 212895 77613 293763 360984 265160 252649 -12413 -124806
647 -124806 126898 38938 -107531 5668 86036 136063 -54834 64126 91622 37402 -74188
636 -74188 -144411 -46161 -63849 87292 167849 115387 49669 212314 200605 158485 171203 -135586
624 -135586 -23513 29126 115966 272862 -34882 -147404 -160038 76938 219229 -12634
614 -12634 -289726 -187905 -183125 -99748 61354 263879 186421 153889 278857 38342 28379
603 28379 84416 -117902 -188326 6469 -46857 -6919 -55536 -248023 -440372 -288030 -36709
$$ packed form
680A45773j41040J11006Q4797j26196j3547j55245K04963l9975L7747r5008J37466
669A50741J88784k56495r9128J6118M9783K5992k1287J27419j82540K23635j04587
658A18435j85053J42338Q4823N2352j35282K16150O7221r5824j2511k65062j12393
647a24806K51704q7960j46469J13199Q0368N0027j90897J18960K7496n4220j11590
636g4188p0223R8250j7688J51141Q0557n2462o5718J62645j1709m2120J2718l06789
624a35586J12073N2639Q6840J56896l07744j12522j2634K36976J42291k31863
614a2634k77092J01821M780Q3377J61102K02525p7458l2532J24968k40515r963
603B8379N6037k02318p0424J94795n3326L9938m8617j92487j92349J52342K51321
$$ plain form
592 -36709 109437 194098 12734 7196 9759 36008 284856 329474 276102 -114395 -196546 -185996
580 -185996 -95263 6881 80549 -101145 -322245 -29771 -44748 491233 427567 224823 349845
569 349845 153820 66289 43540 205309 80674 -34121 -120134 -73104 122929 -10439 97628
558 97628 285360 155594 -55143 67611 134216 93537 -49637 49554 13302 -174711 -193482
547 -193482 -106578 -1639 236775 272358 184909 -19762 -72116 57881 250425 19891 73579
536 73579 -205312 -160181 -100201 22867 57786 -22165 -2883 -62141 155767 34129 167691
525 167691 260201 406591 131877 -30665 -46276 137645 408904 290323 39323 -30220
515 -30220 20968 -85825 -375595 -58278 246905 319970 82850 92310 -125406 -293887 -431328
$$ packed form
592c6709J46146Q4661j81364n538K563K6249K48848M4618n3372l90497q2151J0550
580a85996R0733J02144P3668j81694k21100K92474j4977N35981o3666k02744J25022
569C49845j96025q7531k2749J61769j24635j14795q6013M7030J96033j33368J08067
558I7628J87732j29766k10737J22754O6605m0679j43174R9191l6252j88013j8771
547a93482Q6904J04939K38414L5583q7449k04671n2354J29997J92544k30534N3688
536G3579k78891M5131N9980J23068L4919p9951J9282n9258K17908j21638J33562
525A67691R2510J46390k74714j62542j5611J83921K71259j18581k51000o9543
515c0220N1188j06793k89770L17317L05183P3065k37120R460k17716j68481j37441
$$ plain form
504 -431328 64933 252917 205289 -14190 -317948 -198559 12792 49698 68448 239304
494 239304 53467 -78209 -57900 233299 285618 115250 -80243 -61145 -92895 146419 246788
$$ packed form
504d31328M96261J87984m7628k19479l03758J19389K11351L6906J8750J70856
494B39304j85837j31676K0309K91199N2319j70368j95493J9098l1750K39314J00369
$$ [...]
##END NTUPLES=NMR SPECTRUM
##END=
