##TITLE=1H_TG-2402-X
 200.13Hz, CDCl3.
 8 sc
 
25.3.2026
##JCAMPDX= 6.0         $$ Bruker NMR JCAMP-DX V2.0
##DATA TYPE= NMR SPECTRUM
##DATA CLASS= NTUPLES
##ORIGIN= UXNMR, Bruker Analytische Messtechnik GmbH
##OWNER= pz
$$ XWIN-NMR		Version 3.5
$$ Wed Mar 25 13:24:21 2026 Russian Standard Time (UT+4h)  she@DPX200
##.OBSERVE FREQUENCY= 200.1313
##.OBSERVE NUCLEUS= ^1H
##.ACQUISITION MODE= SIMULTANEOUS
##.ACQUISITION SCHEME= undefined
##.AVERAGES= 8
##.DIGITISER RES= 18
##SPECTROMETER/DATA SYSTEM= spect
##.PULSE SEQUENCE= zg30
##.SOLVENT NAME= CDCl3
##.SHIFT REFERENCE= (INTERNAL, CDCl3, 0, 15.488)
##AUDIT TRAIL= $$ (NUMBER, WHEN, WHO, WHERE, WHAT)
$$ ##TITLE= Audit trail, XWIN-NMR		Version 3.5
$$ ##JCAMPDX= 5.01
$$ ##ORIGIN= Bruker BioSpin GmbH
$$ ##OWNER= she
$$ F:/spectra/data/she/nmr/H-C/1/pdata/1/auditp.txt
$$ ##AUDIT TRAIL=  $$ (NUMBER, WHEN, WHO, WHERE, WHAT)
(   1,<2026-03-25 13:22:39.32 +0400>,<she>,<DPX200>,
      <created by zg, POWCHK disabled, PULCHK disabled
       configuration hash MD5:
       00 E9 B6 7A A2 85 ED C7 34 08 36 98 17 FE 4E 26
       data hash MD5: 16K
       BF B1 49 90 13 0A 1E 35 8F CF EE 3F 33 05 A1 9F>)
(   2,<2026-03-25 13:22:41.35 +0400>,<she>,<DPX200>,
      <Start of raw data processing
       efp BC_mod = 2 LB = 0.25 FT_mod = 6 PKNL = 1 PHC0 = -3708.354 PHC1 = 16.9923 SI = 16K 
       data hash MD5: 16K
       DE D1 F2 1F F5 FF 28 DA 0A 6C CA 38 A4 35 57 7E>)
(   3,<2026-03-25 13:23:01.00 +0400>,<she>,<DPX200>,
      <pk PHC0 = 4.071824 PHC1 = -5.4 
       data hash MD5: 16K
       A0 41 A6 AB 6F 85 A9 1A 6C DF C6 DC B2 A3 D9 22>)
(   4,<2026-03-25 13:23:09.79 +0400>,<she>,<DPX200>,
      <abs ABSG = 5 
       data hash MD5: 16K
       4E 73 A7 63 33 4C A0 AF 50 A2 35 49 AB 0C E0 5A>)
$$ ##END=
$$ 
$$ hash MD5
$$ 52 14 3E E8 0C 5C 60 38 9E 94 3F AD 33 65 D6 25
##$RELAX= 
##$RELAX= 
##$RELAX= 
##$RELAX= 
##$RELAX= 
##$RELAX= 
$$ Bruker specific parameters
$$ --------------------------
##$DU= <F:/spectra>
##$EXPNO= 1
##$NAME= <H-C>
##$PROCNO= 1
##$TYPE= <nmr>
##$USER= <she>
##$AMP= (0..31)
100 100 100 100 100 100 100 100 100 100 100 100 100 100 100 100 100 100 
100 100 100 100 100 100 100 100 100 100 100 100 100 100 
##$AQSEQ= 0
##$AQ_mod= 1
##$AUNM= <au_zg>
##$AUTOPOS= <>
##$BF1= 200.13
##$BF2= 200.13
##$BF3= 200.13
##$BF4= 200.13
##$BF5= 200.13
##$BF6= 200.13
##$BF7= 200.13
##$BF8= 200.13
##$BYTORDA= 1
##$CFDGTYP= 0
##$CFRGTYP= 5
##$CHEMSTR= <none>
##$CNST= (0..31)
1 1 145 1 1 1 1 1 1 1 1 1 1 1 1 1 1 1 1 1 1 1 1 1 1 1 1 1 1 1 1 1 
##$CPDPRG= <>
##$CPDPRG1= <>
##$CPDPRG2= <>
##$CPDPRG3= <>
##$CPDPRG4= <mlev>
##$CPDPRG5= <mlev>
##$CPDPRG6= <mlev>
##$CPDPRG7= <mlev>
##$CPDPRG8= <mlev>
##$CPDPRGB= <>
##$CPDPRGT= <>
##$D= (0..31)
0 0.7 0 0 0 0 0 0 0 0 0 0.03 0 0 0 0 0 0 0 0 0 0 0 0 0 0 0 0 0 0 0 0 
##$DATE= 1774430558
##$DBL= (0..7)
120 120 120 120 120 120 120 120 
##$DBP= (0..7)
150 150 150 150 150 150 150 150 
##$DBP07= 0
##$DBPNAM0= <>
##$DBPNAM1= <>
##$DBPNAM2= <>
##$DBPNAM3= <>
##$DBPNAM4= <>
##$DBPNAM5= <>
$$ [...]
##$SUBNAM3= <"">
##$SUBNAM4= <"">
##$SUBNAM5= <"">
##$SUBNAM6= <"">
##$SUBNAM7= <"">
##$SUBNAM8= <"">
##$SUBNAM9= <"">
##$SW= 18.0517328524113
##$SWIBOX= (0..15)
0 0 2 0 0 0 0 0 0 0 0 0 0 0 0 0 
##$SW_h= 3612.71676300578
##$TD= 16384
##$TD0= 1
##$TE= 0
##$TE2= 300
##$TE3= 300
##$TEG= 300
##$TL= (0..7)
0 120 120 120 120 120 120 120 
##$TP= (0..7)
150 150 150 150 150 150 150 150 
##$TP07= 0
##$TPNAME0= <>
##$TPNAME1= <>
##$TPNAME2= <>
##$TPNAME3= <>
##$TPNAME4= <>
##$TPNAME5= <>
##$TPNAME6= <>
##$TPNAME7= <>
##$TPOAL= (0..7)
0.5 0.5 0.5 0.5 0.5 0.5 0.5 0.5 
##$TPOFFS= (0..7)
0 0 0 0 0 0 0 0 
##$TUNHIN= 0
##$TUNHOUT= 0
##$TUNXOUT= 0
##$USERA1= <user>
##$USERA2= <user>
##$USERA3= <user>
##$USERA4= <user>
##$USERA5= <user>
##$V9= 5
##$VALIST= <valist>
##$VCLIST= <CCCCCCCCCCCCCCC>
##$VD= 0
##$VDLIST= <DDDDDDDDDDDDDDD>
##$VPLIST= <PPPPPPPPPPPPPPP>
##$VTLIST= <TTTTTTTTTTTTTTT>
##$WBST= 1024
##$WBSW= 4
##$XGAIN= (0..3)
0 0 0 0 
##$XL= 0
##$YL= 0
##$YMAX_a= 209099
##$YMIN_a= -271061
##$ZGOPTNS= <>
##$ZL1= 120
##$ZL2= 120
##$ZL3= 120
##$ZL4= 120
##$ABSF1= 15.48907
##$ABSF2= -2.562779
##$ABSG= 5
##$ABSL= 3
##$ALPHA= 0
##$AQORDER= 0
##$ASSFAC= 0
##$ASSFACI= 0
##$ASSFACX= 0
##$ASSWID= 0
##$AUNMP= <proc_1d>
##$AZFE= 0.1
##$AZFW= 0.1
##$BCFW= 0
##$BC_mod= 2
##$BYTORDP= 0
##$COROFFS= 0
##$CY= -3
##$DATMOD= 1
##$DC= 0
##$DFILT= <>
##$DTYPP= 0
##$F1P= 0
##$F2P= 0
##$FCOR= 1
##$FTSIZE= 16384
##$FT_mod= 6
##$GAMMA= 0
##$GB= 0
##$INTBC= 1
##$INTSCL= 3.241238e-09
##$ISEN= 128
##$LB= 0.25
##$LEV0= 0
##$LPBIN= 0
##$MAXI= 10000
##$MC2= 0
##$MEAN= 0
##$ME_mod= 0
##$MI= 1.114404
##$NCOEF= 0
##$NC_proc= -6
##$NLEV= 6
##$NOISF1= 3.799351
##$NOISF2= 2.8
##$NSP= 0
##$NTH_PI= 0
##$NZP= 0
##$OFFSET= 15.48797
##$PC= 1
##$PHC0= -3704.282
##$PHC1= 11.5923
##$PH_mod= 1
##$PKNL= yes
##$PPARMOD= 0
##$PSCAL= 0
##$PSIGN= 0
##$REVERSE= no
##$SF= 200.130006751121
##$SI= 16384
##$SIGF1= 3
##$SIGF2= 2
##$SINO= 0.751879
##$SIOLD= 32768
##$SREGLST= <19F.Aceton>
##$SSB= 0
##$STSI= 16384
##$STSR= 0
##$SW_p= 3612.71676300578
##$SYMM= 0
##$S_DEV= 0
##$TDeff= 16384
##$TDoff= 0
##$TI= <>
##$TILT= no
##$TM1= 0
##$TM2= 0
##$TOPLEV= 0
##$USERP1= <user>
##$USERP2= <user>
##$USERP3= <user>
##$USERP4= <user>
##$USERP5= <user>
##$WDW= 1
##$XDIM= 16384
##$YMAX_p= 522474366
##$YMIN_p= -316241
$$ End of Bruker specific parameters
$$ ---------------------------------
##NTUPLES= NMR SPECTRUM
##VAR_NAME=  FREQUENCY,     SPECTRUM/REAL,   SPECTRUM/IMAG
##SYMBOL=    X,             R,               I
##VAR_TYPE=  INDEPENDENT,   DEPENDENT,       DEPENDENT
##VAR_FORM=  AFFN,          ASDF,            ASDF
##VAR_DIM=   16384,         16384,           16384
##UNITS=     HZ,            ARBITRARY UNITS, ARBITRARY UNITS
##FACTOR=    0.220516191357247, 1,           1
##FIRST=     3099.60761114151, 0,            0
##LAST=      -513.109151864266, 0,           0
##MIN=       -513.109151864266, -316241,     0
##MAX=       3099.60761114151, 522474366,    0
$$ Real data points
##PAGE= N=1
##DATA TABLE= (X++(R..R)), XYDATA
$$ [...]
7431H0241r1214j17414j09664J5357J35767L4433r5511j5714J45739r1112j9075
$$ 80241 -10973 -128387 -238051 -222694 -86927 -52494 -148005 -163719 -17980 -109092 -128167
7420a28167M8518q5658L1929o5944J650P8908J89461j5242o5673j49955J85694
$$ -128167 -79649 -165307 -133378 -199322 -197672 -118764 70697 55455 -10218 -160173 25521
7409B5521p3921k5444j8640N2188L2950L0552r4763m0722L2215p9852L2390j3974
$$ 25521 -48400 -73844 -92484 -40296 -7346 23206 -71557 -112279 -80064 -159916 -127526 -141500
7397a41500j0093l5202p0512k0588N8626p578L3353J75954L3467q9986O0212p0317
$$ -141500 -151593 -186795 -257307 -277895 -219269 -226847 -193494 -17540 15927 -74059 -13847 -84164
7385h4164P8987o9936p0063R5596J751j07319L1834j4986N6670P7569j01612l7764
$$ -84164 -5177 -75113 -145176 -49580 -47829 -155148 -123314 -138300 -81630 -4061 -105673 -143437
7373a43437K4192J08715q982k8811j7188l2397K1238J7020K4268N4969J6941k17966
$$ -143437 -119245 -10530 -19512 -48323 -65511 -97908 -76670 -59650 -35382 19587 36528 -181438
7361a81438n4823P3973J28574l7198M2474j440n8190K0845o8p5331o8251l3446
$$ -181438 -236261 -162288 -33714 -70912 -28438 -29878 -88068 -67223 -67291 -142622 -210873 -244319
7349b44319j5668O2021P3320R901k3943J4060J33849o2662j55720J53259L7340
$$ -244319 -259987 -197966 -124646 -114745 -138688 -124628 9221 -53441 -209161 -55902 -18562
7338a8562m5107n2906M0139p4946J3891Q4596R0016j13828L7633O1501j96024
$$ -18562 -63669 -116575 -76436 -151382 -137491 -52895 37121 -76707 -39074 22427 -173597
7327a73597P8652k571m815l8981m7424J40023j5739J8947m7059r2974m3458J30738
$$ -173597 -94945 -97516 -102331 -141312 -188736 -48713 -64452 -45505 -92564 -185538 -228996 -98258
7315i8258o0409r7651J12634l6215K4719j09K9757o5955j6813J39153m0402l4422
$$ -98258 -158667 -256318 -143684 -179899 -155180 -155289 -125532 -191487 -208300 -69147 -109549 -143971
7303a43971p3023L4042N1243M323J16477n558m1514j7365j01287l4828N8930L8436
$$ -143971 -216994 -182952 -131709 -127386 -10909 -16467 -57981 -75346 -176633 -211461 -152531 -114095
7291a14095O2202o3380K1463m6005j06048L476J59478r5080l9054k3336N5176
$$ -114095 -51893 -115273 -93810 -139815 -245863 -242387 -82909 -177989 -217043 -240379 -185203
7280a85203J01017r9561o2249J15427k6740l1542J68392n1850n3241M8251n3964
$$ -185203 -84186 -183747 -245996 -130569 -157309 -188851 -20459 -72309 -125550 -77299 -131263
7269a31263m1877k4025J23719L2704j1080l6879j02458J07059M9534r053p8320
$$ -131263 -173140 -197165 -73446 -40742 -51822 -88701 -191159 -84100 -34566 -43619 -121939
7258a21939p8794q643Q6304O5663N0421K9476q1481J3594J7710k7549j01115N5585
$$ -121939 -200733 -209376 -123072 -57409 -6988 22488 -58993 -45399 -27689 -55238 -156353 -100768
7246a00768R76N171j4476o2830j2326j0686R4470l8632p6214L2768J47430M2096
$$ -100768 -99792 -94621 -109097 -171927 -184253 -194939 -100469 -139101 -215315 -182547 -35117 6979
7234F979r2811M3300p8344n0207K2316o474j2917q0512J02410p9493R5396k6902
$$ 6979 -85832 -42532 -120876 -171083 -148767 -155241 -168158 -248670 -146260 -225753 -130357 -157259
7222a57259j0975N2535p5476Q714m1755P9460r844m4848J35792j1600N3313q3398
$$ -157259 -168234 -115699 -191175 -182461 -224216 -144756 -154600 -199448 -63656 -75256 -21943 -105341
7210a05341r2462M5535L266k6327J17291k5434N1645r1557n1679P4055K3727J93502
$$ -105341 -197803 -152268 -149002 -175329 -58038 -83472 -31827 -123384 -175063 -101008 -77281 116221
7198A16221p1689p9483q9934j9188o0085q5031O8703q112M5490P1275l6990n3955
$$ 116221 44532 -34951 -124885 -144073 -204158 -289189 -220486 -228598 -183108 -111833 -148823 -202778
7186b02778M6414R3779n6380o6234J4763K8872Q2126J9130j27522j14473K229
$$ -202778 -156364 -62585 -118965 -185199 -170436 -141564 -59438 -40308 -167830 -282303 -280074
7175b80074M0562P0338k3p506K7934l8017N9223Q2467m8868J9958n4311p252R0772
$$ -280074 -239512 -169174 -169197 -176703 -148769 -186786 -127563 -45096 -93964 -74006 -128317 -135569 -44797
7162d4797L1428l5868j09451L6445M2413K6306K2397o822k7561l5121k1013j3045
$$ -44797 -13369 -49237 -158688 -122243 -79830 -53524 -31127 -37949 -65510 -100631 -121644 -134689
7150a34689N2745n0509m7918J33260l297n0612l3894J728j01299n5699Q5171L4970
$$ -134689 -81944 -132453 -180371 -47111 -50408 -101020 -134914 -133186 -234485 -290184 -205013 -170043
7138a70043k8070K9166M2724J5889K3967n2117l6404j0822J06328l106M2821j7366
$$ -170043 -198113 -168947 -126223 -110334 -86367 -138484 -174888 -185710 -79382 -82488 -39667 -57033
7126e7033k12418J03525J26536J553k5259j04831O6226J03905J6563j58802J10981
$$ -57033 -269451 -165926 -39390 -37837 -63096 -167927 -101701 2204 18767 -140035 -29054
7115b9054Q4287k5612J156j67411K350o580n8244O573P3460j61944R0193q8941
$$ -29054 55233 29621 30777 -136634 -134284 -140864 -199108 -192535 -119075 -281019 -190826 -279767
7103b79767P7898j4609J4460K1267Q6149M4882O9846k5785Q128M9131j97063M6515
$$ -279767 -201869 -216478 -202018 -180751 -94602 -49720 20126 -5659 2469 51600 -145463 -98948
7091i8948J131P2039j0227j39k7296O9003p0149l462k9796o6177N9826l8490L5100
$$ -98948 -97817 -25778 -36005 -36144 -63440 5563 -64586 -68048 -97844 -164021 -104195 -142685 -107585
7078a07585P3799N88r2558K3784l4980R1070K3000j27915J01743M4940m2564l3135
$$ -107585 -33786 -33198 -125756 -101972 -136952 -45882 -22882 -150797 -49054 -4114 -46678 -79813
7066g9813j8603K350P734P9671O7173m0450j37171n044L721j11894J02319O8240
$$ -79813 -98416 -96066 -88332 -8661 58512 18062 -119109 -124153 -120432 -232326 -130007 -61767
7054f1767j1563L3791j6090J3878l1701r3761L8657l3790L4773K299J79408N5289
$$ -61767 -73330 -39539 -55629 -41751 -73452 -167213 -128556 -162346 -127573 -125274 54134 109423
7042A09423k40753m2575J55879k0971m170M5352Q3796j07879j68718J8465k9215
$$ 109423 -131330 -173905 -18026 -38997 -43167 2185 85981 -21898 -190616 -172151 -201366
7031b01366n5581J80811M7078n7557j20507o0518N46m9147J10051L8254M5794
$$ -201366 -256947 -76136 -29058 -86615 -207122 -267640 -267094 -316241 -206190 -167936 -122142
7020a22142r1668l2517J3246O2048J17269J83j6729L644m2972m4722N0535r579
$$ -122142 -213810 -246327 -233081 -171033 -53764 -53581 -70310 -66666 -109638 -154360 -103825 -113404
7008a13404J928R750k4431O9607R3007J3904N498j14631J10004n1071r9565m6244
$$ -113404 -111476 -101726 -126157 -56550 36457 50361 55859 -58772 51232 161 -99404 -145648
6996a45648K6533Q8533p2186j91770L8269J91241N9284m5564j14322J18522N2681
$$ -145648 -119115 -30582 -102768 -294538 -256269 -65028 -5744 -51308 -165630 -47108 5573
6985E573o4947K6440K2431m4579q136r075J15383m2099j00335J4505J48371K8045
$$ 5573 -59374 -32934 -10503 -55082 -63218 -72293 43090 991 -99344 -84839 63532 91577
6973I1577j31386K2768q3514L454J17617q1283J8867Q796M1774R0471M7041M6409
$$ 91577 -39809 -17041 -100555 -97101 20516 -60767 -41900 -33104 8670 99141 146182 192591
6961A92591q6067p2154j06771R612J66185K5028q1804m7908J0581L5341R0229
$$ 192591 106524 34370 -72401 -62789 103396 128424 46620 -1288 9293 44634 134863
6950A34863p5048m9673k1680O8394J3135j04465q2417J56770M0863k3825j3075
$$ 134863 59815 10142 -11538 56856 69991 -34474 -116891 39879 80742 56917 43842
6939D3842K1084o8621p3191j718P6220n6805K6023O8780l3247l3590m8079L008
$$ 43842 64926 -3695 -76886 -78604 -2384 -59189 -33166 35614 2367 -31223 -79302 -76294
6927g6294J60721J43375j44189j71020n2163Q5171J2214j02539J5720J93169m7290
$$ -76294 84427 227802 83613 -87407 -139570 -54399 -42185 -144724 -129004 64165 16875
6916A6875n9200j794j47853L1597M3844O4064M6792L5433O6518m221J2944j4466
$$ 16875 -42325 -44119 -191972 -160375 -116531 -52467 -5675 29758 96276 92055 104999 90533
6904I0533k4307j6019o7939l3828N579Q195K4903q9672M3151n2245j4132L9710
$$ 90533 66226 50207 -17732 -51560 -45981 -37786 -12883 -102555 -59404 -111649 -125781 -86071
6892h6071J05838j8240q5568l4866O230N9629J0372M9474k4109o6616K5749Q7812
$$ -86071 19767 1527 -84041 -118907 -112677 -53048 -42676 6798 -17311 -83927 -58178 29634
6880B9634p2629j970l7247L8763O4607m6847K2913N2829K5458p9626k2693l8360
$$ 29634 -42995 -44965 -82212 -43449 21158 -25689 -2776 50053 75511 -4115 -26808 -65168
6868f5168O0000l1720m0333m7477M9177J42673l430j35211k8486J16419n0105
$$ -65168 -5168 -36888 -77221 -124698 -75521 67152 63722 -71489 -99975 16444 -33661
6857c3661r8349R171J32168J50638o6207P395P0014n371o6918O6661o419k6711
$$ -33661 -132010 -122839 9329 159967 93760 101155 171169 165798 98880 165541 159122 132411
6845A32411n5762j10618J56311M1753P3387J35792m6115r0000j19952N5027m9436
$$ 132411 76649 -33969 122342 164095 237482 373274 327159 237159 117207 172234 122798
6834A22798o8844P6307m6152M5293m267P3212L3812k1991J28544J3052p1997k8246
$$ 122798 53954 130261 84109 129402 125135 198347 232159 210168 338712 351764 279767 251521
6822B51521M8179m8097M9648p9675p7913k6739j3167J09205N4226p1043J34130
$$ 251521 299700 251603 301251 221576 143663 116924 103757 212962 267188 196145 330275
6811C30275m6209N786j4829l7215K2425L7889Q411q0760P8589L8702N3496j4661
$$ 330275 284066 289852 275023 237808 260233 298122 306533 225773 304362 343064 396560 381899
6799C81899p6843j17521P697Q6978N0135q8233o3075k0869L7903o3102J45341
$$ 381899 305056 187535 195232 282210 332345 244112 181037 160168 198071 134969 280310
6788B80310K7118P5415q421m6823m9841P3305q031l7656M8897Q1689j27569p5801
$$ 280310 307428 382843 374422 327599 277758 351063 343032 305376 354273 435962 308393 232592
6776B32592R9045N4422J761j38092K0577J19605o6127q4983j2498J15641L5324
$$ 232592 331637 386059 387820 249728 270305 389910 323783 238800 226302 341943 377267
6765C77267K6722Q2509q479l1804o4651l8928L866J65393j11803O3476O6472N739
$$ 377267 403989 486498 478019 446215 381564 342636 346502 511895 400092 463568 530040 535779
6753E35779o147j57637k2610P7117o049P3320j567l751K1820k6045O2218P4099
$$ 535779 529632 371995 349385 426502 420453 493773 492206 488455 510275 484230 546448 620547
6741F20547m1178L8173j7887L4873P7165k328N3746j0629j65879n9947J37987
$$ 620547 579369 617542 599655 634528 711693 709365 763111 752482 586603 526656 664643
6730F64643p743n3926j36871P894R2627Q3853O123J7552L9155j4215M4832o3599
$$ 664643 656900 602974 466103 473997 566624 650477 656600 674152 713307 699092 743924 680325
6718F80325M9907o2661K4582J76353N6402k0072j23328P3130k0049k4885J0188
$$ 680325 730232 667571 692153 868506 924908 904836 781508 854638 834589 809704 819892
6707H19892J47006J17641r8249R2927K37330m63m4578P452L835J39803O6227k5137
$$ 819892 966898 1084539 986290 1079217 1316547 1316084 1271506 1278958 1282793 1422596 1488823 1463686
6695A463686J10889P3415j4204n790J51339J20155J0500M2472m6810J30434k7311
$$ 1463686 1574575 1647990 1633786 1627996 1779335 1899490 1909990 1952462 1905652 2036086 2008775
6684B008775r1706m4587R8772J28595N3248P4301M7235P3534O246M553J5935J31836
$$ 2008775 1917069 1872482 1971254 2099849 2153097 2227398 2274633 2348167 2354413 2358966 2374901 2506737
6672B506737O3794M3742N9613N9212O7537J53966O4343k0357k9272Q8635J55666
$$ 2506737 2570531 2614273 2673886 2733098 2800635 2954601 3018944 2998587 2969315 3057950 3213616
6661C213616M4177Q8311P2586J32327Q6378R5549k0811p902K14032J00743j80062
$$ 3213616 3257793 3346104 3418690 3551017 3637395 3732944 3712133 3704231 3918263 4019006 3838944
6650C838944L17J07575m3468J12553p6337J2143Q6767M0786J62266M3637J40449
$$ 3838944 3839261 3946836 3903368 4015921 3939584 3951727 4038494 4079280 4241546 4285183 4425632
6639D425632L2781M7188J2936J31369N6574N211J81728P9247L2934m0913q4536
$$ 4425632 4458413 4505601 4518537 4649906 4706480 4711691 4893419 4972666 5005600 4964687 4880151
6628D880151M4443K83950J02008m7094R1809l262P9576J22135o5994r4254J35174
$$ 4880151 4924594 5208544 5310552 5263458 5355267 5352005 5431581 5553716 5487722 5393468 5528642
6617E528642O3354J29720n5198j08816N7993J44391m7661P2694O7363j41112o6889
$$ 5528642 5591996 5721716 5666518 5557702 5615695 5760086 5712425 5785119 5852482 5711370 5644481
6606E644481N7520l3988j49885R1069R5525N9270j11593m1682o7964N1283l4292
$$ 5644481 5702001 5668013 5518128 5609197 5704722 5763992 5652399 5610717 5542753 5594036 5559744
6595E559744K8303L5472q7349p6536n4934l5055M8989j32263r2082o609J16j36856
$$ 5559744 5588047 5623519 5536170 5459634 5404700 5369645 5418634 5286371 5194289 5187680 5187796 5050940
6583E050940r6231M9888J54320q0668j55761p8479R77R7318j7786J29427K2107
$$ 5050940 4954709 5004597 5158917 5078249 4922488 4844009 4844986 4942304 4924518 5053945 5076052
6572E076052k26702j04288l9455j07379l4159n9850j4848j89302j14238p2667
$$ 5076052 4849350 4745062 4705607 4598228 4564069 4504219 4489371 4300069 4185831 4113164
6562D113164M4301N6810j5313p867r0543j019j37736j95143n917k305n5647l31870
$$ 4113164 4157465 4214275 4198962 4191095 4100552 4099533 3961797 3766654 3760737 3758432 3702785 3370915
6550C370915r3104m96j68119o1408j1194j27402j16579l4584l94J6530j45615
$$ 3370915 3277811 3277315 3109196 3047788 3036594 2909192 2792613 2758029 2757635 2774165 2628550
6539B628550n1093j21367N4707R3686r7677k6908j63501r2541O3718j07504J957
$$ 2628550 2577457 2456090 2510797 2604483 2506806 2479898 2316397 2223856 2287574 2180070 2182027
6528B182027R5106N874j63555j75930l5992r4487r7534l8780k3569j4311j59302
$$ 2182027 2277133 2283007 2119452 1943522 1907530 1813043 1715509 1676729 1653160 1638849 1479547
6517A479547k33729o0882L8875l139j8740m1922L6695j8283p8062l2083M5944
$$ 1479547 1245818 1184936 1223811 1220672 1201932 1160010 1196705 1178422 1100360 1068277 1114221
6506A114221J35085j96110l4099J6729L584N9284M8719j97900l3739j1547J28409
$$ 1114221 1249306 1053196 1019097 1035826 1039410 1098694 1147413 949513 915774 904227 1032636
6495A032636N6760j51645p5486m2758n8880j6945O0801r8454J38972j08789K9576
$$ 1032636 1089396 937751 862265 819507 760627 743682 804483 706029 845001 736212 765788
6484G65788l222n4557j7369N8305P4133r382r1475R8247J1983j56445O5391M4444
$$ 765788 762566 708009 690640 748945 823078 813696 722221 820468 832451 676006 741397 785841
6472G85841M8122p1283J05985P33l2282l5084J9857j11219O1075R9385o4098m6986
$$ 785841 833963 762680 868665 869398 837116 802032 821889 710670 771745 871130 807032 760046
6460G60046J25196J10564j21874J02561k3340j08147j32873P8947n1258J07646
$$ 760046 885242 995806 873932 976493 953153 845006 712133 791080 739822 847468
6450H47468k8288q8673Q8872Q9472N3838l1363j95156M7605J22967O821j9164
$$ 847468 819180 730507 819379 908851 962689 931326 736170 783775 906742 913563 894399
6439H94399l6738K2500k0615l8806k6927P0261M5385M870p2614M4071k4921q1941
$$ 894399 857661 880161 859546 820740 793813 864074 909459 914329 841715 885786 860865 778924
6427G78924N5280J5877k0k9562j02998j9021J9658l3672o4401O5297J23977j17777
$$ 778924 834204 850081 850061 820499 717501 698480 718138 684466 620065 685362 809339 691562
6415F91562r500k0988j0728J26303J3296j6850k5289J6520m5776j9203J83943
$$ 691562 682062 661074 650346 776649 789945 773095 747806 764326 718550 699347 883290
6404H83290l160j45964k0957O6686J09330j07807r4432j740R685r719o027j43121
$$ 883290 880130 734166 713209 779895 889225 781418 686986 685246 694931 685212 679185 536064
6392E36064N8549M6971j67254l2205L532K06658k9515j08550m3349l2453J48308
$$ 536064 594613 641584 474330 442125 445657 652315 622800 514250 470901 438448 586756
6381E86756J9337K4730o7413p8679R5423q7259j53733M5364l5043L5711n6434
$$ 586756 606093 630823 563410 484731 580154 492895 339162 384526 349483 385194 328760
6370C28760m5186M5065M7335K2359K6523q2833J0070J3922R5522n0167r1778j4979
$$ 328760 283574 328639 375974 398333 424856 342023 352093 366015 461537 411370 319592 304613
6358C04613J08096j4717K823n5728j4744L7110k0069j0029m2762l969p242Q2774
$$ 304613 412709 397992 400815 345087 330343 367453 347384 337355 294593 290624 283382 366156
6346C66156Q6272L3275q8845R2008l646l8529J1091q0450p947j5308J3600j27914
$$ 366156 452428 485703 396858 488866 485220 446691 457782 377332 369385 354077 367677 239763
6334B39763n1167J20118J33683J6786q6419K1012K9189p786p7918J18129Q8117
$$ 239763 188596 308714 442397 459183 372764 393776 422965 415179 337261 455390 543507
6323E43507m5646m5926o0965M7436L1780m4780O3836K937j8450m4670n7843J4151
$$ 543507 497861 451935 390970 438406 470186 425406 489242 492179 473729 429059 371216 385367
6311C85367K9626N3213L9218K01777K0953j90830j11888Q8002L5778L114O7788
$$ 385367 414993 468206 507424 709201 730154 539324 427436 515438 551216 554330 622118
6300F22118q6794P4197k8747p6802R8202l7771p3172J07770L6955K5300j09753
$$ 622118 535324 609521 580774 503972 602174 564403 491231 599001 635956 661256 551503
6289E51503K1624K5282R8547Q3779K8574j51385n7444j5503J22087r622J54554
$$ 551503 573127 598409 696956 780735 809309 657924 600480 584977 707064 697442 851996
6278H51996M3489l101k4952M5737J49439j01633O4114r4817n2553j1686j64505
$$ 851996 895485 892384 867432 913169 1062608 960975 1025089 930272 877719 866033 701528
6267G01528p0465J22279J34466n4169J0698L2154j808j2917L3299M940l4782j60279
$$ 701528 631063 753342 887808 833639 844337 876491 874683 861766 895065 900005 865223 704944
6255G04944L7050J40435n9934J3457p5733K6336l179J24465l7749j61249o4764
$$ 704944 741994 882429 822495 835952 760219 786555 783376 907841 870092 708843 644079
6244F44079j13376J34933Q2672J1210N7877m6375J08980Q8722M1725L2737k3205
$$ 644079 530703 665636 748308 759518 817395 771020 880000 968722 1010447 1043184 1019979
6233A019979q7637K1347J1961Q9381o7940p1568R0023Q3620j40881l273K2428
$$ 1019979 932342 953689 965650 1055031 987091 915523 1005546 1089166 948285 945012 967440
6222I67440J22509q8055m9914m6124j42646O1658k1023M1874m2l2330J8109J6645
$$ 967440 1089949 1001894 951980 905856 763210 824868 803845 845719 845677 813347 831456 848101
6210H48101J06901J20345j3473k4622P3605K1992K3771r366j72825n9693o5574
$$ 848101 955002 1075347 1061874 1037252 1110857 1132849 1156620 1147254 974429 914736 849162
6199H49162n7516J28857O0325K1409j0430J8486p2184p2123J8249l3219O0887
$$ 849162 791646 920503 980828 1002237 991807 1010293 938109 865986 884235 851016 911903
6188I11903K4413r2499r39P8619K9332k4574m0482j01867N254M0674q4362J11015
$$ 911903 936316 843817 842878 921497 950829 926255 885773 783906 789160 829834 745472 856487
6176H56487J12648N3014q8313K1775J07691Q962k4680J8349o6332l2943m114n456
$$ 856487 969135 1022149 933836 955611 1063302 1072264 1047584 1065933 999601 966658 962544 957088
6164I57088m6058K4821l4292J4639j00328K4872j7960R507J64370j08152n5660
$$ 957088 911030 935851 901559 916198 815870 840742 822782 832289 996659 888507 832847
6153H32847k3232J41845J30353j0210r7364l7392P4793K6191k6012k3027K8549
$$ 832847 809615 951460 1081813 1071603 974239 936847 1011640 1037831 1011819 988792 1017341
6142A017341M5513k8716m7494P12j6567j2537L9098K5072R6648m8050K12316P1530
$$ 1017341 1062854 1034138 986644 987356 970789 958252 997350 1022422 1119070 1071020 1283336 1354866
6130A354866j01307Q141k9148R7101j88580J09728R049j05772O0441j00801K8245
$$ 1354866 1253559 1261700 1232552 1329653 1141073 1250801 1259850 1154078 1214519 1113718 1141963
6119A141963j01965J13479J02757m1064r3607N7994J26940K3918j3707L6078j24790
$$ 1141963 1039998 1153477 1256234 1215170 1121563 1179557 1306497 1330415 1316708 1352786 1227996
6108A227996J06855J31449O036n697K0287m7380L6564J91818k0282J3358l6832
$$ 1227996 1334851 1466300 1472336 1466639 1486926 1439546 1476110 1667928 1647646 1661004 1624172
6097A624172Q4120r2461j8742j4156O9421k5029q4534r3990L0251r9773r9828
$$ 1624172 1708292 1615831 1597089 1582933 1652354 1627325 1542791 1448801 1479052 1379279 1279451
6086A279451j8912j16823m378k4156n2190R0027O2810m9449j4021m434J8159j01221
$$ 1279451 1260539 1143716 1139338 1115182 1062992 1153019 1215829 1166380 1152359 1147925 1166084 1064863
6074A064863J31399J05724l7073j2648L1020j35696o1539J11661J01759J07248
$$ 1064863 1196262 1301986 1264913 1252265 1283285 1147589 1086050 1197711 1299470 1406718
6064A406718J3893n624O6069Q4871l6268j5492M5843m3988M9109k0077q8154k1122
$$ 1406718 1420611 1414987 1481056 1565927 1529659 1514167 1560010 1516022 1565131 1545054 1456900 1435778
6052A435778K8145r8961L8691P7879N5431p0780J06120N8609j39929n8548J06352
$$ 1435778 1463923 1364962 1403653 1481532 1536963 1466183 1572303 1630912 1490983 1432435 1538787
6041A538787J42814K5132K988j2094J06654j5211J54897n1439K0697J80349J35974
$$ 1538787 1681601 1706733 1709721 1697627 1804281 1789070 1943967 1892528 1913225 2093574 2229548
6030B229548Q733l1077L6282R8213M8661J4527j09664q2205l7560j16218r5734
$$ 2229548 2238281 2207204 2243486 2341699 2390360 2404887 2295223 2213018 2175458 2059240 1963506
6019A963506l9958k93660J03100l969o7698O0889N8874p4227r591j31009o1473
$$ 1963506 1923548 1629888 1732988 1729019 1661321 1722210 1781084 1706857 1697266 1566257 1504784
6008A504784J79141J20017J23339L9374o4047m4875J57266J46218M0774q0533
$$ 1504784 1683925 1803942 1927281 1966655 1902608 1857733 2014999 2161217 2201991 2121458
5998B121458J00475K6800J72212J25686J29415j6602J7591L7306J9013j4822J12451
$$ 2121458 2221933 2248733 2420945 2546631 2676046 2659444 2677035 2714341 2733354 2718532 2830983
5987B830983j45842P184l0954N155J68711J389j6005O8432J88080j096R3636j02907
$$ 2830983 2685141 2692325 2661371 2666526 2835237 2836626 2820621 2889053 3077133 3076037 3169673 3066766
5975C066766m7790l2746L0364j08511j08170n943K9722q8387N4437N3974n7360
$$ 3066766 3018976 2986230 3016594 2908083 2799913 2793970 2823692 2735305 2789742 2843716 2786356
5964B786356P4159l0638J45314L2752p7333J4512J01319K34103J92625j04007
$$ 2786356 2860515 2829877 2975191 3007943 2930610 2945122 3046441 3280544 3473169 3369162
5954C369162l6428o7254l2888j42278J7933m0727j69351J6600n1795J4809O8269
$$ 3369162 3332734 3265480 3232592 3090314 3108247 3067520 2898169 2914769 2862974 2877783 2946052
5943B946052r3777m3813O9817L7557N3757q7614k2483M4592K1673J2043m521n6827
$$ 2946052 2852275 2808462 2878279 2915836 2969593 2881979 2859496 2904088 2925761 2937804 2933283 2876456
5931B876456n6079j6386O1287m1121k26825L5958J02375R988L6922M0472Q614
$$ 2876456 2820377 2803991 2865278 2824157 2597332 2633290 2735665 2745653 2782575 2823047 2831661
5920B831661J46739M5062J26967l5686L7779K59756J19308P6146J78765P8806
$$ 2831661 2978400 3023462 3150429 3114743 3152522 3412278 3531586 3607732 3786497 3865303
5910C865303l6004J22699K41950J74366K955J44421L02139K41355L93923K08310
$$ 3865303 3829299 3951998 4193948 4368314 4371269 4515690 4817829 5059184 5453107 5661417
5900E661417J75836M56145N20013N72267L38096K82437N50675K78916L85887K98291
$$ 5661417 5837253 6293398 6813411 7385678 7723774 8006211 8556886 8835802 9221689 9519980
5890I519980J48413K72947J14859L23978J94586K01646J98611J11953P5851J03605
$$ 9519980 9668393 9941340 10056199 10380177 10574763 10776409 10975020 11086973 11162824 11266429
5880A1266429P9878J381o1513Q391J18547m2804k0319J44728j14933J07352O7160
$$ 11266429 11346307 11347688 11286175 11294566 11413113 11370309 11349990 11494718 11379785 11487137 11554297
5869A1554297k12832O0096j3519j59242l5000q0676k44157j917J79231k5209m2869
$$ 11554297 11341465 11401561 11388042 11228800 11193800 11113124 10868967 10867050 11046281 11021072 10978203
5858A0978203M0156R7038J17650L3196j9370Q3566J14426J03453j00106j15697
$$ 10978203 11018359 11115397 11233047 11266243 11246873 11330439 11444865 11548318 11448212 11332515
5848A1332515j04404q9388l86107l23375k13408j56587l19467k50609j78628j99514
$$ 11332515 11228111 11138723 10752616 10429241 10215833 10059246 9739779 9489170 9310542 9111028
5838I111028j96056p0815p6518r8327m4690p1337q0587L1509R5495J32184K20743
$$ 9111028 8914972 8844157 8767639 8669312 8624622 8553285 8472698 8504207 8599702 8731886 8952629
5827H952629J14939K71988K95040L19613K00644M07832M19881L78515N90692N65868
$$ 8952629 9067568 9339556 9634596 9954209 10154853 10562685 10982566 11361081 11951773 12517641
5817A2517641K29195M27788M54056N8536m1003j05893l25745m41092m78058m72608
$$ 12517641 12746836 13174624 13628680 13687216 13646213 13540320 13214575 12773483 12295425 11822817
5807A1822817m30627m48638m23127l00083k50861k85470j66693k2838R2482n1097
$$ 11822817 11392190 10943552 10520425 10220342 9969481 9684011 9517318 9494480 9586962 9535865
5797I535865Q8004K74862L11668J77775K58927L71084M07444L03214J83765O802
$$ 9535865 9623869 9898731 10210399 10388174 10647101 11018185 11425629 11728843 11912608 11919410
5787A1919410p3048k72067l70647m97164n37877m91423n08223n60814o84652n60912
$$ 11919410 11846362 11574295 11203648 10706484 10168607 9677184 9168961 8608147 7923495 7362583
5777G362583m78973l20898n12216m24557l51086l56320l03616j63221j44307j97147
$$ 7362583 6883610 6562712 6050496 5625939 5274853 4918533 4614917 4451696 4307389 4110242
5767D110242l47367l3093j38163j95233L530p593j23517j07691q8313l0723m3178
$$ 4110242 3762875 3729782 3591619 3396386 3399916 3392323 3268806 3161115 3072802 3042079 2998901
5756B998901r4014r4416j34020L5299N1234r081k31100p6729L0751P423n0752
$$ 2998901 2904887 2810471 2676451 2711750 2762984 2753903 2522803 2446074 2476825 2484248 2433496
5745B433496j08479M9510m828k3252r6517q9708Q7328j0480j52960J3841M8673
$$ 2433496 2325017 2374527 2369699 2346447 2249930 2160222 2247550 2237070 2084110 2097951 2146624
5734B146624r5295L663n6143N9677m1259k580Q0343k6933l4928p8805O4438j31438
$$ 2146624 2051329 2054992 1998849 2058526 2017267 2014687 2095030 2068097 2033169 1954364 2018802 1887364
5722A887364J5654m041J22865p5373j23083J16947j3933J0351j71566p6296J01184
$$ 1887364 1903018 1898977 2021842 1946469 1823386 1940333 1926400 1936751 1765185 1688889 1790073
5711A790073P5780M8188r5097K591K1789J50268j20666j03809Q8872k2430r5460
$$ 1790073 1865853 1914041 1818944 1821535 1843324 1993592 1872926 1769117 1857989 1835559 1740099
5700A740099n180K8519m6299O5419j10388j44049J5425J69413j45350P7854M2087
$$ 1740099 1734919 1763438 1717139 1782558 1672170 1528121 1543546 1712959 1567609 1645463 1687550
5689A687550R9799r0555p2756J26246J4721M8561k3025m7747n9435o914N0026
$$ 1687550 1787349 1696794 1624038 1750284 1765005 1813566 1790541 1742794 1683359 1676445 1726471
5678A726471R6793M840q4180J48814P4708k12312o3932O9451m8715l0218K4799
$$ 1726471 1823264 1828104 1743924 1892738 1967446 1755134 1691202 1760653 1711938 1681720 1706519
5667A706519J6500J67253r3957M4348j6378p2634K5066O2521j9777l5865R7215
$$ 1706519 1723019 1890272 1796315 1840663 1824285 1751651 1776717 1839238 1819461 1783596 1880811
5656A880811m7640j9210Q9194R3687N7594o4700l2481K066j33935k1707J31231
$$ 1880811 1833171 1813961 1903155 1996842 2054436 1989736 1957255 1959321 1825386 1803679 1934910
5645A934910J96906n6489q2531j3150k8741P670n7861N5148J7390l3199M0133
$$ 1934910 2131816 2075327 1992796 1979646 1950905 1958575 1900714 1955862 1973252 1940053 1980186
5634A980186L0321j1994K0189N6797q4838m705m1671K4398M8737O1236m5999P377
$$ 1980186 2010507 1998513 2018702 2075499 1990661 1985956 1944285 1968683 2017420 2078656 2032657 2040034
5622B040034n8882m0783J4476o949p1800O9452J55761Q0m7752l6657Q2869l900
$$ 2040034 1981152 1940369 1954845 1947896 1876096 1945548 2101309 2101389 2053637 2016980 2099849 2095949
5610B095949R9834J17159p420n5904n1959R3618r8332R4186J87519K5263r212
$$ 2095949 2195783 2312942 2305522 2249618 2197659 2291277 2192945 2287131 2474650 2499913 2490701
5599B490701p0j0436q6587Q255K2762P866p6607K5658L2958o5295J4999K2917
$$ 2490701 2490631 2480195 2393608 2401863 2424625 2432491 2355884 2381542 2414500 2349205 2364204 2387121
5587B387121j99461K41028M7660M7033M2064Q310J11233M6674K4056j32287P6209
$$ 2387121 2187660 2428688 2476348 2523381 2565445 2573755 2684988 2731662 2755718 2623431 2699640
5576B699640O5184L6170J15008p5627j37698l0579K32871p4837r3525j3514q9793
$$ 2699640 2764824 2800994 2916002 2840375 2702677 2672098 2904969 2830132 2736607 2723093 2633300
5565B633300O7628p9931O1065M8741O5021M2601J8033o2777J9216r5584P7548
$$ 2633300 2700928 2620997 2682062 2730803 2795824 2838425 2856458 2793681 2812897 2717313 2794861
5554B794861k5137l7104m9738J56828N6034q5370j6772Q3319M2136N3697q0040
$$ 2794861 2769724 2732620 2682882 2839710 2895744 2810374 2793602 2876921 2919057 2972754 2892714
5543B892714j60395O244q9761O8279K2157j0099j06959q270M6847Q2777R9118
$$ 2892714 2732319 2738563 2648802 2717081 2739238 2729139 2622180 2613910 2660757 2743534 2842652
5532B842652O4708j90243J9452M5710M6520N8311j5417J2213L4690P2112L4411
$$ 2842652 2907360 2717117 2736569 2782279 2828799 2887110 2871693 2883906 2918596 2990708 3025119
5521C025119J61816j44777l31432L8698J32026J9597N8686J71783k7804j03829
$$ 3025119 3186935 3042158 2710726 2749424 2881450 2901047 2959733 3131516 3103712 2999883
5511B999883m2508K7784j5261Q5575n9336m7274j5401j7550J29177M8934M4139
$$ 2999883 2957375 2985159 2969898 3055473 2996137 2948863 2933462 2915912 3045089 3094023 3138162
5500C138162L7424l5180N1423P1009l5794j03668M6795J19555j1204j58380m3734
$$ 3138162 3175586 3140406 3191829 3262838 3227044 3123376 3170171 3289726 3278522 3120142 3076408
5489C076408L7917P4081r47n5155N3716L658q5773Q452Q5499o5122N776M9082
$$ 3076408 3114325 3188406 3187459 3132304 3186020 3189678 3103905 3112357 3197856 3132734 3138510 3187592
5477C187592J37956N4022P3147l4169J2073J1391o9165p862P815q036J4857k3588
$$ 3187592 3325548 3379570 3452717 3418548 3430621 3442012 3372847 3364985 3372800 3364764 3379621 3356033
5465C356033j62j7952M7475J3541J45004M5950o6969l9648p2751j4901j18752
$$ 3356033 3355871 3337919 3385394 3398935 3543939 3589889 3522920 3483272 3410521 3395620 3276868
5454C276868O4129o400m213Q553L9987r8994q28M9783N3128l5159j814Q2945r3448
$$ 3276868 3340997 3334597 3330384 3338937 3378924 3279930 3279102 3328885 3382013 3346854 3345040 3427985 3334537
5441C334537j10733k526J0992l4226Q882J14491n9877q2555R7044j5631l412N8194
$$ 3334537 3223804 3221278 3232270 3198044 3206926 3321417 3261540 3178985 3276029 3260398 3256986 3315180
5429C315180q0443K6298R3808m1166n0431j5460N8197L1319m1353m246K8199j2769
$$ 3315180 3234737 3261035 3354843 3313677 3263246 3247786 3305983 3337302 3295949 3291703 3319902 3307133
5417C307133N6819r2163M8314J2784L9539k9417l899K1926N714m2396o425L2874
$$ 3307133 3363952 3271789 3320103 3332887 3372426 3343009 3339110 3361036 3366750 3324354 3317929 3350803
5405C350803n0990j43971Q5202R5591J46312j42813k0000J10350J3230n6200l0238
$$ 3350803 3299813 3155842 3241044 3336635 3482947 3340134 3320134 3430484 3443714 3387514 3357276
5394C357276q4214n1869O0689j14871L0668P485J39453J9702k33439o2665J13464
$$ 3357276 3273062 3221193 3281882 3167011 3197679 3205164 3344617 3364319 3130880 3068215 3181679
5383C181679J40068P7190j73235j20817n2730O0967O1322O2267R8850r9338j42147
$$ 3181679 3321747 3398937 3225702 3104885 3052155 3113122 3174444 3236711 3335561 3236223 3094076
5372C094076J962J44628m3019j5722J1027o1562J20382j33197j4038O0187J02747
$$ 3094076 3096038 3240666 3197647 3181925 3192952 3131390 3251772 3118575 3104537 3164724 3267471
5361C267471j51632j1953k1991J20105K6403r8671j1352L6363M2956O452r6911
$$ 3267471 3115839 3103886 3081895 3202000 3228403 3129732 3118380 3154743 3197699 3204151 3107240
5350C107240k8891L1896m6570J57332L7811l5396l3044l6959l417P6918K1688
$$ 3107240 3078349 3110245 3063675 3221007 3258818 3223422 3190378 3153419 3150002 3226920 3248608
5339C248608j16753j2345R0911o2530m9213j3405L4612o5932J3949Q1747p532
$$ 3248608 3131855 3119510 3210421 3147891 3098678 3085273 3119885 3053953 3067902 3149649 3142117
5328C142117j5534n2147J4830m316p9361M176j52035J9999L8404R5446k4726k4534
$$ 3142117 3126583 3074436 3089266 3084950 3005589 3009765 2857730 2877729 2916133 3011579 2986853 2962319
5316B962319O4191O944Q576J41313J3922o2094K5001l491M3694j05091J9091n0246
$$ 2962319 3026510 3033454 3042030 3183343 3197265 3135171 3160172 3156681 3200375 3095284 3114375 3064129
5304C064129j14444K8041K5339p0922o2126R2139l4359q4991l1949K1868L5655
$$ 3064129 2949685 2977726 3003065 2932143 2870017 2962156 2927797 2842806 2810857 2832725 2868380
5293B868380K1876J43083J57199p4531p301K4627k393m0641q2568k1691M0454
$$ 2868380 2890256 3033339 3190538 3116007 3108706 3133333 3130940 3090299 3007731 2986040 3026494
5282C026494R2027n9541Q8813n5019k8243n2534o8366M0952M199N1373O4703o4158
$$ 3026494 3118521 3058980 3147793 3092774 3064531 3011997 2943631 2984583 2988782 3040155 3104858 3040700
5270C040700j01239j20691P3967R209M7611j5138q135r894J536J5957L292N4325
$$ 3040700 2939461 2818770 2892737 2901946 2949557 2934419 2926284 2916390 2917926 2933883 2937175 2991500
5258B991500j38008j0500Q8863k6776j0955j1177J53040J4775k02840M5810M622
$$ 2991500 2853492 2842992 2931855 2905079 2894124 2882947 3035987 3050762 2847922 2893732 2898354
5247B898354J7841m3793k0282r6638O2058K8421N819m776o2019R6715O0686K9118
$$ 2898354 2916195 2872402 2852120 2755482 2817540 2845961 2851780 2847004 2784985 2881700 2942386 2971504
5235B971504q8827J3176p3459l5267J4438J8324J30683m6057j0192J86376r1826
$$ 2971504 2882677 2895853 2822394 2787127 2801565 2819889 2950572 2904515 2894323 3080699 2988873
5224B988873j86143J2890N0360K829p558j20501N4092K9203N273L423k474K3475
$$ 2988873 2802730 2815620 2865980 2868809 2861251 2740750 2794842 2824045 2829318 2832741 2830267 2853742
5212B853742p9724n5459l457O9542K4419P601j20176J13252M2187M707L1660l5574
$$ 2853742 2774018 2718559 2715102 2784644 2809063 2816664 2696488 2809740 2851927 2856634 2888294 2852720
5200B852720K5759r4766n7722j5237j1856k3826P3518J22677k6103J05962r016
$$ 2852720 2878479 2783713 2725991 2710754 2698898 2675072 2748590 2871267 2845164 2951126 2942110
5189B942110l0424n306K7087k7738j53568P2300J97978l4081j30136k4800j0897
$$ 2942110 2911686 2906380 2933467 2905729 2752161 2824461 3022439 2988358 2858222 2833422 2822525
5178B822525q061J0464o5898Q7049L3866L3869K5104l1539o8849j25186Q8930
$$ 2822525 2814464 2824928 2759030 2846079 2879945 2913814 2938918 2907379 2838530 2713344 2802274
5167B802274N4106O5421r5737j319P9926q6613p0566J3605J38892n3786L6265
$$ 2802274 2856380 2921801 2826064 2824745 2904671 2818058 2747492 2761097 2899989 2846203 2882468
5156B882468P9324j62187N305K5459M9132j3250m3329Q4111R623j6778J51222
$$ 2882468 2961792 2799605 2804910 2830369 2879501 2866251 2822922 2907033 2916656 2899878 3051100
5145C051100r4706j660L2181j10732O1905J15338Q6485R4398l6944j22164J40352
$$ 3051100 2956394 2954734 2986915 2876183 2938088 3053426 3139911 3234309 3197365 3075201 3215553
5134C215553K1752P4123K1216J29708k6327r1548M9530J68342j57782J50794J36189
$$ 3215553 3237305 3311428 3332644 3462352 3436025 3344477 3394007 3562349 3404567 3555361 3691550
5123C691550p8740L8244K10369J91737m1394N818q1693J78854J56621l8169O078
$$ 3691550 3612810 3651054 3861423 4053160 4011766 4017584 3935891 4114745 4271366 4233197 4239275
5112D239275J76725j4244M2861J29343K8067k2788m2329R1385P8442j8776K9563
$$ 4239275 4416000 4401756 4444617 4573960 4602027 4579239 4536910 4628295 4706737 4687961 4717524
5101D717524O8651J70553M5291q949K6863L6595N1874N8201m2029J37959M9570
$$ 4717524 4786175 4956728 5002019 4993070 5019933 5056528 5108402 5166603 5124574 5262533 5312103
5090E312103M9386k209K4055P5999j25355K12825L8576j33310J01157O480j3756
$$ 5312103 5361489 5359280 5383335 5459334 5333979 5546804 5585380 5452070 5553227 5559707 5545951
5079E545951Q9626Q4038L4613M6974r6027Q766K0017J72086R5611n0261R4390
$$ 5545951 5635577 5719615 5754228 5801202 5705175 5713941 5733958 5906044 6001655 5951394 6045784
5068F045784J00710L3655M6353k7280J08267L6690J15485Q8262r318q546L5952
$$ 6045784 6146494 6180149 6226502 6199222 6307489 6344179 6459664 6547926 6538608 6530062 6566014
5057F566014P9744J026J14441K8504N6280J00991O0502o0160q7132Q8721K00264
$$ 6566014 6645758 6646784 6761225 6789729 6846009 6947000 7007502 6947342 6860210 6948931 7149195
5046G149195L0575k23229M3318K706J09431k3690j0748J3372q2964o516J19226
$$ 7149195 7179770 6956541 6999859 7002565 7111996 7088306 7077558 7090930 7007966 7001450 7120676
5035G120676J11570j6452j7788j11517O2983O7945P9730j01832j2935P4305M8352
$$ 7120676 7232246 7215794 7198006 7086489 7149472 7217417 7297147 7195315 7182380 7256685 7305037
5024G305037j46387R0479O1440J526l5160Q2155O9708m1927n8427j33812j35429
$$ 7305037 7158650 7249129 7310569 7312095 7276935 7359090 7428798 7386871 7328444 7194632 7059203
5013G059203r8064r04L0312j49734j382J05446n5188l0230j24631R341J30818
$$ 7059203 6961139 6960235 6990547 6840813 6839431 6944877 6889689 6859459 6734828 6744169 6874987
5002F874987J1247J05773J15582O6564q8495n4558j01661l16906k76310j60496
$$ 6874987 6886234 6992007 7107589 7174153 7085658 7031100 6929439 6612533 6336223 6175727
4992F175727r8641k10774j13688p9451j53299p1987j28146j26256q7271j29280
$$ 6175727 6077086 5866312 5752624 5673173 5519874 5447887 5319741 5193485 5106214 4976934
4982D976934r6736q3168m3043k67120j03654l8725k7707J2347j06301J62267j76138
$$ 4976934 4880198 4797030 4753987 4486867 4383213 4344488 4316781 4329128 4222827 4385094 4208956
4971D208956l4683m4352j44693O322o620N4699m0100q7190P1506K112O1769q5514
$$ 4208956 4174273 4129921 3985228 3991550 3984930 4039629 3999529 3912339 3983845 3985957 4047726 3962212
4959C962212o3411o8298j10896J6319Q9194o2157j39204J76988r0027n9485L3976
$$ 3962212 3898801 3830503 3719607 3735926 3825120 3762963 3623759 3800747 3710720 3651235 3685211
4948C685211J9216L9834p8983j4394K7546L4215M4146n137J7587n8166O7136j07344
$$ 3685211 3704427 3744261 3665278 3650884 3678430 3712645 3756791 3751654 3769241 3711075 3778211 3670867
4936C670867J94115J83292N5947M2614p441j73529P7066J51637j19826L2341J48655
$$ 3670867 3864982 4048274 4104221 4146835 4139394 3965865 4042931 4194568 4074742 4107083 4255738
4925D255738J43507J47403M6869J41920M3708J4120K16142J34583J9927K42175
$$ 4255738 4399245 4546648 4593517 4735437 4779145 4793265 5009407 5143990 5163917 5406092
4915E406092K65582K0609O9805N9730N8862J79333J30386n4060P8231K16587O0164
$$ 5406092 5671674 5692283 5762088 5821818 5880680 6060013 6190399 6136339 6214570 6431157 6491321
4904F491321j766J11292Q5846J2816m680K30160N5148L7119J56702J24081Q3634
$$ 6491321 6489555 6600847 6686693 6699509 6694829 6924989 6980137 7017256 7173958 7298039 7381673
4893G381673L8299K5087J96746Q3584J51634L9549M6953J48751J15382J88272
$$ 7381673 7419972 7445059 7641805 7725389 7877023 7916572 7963525 8112276 8227658 8415930
4883H415930m1202j5163N5634o839N0148J1589j4944J93212J27768J01818n4224
$$ 8415930 8374728 8359565 8415199 8408360 8458508 8470097 8455153 8648365 8776133 8877951 8823727
4872H823727Q9816R4358J86558J25281m4017J11781O6554J1035Q5080Q6807K12238
$$ 8823727 8913543 9007901 9194459 9319740 9275723 9387504 9454058 9465093 9550173 9636980 9849218
4861I849218n6510o3014J35324J39457M7144k1374r7463n0434J90271M8382J26358
$$ 9849218 9792708 9729694 9865018 10004475 10051619 10030245 9932782 9882348 10072619 10121001 10247359
4850A0247359k2740k5081N2917m4627N8613J02800j25861n5903J38238L7150J03279
$$ 10247359 10224619 10199538 10252455 10207828 10266441 10369241 10243380 10187477 10325715 10362865 10466144
4839A0466144J8879K9191P3499J17489J9026Q5205J38986J26316N1627R5062K20891
$$ 10466144 10485023 10514214 10587713 10705202 10724228 10809433 10948419 11074735 11126362 11221424 11442315
4828A1442315k9953J49445J32059K08451K10746K5177k4130J56214K07033J82087
$$ 11442315 11412362 11561807 11693866 11902317 12113063 12138240 12114110 12270324 12477357 12659444
4818A2659444J52714Q1564r310R3224N2303N3377j10653J1173J36394N0529J7558
$$ 12659444 12812158 12893722 12884412 12977636 13029939 13083316 12972663 12983836 13120230 13170759 13188317
4807A3188317p8294j69431j28145r7419j16160O6247n386j05260j1959m8837j13317
$$ 13188317 13110023 12940592 12812447 12715028 12598868 12665115 12659729 12554469 12542510 12493673 12380356
4796A2380356O30j75273j1019L2052Q2649J8705j11187J67270M0876m7130q6976
$$ 12380356 12380986 12205713 12194694 12226746 12309395 12328100 12216913 12384183 12425059 12377929 12290953
4785A2290953o8125m9231N4781l9861l0355Q7949m5101N4051K92197j15823r8890
$$ 12290953 12222828 12173597 12228378 12188517 12158162 12246111 12201010 12255061 12547258 12431435 12332545
4774A2332545L2034n4273J76957k8936Q3991K72060O2858J18029O1495R6784K72127
$$ 12332545 12364579 12310306 12487263 12458327 12542318 12814378 12877236 12995265 13056760 13153544 13425671
4763A3425671O0578K8991K60343K84419l7981N8285J14064k1040m7852L3357l7723
$$ 13425671 13486249 13515240 13775583 14060002 14022021 14080306 14194370 14173330 14125478 14158835 14121112
4752A4121112M8811M5281k12562n1867J9747o7957J4833l8728P7122J31492J14877
$$ 14121112 14169923 14215204 14002642 13950775 13970522 13902565 13917398 13878670 13955792 14087284 14202161
4741A4202161O7928N2817K54379J96884K22216J92432K80965L07576L0508L0272
$$ 14202161 14270089 14322906 14577285 14774169 14996385 15188817 15469782 15777358 15807866 15838138
4731A5838138N6169J85296J70913J38755K03780Q3566J09875O6019J38752J29661
$$ 15838138 15894307 16079603 16250516 16389271 16593051 16676617 16786492 16852511 16991263 17120924
4721A7120924J17465K16621L95754K78904K76721J81784Q89O5426J71189P9505
$$ 17120924 17238389 17455010 17850764 18129668 18406389 18588173 18589062 18654488 18825677 18905182
4711A8905182j45780L9004O0854j07392j53576k6744L552m4588j11908r1857j6850
$$ 18905182 18759402 18798406 18859260 18751868 18598292 18571548 18575100 18530512 18418604 18326747 18309897
4700A8309897J97155J32958P9643R1300K98075L17042L59332N11088M18373N34492
$$ 18309897 18507052 18640010 18719653 18810953 19109028 19426070 19785402 20296490 20714863 21249355
4690B1249355O50035N89899O56727O05452O86951N16191O13642L96262L42282
$$ 21249355 21899390 22489289 23146016 23751468 24438419 24954610 25568252 25964514 26306796
4681B6306796K22736J13474J49117j0494j10545j05842j84095k4824j57490k50151
$$ 26306796 26529532 26643006 26792123 26781629 26671084 26565242 26381147 26356323 26198833 25948682
4671B5948682r3674k45810L8563L508O9878J6500j70314J63454J90606O1957J05928
$$ 25948682 25855008 25609198 25647761 25651269 25721147 25737647 25567333 25730787 25921393 25983350 26089278
4660B6089278J63546Q4366K6780J06380Q2170O0461l3249j97484j48190k66834
$$ 26089278 26252824 26337190 26363970 26470350 26552520 26612981 26579732 26382248 26234058 25967224
4650B5967224l39780l83582n41256n79513m27799o11100o98529n54301n87358
$$ 25967224 25627444 25243862 24702606 24123093 23695294 23084194 22385665 21831364 21244006
4641B1244006m89759o56072n43928n39312n69444m63267m31255m61955k24285
$$ 21244006 20754247 20098175 19554247 19014935 18445491 17982224 17550969 17089014 16864729
4632A6864729k22318l24433l01790k89884m02016l55231j35955l73692n03772
$$ 16864729 16642411 16317978 16016188 15726304 15324288 14969057 14833102 14459410 13955638
4623A3955638j69431l52733l42493m69860n14873l03761l23618l51433l01667
$$ 13955638 13786207 13433474 13090981 12621121 12106248 11802487 11478869 11127436 10825769
4614A0825769l37085k57014l86210l33514k34757l69193k82920j89893k67654
$$ 10825769 10488684 10231670 9845460 9511946 9277189 8907996 8625076 8435183 8167529
4605H167529j55770k24366j19356j73290q6930p3904O018n7805K4924j8548J02224
$$ 8167529 8011759 7787393 7668037 7494747 7407817 7333913 7339931 7282126 7307050 7288502 7390726
4594G390726J27594R1669K60730L84087L78996L12350K03784K18151K72557r3114
$$ 7390726 7518320 7609989 7870719 8254806 8633802 8946152 9149936 9368087 9640644 9547530
4584I547530k15804j09171j90280k25008j02185Q8823j05385q3151O279p7414
$$ 9547530 9331726 9222555 9032275 8807267 8705082 8793905 8688520 8605369 8611648 8534234
4574H534234n0185n4324J64553p6949j75798j95387j53321P6241k14772k19107
$$ 8534234 8484049 8429725 8594278 8517329 8341531 8146144 7992823 8069064 7854292 7635185
4564G635185p3244j45928j59695j60145k10308j73851p6950j30953j42567k05972
$$ 7635185 7561941 7416013 7256318 7096173 6885865 6712014 6635064 6504111 6361544 6155572
4554F155572j58463j46041l5136j18965m1897j05107K28096K6575P204k9394J17346
$$ 6155572 5997109 5851068 5815932 5696967 5655070 5549963 5778059 5804634 5811838 5782444 5899790
4543E899790J42034k2434R2509K50203J42550J50838M6203N4669O0026m4835N9241
$$ 5899790 6041824 6019390 6111899 6362102 6504652 6655490 6701693 6756362 6816388 6771553 6830794
4532F830794j12705l9010L2679k6086k51939k21475k33594j13699q7990j37233
$$ 6830794 6718089 6679079 6711758 6685672 6433733 6212258 5978664 5864965 5776975 5639742
4522E639742k38244l14798j57015j40824j36368j07197k05829j90982j93706j95117
$$ 5639742 5401498 5086700 4929685 4788861 4652493 4545296 4339467 4148485 3954779 3759662
4512C759662l5918j30082q1761n9932n8732j59090p5851j09301j01686k8290J4008
$$ 3759662 3723744 3593662 3511901 3451969 3393237 3234147 3158296 3048995 2947309 2919019 2933027
4501B933027m0507j4845p0747J2564n028L835m3096R148j27997n3671M6031M2297
$$ 2933027 2892520 2877675 2806928 2819492 2814464 2818299 2775203 2784351 2656354 2602683 2648714 2691011
4489B691011M6690J5300r8531j29260J214l6338o871J8298M3499O3886j3083O4328
$$ 2691011 2737701 2753001 2654470 2525210 2526424 2490086 2483215 2501513 2545012 2608898 2595815 2660143
4477B660143M7363N1918M8146R5573l9644m3641l513R2768k7367j937J5135n9823
$$ 2660143 2707506 2759424 2807570 2903143 2863499 2819858 2816345 2909113 2881746 2879809 2894944 2835121
4465B835121K7702K062n083O3417M9385K02862N3395q6927J94429J32343m8015
$$ 2835121 2862823 2864885 2859802 2923219 2972604 3175466 3228861 3141934 3336363 3468706 3420691
4454C420691j00025m1131M9734J64861r1439J43968J87816P4953L8310q6916K559
$$ 3420691 3320666 3279535 3329269 3494130 3402691 3546659 3734475 3809428 3847738 3760822 3763381
4443C763381k7146k10766L4552M2551K3076K4855M4864j30088N3206J60997O2230
$$ 3763381 3736235 3525469 3560021 3602572 3625648 3650503 3695367 3565279 3618485 3779482 3841712
4432C841712o6640p5116Q3100L1218o4459j6482p6172K5171L1145K9853L5009
$$ 3841712 3775072 3699956 3783056 3814274 3749815 3733333 3657161 3682332 3713477 3743330 3778339
4421C778339k1851k19057q147j6348j47463N1083Q1441q5649m5892m8524j83005
$$ 3778339 3756488 3537431 3529284 3512936 3365473 3416556 3497997 3412348 3366456 3317932 3134927
4410C134927j61519l0100Q8105J30313q6203J635O4354P9816p2601N0190j5634
$$ 3134927 2973408 2943308 3031413 3161726 3075523 3077158 3141512 3221328 3148727 3198917 3183283
4399C183283P6848J0449k5622j46571p1409l0027N2072J05616R6490j7196O3615
$$ 3183283 3260131 3270580 3244958 3098387 3026978 2996951 3049023 3154639 3251129 3233933 3297548
4388C297548J8900j60919M8845K44907q1087j22617J43083J18589j08900M5765
$$ 3297548 3316448 3155529 3204374 3449281 3368194 3245577 3388660 3507249 3398349 3444114
4378C444114P2369j07239p1865K71580K3939J34251J33097O5051K14066R9806
$$ 3444114 3516483 3409244 3337379 3608959 3632898 3767149 3900246 3965297 4179363 4279169
4368D279169Q2690n6724j9173J67966Q2040L02954K52120J4146J72691l3690J07642
$$ 4279169 4361859 4305135 4285962 4453928 4535968 4838922 5091042 5105188 5277879 5244189 5351831
4357E351831J05417l8545J28767J28407L4267P7783Q0902J68970L36248K47817
$$ 5351831 5457248 5418703 5547470 5675877 5710144 5787927 5868829 6037799 6374047 6621864
4347F621864N01108P86711L87808J88268n6927j08492j60294k14780n0759J10286
$$ 6621864 7122972 7909683 8297491 8485759 8428832 8320340 8160046 7945266 7894507 8004793
4337H004793L7856J47362L31415K52061J72047J33639J81627L49096N97101N85517
$$ 8004793 8042649 8190011 8521426 8773487 8945534 9079173 9260800 9609896 10206997 10792514
4327A0792514L09538O54999N45716Q97755Q39646Q87851R31973J148335J303705
$$ 10792514 11102052 11757051 12302767 13200522 14040168 14928019 15859992 17008327 18312032
4318A8312032J629673J795798K434380L054320L792557L655259M003963L748596
$$ 18312032 19941705 21737503 24171883 27226203 31018760 34674019 38677982 42426578
4310D2426578M400987N127647P103479R662255J6778298L0230627O1083940J07636106
$$ 42426578 46827565 51955212 59058691 68720946 85499244 115729871 176813811 284449917
4302B84449917J34015948R4776624R231877p3146877j00359341q2159008o3507618
$$ 284449917 418465865 513242489 522474366 449327489 348968148 266809140 203301522
4295B03301522m6889600l4573064k5772603k0819047j5536569j0583307o338988
$$ 203301522 156411922 121838858 96066255 75247208 59710639 49127332 42788344
4288D2788344m774412l563607l381702k808126k373405j722272j526794j311564
$$ 42788344 38013932 34450325 31068623 28260497 25887092 24164820 22638026 21326462
4280B1326462j191670o16056r62247p02254p04966m64099n59907k57608l21836
$$ 21326462 20134792 19518736 18556489 17854235 17149269 16685170 16125263 15867655 15545819
4271A5545819l070k11660j80837m43339l57091k05775k82272l11482k16778k26542
$$ 15545819 15542749 15331089 15150252 14706913 14349822 14144047 13861775 13550293 13333515 13106973
4261A3106973l52780n40663m28296l93712l22784j94041J9732k02559j07539q929
$$ 13106973 12754193 12213530 11785234 11391522 11068738 10874697 10894429 10691870 10584331 10575402
4251A0575402j94006l35889k90868j46156k72231k14476j42183j61597l53207
$$ 10575402 10381396 10045507 9754639 9608483 9336252 9121776 8979593 8817996 8464789
4242H464789k59858k29045k62863r1564o2277k07965j00601k17337j78227j35968
$$ 8464789 8204931 7975886 7713023 7621459 7559182 7351217 7250616 7033279 6855052 6719084
4232F719084k01726r9308q3123m1027n0670j9978j08924j05521J4475n5856j53501
$$ 6719084 6517358 6418050 6334927 6293900 6243230 6223252 6114328 6008807 6023282 5967426 5813925
4221E813925m1678p8817L508k5350q7643Q5121N1583j20757o9963L3405K2153
$$ 5813925 5772247 5693430 5696938 5671588 5583945 5669066 5720649 5599892 5529929 5563334 5585487
4210E585487K5887j2309L631q2413M4946K2291R1303J07648j24528Q8172J5590
$$ 5585487 5611374 5599065 5602696 5520283 5565229 5587520 5678823 5786471 5661943 5750115 5765705
4199E765705p0309J5628j13584r2338j28201j5435J3802Q0900k80284p9388j39904
$$ 5765705 5695396 5711024 5597440 5505102 5376901 5361466 5375268 5456168 5175884 5096496 4956592
4188D956592j11467J9344p6151r5393j78173j50285j58733k3178k5209j72150
$$ 4956592 4845125 4864469 4788318 4692925 4514752 4364467 4205734 4182556 4157347 3985197
4178C985197j21622j73425l7559K3813q3976j58442N8858j29865L4139l1455k5531
$$ 3985197 3863575 3690150 3652591 3676404 3592428 3433986 3492844 3362979 3397118 3365663 3340132
4167C340132n6264R3963O8224O4942q3950k8451R312Q4329K05706k2136j1436
$$ 3340132 3283868 3377831 3446055 3510997 3427047 3398596 3407908 3492237 3697943 3675807 3664371
4156C664371q3048q4453o4431K1971k821j86537M6333k3479j9049O6998R833K9395
$$ 3664371 3581323 3496870 3432439 3454410 3451589 3265052 3311385 3287906 3268857 3335855 3345688 3375083
4144C375083L7487K76K6468j5682J6356N6553Q4348O6539k6904r3467j1629N3822
$$ 3375083 3412570 3412846 3439314 3423632 3439988 3496541 3580889 3647428 3620524 3527057 3515428 3569250
4132C569250j63732l2559Q7732M1988j02929o9160p385K6376K19378Q1575j14048
$$ 3569250 3405518 3372959 3460691 3502679 3399750 3330590 3323205 3349581 3568959 3650534 3536486
4121C536486o0405k8750N1500J24465K8740m0032O1884J60468J1861N8576Q376
$$ 3536486 3476081 3447331 3498831 3623296 3652036 3612004 3673888 3834356 3846217 3904793 3913169
4110C913169K5597O3802N4691J8972J73715P9561M6841J7723n5437R9576J35138
$$ 3913169 3938766 4002568 4057259 4076231 4249946 4329507 4376348 4394071 4338634 4438210 4573348
4099D573348l4075Q1572J71360R2776Q7958K8809O9263M7151K06519J61166K22137
$$ 4573348 4539273 4620845 4792205 4884981 4972939 5001748 5071011 5118162 5324681 5485847 5707984
4088E707984K60466J60098N0249J47766R8108M7293J36166K04550J70614J82145
$$ 5707984 5968450 6128548 6178797 6326563 6424671 6471964 6608130 6812680 6983294 7165439
4078G165439J92762K55534L53340J80899K21323K18163K12602L47311K55864J59239
$$ 7165439 7358201 7613735 7967075 8147974 8369297 8587460 8800062 9147373 9403237 9562476
4068I562476R1477M37059K19806K95282L25609J75757K46968K54839L19838J25965
$$ 9562476 9653953 10091012 10310818 10606100 10931709 11107466 11354434 11609273 11929111 12055076
4058A2055076J73092L24129K79096L00323M27592L48981L09542N84629N21402
$$ 12055076 12228168 12552297 12831393 13131716 13559308 13908289 14217831 14802460 15323862
4049A5323862L57751K68855M64169L88019M13854K96943M75954M47977M87522
$$ 15323862 15681613 15950468 16414637 16802656 17216510 17513453 17989407 18437384 18924906
4040A8924906M24703L47635K60666L61025M71614L14331K49726K36574N7746M5654
$$ 18924906 19349609 19697244 19957910 20318935 20790549 21104880 21354606 21591180 21648926 21694580
4030B1694580o133K15226K59828K07293K34412K86223L54832L94387L31059K67102
$$ 21694580 21688447 21903673 22163501 22370794 22605206 22891429 23246261 23640648 23971707 24238809
4020B4238809K47302M25563M52317L94464O56047N59420Q18949O86645N27289
$$ 24238809 24486111 24911674 25363991 25758455 26414502 26973922 27792871 28479516 29006805
4011B9006805L82778M25895K47903J59862J90213p3842j08718j3654O3306j5001
$$ 29006805 29389583 29815478 30063381 30223243 30413456 30339614 30230896 30217242 30280548 30265547
4001C0265547J48184J32588J22425K08085J94234K52693J71345K41180J15255
$$ 30265547 30413731 30546319 30668744 30876829 31071063 31323756 31495101 31736281 31851536
3992C1851536o2421Q9560K33618L79712J76409N8123J86640K49532J71123M8705
$$ 31851536 31789115 31878675 32112293 32492005 32668414 32726537 32913177 33162709 33333832 33382537
3982C3382537R5534j8029K1947J13018R5403k09455m2833m5675j5289l65082j52910
$$ 33382537 33478071 33460042 33481989 33595007 33690410 33480955 33438122 33392447 33377158 33012076 32859166
3971C2859166j22994k15608k51711j48997m0169k60554m20913j25501k050j70534
$$ 32859166 32736172 32520564 32268853 32119856 32079687 31819133 31398220 31272719 31270669 31100135
3961C1100135j9560j73023q3418o4610n2886n9174j03350j03000N770j41800k42985
$$ 31100135 31080575 30907552 30824134 30759524 30706638 30647464 30544114 30441114 30446884 30305084 30062099
3950C0062099j86311l05576j01210p4570k29680l19328j04376m7630k44657k15898
$$ 30062099 29875788 29570212 29469002 29394432 29164752 28845424 28741048 28693418 28448761 28232863
3940B8232863l39754l26620j70383l22347k91050k40073j64100k37725l28728
$$ 28232863 27893109 27566489 27396106 27073759 26782709 26542636 26378536 26140811 25812083
3931B5812083l02664k61213j29907j96914k66890j70446j99935l40890k79923
$$ 25812083 25509419 25248206 25118299 24921385 24654495 24484049 24284114 23943224 23663301
3922B3663301k49544k34745j32839l06204j14257j22161k83576k30816k70047
$$ 23663301 23413757 23179012 23046173 22739969 22625712 22503551 22219975 21989159 21719112
3913B1719112k08773k83422k47228m11538k88384j03923k65804l72558k42450
$$ 21719112 21510339 21226917 20979689 20568151 20279767 20175844 19910040 19537482 19295032
3904A9295032k65898m18282k59408k34960l93267l56527l21287m17943k96293
$$ 19295032 19029134 18610852 18351444 18116484 17723217 17366690 17045403 16627460 16331167
3895A6331167j01882k87092r2715j52536j79145j69085r0931m4187p367J06413
$$ 16331167 16229285 15942193 15849478 15696942 15517797 15348712 15257781 15213594 15206227 15312640
3885A5312640k8979m03J90960K54661J61786K09192M26971L69149P03329R82078
$$ 15312640 15283661 15283258 15474218 15728879 15890665 16099857 16526828 16895977 17599306 18581384
3875A8581384J133514R89670N16383M8855m98614n10031m09215l39290l52344
$$ 18581384 19714898 20704568 21220951 21269806 20771192 20261161 19851946 19512656 19160312
3866A9160312l92086l88425l63559k30709k24741j95314j46910j58353p8912K1606
$$ 19160312 18768226 18379801 18016242 17785533 17560792 17365478 17218568 17060215 16981303 17002909
3856A7002909o6573j69787M4479j96565k96316k80478m82780m06587n53042m68407
$$ 17002909 16936336 16766549 16811028 16614463 16318147 16037669 15554889 15148302 14595260 14126853
3846A4126853m14774l03117k76403k93289j51324m23993k14002m1967k9938O6071
$$ 14126853 13712079 13408962 13132559 12839270 12687946 12263953 12049951 12007984 11978046 12044117
3836A2044117J83578J39622J45266J82649K15087L01278K13537J18181P3056P5048
$$ 12044117 12227695 12367317 12512583 12695232 12910319 13211597 13425134 13543315 13616371 13691419
3826A3691419P7799j17349j5147j14061l21954o1971n0888j58051j37241r0746
$$ 13691419 13769218 13651869 13636722 13522661 13200707 13138736 13087848 12929797 12792556 12701810
3816A2701810j62814P2578J08256l0700q4477m9645j62966l56410k08837l80706
$$ 12701810 12538996 12611574 12719830 12689130 12604653 12555008 12392042 12035632 11826795 11446089
3806A1446089l76291l20575m38925n23271n29408m34924l34784l35331l52361
$$ 11446089 11069798 10749223 10310298 9787027 9257619 8822695 8487911 8152580 7800219
3797G800219l60521l04555j40179j27812n5462j79580k75928j013m2107k5726
$$ 7800219 7439698 7135143 6994964 6867152 6811690 6632110 6356182 6355169 6313062 6287336
3787F287336J05520k9082j8097n5092O1550M3258k46784j59120K5463o2946o7990
$$ 6287336 6392856 6363774 6345677 6290585 6352135 6395393 6148609 5989489 6014952 5952006 5884016
3776E884016L6345p7899r1687J70793q3744j65613k1374l8527K9341K08530k6833
$$ 5884016 5920361 5842462 5750775 5921568 5837824 5672211 5650837 5612310 5641651 5850181 5823348
3765E823348j3237M5432J27470K01995J61411J18416m72K88937Q1199J82804K16141
$$ 5823348 5810111 5855543 5983013 6185008 6346419 6464835 6464363 6753300 6834499 7017303 7233444
3754G233444J35524J58105K76497J48231K93718L63637Q8299K06946J70343K78497
$$ 7233444 7368968 7527073 7803570 7951801 8245519 8609156 8697455 8904401 9074744 9353241
3744I353241L10650Q7354J10580J82810L546J38787K0929p4818Q2843Q736P4882
$$ 9353241 9663891 9751245 9861825 10044635 10048181 10186968 10207897 10133079 10215922 10224658 10299540
3733A0299540P6754R840L6033j33821j63856l4572K2015j93027k0292j0739o5103
$$ 10299540 10376294 10386134 10422167 10288346 10124490 10089918 10111933 9918906 9898614 9887875 9822772
3722I822772j84635o9272p8606j42535L3106o8492N7918j27161J26443J30039
$$ 9822772 9638137 9568865 9490259 9347724 9380830 9312338 9370256 9243095 9369538 9499577
3712I499577l3124J10432J92829L5050J46205J62933J77595J26734J99806Q4539
$$ 9499577 9466453 9576885 9769714 9804764 9950969 10113902 10291497 10418231 10618037 10702576
3702A0702576R7723K01842K29646J65302J11779K10541J20081L05191K81688J24698
$$ 10702576 10800299 11002141 11231787 11397089 11508868 11719409 11839490 12144681 12426369 12551067
3692A2551067L9305J52445K30612J99232J69055J38321l7545p2548j8875J09556
$$ 12551067 12590372 12742817 12973429 13172661 13341716 13480037 13442492 13369944 13351069 13460625
3682A3460625O4405j56663r3446K8017k12496o4332j68154p9439p2986j11594
$$ 13460625 13525030 13368367 13274921 13302938 13090442 13026110 12857956 12778517 12705531 12593937
3672A2593937j42575j52541j44836q8918k13490j43096j46223j90392j73883j35579
$$ 12593937 12451362 12298821 12153985 12065067 11851577 11708481 11562258 11371866 11197983 11062404
3662A1062404j62438j52760j00438q3679j732j2342R1871j24527O359N568P8782
$$ 11062404 10899966 10747206 10646768 10563089 10561357 10549015 10640886 10516359 10522718 10528286 10607068
3651A0607068L6489O7761K9715l9130Q93K2528m9036j58575J05184r4366l6206
$$ 10607068 10643557 10711318 10741033 10701903 10702796 10725324 10676288 10517713 10622897 10528531 10492325
3640A0492325N6260J74440N1574J95966J57450q3400K73633Q6663J45510J90888
$$ 10492325 10548585 10723025 10774599 10970565 11128015 11044615 11318248 11404911 11550421 11741309
3630A1741309m3026k37488O4285j74281o8740j08832j67845j83568l5228O4481
$$ 11741309 11698283 11460795 11525080 11350799 11282059 11173227 11005382 10821814 10786586 10851067
3620A0851067J094m0643J70747J59465k5791r7326o4363j09403l7671j45174k02943
$$ 10851067 10852161 10811518 10982265 11141730 11115939 11018613 10954250 10844847 10807176 10662002 10459059
3609A0459059j61934j35233j86753q1797j17857j68759R1506j27643n985J12726
$$ 10459059 10297125 10161892 9975139 9893342 9775485 9606726 9698232 9570589 9564604 9677330
3599I677330O7069Q114j0056P3519J6277m5886J960j23685q7206j76721j4839
$$ 9677330 9744399 9752513 9742457 9815976 9832253 9786367 9788327 9664642 9577436 9400715 9385876
3588I385876J921m1296j00309j02725j7259l4207Q0034l2163O9790J33905j4792
$$ 9385876 9387797 9346501 9246192 9143467 9126208 9092001 9172035 9139872 9209662 9343567 9328775
3577I328775O2918m9078Q8901K8499p3147j32989Q7619J53994j19379J24205P1787
$$ 9328775 9391693 9342615 9431516 9460015 9386868 9253879 9341498 9495492 9376113 9500318 9572105
3566I572105R9901K01611J56354J52939J03515J1256M670n2914j37004j15583
$$ 9572105 9672006 9873617 10029971 10182910 10286425 10297681 10302351 10249437 10112433 9996850
3556I996850k38177j65193k98566k46510j7552j26138j31961k51185n004j731
$$ 9996850 9758673 9593480 9294914 9048404 9030852 8904714 8772753 8521568 8516564 8514833
3546H514833j87925p4556l177J5757Q0628k9450k2525O2999k9964j09188N5414
$$ 8514833 8326908 8252352 8249175 8264932 8345560 8316110 8293585 8356584 8326620 8217432 8272846
3535H272846q7318M4554J93823R5288Q6846J26280K56053K27521K28769K70164
$$ 8272846 8185528 8230082 8423905 8519193 8606039 8732319 8988372 9215893 9444662 9714826
3525I714826L82139L12606L96315L88022O39366M13264N48454M64886N05851N60288
$$ 9714826 10096965 10409571 10805886 11193908 11833274 12246538 12794992 13259878 13765729 14326017
3515A4326017Q47805P61447R56186J155539J260554J591935K090988K479986K862560
$$ 14326017 15173822 15935269 16891455 18046994 19307548 20899483 22990471 25470457 28333017
3506B8333017L305412L866204L945436L690497K612120J084961o14104j812552
$$ 28333017 31638429 35504633 39450069 43140566 45752686 46837647 46223543 44410991
3498D4410991k790696l370549l440977l186606k877957k618319k142139k008761
$$ 44410991 41620295 38249746 34808769 31622163 28744206 26125887 23983748 21974987
3490B1974987j708315j388603j100731j033442p74262n23417l96139l46159m15723
$$ 21974987 20266672 18878069 17777338 16743896 15969634 15446217 15050078 14703919 14288196
3481A4288196l85222j31410k65776j41765n5020M7519J509J73848J33373K94074
$$ 14288196 13902974 13771564 13505788 13364023 13309003 13356522 13358031 13531879 13665252 13959326
3471A3959326J87212L49436N34957Q83248R64092J179259Q86476M25684J94541
$$ 13959326 14146538 14495974 15030931 15914179 16878271 18057530 18944006 19369690 19564231
3462A9564231k33527k64450j76218l26682k82699j26051j07911j15996k32178
$$ 19564231 19330704 19066254 18890036 18563354 18280655 18154604 18046693 17930697 17698519
3453A7698519m24603m65392l64574l23312l93097k22681l46399m07992j27978
$$ 17698519 17273916 16808524 16443950 16120638 15727541 15504860 15158461 14750469 14622491
3444A4622491j33440k06121J42667P1644J56263L38298O9690M48252O37284N68660
$$ 14622491 14489051 14282930 14425597 14497241 14653504 14991802 15061492 15509744 16147028 16715688
3434A6715688Q80696R16249R29342Q90425Q08077P52399P07650Q26941R70867
$$ 16715688 17596384 18512633 19441975 20332400 21140477 21892876 22600526 23427467 24398334
3425B4398334R64723J018806R18029P99274O39862L29331J03694l03264n41577
$$ 24398334 25363057 26381863 27299892 28099166 28739028 29068359 29172053 28868789 28327212
3416B8327212l80269l27959n40390o62487n28292n51779l41043m3726J66536L76068
$$ 28327212 27946943 27618984 27078594 26416107 25887815 25336036 24994993 24951267 25117803 25493871
3406B5493871N80710O76196P71723Q24640P25166J166740J432252J819414K091669
$$ 25493871 26074581 26750777 27522500 28347140 29072306 30239046 31671298 33490712 35582381
3397C5582381K620209L097271L780041M149202L809964L015255J825882M17496
$$ 35582381 38202590 41299861 45079902 49229104 53039068 56054323 57880205 58297701
3389E8297701j052076j977102k213224k025508j764362j142590o46061j24997
$$ 58297701 57245625 55268523 53055299 51029791 49265429 48122839 47476778 47351781
3381D7351781O40080R14623J289639J473961J233023R91418M00866l87730j263814
$$ 47351781 47991861 48906484 50196123 51670084 52903107 53894525 54295391 53907661 52643847
3372E2643847j863329k108896k504870k636621k304559k032915j777409j398364
$$ 52643847 50780518 48671622 46166752 43530131 41225572 39192657 37415248 36016884
3364C6016884j162328j177702j252344j091571j158075j019106r12113q84445
$$ 36016884 34854556 33676854 32424510 31332939 30174864 29155758 28243645 27359200
3356B7359200p08629o74075o43582l98101n50841o18155n22599n84641o59793
$$ 27359200 26650571 25976496 25332914 24934813 24383972 23765817 23243218 22658577 21998784
3347B1998784o84393o21041o93459m96878n14542m48678k54151j86996j97007
$$ 21998784 21314391 20693350 19999891 19503013 18988471 18539793 18285642 18098646 17901639
3338A7901639j46092k76127k06124k72717o6574M3939l06488n8575j30012j64620
$$ 17901639 17755547 17479420 17273296 17000579 16934005 16977944 16671456 16612881 16482869 16318249
3328A6318249k32368k57281j70071r9419m6445p928l1174j8797m8176j31574j80506
$$ 16318249 16085881 15828600 15658529 15559110 15512665 15504737 15473563 15454766 15406590 15275016 15094510
3317A5094510j86325o9771n0824m3218j48251j93926n9504R410J4794k48951j3584
$$ 15094510 14908185 14838414 14787590 14744372 14596121 14402195 14342691 14352101 14366895 14117944 14104360
3306A4104360j42057k9360r794j4684J26774N4987m0984L6940K01739K13243K42013
$$ 14104360 13962303 13932943 13923149 13908465 14035239 14090226 14049242 14086182 14287921 14501164 14743177
3295A4743177J26560J74098K61353K00311K66947J99104O5084J60767P0394O440
$$ 14743177 14869737 15043835 15305188 15505499 15772446 15971550 16036634 16197401 16267795 16274235
3285A6274235K32444J72796J85674R5697O5970K57365K29050L12917L15269M96477
$$ 16274235 16506679 16679475 16865149 16960846 17026816 17284181 17513231 17826148 18141417 18637894
3275A8637894M65919P73791Q50430R93230J190590J312576J508224K106024K422038
$$ 18637894 19103813 19877604 20728034 21721264 22911854 24224430 25732654 27838678 30260716
3266C0260716K478865K476542K037871J768559J404600R81166N62912J08004m48299
$$ 30260716 32739581 35216123 37253994 39022553 40427153 41408319 41971231 42079235 41630936
3257D1630936r93478j332264j639583j777506j727726j537212j391259j234618
$$ 41630936 40637458 39305194 37665611 35888105 34160379 32623167 31231908 29997290
3249B9997290r64722o00552m84392j77761J08543J13182J60587J29549n9137j27664
$$ 29997290 29032568 28432016 27947624 27769863 27878406 27991588 28152175 28281724 28222587 28094923
3239B8094923l22310n91037q57942q07576p53614q38931n47180l74357k29009
$$ 28094923 27772613 27181576 26323634 25516058 24762444 23923513 23376333 23001976 22772967
3230B2772967J24539K10160K88426O51899R74461J321356J727036K168946K852958
$$ 22772967 22897506 23107666 23396092 24047991 25022452 26343808 28070844 30239790 33092748
3221C3092748L139484L505087L295614K637613J773157L98350j206324k331759
$$ 33092748 36232232 39737319 43032933 45670546 47443703 47842053 46635729 44303970
3213D4303970l030184l433627l370009l185607k826509k532346k285132j894016
$$ 44303970 41273786 37840159 34470150 31284543 28458034 25925688 23640556 21746540
3205B1746540j621178j433643j098357j041649q61271q22443n01898n56662m82212
$$ 21746540 20125362 18691719 17593362 16551713 15690442 14867999 14366101 13809439 13327227
3196A3327227l49561l49116k89494l25492l39142k08060j88078k32443j76740
$$ 13327227 12977666 12628550 12339056 12013564 11674422 11466362 11278284 11045841 10869101
3187A0869101j13067j29453j75237K2883J23599j10643M5454K56250J10980J06849
$$ 10869101 10756034 10626581 10451344 10474227 10597826 10487183 10532637 10788887 10899867 11006716
3177A1006716J91243L09136K86101K75636J08388L32863J38415K63459M14642
$$ 11006716 11197959 11507095 11793196 12068832 12177220 12510083 12648498 12911957 13326599
3168A3326599O44477M43715O37182R27990Q33128R60058Q84973Q76393P30619
$$ 13326599 13971076 14414791 15051973 15979963 16813091 17773149 18658122 19534515 20265134
3159B0265134R74446R17214J196383J330128J794847K525718K706147K838088
$$ 20265134 21239580 22156794 23353177 24683305 26478152 29003870 31710017 34548105
3151C4548105K609738K162582J133894j86271j278158k301265k930642l088240
$$ 34548105 37157843 39320425 40454319 40268048 38989890 36688625 33757983 30669743
3143C0669743k926146k726865k584127k266904k036607j729301j337578j236367
$$ 30669743 27743597 25016732 22432605 20165701 18129094 16399793 15062215 13825848
3135A3825848j017257q04705o36344o82288n52585l70315l67590k66967k78872
$$ 13825848 12808591 12003886 11367542 10685254 10132669 9762354 9394764 9127797 8848925
3126H848925k57509j77451l68851k78500j63859k10514k58022k11175j38986k40584
$$ 8848925 8591416 8413965 8045114 7766614 7602755 7392241 7134219 6923044 6784058 6543474
3116F543474j59179j73379j49413j01205O164p7527k80505j47100j01381J1453
$$ 6543474 6384295 6210916 6061503 5960298 5966462 5888935 5608430 5461330 5359949 5371402
3106E371402o3618l5138l2972m522q4328n2994r6073k23161j72175l1136j65155
$$ 5371402 5307784 5272646 5239674 5235152 5150824 5097830 5001757 4778596 4606421 4575285 4410130
3095D410130j13323j31114r4709j59474j35007k43558j6393k1904j44745n8301
$$ 4410130 4296807 4165693 4070984 3911510 3776503 3532945 3516552 3494648 3349903 3291602
3085C291602p6391Q1933l9954p6081Q0907k5006N316m3231j04573p700k9950j24414
$$ 3291602 3215211 3297144 3257190 3181109 3262016 3237010 3242326 3199095 3094522 3086822 3056872 2932458
3073B932458r5550m6113j72388J3020j06618j4907Q168j39147j2899R0418o444
$$ 2932458 2836908 2790795 2618407 2631427 2524809 2509902 2518070 2378923 2366024 2456442 2449998
3062B449998k3859o6140k648n4058M7880r9971j94204K8178N0079K49M203j96814
$$ 2449998 2426139 2359999 2357351 2303293 2351173 2251202 2056998 2085176 2135255 2135504 2139707 1942893
3050A942893P38k618n2343m8186k2485j14722o0288O5606n9543j09604N4033P2764
$$ 1942893 1943631 1941013 1888670 1840484 1817999 1703277 1642989 1708595 1649052 1539448 1593481 1666245
3038A666245L697r0624M773M3016n4967Q423J54846j49032j54057J21511M5064
$$ 1666245 1669942 1579318 1584091 1627107 1572140 1580563 1735409 1586377 1432320 1553831 1598895
3027A598895m6045l0286p0308K3679J5469r0604L9941J52101P201k7094k0791
$$ 1598895 1552850 1522564 1452256 1475935 1491404 1400800 1440741 1592842 1600043 1572949 1552158
3016A552158J51734J01463N2861p9332j2959J50995j52579K7569R2283R330j75162
$$ 1552158 1703892 1805355 1858216 1778884 1765925 1916920 1764341 1791910 1884193 1893523 1718361
3005A718361q1579r8169J00854q9869k466r7515m3104O4217q7725q5212L943j02891
$$ 1718361 1636782 1538613 1639467 1549598 1547132 1449617 1406513 1470730 1383005 1297793 1301736 1198845
2993A198845q8368J41795m1056k3619L2146q7092n7347Q5931L5166O3766K6061
$$ 1198845 1110477 1252272 1211216 1187597 1219743 1132651 1075304 1161235 1196401 1260167 1286228
2982A286228M397j03531n8064R1997j8847q5420R9479M6072K7944l5273L7108
$$ 1286228 1290625 1187094 1129030 1221027 1202180 1116760 1216239 1262311 1290255 1254982 1292090
2971A292090R0280n1613J0482k0828j20477J09842l6121K4853P2291k3207J4999
$$ 1292090 1382370 1330757 1341239 1320411 1199934 1309776 1273655 1298508 1370799 1347592 1362591
2960A362591m355J0743q6228q3650k9273P1407O418J7313j73412l4319j15868
$$ 1362591 1358236 1368979 1282751 1199101 1169828 1241235 1247653 1264966 1091554 1057235 941367
2949I41367J12484m9817n4500j7828m6476K2812j35841J26221J972q8627P230
$$ 941367 1053851 1004034 949534 931706 885230 908042 772201 898422 900394 811767 818997
2938H18997N7192P297L7225N3003J0663O3968k9399o5776R0252O422j31403o8405
$$ 818997 876189 883486 920711 973714 984377 1048345 1018946 953170 1043422 1049844 918441 850036
2926H50036n8367L9892L6591N4537m3981j40774J2627j1073Q5190l3985L5438
$$ 850036 791669 831561 868152 922689 878708 737934 750561 739488 824678 790693 826131
2915H26131Q403l8050R2654k9812J9864m133k5098l1323K7458P4608j16170o6634
$$ 826131 834534 796484 889138 859326 879190 875057 849959 818636 846094 920702 804532 737898
2903G37898J2477K4725j52007N2915J32398l4206o7957M028p2356j4395j19109
$$ 737898 750375 775100 623093 676008 808406 774200 706243 710271 637915 623520 504411
2892E04411m5985P9966k8176l6344L885L4901J2158Q352K5703O5686n4238K2955
$$ 504411 458426 538392 510216 473872 477757 512658 524816 533168 558871 624557 570319 593274
2880E93274L9146K6224j34568K7423J11459p1769M9244k9816j00322Q1361l9201
$$ 593274 632420 658644 524076 551499 662958 591189 640433 610617 510295 591656 552455
2869E52455J5302l171k9063M31o192J9148M9610n9224j02313L676N313O6225m395
$$ 552455 567757 564586 535523 535954 529762 548910 598520 539296 436983 440659 445972 512197 507802
2856E07802l2628k5184N3683o1922p2252j03757J676J5875l5742M9854m8285l8683
$$ 507802 475174 449990 503673 441751 369499 265742 267418 283293 247551 297405 249120 210437
2844B10437J8550N1018Q8034K209j82284J07348J59081J8346j64667m5635J32676
$$ 210437 228987 280005 368039 370248 187964 295312 454393 472739 308072 262437 395113
2833C95113N8078j30711p6776J23571M195j432k610n4997J5357k2238n8456J02227
$$ 395113 453191 322480 245704 369275 373470 372038 369428 314431 329788 307550 249094 351321
2821C51321J13743O001j44302k6616K2181m2215R2400k5945j02626J5284n9831
$$ 351321 465064 471065 326763 300147 322328 280113 372513 346568 243942 259226 199395
2810A99395J07709J02122m5601P619j10899m9620P3225N3785p8743J12873j681
$$ 199395 307104 409226 363625 371244 260345 210725 283950 337735 258992 371865 370184
2799C70184j28260m6294M3258o307J8121J38594o7357l9751K8456L9462k7908
$$ 370184 241924 195630 238888 232581 250702 389296 321939 282188 310644 350106 322198
2788C22198M6459n0988l3142k945N3809j9846r9138P270l2791J20155o6458K3882
$$ 322198 368657 317669 284527 281582 335391 315545 216407 223677 190886 311041 244583 268465
2776B68465P9954o0869j18091k5993J06447J04862j20363n8943p358p211M6934
$$ 268465 348419 287550 169459 143466 249913 354775 234412 175469 168111 160900 207834
2765B07834r6389N0538N0279j0194q3047j5549N8580K8660j07939J3224o9514
$$ 207834 111445 161983 212262 202068 119021 103472 162052 190712 82773 95997 26483
2754B6483P1111o6446p618J7921o4742R051k5314P5579L3310K6143m1854j867
$$ 26483 97594 31148 23530 41451 -23291 -14240 -39554 36025 69335 95478 53624 51757
2742E1757k8579j148M5646M8136j39893R1111J13386j37671M0218o1498m9509
$$ 51757 23178 22030 67676 115812 -24081 67030 180416 42745 82963 21465 -28044
2731b8044M6929N3334M2598j01612L8322R6506K894n1316L1030j30283Q7189O5054
$$ -28044 18885 72219 114817 13205 51527 148033 150927 99611 130641 358 87547 152601
2719A52601r7748J2084m5755K4220R7725O6433K0042J882j17770k8292l8543k1055
$$ 152601 54853 66937 21182 45402 143127 209560 229602 231484 113714 85422 46879 25824
2707B5824r1797K3618Q9624J52093K0103o7575j5417j7912M9742n8102N9052m1558
$$ 25824 -65973 -42355 47269 199362 219465 151890 136473 118561 168303 110201 169253 127695
2695A27695J0219J1616m8747N9985j10379j67531o4867J76779J08853q2649K24274
$$ 127695 137914 149530 100783 160768 50389 -117142 -182009 -5230 103623 20974 245248
2684B45248R402k07851k8401q6658J52385n574j7556p5955M5167Q1588q139k0051
$$ 245248 254650 46799 18398 -68260 84125 78551 60995 -14960 30207 111795 103656 83605
2672H3605J2844J2772n8464O0682L9875R0822O0426m2810j35256L3822o538M7096
$$ 83605 96449 109221 50757 111439 151314 242136 302562 259752 124496 158318 151780 198876
2660A98876L1827q291q7549L4202J06859p0205m0111r9835J23289J1838p3330
$$ 198876 230703 222412 134863 169065 275924 205719 165608 65773 189062 200900 127570
2649A27570r5034J9372m6959K0474J22436m766k0190M4023j7783j1237k0790p2993
$$ 127570 32536 51908 4949 25423 147859 143093 122903 166926 149143 137906 117116 44123
2637D4123J20349L644P9910M9645m5284l6024J7498N5389M115j09976j35310K451
$$ 44123 164472 168116 248026 297671 252387 216363 233861 289250 293365 183389 48079 50530
2625E0530R4548k5424k9981M6722r8749K535K7967N4799m0584j4632n007J1399
$$ 50530 145078 119654 89673 136395 37646 40181 68148 122947 82363 67731 62724 74123
2613G4123l1386J7976R8863m787r5057l5065J58232r480J09500o6313J39161p6485
$$ 74123 42737 60713 159576 154789 59732 24667 182899 173419 282919 216606 355767 279282
2601B79282J200J35302n5271N6171J16759K60101K23324K15820N8010j81088j34114
$$ 279282 280482 415784 360513 416684 533443 793544 1016868 1232688 1290698 1109610 975496
2590I75496j31916k53143j60699K1518j8335j77029m3974J03409P8709k3046j44971
$$ 975496 843580 590437 429738 451256 432921 255892 211918 315327 394036 370990 226019
2579B26019O9610j37758k0685l9881r3050Q2530J25437R3520p3663r2879l617
$$ 226019 295629 157871 137186 97305 4255 86785 212222 305742 232079 139200 135583
2568A35583l5375J4392Q1397K7246j02270q778L55O5350k6622K7447M6607p3984
$$ 135583 100208 114600 195997 223243 120973 112195 112550 177900 151278 178725 225332 151348
2556A51348n8197q5545r3977J44172J02443j9328J8847j00885K8384L992r7229
$$ 151348 93151 7606 -86371 57801 160244 140916 159763 58878 87262 91254 -5975
2545e975J3765l2277J95279m4941j64037N0410j3838J02787M1555m6288o4384
$$ -5975 7790 -24487 170792 125851 -38186 12224 -1614 101173 142728 96440 32056
2534C2056P6161L2316O6713N7809L7801j00001p4897k0783J4029K5678K6848j63349
$$ 32056 108217 140533 207246 265055 302856 202855 127958 107175 121204 146882 173730 10381
2522A0381l4088Q5116R3311O2298m8085L0528L3368j0871l3778q7277M3371M6694
$$ 10381 -23707 61409 154720 217018 168933 199461 232829 221958 188180 100903 144274 190968
2510A90968J03015m8242p0996j21320J29652n9572j28132K3256L7573P0186j1605
$$ 190968 293983 245741 174745 53425 183077 123505 -4627 18629 56202 126388 114783
2499A14783R037K6616M3988N1880O550k3108j61420P5097l1647l9787o5445N4143
$$ 114783 123820 150436 194424 246304 252854 229746 68326 143423 111776 71989 6544 60687
2487F0687J18785K1158J06239p6107n4087L6311Q07N7593R777m2000J3197P1354
$$ 60687 179472 200630 306869 230762 176675 212986 213793 271386 281163 239163 252360 323714
2475C23714N7311o1865j17139j9086M6670L3847p98k9767L7837m5042J08440k3855
$$ 323714 381025 319160 202021 182935 229605 263452 262654 232887 270724 225682 334122 310267
2463C10267j62718J2911o1651l5632J27824N1715l1622k3353q7434J80737L2825
$$ 310267 147549 160460 98809 63177 191001 242716 211094 187741 100307 281044 313869
2452C13869m9250K2491J56918M1121j08150m3234L5298p8755r0418J02348J64553
$$ 313869 264619 287110 444028 485149 376999 333765 369063 290308 199890 302238 466791
2441D66791j82681n9290j3076J17309J10561j21569J42556k2050M3598j7248N07
$$ 466791 284110 224820 211744 329053 439614 318045 460601 438551 482149 464901 465408
2430D65408o0944J689N0238P0369n1250l6388l0836K9894O0942q2389O501R4190
$$ 465408 404464 406153 456391 526760 475510 439122 408286 438180 499122 416733 423234 517424
2418E17424J07307k9865q141j3353J11400J20749m5347R3564r8415l1213P5567
$$ 517424 624731 594866 586725 573372 684772 805521 760174 853738 755323 724110 799677
2407G99677L310p4926n351q4897n653J8994J34469K8770k6410P3864J42946j1073
$$ 799677 802987 728061 722710 637813 632160 651154 785623 814393 787983 861847 1004793 993720
2395I93720P4729L053o0066L8097P3588j6172P8800Q6664J18749J30488J58127
$$ 993720 1068449 1071502 1011436 1049533 1123121 1106949 1185749 1272413 1391162 1521650 1679777
2384A679777j48795p9415P182l236P3588j4412l0978J91647j9859Q3224l3925
$$ 1679777 1530982 1451567 1458749 1455513 1529101 1514689 1483711 1675358 1655499 1738723 1704798
2373A704798K12380J71624o904p36k3291J87961J14007J0694K4742J41353J56097
$$ 1704798 1917178 2088802 2081898 2081162 2057871 2245832 2359839 2370533 2395275 2536628 2692725
2362B692725j32601K59707J61384J43931M8981J28449M4227L30921K98368K07504
$$ 2692725 2560124 2819831 2981215 3125146 3174127 3302576 3346803 3677724 3976092 4183596
2352D183596J98381M01982M89260M79198M79550O13328P60168J446396J801115
$$ 4183596 4381977 4783959 5273219 5752417 6231967 6845295 7605463 9051859 10852974
2343A0852974K331142J764030J009703L65894N33222J010864J488825J798026
$$ 10852974 13184116 14948146 15957849 16323743 16856965 17867829 19356654 21154680
2335B1154680K515062L516431N249654Q327806J5447141L1953735N4351523O0212986
$$ 21154680 23669742 27186173 32435827 40763633 56210774 88164509 142516032 202729018
2327B02729018L2792832o932905m2398527m4643285l2850595k4794830j8154109
$$ 202729018 235521850 228588945 186190418 141547133 108696538 83901708 65747599
2320F5747599j3918078j1101841q558066o304312m227063k149710j020795j67449
$$ 65747599 51829521 40727680 32169614 25865302 21638239 19488529 18467734 18300285
2312A8300285m03394r12765j904621j680587j373402j099437r48167o13295p68812
$$ 18300285 17896891 16984126 15079505 13398918 12025516 10926079 9977912 9364617 8595805
2303H595805l18910l67864m85366m42830k22628l31200k60893j87580k27379k71188
$$ 8595805 8276895 7909031 7423665 6980835 6758207 6427007 6166114 5978534 5751155 5479967
2293E479967l11713j90591j42290j77870L2449j06497j62507l03964j53713k04802
$$ 5479967 5168254 4977663 4835373 4657503 4689952 4583455 4420948 4116984 3963271 3758469
2283C758469j09674j65445M3274j7268l3401j07638j44497K0560k80275j60178
$$ 3758469 3648795 3483350 3526624 3509356 3475955 3368317 3223820 3244380 2964105 2803927
2273B803927j9447j72074q9416j01228n7835k5359j05429j23193Q0239j73318
$$ 2803927 2784480 2612406 2522990 2421762 2363927 2338568 2233139 2109946 2190185 2016867
2263B016867m2993m773k7553p6271O7552p4940j5080Q713m9694m6696K0671p5166
$$ 2016867 1973874 1969101 1941548 1865277 1932829 1857889 1842809 1851522 1801828 1755132 1775803 1700637
2251A700637K210Q520n961L9915r3229n4418l2698p9092j07441R7940n5580j77575
$$ 1700637 1702847 1711367 1705406 1745321 1652092 1597674 1564976 1485884 1378443 1476383 1420803 1243228
2239A243228k3752L3298m2713j44348O6616l6616m6107m878K1418j09944L3117
$$ 1243228 1219476 1252774 1210061 1065713 1132329 1095713 1049606 1044728 1066146 956202 989319
2228I89319n4570q387j53510o6705J20266j2938o3717K6485K950n991k26823R778
$$ 989319 934749 926362 772852 706147 826413 813475 749758 776243 779193 773202 546379 556157
2216E56157J43707p8684l5221N1475J1749n7141J38249N0193j21817J4161p688
$$ 556157 699864 621180 585959 637434 649183 592042 730291 780484 658667 672828 665140
2205F65140j63808M8954k6071R3300j01893m4351P3551j5324m5817Q7906J23820
$$ 665140 501332 550286 524215 617515 515622 471271 544822 529498 483681 571587 695407
2194F95407R7204Q7625j85397p1792J0380k8861m5230j74451r486R6652O6433
$$ 695407 792611 880236 694839 623047 633427 604566 559336 384885 375399 472051 538484
2183E38484K5065j84970Q9268j3366R9322P1741k00626k4058K4464p158k5240
$$ 538484 563549 378579 467847 454481 553803 625544 424918 400860 425324 418166 392926
2172C92926M9030o6323n5381J00223N164j73158m8702k780J9340J32656l5230
$$ 392926 441956 375633 320252 420475 425639 252481 203779 200999 220339 352995 317765
2161C17765j8841N9462L064L0083l8489L452m5035l7492N7716J27990j52098J20645
$$ 317765 298924 358386 361450 391533 353044 356496 311461 273969 331685 459675 307577 428222
2149D28222M9537j46915l4491m2442j9915L1172P188O2139r1818M9822Q3453L4701
$$ 428222 477759 330844 296353 253911 233996 265168 272356 334495 242677 292499 375952 410653
2137D10653j08916j32382L5390q324j25932J09351K4666Q3045o3160r6225n0753
$$ 410653 301737 169355 204745 196421 70489 179840 204506 287551 224391 128166 77413
2126G7413p5139m4908M0161J2987N6018M8430m1407M0526R2590K4507j15267j3065
$$ 77413 2274 -42634 -2473 10514 66532 114962 73555 114081 206671 231178 115911 102846
2114A02846J2394R7027n1577R9793k7404J7677p0189j33684P4531L707L686k194
$$ 102846 115240 212267 160690 260483 233079 250756 180567 46883 121414 125121 128807 126613
2102A26613n269m7778J5386K8017m9504Q5141M267l6951L6015m3651J00329j4618
$$ 126613 121344 73566 88952 116969 67465 152606 156873 119922 155937 112286 212615 197997
2090A97997l3135j2537j1397P669N0252J0289n4041q8010K2484j9197k9764r161
$$ 197997 164862 152325 140928 148597 198849 209138 155097 67087 89571 70374 40610 31449
2078C1449J0835k2644R5181J9978j1724J19629j10524K9913N9010K7641l0557
$$ 31449 42284 19640 114821 134799 123075 242704 132180 162093 221103 248744 218187
2067B18187O7903j21099K9371m8293J5877J83374J29092K11392J88299J93658
$$ 218187 286090 164991 194362 146069 161946 345320 474412 685804 874103 1067761
2057A067761N4967j3903o4317k71848j97978m5241n3036r2593O085r3202o0771
$$ 1067761 1122728 1108825 1044508 772660 574682 529441 476405 383812 389897 296695 235924
2046B35924R16j48708K1354R8361j15663P7992K8051J3346J3609o6753m566P092
$$ 235924 236840 88132 109486 207847 92184 170176 198227 211573 225182 158429 153863 160955
2034A60955k6552p8997J06396M4871l5011L6286k2609j07767n4246N4832L6455
$$ 160955 134403 55406 161802 206673 171662 207948 185339 77572 23326 78158 114613
2023A14613L9324j02488l1382k8180m7121M6828L2295n9136j8203J08852M875
$$ 114613 153937 51449 20067 -8113 -55234 -8406 23889 -35247 -53450 55402 60277
2012F0277j5370k2852N9222J53238k8152m7268l2044N4109q6133l2850r2759j02295
$$ 60277 44907 22055 81277 234515 206363 159095 127051 181160 95027 62177 -30582 -132877
2000a32877J82625L8441o6402K8679n5295m183n5888K14545m806j55729R6720
$$ -132877 49748 88189 21787 50466 -4829 -9012 -64900 149645 144839 -10890 85830
1989H5830j89820R2085M4199J05679j35154j066P1776K2971N351l2290N9161m6505
$$ 85830 -103990 -11905 32294 137973 2819 1753 73529 96500 101851 69561 128722 82217
1977H2217k1732K2040l329j8625q636J4192m8432j5904J17288p3746l8740o6362
$$ 82217 60485 82525 79196 60571 51935 66127 17695 1791 119079 45333 6593 -59769
1965e9769K4554K32479j47319k2566J8787P344O9284j18775L6609P5938p9748
$$ -59769 -35215 197264 49945 27379 46166 53510 122794 4019 40628 116566 36818
1954C6818q9221j4115k2200O6975l6079L8006L529J01929m4730k8838M1665r5785
$$ 36818 -52403 -66518 -88718 -21743 -57822 -19816 -16287 85642 40912 12074 53739 -42046
1942d2046J4519M7240j5626o9372J09492L9552K8350j14898L9052J41390n4544
$$ -42046 -27527 19713 4087 -65285 44207 83759 112109 -2789 36263 177653 123109
1931A23109r9576q2902L9047J07705N2676M0713j84564j2263L3674j6495m6634
$$ 123109 23533 -59369 -20322 87383 140059 180772 -3792 -16055 17619 1124 -45510
1920d5510m6292k4040P4579j20003Q2054M3718j29211J00675K7068J33821K740
$$ -45510 -91802 -115842 -41263 -161266 -79212 -35494 -164705 -64030 -36962 96859 99599
1909I9599m8125p2022M1566l8344N6343O1919R2670k7840j43218N9581l8557o7700
$$ 99599 51474 -20548 21018 -17326 39017 100936 193606 165766 22548 82129 43572 -24128
1897b4128J30528r3791M6152R2169o7932r0067o2166j3700O3140J03815K6466
$$ -24128 106400 12609 58761 150930 82998 -7069 -69235 -82935 -19795 84020 110486
1886A10486K9650J4176M9104j40833j0124q5833N4968P0461j03731N3089Q8034
$$ 110486 140136 154312 203416 62583 52459 -33374 21594 92055 -11676 41413 129447
1875A29447p4998l4416R8983L4054M5423n3785j23884k15109J97996M5157o1230
$$ 129447 54449 20033 119016 153070 198493 144708 20824 -194285 3711 48868 -12362
1864a2362j6857m942R3459k5029l7629M2370J0407J9298m0811L7982R2560o5353
$$ -12362 -29219 -34161 59298 34269 -3360 39010 49417 68715 27904 65886 158446 93093
1852I3093p8161O7675m0960j67870M5095o570Q9562p3816K977P0884R9796R6000
$$ 93093 14932 82607 41647 -126223 -81128 -87698 1864 -71952 -68975 1909 101705 197705
1840A97705n1640m9277l2990k8047j5914K9929l1026l6751k7706j8486N0361N6439
$$ 197705 146065 96788 63798 35751 19837 49766 18740 -18011 -45717 -64203 -13842 42597
1828D2597j2751j41J8927L5245J9803K4736k0254k03189J4843P4452O52k273r4352
$$ 42597 29846 29705 48632 83877 103680 128416 108162 -95027 -80184 -5732 -5080 -7353 -101705
1815a01705R3686O2584l5886L8114n0056M3452J04387j49660j18237j4984Q4706
$$ -101705 -8019 54565 18679 56793 6737 50189 154576 4916 -113321 -128305 -43599
1804d3599k1616k35J35315J14923l442o8548L8038n3431R690p0914K2577o0158
$$ -43599 -65215 -65450 69865 184788 181346 112798 150836 97405 107095 36181 58758 -1400
1792a400J2523l9118l5082J70431K4845j17122l846l5474J7944o4900m4427J05798
$$ -1400 11123 -27995 -63077 107354 132199 15077 11231 -24243 -6299 -71199 -115626 -9828
1780i828m9686O99K6377n6443l3608J18835J3017o9025L2573m0713P398L98m768
$$ -9828 -59514 -58815 -32438 -88881 -122489 -3654 9363 -59662 -27089 -67802 -60404 -60006 -64774
1767f4774J3693M1401R161M523O1243R4648j0849j11305j39043n8955O8960m123
$$ -64774 -51081 -9680 -519 4004 65247 159895 149046 37741 -101302 -160257 -91297 -95420
1755i5420L1757p457K1546L4081j8445p8049M2049N2630J5050k7640j09113o2186
$$ -95420 -63663 -71120 -49574 -15493 -33938 -111987 -69938 -17308 -2258 -29898 -139011 -201197
1743b01197J47266q231P7267j04510L4448J32417o7185q6274L311J42168J8110
$$ -201197 -53931 -62162 15105 -89405 -54957 77460 10275 -75999 -72688 69480 87590
1732H7590j1541q0482K0502r388J7519Q6324m2477k8975K2549K3869m7580J2848
$$ 87590 76049 -4433 16069 6681 24200 110524 68047 39072 61621 85490 37910 50758
1720E0758m8876M0631q9979P344J87397j07641r9257R832N7400k465q851j0592
$$ 50758 1882 42513 -47466 -40122 147275 39634 -59623 -49791 7609 5144 -3707 -14299
1708a4299P5494q8060R8847P1344j89414k72r699J23106k0848o9819p9193J16442
$$ -14299 61195 -26865 71982 143326 -46088 -46360 -56059 67047 46199 -23620 -102813 13629
1696A3629k5819n9297R212L3169P6976j56540j3866Q3888L4374p7075J02351R5169
$$ 13629 -12190 -71487 -62275 -29106 47870 -108670 -122536 -38648 -4274 -81349 21002 116171
1684A16171j73866L8353q1405L6420J911n4970N8264R7303K9629m1351O5215M730
$$ 116171 -57695 -19342 -100747 -64327 -62416 -117386 -59122 38181 67810 26459 91674 96404
1672I6404k2529j06239J12325j4691l1208j7861K0852j7208k0222j4505l3143
$$ 96404 73875 -32364 79961 65270 34062 16201 37053 19845 -377 -14882 -48025
1661d8025O3141Q0345p6308p8363k1899M5262o8729J77223o4340j24272o3066
$$ -48025 15116 95461 19153 -59210 -81109 -35847 -104576 72647 8307 -115965 -179031
1650a79031J2156J31512O3127j8611j2753Q0980P265j33540m9772J33700n6282
$$ -179031 -166875 -35363 27764 9153 -3600 77380 84645 -48895 -98667 35033 -21249
1639b1249J0934Q7128p2670K1875M965J24597n6625l8015k9398n9347n6934O9462
$$ -21249 -10315 76813 4143 26018 30983 155580 98955 60940 31542 -27805 -84739 -15277
1627a5277O1657L5676q9923J4911O6885j17218J44458k7016l0872j15466p2166
$$ -15277 46380 82056 -7867 7044 73929 -43289 101169 74153 43281 -72185 -144351
1616a44351L4996P72j7589J15922N8000Q3156k08381j5000R6820J96273j24510
$$ -144351 -109355 -108583 -126172 -10250 47750 130906 -77475 -92475 4345 200618 76108
1605G6108q8028K6381K9161O2822l4719L3726j09859q5793N6704O7154M3275m0422
$$ 76108 -11920 14461 43622 106444 71725 105451 -4408 -90201 -33497 33657 76932 36510
1593C6510q4539P5005N4526o9690m9075q900r4969N424R1953J08884L2939r1977
$$ 36510 -48029 26976 81502 11812 -37263 -46163 -141132 -135708 -43755 65129 98068 6091
1581F091l0038J43148j9447r8761j14223J37221m8086l384N4515j06811R5423
$$ 6091 -23947 119201 99754 993 -113230 23991 -24095 -27479 27036 -79775 15648
1570A5648j1469p9597m1739l1333L0405J99246J7382j04029j9956p937l3013J76027
$$ 15648 4179 -75418 -117157 -148490 -118085 81161 98543 -5486 -25442 -33379 -66392 109635
1558A09635j13464p9856R9650K579o977j1193l1351R6218j4091N9700M3371j42801
$$ 109635 -3829 -83685 15965 18544 11567 374 -30977 65241 51150 110850 154221 11420
1546A1420q823k6662M5377o6338J235N7618r0718K2080K37708p6086r9917j19781
$$ 11420 2597 -24065 21312 -45026 -43791 13827 -76891 -54811 182897 106811 6894 -112887
1534a12887M4178R6149k2863O2190K6457j00404k6533n6571o7026k0101M0815
$$ -112887 -68709 27440 4577 66767 93224 -7180 -33713 -90284 -157310 -177411 -136596
1523a36596M1523n7433M8536R7595j943j9243l3811m008J24833j31039n2231N9821
$$ -136596 -95073 -152506 -103970 -6375 -8318 -27561 -61372 -65380 59453 -71586 -123817 -63996
1511f3996O1232K2057Q351O5315q6585j75256J5891J89867n5157O1264j35211
$$ -63996 -2764 19293 27644 92959 6374 -168882 -152991 36876 -18281 42983 -92228
1500i2228j9649N4289n9623M2059L0521P1996K7503m5255L0841L6821k8828r2176
$$ -92228 -111877 -57588 -117211 -75152 -44631 27365 54868 9613 40454 77275 48447 -43729
1488d3729J1668K9626n1373K0967L4308k1490l9097Q9677j9813L0526P1112m911
$$ -43729 -32061 -2435 -53808 -32841 1467 -20023 -59120 30557 10744 41270 112382 107471
1476A07471j20461M5536M4211M6237p2292n8206R2619j27629p2522j4567j9923
$$ 107471 -12990 32546 76757 122994 50702 -7504 85115 -42514 -115036 -129603 -149526
1465a49526J67795n4508J8331n0324L1385M7250j0896p2371p54J602K4882R5086
$$ -149526 18269 -36239 -17908 -68232 -36847 10403 -493 -72864 -73618 -72016 -47134 47952
1453D7952m8299j7883j24081L288K3148K0249k367j591l6308n9073L089J14799
$$ 47952 -347 -18230 -142311 -139023 -115875 -95626 -97993 -99584 -135892 -194965 -191876 -77077
1441g7077L304l9030P4560m8470o7914M5921p0639n5143r660J90616Q0496j88941
$$ -77077 -73773 -112803 -38243 -86713 -154627 -108706 -179345 -234488 -244148 -53532 26964 -161977
1429a61977O9813j0887P1998k1338q9950P7651m1054Q6458m5811j19608m010J23471
$$ -161977 -92164 -103051 -31053 -52391 -142341 -64690 -105744 -19286 -65097 -184705 -188715 -65244
1417f5244k4476K5420O0315o1828Q2062O1232j28218q3173R3334J1183j70647
$$ -65244 -89720 -64300 -3985 -65813 16249 77481 -50737 -133910 -40576 -29393 -200040
1406b00040K2595J34987R1499L1359o494l2051Q3864n6510q1090L055J9819o0336
$$ -200040 -177445 -42458 49041 80400 73906 41855 125719 69209 -11881 -8826 10993 -49343
1394d9343j6630M7342n9523N8158N3987R0584j00462j32403j28246K9627Q4293
$$ -49343 -65973 -18631 -78154 -19996 33991 124575 24113 -108290 -236536 -206909 -122616
1383a22616L5307M0249k8222L2682Q5489l0922r1923j9999R6313j48099L3732
$$ -122616 -87309 -47060 -75282 -42600 42889 11967 -79956 -99955 -3642 -151741 -118009
1372a18009J94551o0052n2859J20605O083r5916o3429m9323j3662J49860K0305
$$ -118009 76542 16490 -36369 84236 90319 -5597 -69026 -118349 -132011 17849 38154
1361C8154j06021j154O2771q06p1176J23456M5929n4871m9994q0004K3063k1271
$$ 38154 -67867 -69021 -6250 -7056 -78232 45224 91153 36282 -13712 -93716 -70653 -91924
1349i1924K8643K739K924J5042k4724Q9810n1721K0918N5144l1571j53131j8222
$$ -91924 -63281 -60542 -57618 -42576 -67300 22510 -29211 -8293 46851 15280 -137851 -156073
1337a56073N2283J23979O6413K272o5805k9379K7788p6473Q7561P899k15602J27120
$$ -156073 -103790 20189 86602 88874 23069 -6310 21478 -54995 32566 40465 -175137 -48017
1325d8017J65263q2450P0678L6493j10676q018q7815n2471O7504K4748M5605n4440
$$ -48017 117246 34796 105474 141967 31291 23273 -64542 -117013 -49509 -24761 20844 -33596
1313c3596j69987L0885J4696L1033K7141L5924J98664p138l9257p5223j32727
$$ -33596 -203583 -172698 -158002 -126969 -99828 -63904 134760 127622 88365 13142 -119585
1302a19585K0226J39293Q630j19517J8093K661k3326Q9550l3570o6816K2752M8967
$$ -119585 -99359 39934 48564 -70953 -52860 -50199 -73525 16025 -17545 -84361 -61609 -12642
1290a2642M5413j1391k4342L8632r2606m3547J1680p0232R1935q2404o7437J74508
$$ -12642 32771 21380 -2962 35670 -56936 -100483 -88803 -159035 -67100 -149504 -216941 -42433
$$ [...]
##END NTUPLES=NMR SPECTRUM
##END=
