##TITLE=1H_TG-2401
 200.13Hz, CDCl3.
 8 sc
 
19.3.2026
##JCAMPDX= 6.0         $$ Bruker NMR JCAMP-DX V2.0
##DATA TYPE= NMR SPECTRUM
##DATA CLASS= NTUPLES
##ORIGIN= UXNMR, Bruker Analytische Messtechnik GmbH
##OWNER= pz
$$ XWIN-NMR		Version 3.5
$$ Thu Mar 19 13:45:41 2026 Russian Standard Time (UT+4h)  she@DPX200
##.OBSERVE FREQUENCY= 200.1313
##.OBSERVE NUCLEUS= ^1H
##.ACQUISITION MODE= SIMULTANEOUS
##.ACQUISITION SCHEME= undefined
##.AVERAGES= 8
##.DIGITISER RES= 18
##SPECTROMETER/DATA SYSTEM= spect
##.PULSE SEQUENCE= zg30
##.SOLVENT NAME= CDCl3
##.SHIFT REFERENCE= (INTERNAL, CDCl3, 0, 15.4483)
##AUDIT TRAIL= $$ (NUMBER, WHEN, WHO, WHERE, WHAT)
$$ ##TITLE= Audit trail, XWIN-NMR		Version 3.5
$$ ##JCAMPDX= 5.01
$$ ##ORIGIN= Bruker BioSpin GmbH
$$ ##OWNER= she
$$ F:/spectra/data/she/nmr/H-C/1/pdata/1/auditp.txt
$$ ##AUDIT TRAIL=  $$ (NUMBER, WHEN, WHO, WHERE, WHAT)
(   1,<2026-03-19 13:44:27.85 +0400>,<she>,<DPX200>,
      <created by zg, POWCHK disabled, PULCHK disabled
       configuration hash MD5:
       00 E9 B6 7A A2 85 ED C7 34 08 36 98 17 FE 4E 26
       data hash MD5: 16K
       94 37 5C 58 EC E6 08 0A 7F 57 43 D8 CD 47 7E A3>)
(   2,<2026-03-19 13:44:31.65 +0400>,<she>,<DPX200>,
      <Start of raw data processing
       efp BC_mod = 2 LB = 0.25 FT_mod = 6 PKNL = 1 PHC0 = -3701.324 PHC1 = 6.992302 SI = 16K 
       data hash MD5: 16K
       32 7E 46 B4 48 B8 3D B2 65 AF 63 B5 5A 35 12 04>)
(   3,<2026-03-19 13:44:47.93 +0400>,<she>,<DPX200>,
      <pk PHC0 = 2.025757 PHC1 = -2.4 
       data hash MD5: 16K
       40 E3 56 D6 0E 12 94 60 B7 72 06 D0 A0 0D B9 41>)
(   4,<2026-03-19 13:44:51.93 +0400>,<she>,<DPX200>,
      <abs ABSG = 5 
       data hash MD5: 16K
       D2 30 74 0E BD DF 77 AE 87 CC 36 78 0E 09 42 1D>)
$$ ##END=
$$ 
$$ hash MD5
$$ 70 6B 55 15 4D F0 F0 17 FE 2F DC 1D AF E7 7C C1
##$RELAX= 
##$RELAX= 
##$RELAX= 
##$RELAX= 
##$RELAX= 
##$RELAX= 
$$ Bruker specific parameters
$$ --------------------------
##$DU= <F:/spectra>
##$EXPNO= 1
##$NAME= <H-C>
##$PROCNO= 1
##$TYPE= <nmr>
##$USER= <she>
##$AMP= (0..31)
100 100 100 100 100 100 100 100 100 100 100 100 100 100 100 100 100 100 
100 100 100 100 100 100 100 100 100 100 100 100 100 100 
##$AQSEQ= 0
##$AQ_mod= 1
##$AUNM= <au_zg>
##$AUTOPOS= <>
##$BF1= 200.13
##$BF2= 200.13
##$BF3= 200.13
##$BF4= 200.13
##$BF5= 200.13
##$BF6= 200.13
##$BF7= 200.13
##$BF8= 200.13
##$BYTORDA= 1
##$CFDGTYP= 0
##$CFRGTYP= 5
##$CHEMSTR= <none>
##$CNST= (0..31)
1 1 145 1 1 1 1 1 1 1 1 1 1 1 1 1 1 1 1 1 1 1 1 1 1 1 1 1 1 1 1 1 
##$CPDPRG= <>
##$CPDPRG1= <>
##$CPDPRG2= <>
##$CPDPRG3= <>
##$CPDPRG4= <mlev>
##$CPDPRG5= <mlev>
##$CPDPRG6= <mlev>
##$CPDPRG7= <mlev>
##$CPDPRG8= <mlev>
##$CPDPRGB= <>
##$CPDPRGT= <>
##$D= (0..31)
0 0.7 0 0 0 0 0 0 0 0 0 0.03 0 0 0 0 0 0 0 0 0 0 0 0 0 0 0 0 0 0 0 0 
##$DATE= 1773913467
##$DBL= (0..7)
120 120 120 120 120 120 120 120 
##$DBP= (0..7)
150 150 150 150 150 150 150 150 
##$DBP07= 0
##$DBPNAM0= <>
##$DBPNAM1= <>
##$DBPNAM2= <>
##$DBPNAM3= <>
##$DBPNAM4= <>
##$DBPNAM5= <>
$$ [...]
##$SUBNAM3= <"">
##$SUBNAM4= <"">
##$SUBNAM5= <"">
##$SUBNAM6= <"">
##$SUBNAM7= <"">
##$SUBNAM8= <"">
##$SUBNAM9= <"">
##$SW= 18.0517328524113
##$SWIBOX= (0..15)
0 0 2 0 0 0 0 0 0 0 0 0 0 0 0 0 
##$SW_h= 3612.71676300578
##$TD= 16384
##$TD0= 1
##$TE= 0
##$TE2= 300
##$TE3= 300
##$TEG= 300
##$TL= (0..7)
0 120 120 120 120 120 120 120 
##$TP= (0..7)
150 150 150 150 150 150 150 150 
##$TP07= 0
##$TPNAME0= <>
##$TPNAME1= <>
##$TPNAME2= <>
##$TPNAME3= <>
##$TPNAME4= <>
##$TPNAME5= <>
##$TPNAME6= <>
##$TPNAME7= <>
##$TPOAL= (0..7)
0.5 0.5 0.5 0.5 0.5 0.5 0.5 0.5 
##$TPOFFS= (0..7)
0 0 0 0 0 0 0 0 
##$TUNHIN= 0
##$TUNHOUT= 0
##$TUNXOUT= 0
##$USERA1= <user>
##$USERA2= <user>
##$USERA3= <user>
##$USERA4= <user>
##$USERA5= <user>
##$V9= 5
##$VALIST= <valist>
##$VCLIST= <CCCCCCCCCCCCCCC>
##$VD= 0
##$VDLIST= <DDDDDDDDDDDDDDD>
##$VPLIST= <PPPPPPPPPPPPPPP>
##$VTLIST= <TTTTTTTTTTTTTTT>
##$WBST= 1024
##$WBSW= 4
##$XGAIN= (0..3)
0 0 0 0 
##$XL= 0
##$YL= 0
##$YMAX_a= 1005043
##$YMIN_a= -1114573
##$ZGOPTNS= <>
##$ZL1= 120
##$ZL2= 120
##$ZL3= 120
##$ZL4= 120
##$ABSF1= 15.49568
##$ABSF2= -2.55617
##$ABSG= 5
##$ABSL= 3
##$ALPHA= 0
##$AQORDER= 0
##$ASSFAC= 0
##$ASSFACI= 0
##$ASSFACX= 0
##$ASSWID= 0
##$AUNMP= <proc_1d>
##$AZFE= 0.1
##$AZFW= 0.1
##$BCFW= 0
##$BC_mod= 2
##$BYTORDP= 0
##$COROFFS= 0
##$CY= -3
##$DATMOD= 1
##$DC= 0
##$DFILT= <>
##$DTYPP= 0
##$F1P= 0
##$F2P= 0
##$FCOR= 1
##$FTSIZE= 16384
##$FT_mod= 6
##$GAMMA= 0
##$GB= 0
##$INTBC= 1
##$INTSCL= 3.241238e-09
##$ISEN= 128
##$LB= 0.25
##$LEV0= 0
##$LPBIN= 0
##$MAXI= 10000
##$MC2= 0
##$MEAN= 0
##$ME_mod= 0
##$MI= 1.114404
##$NCOEF= 0
##$NC_proc= -5
##$NLEV= 6
##$NOISF1= 3.799351
##$NOISF2= 2.8
##$NSP= 0
##$NTH_PI= 0
##$NZP= 0
##$OFFSET= 15.4483
##$PC= 1
##$PHC0= -3699.298
##$PHC1= 4.592302
##$PH_mod= 1
##$PKNL= yes
##$PPARMOD= 0
##$PSCAL= 0
##$PSIGN= 0
##$REVERSE= no
##$SF= 200.130014689563
##$SI= 16384
##$SIGF1= 3
##$SIGF2= 2
##$SINO= 0.751879
##$SIOLD= 32768
##$SREGLST= <19F.Aceton>
##$SSB= 0
##$STSI= 16384
##$STSR= 0
##$SW_p= 3612.71676300578
##$SYMM= 0
##$S_DEV= 0
##$TDeff= 16384
##$TDoff= 0
##$TI= <>
##$TILT= no
##$TM1= 0
##$TM2= 0
##$TOPLEV= 0
##$USERP1= <user>
##$USERP2= <user>
##$USERP3= <user>
##$USERP4= <user>
##$USERP5= <user>
##$WDW= 1
##$XDIM= 16384
##$YMAX_p= 297513157
##$YMIN_p= -417384
$$ End of Bruker specific parameters
$$ ---------------------------------
##NTUPLES= NMR SPECTRUM
##VAR_NAME=  FREQUENCY,     SPECTRUM/REAL,   SPECTRUM/IMAG
##SYMBOL=    X,             R,               I
##VAR_TYPE=  INDEPENDENT,   DEPENDENT,       DEPENDENT
##VAR_FORM=  AFFN,          ASDF,            ASDF
##VAR_DIM=   16384,         16384,           16384
##UNITS=     HZ,            ARBITRARY UNITS, ARBITRARY UNITS
##FACTOR=    0.220516191357247, 1,           1
##FIRST=     3091.66857830245, 0,            0
##LAST=      -521.048184703326, 0,           0
##MIN=       -521.048184703326, -417384,     0
##MAX=       3091.66857830245, 297513157,    0
$$ Real data points
##PAGE= N=1
##DATA TABLE= (X++(R..R)), XYDATA
$$ [...]
5968A4337777m09057l17892k09373k49194k66104j12626j15341p3412o4882j03864
$$ 14337777 13928720 13610828 13401455 13152261 12886157 12773531 12658190 12584778 12519896 12416032
5958A2416032o544L3223l7209n1546j40937k44625k51513k41544l14663j80850
$$ 12416032 12409488 12442711 12405502 12353956 12213019 11968394 11716881 11475337 11160674 10979824
5948A0979824j37444j5698J28618L14368M53959M58523L71825J74596N8590r2204
$$ 10979824 10842380 10826682 10955300 11269668 11723627 12182150 12553975 12728571 12787161 12694957
5938A2694957j22483p4074j01896M706J42288P3080J16815K36877L10827L32766
$$ 12694957 12572474 12498400 12396504 12401210 12543498 12616578 12733393 12970270 13281097 13613863
5928A3613863L68605N25671O03103Q34518J212188J343590J268645Q09990J50086
$$ 13613863 13982468 14508139 15111242 15945760 17157948 18501538 19770183 20580173 20730259
5919B0730259m19772o70075q23609q41919q01932p08250m65668j89736N8581M00416
$$ 20730259 20310487 19640412 18816803 17974884 17172952 16464702 15999034 15809298 15867879 16268295
5909A6268295P55931Q65708Q93687O92073L05906n5318l35019m80557n09989n46399
$$ 16268295 17024226 17889934 18783621 19475694 19781600 19726282 19391263 18910706 18400717 17854318
5899A7854318n20481m08929l91512k54647o87K73201M29082P14920R09286J076839
$$ 17854318 17333837 16924908 16533396 16278749 16278062 16551263 16980345 17695265 18604551 19681390
5889A9681390J039720R87969R11119Q43855Q73245M31670J03261k74799o29595
$$ 19681390 20721110 21709079 22620198 23464053 24337298 24768968 24872229 24597430 23967835
5880B3967835p84318p37173n81077m46789k58585P9590J46050J16037J47593l7269
$$ 23967835 23183517 22446344 21865267 21418478 21159893 21239483 21385533 21501570 21649163 21611894
5870B1611894l8710q0669k0817J53337L82641M97666M77764J39416l10813p65781
$$ 21611894 21573184 21492515 21471698 21625035 22007676 22505342 22983106 23122522 22811709 22045928
5860B2045928q30735p64507l94037j3770K21596K32306K6226k16872m35368m28576
$$ 22045928 21215193 20450686 20056649 20042879 20264475 20496781 20523007 20306135 19870767 19442191
5850A9442191k47386r66J95696M264m80359r73649j137004j116798r82357o07191
$$ 19442191 19194805 19193839 19389535 19393799 18913440 17939791 16802787 15685989 14703632 14096441
5840A4096441k82049j71910j71871k52079k10207k51163k15913j04685m4944N6206
$$ 14096441 13814392 13642482 13470611 13218532 13008325 12757162 12541249 12436564 12391620 12447826
5830A2447826M8625M569k66819m09530p31974p55205n63926m15204n56543m47750
$$ 12447826 12496451 12501020 12234201 11824671 11092697 10337492 9773566 9358362 8801819 8354069
5820H354069l93517l37950l32694m03066l66107l63618l07829m79119l64445l84783
$$ 8354069 7960552 7622602 7289908 6886842 6520735 6157117 5849288 5370169 5005724 4620941
5810D620941k34867j72401j00570l3954k7717P1970R4334o0562j04804j49666
$$ 4620941 4386074 4213673 4113103 4079149 4051432 4123402 4217736 4157174 4052370 3902704
5800C902704k52339l31837l29386k65813k36853k00899j61514j67271j06478p2515
$$ 3902704 3650365 3318528 2989142 2723329 2486476 2285577 2124063 1956792 1850314 1777799
5790A777799q1731j32250n8927m704o9534n9775l9334J3492l6311L19p8065l2198
$$ 1777799 1696068 1563818 1504891 1500187 1430653 1370878 1331544 1345036 1308725 1309044 1230979 1198781
5778A198781O3315r303l8331k2234j41804O465j9009j6733m1817p4102l6414K4339
$$ 1198781 1262096 1252793 1214462 1192228 1050424 1056889 1037880 1021147 979330 905228 868814 893153
5766H93153o7850l3598J6207j0401o2498k8184J8799N5020R841l5811o3013K70
$$ 893153 825303 791705 807912 797511 735013 706829 725628 780648 790489 754678 691665 691935
5754F91935M1247o265N3757N237l8059J1631m6699K1877n3487n5011P9861J268
$$ 691935 733182 726917 780674 785911 747852 759483 712784 734661 681174 626163 706024 707292
5742G07292K2826n3080o6039M8120R352J1224m2547r967k2725K4723O2966m4938
$$ 707292 730118 677038 610999 659119 668471 679695 637148 627181 604456 629179 692145 647207
5730F47207n8480m7283J521p805L2309M8584M997J6685q4285O2630N4577m5892
$$ 647207 588727 541444 542965 535160 567469 616053 621050 637735 553450 616080 670657 624765
5718F24765l6474r4713O3435O6547l0577j623r315J3607j8693l4112L3828j1917
$$ 624765 588291 493578 557013 623560 592983 591360 582045 595652 576959 542847 576675 564758
5706E64758K5662L9242M1228K0019J8506J2248L2116K006n6248J3118J0836l1990
$$ 564758 590420 629662 670890 690909 709415 721663 753779 755785 699537 712655 723491 691501
5694F91501Q255k1283l3139m3215J0624q20J9091o8513j8721N9907J6491R692
$$ 691501 699756 678473 645334 602119 612743 611923 631014 562501 543780 603687 620178 629870
5682F29870n4017N427K2461L5119l1462l8726N238M0421m651r8554N8850j9265
$$ 629870 575853 581280 603741 638860 607398 568672 573910 614331 609680 511126 569976 550711
5670E50711m9435J3087N811m2539m641N9627J883m1538n9466o8226o779m0054
$$ 550711 501276 514363 520174 477635 472994 532621 534504 492966 433500 365274 358495 318441
5658C18441n5047K9025L1918L091l0513o7659L6742Q772r222j3047o963K9622
$$ 318441 263394 292419 324337 327428 296915 229256 265998 274770 265548 252501 245538 275160
5646B75160L0488K1665j3025l1106j2473L6288j4916m1295l3535n6989R6376L1200
$$ 275160 305648 327313 314288 283182 270709 306997 292081 250786 217251 160262 256638 287838
5634B87838k0385O33k2364k9178K45L5278k6769L1210k825o0036j5137J4884J5279
$$ 287838 267453 268086 245722 216544 216789 252067 225298 256508 253683 193647 178510 193394 208673
5621B08673l7432N9498r92l1882j5735Q660J0672m154Q0526O613l3229m833l8974
$$ 208673 171241 230739 229747 197865 182130 190790 201462 197308 277834 284447 251218 246385 207411
5608B07411L341k7251k3243k8313O5765j2802n131K5092l5361n155J4022q509
$$ 207411 210752 183501 160258 131945 197710 184908 179777 204869 169508 164353 178375 169866
5596A69866j094O3978q47p229j8695n0021j7139O5398m4931m1438Q4237N826L4400
$$ 169866 168772 232750 231903 224674 205979 155958 138819 204217 159286 117848 202085 207911 242311
5583B42311k848j3007P0108J444l1046j0163K4186K4292J1232k3088o0759k0489
$$ 242311 239463 226456 296564 298008 266962 256799 280985 305277 316509 293421 232662 212173
5571B12173P390J4227M2154l2029K7233J2637l7360j8834N217L9467J276L6288
$$ 212173 219563 233790 275944 243915 271148 283785 246425 227591 232808 272275 273551 309839
5559C09839J5341p671n0492j7174P2397k2929K0264o4105J6360n0538l4526M905
$$ 309839 325180 317509 267017 249843 322240 299311 319575 255470 271830 221292 186766 191671
5547A91671O8155j1703o2487p656O7897K7533m3337l2638P0003p57k5300m5915
$$ 191671 259826 248123 185636 177980 245877 273410 230073 197435 267438 266681 241381 195466
5535A95466l7756j2020P4945n466K1595q144j5708l0109m6457P357o3032k6799
$$ 195466 157710 145690 220635 215169 236764 228620 212912 182803 136346 143703 80671 53872
5523E3872Q4842N4891j8720m4959k3222j7305l3782J9092j7663J5265R172L350
$$ 53872 138714 193605 174885 129926 106704 89399 55617 74709 57046 72311 81483 84833
5511H4833K3013l0148l1286m8210L5820k3035k6655R6279l9644k5629j1198m1532
$$ 84833 107846 77698 46412 -1798 34022 10987 -15668 80611 40967 15338 4140 -37392
5499c7392L3794k4233O729N2284m875R042j8160J2354M3611L5876n1492M4803
$$ -37392 -3598 -27831 -21102 31182 26307 35349 17189 29543 73154 109030 57538 102341
5487A02341k8682q9450O455R7617R752p6624J0759O125R729J0374q967n222L0389
$$ 102341 73659 -15791 -9336 88281 98033 21409 32168 38293 48022 58396 49429 44207 74596
5474G4596J05655q0901N8260K5328m2582j7307m13q999n0939n1295P4883O5336
$$ 74596 180251 99350 157610 182938 140356 123049 122636 113637 62698 11403 86286 151622
5462A51622k2129j9845l675j2637O3092K8690k8598l0736q4792j3235Q8898j5596
$$ 151622 129493 109648 105973 93336 156428 185118 156520 125784 40992 27757 116655 101059
5450A01059r6323p426K7235m0796N90J6188L8129O738J7691L670m3O83q589L7813
$$ 101059 4736 -2690 24545 -16251 -15661 527 38656 45394 63085 66755 66712 67395 58806 96619
5436I6619M0839M497k5782m5367K145O8136o337m1822n814m929j598j7401Q792
$$ 96619 137458 141955 116173 70806 72951 141087 134750 92928 87114 82185 80587 63186 71978
5423G1978J505J3005M816l9413K4229J7955R372l749o655j8227N448L3466m3502
$$ 71978 73483 86488 91304 51891 76120 94075 103447 99698 93043 74816 80264 113730 70228
5410G0228J1134J1278o8291J04234L3070j7296J5143m1709L0884r922m4709k4050
$$ 70228 81362 92640 24349 128583 161653 144357 159500 117791 148675 138753 94044 69994
5398F9994j1698m3452N0912L88m646J413l0107O7018R078j080l1407K256J199
$$ 69994 58296 14844 65756 66144 61498 62911 32804 99822 108900 107820 76413 78669 79868
5385G9868k0684l1576K1114k8627k894J4775j2500O2121L1177p1413M8781r027
$$ 79868 59184 27608 48722 20095 17201 31976 19476 81597 112774 41361 90142 81115
5373H1115K4944K8765m5307O6337L1062l5865O4963j7906j5240O927p257m9728
$$ 81115 106059 134824 89517 155854 186916 151051 216014 198108 182868 189795 182538 132810
5361A32810M0823K5317l2970n5064K6045N6622n2220P152k1120J136L0964J954
$$ 132810 173633 198950 165980 110916 136961 193583 141363 148515 127395 128531 159495 161449
5349A61449k9090O0619m976O158J6213m4537J566n583K7838k6283p537K3141k2694
$$ 161449 132359 192978 188002 194160 210373 165836 167402 161819 189657 163374 155837 178978 156284
5336A56284l1045K62L2314L6561L6362N8399K253k9585j0276j2825K4219n1680
$$ 156284 125239 125501 157815 194376 230738 289137 291390 261805 251529 238704 262923 211243
5324B11243J3137r58M0041J9726j5059k6578M7198P6622m0196r000K3265l9242
$$ 211243 224380 223422 263463 283189 268130 241552 288750 365372 325176 316176 339441 300199
5312C00199J6405k110M9464K9846K75K7624j9455o3996l9253K9253q728O2936
$$ 300199 316604 314494 363958 393804 394079 421703 402248 338252 298999 328252 319524 382460
5300C82460N1714m5770M0622L3954k4495n713j7851M5584k1016j9852K2722M3322
$$ 382460 434174 388404 429026 462980 438485 432772 414921 460505 439489 419637 442359 485681
5288D85681J7392K8909J2200L1769l1739P33k5116M6952J5001k0859m4743j6089
$$ 485681 503073 531982 544182 575951 544212 544945 519829 566781 581782 560923 516180 500091
5276E00091J9373L3106K0835m7096L8071k8174J6825M2320k4562k4328m4953j4360
$$ 500091 519464 552570 573405 526309 564380 536206 553031 595351 570789 546461 501508 487148
5264D87148o6851j3389L1641J1181j6270j8614N930m5377O478J5082l6229L0897
$$ 487148 420297 406908 438549 449730 433460 414846 420776 375399 381877 396959 360730 391627
5252C91627J4189N3682l375l5957j2668J2123O521K3648j9536j22423l2199N1693
$$ 391627 405816 459498 456123 420166 407498 419621 426142 449790 430254 307831 275632 327325
5240C27325O9357o1740K6124N6813j7286L3560J5019m6167r58O7288O2294m5015
$$ 327325 396682 334942 361066 417879 400593 434153 449172 403005 402047 469335 531629 486614
5228D86614n0561k6545M5079P2502m6004j3074J3665m2307R2174L96L7339M7608
$$ 486614 436053 409508 454587 527089 481085 468011 481676 439369 531543 531939 569278 616886
5216F16886L124j07008k1408M2737K8326J860R788k9899P4109K2122L4384n7184
$$ 616886 620010 513002 491594 534331 562657 564517 574305 544406 618515 640637 675021 617837
5204F17837K4548Q5459N700j3339N464k7077n1932J9593l6091j3557j2040l1418
$$ 617837 642385 727844 733544 720205 725669 698592 646660 666253 630162 616605 604565 573147
5192E73147j4047J5342J3198l0965l4990J994o184K7298L5532m3878n9876K2670
$$ 573147 559100 574442 587640 556675 521685 523679 517495 544793 580325 536447 476571 499241
5180D99241k1450j3041K9949J06136k3315P7164L4165J5807M1778R579n352o257
$$ 499241 477791 464750 494699 600835 577520 654684 688849 704656 746434 756013 750661 744404
5168G44404l3336l8129J8938L6776k6225n920k3506k5514m0856L2584P9579m611
$$ 744404 711068 672939 691877 728653 702428 696508 673002 647488 606632 639216 718795 714184
5156G14184r639R269O0766N4170L3846j0955j02092L9946O3221L0585N373O1955
$$ 714184 704545 713814 774580 828750 862596 851641 749549 789495 852716 883301 888674 950629
5144I50629L9979l5095m386N0953L0786J0716k450K387M8778q4192m9533O8672
$$ 950629 990608 955513 951127 1002080 1032866 1043582 1041132 1043519 1092297 1008105 958572 1027244
5132A027244J0464p0946k8473n4112k0036M6899j9101j5662L6017n7457K0610
$$ 1027244 1037708 966762 938289 884177 864141 911040 891939 876277 912294 854837 875447
5121H75447O7062m9812k1758N0132p498P269m381K1577M9262O8374o340j4852
$$ 875447 942509 892697 870939 921071 913573 920842 916461 938038 987300 1055674 1049334 1034482
5109A034482R970j7928q958K3947k4694j4330N3845N1272K2155L0628N3778j7097
$$ 1034482 1044452 1026524 1017566 1041513 1016819 1002489 1056334 1107606 1129761 1160389 1214167 1197070
5097A197070l7629J02346Q1592K3794Q387M2227M647R65O1890p5884l3986J26831
$$ 1197070 1159441 1261787 1343379 1367173 1375560 1417787 1422434 1423399 1485289 1409405 1375419 1502250
5085A502250K9809L9895L1491n9291M3223J3746k6196j4550M4204k1613J5360
$$ 1502250 1532059 1571954 1603445 1544154 1587377 1601123 1574927 1560377 1604581 1582968 1598328
5074A598328M22M6108J7057R515J38137N1323K9911Q3226K7096M2878M7272J10524
$$ 1598328 1598750 1644858 1661915 1671430 1809567 1860890 1890801 1974027 2001123 2044001 2091273 2201797
5062B201797p92k1718n9822m1437L5391K4440j2457k9698p1142o6235n0207p010
$$ 2201797 2201005 2179287 2119465 2078028 2113419 2137859 2125402 2095704 2024562 1958327 1908120 1901110
5050A901110N3295O755n980O9957J5526o22L4966J02002L9622l7672k1767p9100
$$ 1901110 1954405 1961160 1955180 2025137 2040663 2040041 2075007 2177009 2216631 2178959 2157192 2078092
5038B078092r558J2730m1699m2306K4913Q797j6853p2391r566q370o206J1448
$$ 2078092 2068534 2081264 2039565 1997259 2022172 2030969 2014116 1941725 1932159 1923789 1917583 1929031
5026A929031j2817j0804l3277N9548l0254p7189j4164n3424k3332M9533J0313
$$ 1929031 1916214 1905410 1872133 1931681 1901427 1824238 1810074 1756650 1733318 1782851 1793164
5015A793164K8314J5986P01N7475M968Q487k839M7174J5292k3974k414j7276m805
$$ 1793164 1821478 1837464 1838165 1895640 1900608 1909095 1906256 1953430 1968722 1944748 1942334 1925058 1920253
5002A920253J0122q353L7634j480k8834J2240L6506K9619J8540Q795K1025r621
$$ 1920253 1930375 1922022 1959656 1958176 1929342 1941582 1978088 2007707 2026247 2035042 2056067 2046446
4990B046446P0548L7161K3351k3470N2065J0689P2067Q6993j4707Q0344O1538
$$ 2046446 2116994 2154155 2177506 2154036 2206101 2216790 2288857 2375850 2361143 2441487 2503025
4979B503025k0966K2972q958J8316M9058J1686l9179M347O9392J33022J48997
$$ 2503025 2482059 2505031 2496073 2514389 2563447 2575133 2535954 2540301 2609693 2742715 2891712
4968B891712j094m3039N3305N7299M2614R2646Q6554O9058L8465L1764P8479R8689
$$ 2891712 2890618 2847579 2900884 2958183 3000797 3093443 3179997 3249055 3287520 3319284 3397763 3496452
4956C496452Q2378J58575R4886J35283J00085J83177J45239J12044K13587J06923
$$ 3496452 3578830 3737405 3832291 3967574 4067659 4250836 4396075 4508119 4721706 4828629
4946D828629J55151J60270J56161Q4890J52980J34145R0980J57679R7538J16665
$$ 4828629 4983780 5144050 5300211 5385101 5538081 5672226 5763206 5920885 6018423 6135088
4936F135088Q9623J46262K40357J60340J74814J99271L68431L82175M30079N07927
$$ 6135088 6224711 6370973 6611330 6771670 6946484 7145755 7514186 7896361 8326440 8834367
4926H834367M97878L89168K31330J27829J0236m1318r1530r1469p3015q966j2599
$$ 8834367 9332245 9721413 9952743 10080572 10090808 10049490 9957960 9866491 9793476 9784510 9771911
4915I771911J21978J26554J75785K45332K72020K86616K29068K31882k1402j54653
$$ 9771911 9893889 10020443 10196228 10441560 10713580 11000196 11229264 11461146 11439744 11285091
4905A1285091j79887k44474k43946j59340j8693M5903l1770O7689K26563K51311
$$ 11285091 11105204 10860730 10616784 10457444 10438751 10484654 10452884 10520573 10747136 10998447
4895A0998447K62886K73600L11847K56663M31487M34172M11189M86265N64889
$$ 10998447 11261333 11534933 11846780 12103443 12534930 12969102 13380291 13866556 14431445
4886A4431445M80379O48527O34927P36244P35048Q92721R86769J072295J253147
$$ 14431445 14911824 15560351 16195278 16931522 17666570 18559291 19546060 20618355 21871502
4877B1871502J299237J486324J567754J543149J610909J651213J443780J257841
$$ 21871502 23170739 24657063 26224817 27767966 29378875 31030088 32473868 33731709
4869C3731709J075921R32843R28047P47344O13823O66136P10436P24183Q34803
$$ 33731709 34807630 35740473 36668520 37415864 38029687 38695823 39406259 40130442 40965245
4860D0965245J037198J242577J512508J773124K093864K343859K641852K913198
$$ 40965245 42002443 43245020 44757528 46530652 48624516 50968375 53610227 56523425
4852E6523425L127602L311422L378412L133837K405241J497517P49215R1551k26141
$$ 56523425 59651027 62962449 66340861 69474698 71879939 73377456 74126671 74218222 73992081
4843G3992081m50214m41868l41352k77581l44450n84974o85109p55176m99838
$$ 73992081 73541867 73099999 72758647 72481066 72136616 71551642 70866533 70111357 69611519
4834F9611519j51773L05566Q74220J109814R33062M71149r1003k39629k56249
$$ 69611519 69459746 69765312 70639532 71749346 72682408 73153557 73062554 72822925 72566676
4825G2566676j84625j67515j66399k88617n94089q25244j123517j315769j411911
$$ 72566676 72382051 72214536 72048137 71759520 71165431 70340187 69216670 67900901 66488990
4816F6488990j407610j401975j094443q88746o43061l87969k19719O881L44255
$$ 66488990 65081380 63679405 62584962 61696216 61053155 60665186 60445467 60452348 60796603
4807F0796603M93441P86325J128510J498698J812509K101870K418611K549539
$$ 60796603 61290044 62076369 63204879 64703577 66516086 68617956 71036567 73586106
4799G3586106K743530L076770L272043L334578L035848K153200Q25272n82797
$$ 73586106 76329636 79406406 82678449 86013027 89048875 91202075 92027347 91444550
4791I1444550j677488k228918k248578k027905j441622q76893j43596M15675P48770
$$ 91444550 89767062 87538144 85289566 83261661 81820039 80943146 80799550 81215225 81963995
4782H1963995J145263J274974J261481J339623J755305K115143K241075K106470
$$ 81963995 83109258 84384232 85645713 86985336 88740641 90855784 93096859 95203329
4774I5203329J647071J393318J433712J649966K029043K290538K426343K349764
$$ 95203329 96850400 98243718 99677430 101327396 103356439 105646977 108073320 110423084
4766A10423084J925265R16760n54401k148134l480072m193139m208858m132433
$$ 110423084 112348349 113265109 112710708 110562574 107082502 102889363 98680505 94548072
4758I4548072l836383l516816l288718l065918k640261k095577j721346j377368
$$ 94548072 90711689 87194873 83906155 80840237 78199976 76104399 74383053 73005685
4750G3005685r94897q37555n80078l96323l82780l68313m74259p28267q48427
$$ 73005685 72010788 71173233 70593155 70196832 69814052 69445739 68971480 68243213 67394786
4741F7394786r90290j277639j561923j785251k006103k068560k132983k036728
$$ 67394786 66404496 65126857 63564934 61779683 59773580 57705020 55572037 53535309
4733E3535309j686862j409064r24541l75476K66180L07170r3657j058090k089066
$$ 53535309 51848447 50439383 49514842 49139366 49405546 49712716 49619059 48560969 46471903
4724D6471903k843493l064032k866153k469716k178652j781154j266094r21635
$$ 46471903 43628410 40564378 37698225 35228509 33049857 31268703 30002609 29080974
4716B9080974m47239R1374N64261J035620J190810O39173l14793j236097k093590
$$ 29080974 28633735 28725109 29289370 30324990 31515800 32154973 31840180 30604083 28510493
4707B8510493k279594k201070k018453j703190j330150j085147r16558q05193
$$ 28510493 26230899 24029829 22011376 20308186 18978036 17892889 16976331 16171138
4699A6171138o50556m95009m30977k94357k77838j67889j66844j06803J2020O3967
$$ 16171138 15520582 15025573 14594596 14300239 14022401 13854512 13687668 13580865 13592885 13656852
4689A3656852J78957K40048L28721L22173K37328L5485k92677m75011n25127n28100
$$ 13656852 13835809 14075857 14404578 14726751 14964079 14999564 14706887 14231876 13706749 13178649
4679A3178649m53635m65596l94942k64258k45961j70529k33387j52806n7012m9992
$$ 13178649 12725014 12259418 11864476 11600218 11354257 11183728 10950341 10797535 10740523 10690531
4669A0690531n2468k3046n2481l1191P4275Q3735J64349J57575J30910J30757
$$ 10690531 10638063 10615017 10562536 10531345 10605620 10689355 10853704 11011279 11142189 11272946
4659A1272946K06595K81647L38380M20638M54986O34563P99026R70334J196009
$$ 11272946 11479541 11761188 12099568 12520206 12975192 13609755 14408781 15379115 16575124
4650A6575124J390646J272706J099891O75026K05344K3175O4817K82308P55311
$$ 16575124 17965770 19238476 20338367 21013393 21218737 21241912 21306729 21589037 22344348
4641B2344348J314859J734325J904635J767711J170699K62886n47055q19326n78840
$$ 22344348 23659207 25393532 27298167 29065878 30236577 30499463 29952408 29133082 28554242
4632B8554242k16861L76047Q07502J313620J733568K039843K044707J460373L04985
$$ 28554242 28337381 28713428 29520930 30834550 32568118 34607961 36652668 38113041 38418026
4623C8418026j119603k228057k574540k487478k174802j655594j208184p40389
$$ 38418026 37298423 35070366 32495826 30008348 27833546 26177952 24969768 24229379
4615B4229379n54246l60973k09608j19727o2151L0706L07493P09343J150811J551419
$$ 24229379 23675133 23314160 23104552 22984825 22922674 22953380 23260873 23970216 25121027 26672446
4605B6672446K070035K597397K989713L206420K974063K270345J289288J93978
$$ 26672446 28742481 31339878 34329591 37536011 40510074 42780419 44069707 44263685
4597D4263685l67767l45527L8667O71074J190626J514234J357613P26676k23466
$$ 44263685 43895918 43550391 43589058 44260132 45450758 46964992 48322605 49049281 48825815
4588D8825815j015753j437147j376421j205309j161949j421619j977531k389322
$$ 48825815 47810062 46372915 44996494 43791185 42629236 41207617 39230086 36840764
4580C6840764k550632k305647j937362j532401q82466k86732L23387J071328J694393
$$ 36840764 34290132 31984485 30047123 28514722 27632256 27345524 27668911 28740239 30434632
4571C0434632J933400J698331J074447L30106k58881n55665o37873n39726l53642
$$ 30434632 32368032 34066363 35140810 35470916 35212035 34656370 34018497 33478771 33125129
4562C3125129j67834N0535R8382l8355l17977o10955q12484q15289n37113k75214
$$ 33125129 32957295 33007830 33106212 33067857 32749880 32138925 31326441 30511152 29974039 29698825
4552B9698825K7386L58221N62834P23274N35533L40900j55311q65423j382966
$$ 29698825 29726211 30084432 30647266 31370540 31906073 32246973 32091662 31226239 29843273
4543B9843273j581389j463347j052822o29138m2708M80240P42869O67293P2534
$$ 29843273 28261884 26798537 25745715 25116577 25073869 25554109 26296978 26964271 27036805
4534B7036805n53337r93872j009783q17464m21627j71943J18109L58031M10635
$$ 27036805 26483468 25489596 24479813 23662349 23240722 23068779 23186888 23544919 23955554
4525B3955554K30439q8251m56277p36132r53742j145930j113541j070119r14997
$$ 23955554 24185993 24097742 23641465 22905333 21951591 20805661 19692120 18622001 17707004
4516A7707004q72783q08217o52594m09689m28106l70135k99030k98304j95421
$$ 17707004 16834221 16026004 15373410 14963721 14535615 14165480 13866450 13568146 13372725
4507A3372725j12655j15077j80624j42634r4010p1635r5555j26138k8064l6326
$$ 13372725 13260070 13144993 12964369 12821735 12727725 12656090 12560535 12434397 12406333 12370007
4497A2370007m3950J9673O4178m5042l2370o1369n3854j54881j56688j21335k15999
$$ 12370007 12326057 12345730 12409908 12364866 12332496 12271127 12217273 12062392 11905704 11784369 11568370
4486A1568370j29275j60295q9659q1575o9368j3370M4600M5720J3539P1737M9115
$$ 11568370 11439095 11278800 11189141 11107566 11038198 11024828 11069428 11115148 11128687 11200424 11249539
4475A1249539o7618p987k360m1535j3912k6366k1859n1882j88294j01050j07266
$$ 11249539 11181921 11173934 11171574 11130039 11116127 11089761 11067902 11016020 10827726 10726676 10619410
4464A0619410j64888k64605j58980j54476j28497j04178j4329j25439j73846J1225
$$ 10619410 10454522 10189917 10030937 9876461 9747964 9643786 9629457 9504018 9330172 9341397
4454I341397o25m992r6841J1973M2065k9669J9117J9141R149L0240j3000J68K7386
$$ 9341397 9340772 9335780 9238939 9250912 9292977 9263308 9282425 9301566 9310715 9340955 9327955 9328123 9355509
4441I355509K5140P7262L1311P453L6818N7749O7O4885P0434M7194J45658N039
$$ 9355509 9380649 9457911 9489222 9496675 9533493 9591242 9591309 9656194 9726628 9773822 9919480 9924519
4429I924519P2974J05116L4564Q254M1302R5430K8383N3361J24044M2533J3712
$$ 9924519 9997493 10102609 10137173 10145427 10186729 10282159 10310542 10363903 10487947 10530480 10544192
4418A0544192P2001J09986O0005k3638P1708O8916Q6453J51110J81441K05862
$$ 10544192 10616193 10726179 10786184 10762546 10834254 10903170 10989623 11140733 11322174 11528036
4408A1528036K24321J76433M2374n3052p8955j26346p3304m4196j808L3499L0416
$$ 11528036 11752357 11928790 11971164 11918112 11839157 11712811 11639507 11595311 11593503 11627002 11657418
4397A1657418M3346l3306O5427j3088M3558N2946J4985M1914L4258J4596M774
$$ 11657418 11700764 11667458 11732885 11719797 11763355 11816301 11831286 11873200 11907458 11922054 11926828
4386A1926828N8699Q2076L3600J06596L1923k2300J3777m751J32903P4906j4658
$$ 11926828 11985527 12067603 12101203 12207799 12239722 12217422 12231199 12226448 12359351 12434257 12419599
4375A2419599q378J1167K4041R2211Q0049J03974Q1411P6323R3303k8631L6957
$$ 12419599 12411221 12422388 12446429 12538640 12618689 12722663 12804074 12880397 12973700 12945069 12982026
4364A2982026P3802o1093j5103J18726P2123L0199L7134R2761O891R9315Q4444
$$ 12982026 13055828 12994735 12979632 13098358 13170481 13200680 13237814 13330575 13337466 13436781 13521225
4353A3521225P4811O5968P9639j0969L1420J08074P6402M4467L5040M7851M0418
$$ 13521225 13596036 13662004 13741643 13730674 13762094 13870168 13946570 13991037 14026077 14073928 14114346
4342A4114346J92014J80552R5517J08877J54507J76952J44014J46736O4956K6493
$$ 14114346 14306360 14486912 14582429 14691306 14845813 15022765 15166779 15313515 15378471 15404964
4332A5404964k3236n3433Q7710j9466M5918k017N8017J80738R3051J24757J12326
$$ 15404964 15381728 15328295 15416005 15396539 15442457 15440440 15498457 15679195 15772246 15897003 16009329
4321A6009329R5318J03577Q5797M2512K4620M1557n6119N3840j0831n4677j37374
$$ 16009329 16104647 16208224 16294021 16336533 16361153 16402710 16346591 16400431 16389600 16334923 16197549
4310A6197549j36947r9999j4494p1363p4302k4938K445L0093J18447J08913M8911
$$ 16197549 16060602 15960603 15946109 15874746 15800444 15775506 15777951 15808044 15926491 16035404 16084315
4299A6084315n201k9159j3200j2956q9868k2341L6183o0234O087l968k6534o5761
$$ 16084315 16079114 16049955 16036755 16023799 15933931 15911590 15947773 15887539 15893626 15889658 15863124 15797363
4287A5797363n7422k410k1702j0739O6542R7500J57490K25288K30782J16231J34060
$$ 15797363 15739941 15737531 15715829 15705090 15771632 15869132 16026622 16251910 16482692 16598923 16732983
4276A6732983J01844K9340r7367n512j35288R907k3665K1101l6592K7423O9051
$$ 16732983 16834827 16864167 16766800 16761288 16626000 16635907 16612242 16633343 16596751 16624174 16693225
4265A6693225m30j9993l7025l5540j5358P3196Q6006r212J030L8141l3427j30890
$$ 16693225 16692795 16672802 16635777 16600237 16584879 16658075 16744081 16734869 16735899 16774040 16740613 16609723
4253A6609723k40206k72058l09322k46315k43665j31951j83829j08051n0264l358
$$ 16609723 16369517 16097459 15788137 15541822 15298157 15166206 14982377 14874326 14824062 14820704
4243A4820704J4890n3918j10013n5724j01016j52840j27316k3109j22516O3465
$$ 14820704 14835594 14781676 14671663 14615939 14514923 14362083 14234767 14211658 14089142 14152607
4233A4152607l7865r8538P04p4311j46783j54745j36321j03045n1400j3497j2119
$$ 14152607 14114742 14016204 14016908 13942597 13795814 13641069 13504748 13401703 13350303 13336806 13324687
4222A3324687N3755Q9531J28941Q2838r297O0330N5404l1607R048l3231q8667
$$ 13324687 13378442 13467973 13596914 13679752 13670455 13730785 13786189 13754582 13763630 13730399 13641732
4211A3641732r5034p0076o0060q4117n4548j16743p8935p3599j579M1938J05910
$$ 13641732 13546698 13476622 13416562 13332445 13277897 13161154 13082219 13008620 13007041 13048979 13154889
4200A3154889Q4859o377K0837M9258n4706p7013j77829j46955j09081j18176q3073
$$ 13154889 13239748 13233371 13254208 13303466 13248760 13171747 12993918 12846963 12737882 12619706 12536633
4189A2536633j48318q7343p7632k8338q776p9984P167R3042L624Q114J21762P7523
$$ 12536633 12388315 12300972 12223340 12195002 12186226 12106242 12113409 12206451 12210075 12218189 12339951 12417474
4177A2417474M1019O6294O8801R1777K05114J36049O9979J75761J26043K32257
$$ 12417474 12458493 12524787 12593588 12685365 12890479 13026528 13096507 13272268 13398311 13630568
4167A3630568L08650K46612L56406L83580L61463L41065M99185N55265N79684
$$ 13630568 13939218 14185830 14542236 14925816 15287279 15628344 16127529 16682794 17262478
4158A7262478N73614N23988N54548N74687M75805M52208M15569M28581M10859
$$ 17262478 17836092 18360080 18914628 19489315 19965120 20417328 20832897 21261478 21672337
4149B1672337L88789N69412O36695R59513J357358J784103J906149J383333P55573
$$ 21672337 22061126 22630538 23267233 24226746 25584104 27368207 29274356 30657689 31413262
4140C1413262K71051J436k34260l12237p5488R1181J23805L08847M84370N49348
$$ 31413262 31684313 31685749 31451489 31139252 31063764 31154945 31278750 31587597 32071967 32621315
4130C2621315N30359O66514O04237N84496O65055P07363O45922P45940O54532
$$ 32621315 33151674 33818188 34422425 35006921 35671976 36379339 37025261 37771201 38425733
4121C8425733P00422Q04699Q55639J012803J271704J569357J742361J700841J455118
$$ 38425733 39126155 39930854 40786493 41799296 43071000 44640357 46382718 48083559 49538677
4112D9538677J255016Q27017M52410K81199K27048J19646J32796K47811K18115
$$ 49538677 50793693 51620710 52073120 52354319 52581367 52701013 52833809 53081620 53299735
4103E3299735K85766M39954N91804P24098P21572O93748N18416M87599M82776
$$ 53299735 53585501 54025455 54617259 55341357 56062929 56756677 57275093 57762692 58245468
4094E8245468L89500M40843O13011R51322J404166J879511K335748K668427K743440
$$ 58245468 58634968 59075811 59688822 60640144 62044310 63923821 66259569 68927996 71671436
4085G1671436K758831K589633K164104J946686J778013J615355J529436J409233
$$ 71671436 74430267 77019900 79184004 81130690 82908703 84524058 86053494 87462727
4077H7462727J163784J031541P55863O63223M74470K25874m8150j41352n2559
$$ 87462727 88626511 89658052 90413915 91077138 91551608 91777482 91729332 91587980 91535421
4068I1535421N2393J96943L01644J10966J31404J41465L3296j1845n4194J5212
$$ 91535421 91587814 91784757 92086401 92197367 92328771 92470236 92503532 92491687 92437493 92452705
4058I2452705k0261Q1817J48215L43066M04116M68802O82379N65724L94919J50863
$$ 92452705 92432444 92514261 92662476 93005542 93409658 93878460 94560839 95126563 95521482 95672345
4048I5672345k29117n56398p24374j051440j359056j610838j593227j489840j665807
$$ 95672345 95443228 94886830 94162456 93111016 91751960 90141122 88547895 87058055 85392248
4039H5392248k043931k612963l076673l315773l315777k827347k286425j784580
$$ 85392248 83348317 80735354 77658681 74342908 71027131 68199784 65913359 64128779
4031F4128779j324203r15625n94400n54899n55438o11612n41241n92676o65370
$$ 64128779 62804576 61888951 61294551 60739652 60184214 59572602 59031361 58438685 57773315
4022E7773315o92856q44566r53619r63234r87079q25209n79663m44091k02860
$$ 57773315 57080459 56235893 55282274 54319040 53331961 52506752 51927089 51482998 51280138
4013E1280138r7490j91943m80352r59990j439787j789827j780514j724508j472363
$$ 51280138 51182648 50990705 50510353 49550363 48110576 46320749 44540235 42815727 41343364
4004D1343364j224398j056842q32439p54078p78703q45497q72257r17845r18056
$$ 41343364 40118966 39062124 38229685 37475607 36696904 35851407 34979150 34061305 33143249
3995C3143249p81743p42867p12878o79291n72847m32757l84952l92717l01921
$$ 33143249 32361506 31618639 30905761 30226470 29653623 29220866 28835914 28443197 28141276
3986B8141276l87543m54552m99863p73487p53494q11516q66460p30836o97006
$$ 28141276 27753733 27299181 26799318 26025831 25272337 24460821 23594361 22863525 22166519
3977B2166519n67051n35779m23655n26488m81684m12468m19789k85597j78638
$$ 22166519 21599468 21063689 20640034 20113546 19631862 19219394 18799605 18514008 18335370
3968A8335370k67489k15597k28059k72795l47886l46762l42279l57487l57862
$$ 18335370 18067881 17852284 17624225 17351430 17003544 16656782 16314503 15957016 15599154
3959A5599154l95065l68715k58872j71177q8835o6747n7971m2934m6554P3562
$$ 15599154 15204089 14835374 14576502 14405325 14316490 14249743 14191772 14148838 14102284 14175846
3949A4175846O4126M8293O7148J23708N9343P7462J20702M3242j3842M4220K8412
$$ 14175846 14239972 14288265 14355413 14479121 14538464 14615926 14736628 14779870 14766028 14810248 14838660
3938A4838660J08264J52680K46555K70508K17882K38287K07306K29929K16076
$$ 14838660 14946924 15099604 15346159 15616667 15834549 16072836 16280142 16510071 16726147
3929A6726147L23260K72226K62781L29725L14997L07031K58365K14759K50044
$$ 16726147 17049407 17321633 17584414 17914139 18229136 18536167 18794532 19009291 19259335
3920A9259335L02702K70180K63579L17300L75775M10583M34490M38683N40112
$$ 19259335 19562037 19832217 20095796 20413096 20788871 21199454 21633944 22072627 22612739
3911B2612739M96952N97171N71115N81195O31333O78939P11902P40638O92200
$$ 22612739 23109691 23706862 24277977 24859172 25490505 26169444 26881346 27621984 28314184
3902B8314184P77510Q16173P95957R12466R66089R50989R97149J066877J139110
$$ 28314184 29091694 29907867 30703824 31616290 32582379 33533368 34530517 35597394 36736504
3893C6736504J237017J237533J257874J221528J310381J350099J399125J476877
$$ 36736504 37973521 39211054 40468928 41690456 43000837 44350936 45750061 47226938
3885D7226938J539981J557367J396374J240060R75794O43388M51580K92500K08136
$$ 47226938 48766919 50324286 51720660 52960720 53936514 54579902 55031482 55323982 55532118
3876E5532118L22349L52243M70811N68091O51085P86668P59361N97638M40101
$$ 55532118 55854467 56206710 56677521 57245612 57896697 58683365 59442726 60040364 60480465
3867F0480465J77916j67689o57383r10947j058595j021367q63322n75743l03671
$$ 60480465 60658381 60490692 59833309 58922362 57863767 56842400 55979078 55403335 55099664
3858E5099664n9931n4197l04444m53157p64059q44228j010187j004553q70010
$$ 55099664 55039733 54985536 54681092 54227935 53463876 52619648 51609461 50604908 49734898
3849D9734898q63813q15317n54633k07898J2071K34257M07297L31228M09415K36472
$$ 49734898 48871085 48055768 47501135 47293237 47305308 47539565 47946862 48278090 48687505 48923977
3839D8923977J61053J41487r0889k02818k77579l89771n49307n80554n03524m02945
$$ 48923977 49085030 49226517 49135628 48932810 48655231 48265460 47716153 47135599 46632075 46229130
3829D6229130k46645l5575J67969L33158M18839M09458M47303L38318N7548j99201
$$ 46229130 45982485 45946910 46114879 46448037 46866876 47276334 47723637 48061955 48119503 47920302
3819D7920302n75065r48534j342736j509996j407694j180110q73457n21112j97499
$$ 47920302 47345237 46396703 45053967 43543971 42136277 40956167 40082710 39561598 39364099
3810C9364099Q1309L36751M66023N85608O85282Q34802R66751J116718J297762
$$ 39364099 39445408 39782159 40248182 40833790 41519072 42353874 43320625 44437343 45735105
3801D5735105J223881J112736R16318N69352R7400k80427n46144q84673r87056
$$ 45735105 46958986 48071722 48988040 49557392 49654792 49374365 48828221 47943548 46956492
3792D6956492r55708q17732n58483l6210O01309J365344J988394K552087K726305
$$ 46956492 46000784 45183052 44624569 44588359 45189668 46555012 48543406 51095493 53821798
3783E3821798K670303K338973J789244J083648K58358o01099j524021k110761
$$ 53821798 56492101 58831074 60620318 61703966 61962324 61361225 59837204 57726443
3775E7726443k465105k440738k160397j746149j078226m96790Q0301L30159K78463
$$ 57726443 55261338 52820600 50660203 48914054 47835828 47339038 47419339 47749498 48027961
3766D8027961J37715q0646j60110j2149L35903P66425J458454K053791K605354
$$ 48027961 48165676 48085030 47924920 47912771 48248674 49015099 50473553 52527344 55132698
3757E5132698L004783L336597L334919L078480K529324K001131J393685Q40205
$$ 55132698 58137481 61474078 64808997 67887477 70416801 72417932 73811617 74651822
3749G4651822M75065J10225j83540l06361n49108q61044j268188j721142k276450
$$ 74651822 75126887 75237112 75053572 74747211 74198103 73337059 72068871 70347729 68071279
3740F8071279k716290k848288k911367k839594k590752k106306j518422q46872
$$ 68071279 65354989 62506701 59595334 56755740 54164988 52058682 50540260 49693388
3732D9693388k29313L02749P18457N99250K63916j66887p16478j024095j183096
$$ 49693388 49464075 49766824 50485281 51084531 51348447 51181560 50465082 49440987 48257891
3723D8257891j051680r30022q06809n80697m31266m25631n01079n95135p18651
$$ 48257891 47206211 46276189 45469380 44888683 44457417 44031786 43530707 42935572 42216921
3714D2216921r59253j108932j193768j393739j624535j663353j800776j827091
$$ 42216921 41257668 40148736 38954968 37561229 35936694 34273341 32472565 30645474
3706C0645474j665681j412101j185748r12658p06199o25417m86809n27809m85688
$$ 30645474 28979793 27567692 26381944 25469286 24763087 24137670 23650861 23123052 22637364
3697B2637364n33864o26043n47882o08567o86402n71409m70750k97848q3284J44582
$$ 22637364 22103500 21477457 20929575 20321008 19634606 19063197 18592447 18294599 18211315 18355897
3687A8355897K56995L28042M91862N26066M99088M57183K73428J49579j18999
$$ 18355897 18612892 18940934 19432796 19958862 20457950 20915133 21188561 21338140 21219141
3678B1219141l68288m77072m94229m37857k75218k47302m6157J76418K01713L75374
$$ 21219141 20850853 20373781 19879552 19441695 19166477 18919175 18873018 19049436 19251149 19626523
3668A9626523M04079L63358L78383L66471K56679Q8773K4799P259j51468k57967
$$ 19626523 20030602 20393960 20772343 21138814 21395493 21484266 21509065 21516324 21364856 21106889
3658B1106889m59054n92943q54096j003199j111631j194507j144037j064926r24371
$$ 21106889 20647835 20054892 19200796 18197597 17085966 15891459 14747422 13682496 12758125
3649A2758125p69600o22476n04534m81246m26680l36657l02600k07032j51533
$$ 12758125 11988525 11366049 10861515 10380269 9953589 9616932 9314332 9107300 8955767
3640H955767j47663q8830l1552j0353l7371R940L8558J5645J7280J1649M0735
$$ 8955767 8808104 8719274 8687722 8677369 8639998 8649938 8688496 8704141 8721421 8733070 8773805
3629H773805R3066J99450K42665K93532L17812K68216L03261K58614J78159J32264
$$ 8773805 8866871 9066321 9308986 9602518 9920330 10188546 10491807 10750421 10928580 11060844
3619A1060844J15953Q5942l562K4319P6418M2986J43944n9450n6739n8160o1393
$$ 11060844 11176797 11262739 11259177 11283496 11359914 11402900 11546844 11487394 11430655 11372495 11311102
3608A1311102j18408k29269k08588l23685l10030l05485l45085l56977k68893
$$ 11311102 11192694 10963425 10754837 10431152 10121122 9815637 9470552 9113575 8844682
3599H844682k23653j97175j51990j73918k52303k10205j65188j88515r1014r6129
$$ 8844682 8621029 8423854 8271864 8097946 7845643 7635438 7470250 7281735 7190721 7094592
3589G094592j15147j03312j45754q1774j0039k3093q478K8822m5458Q2286M1144
$$ 7094592 6979445 6876133 6730379 6648605 6638566 6615473 6606995 6635817 6590359 6672645 6713789
3578F713789J7314m0689q0844j05321j26671j05082k6239m3892o2199p9542J988
$$ 6713789 6731103 6690414 6609570 6504249 6377578 6272496 6246257 6202365 6140166 6060624 6062612
3567F062612J70025J74283J76569J47022J23747K03920J35234Q2020P2775J10400
$$ 6062612 6232637 6406920 6583489 6730511 6854258 7058178 7193412 7275432 7348207 7458607
3557G458607L5695J03568m8422M5760n877o9620j5025L6835K5668M2032J03429
$$ 7458607 7494302 7597870 7549448 7595208 7589331 7519711 7504686 7541521 7567189 7609221 7712650
3546G712650n310J05465N7546Q6510K30866R4054M2518J26606J30369P1918N0313
$$ 7712650 7707340 7812805 7870351 7956861 8187727 8281781 8324299 8450905 8581274 8653192 8703505
3535H703505l7410j17553p3704r4972o2641k9799K6677o334K9972j5121o0643
$$ 8703505 8666095 8548542 8474838 8379866 8317225 8287426 8314103 8307769 8337741 8322620 8261977
3524H261977o1720j29495k14547j15272p4453m9154j5633L433n6331o488l6905
$$ 8261977 8200257 8070762 7856215 7740943 7666490 7617336 7601703 7605136 7548805 7542317 7505412
3513G505412o1543k8731J2006M9950R6890J16865K61110K18370K76657K56249
$$ 7505412 7443869 7415138 7427144 7477094 7573984 7690849 7951959 8170329 8446986 8703235
3503H703235K89797K92462K58521K32413J28647k5440l2762j26536j25925k03432
$$ 8703235 8993032 9285494 9544015 9776428 9905075 9879635 9846873 9720337 9594412 9390980
3493I390980n7214K2821o0909K6580J08973O8459O8440J76783P6731J50175R4437
$$ 9390980 9333766 9356587 9295678 9322258 9431231 9499690 9568130 9744913 9821644 9971819 10066256
3482A0066256r644J36754J16948K3168J8165n0067q0766k62229k12079k11092
$$ 10066256 10056612 10193366 10310314 10333482 10351647 10301580 10220814 9958585 9746506 9535414
3472I535414j84562j86037j96275j00517j57681j48163q6310j56986k46053l11901
$$ 9535414 9350852 9164815 8968540 8868023 8710342 8562179 8475869 8318883 8072830 7760929
3462G760929j33183j01171k66182j70196j06611j14667j69526j41507q7756j13435
$$ 7760929 7627746 7526575 7260393 7090197 6983586 6868919 6699393 6557886 6470130 6356695
3452F356695r2926r774O0941o9250j0029O1241Q5724N696k9252m4709l9736L092
$$ 6356695 6263769 6253995 6314936 6245686 6235657 6296898 6382622 6388318 6359066 6314357 6274621 6277713
3440F277713K4776J6603N2640M2203J1763L4408N6287J11236R0088P7027J77530
$$ 6277713 6302489 6319092 6371732 6413935 6425698 6460106 6516393 6627629 6717717 6794744 6972274
3429F972274J23418J69481K50004K05529J17738J15417Q0876R0262O2273R7218
$$ 6972274 7095692 7265173 7515177 7720706 7838444 7953861 8034737 8124999 8187272 8284490
3419H284490J29139R5629K30347K31280J51907J93734J37767J42734J62276O4586
$$ 8284490 8413629 8509258 8739605 8970885 9122792 9316526 9454293 9597027 9759303 9823889
3409I823889M7738L9583O0292J27375O2532j7106q9141j06388r4250j32366p9871
$$ 9823889 9871627 9911210 9971502 10098877 10161409 10144303 10055162 9948774 9854524 9722158 9642287
3398I642287j79161k6827J0017n4487J19863J25073K7543M2284J00495Q9615J18859
$$ 9642287 9463126 9436299 9446316 9391829 9511692 9636765 9664308 9706592 9807087 9896702 10015561
3387A0015561J72599K49302K60888L12539L62294L58596L38566L70562K53135
$$ 10015561 10188160 10437462 10698350 11010889 11373183 11731779 12070345 12440907 12694042
3378A2694042J99626J15044Q2195R6835P3534J69284J19856O1579q210N2980L8132
$$ 12694042 12893668 13008712 13090907 13187742 13261276 13430560 13550416 13611995 13603785 13656765 13694897
3367A3694897N9273J88346L59945M16059N26411N68353N86770N35548N28618M89023
$$ 13694897 13754170 13942516 14302461 14718520 15244931 15813284 16400054 16935602 17464220 17953243
3357A7953243M70330M23810L84094K92438J76914J8146m7743q4438j1173Q5993
$$ 17953243 18423573 18847383 19231477 19523915 19700829 19718975 19671232 19586794 19575621 19661614
3347A9661614R8796J21065Q2497K407M7307O2532M3393O8092N9252J37904R5556
$$ 19661614 19760410 19881475 19963972 19966379 20013686 20076218 20119611 20187703 20246955 20384859 20480415
3336B0480415J12240J26483K22433L50826L73777M09853M79566N44338N49622
$$ 20480415 20592655 20719138 20941571 21292397 21666174 22076027 22555593 23099931 23649553
3327B3649553N50656P18765P98412J006955J018047J047949J251933J307856J527625
$$ 23649553 24200209 24918974 25717386 26724341 27742388 28790337 30042270 31350126 32877751
3318C2877751J818995K135397K597445L098512L627267M152709M748309N097453
$$ 32877751 34696746 36832143 39429588 42528100 46155367 50308076 55056385 60153838
3310F0153838M909683M243762L175194J697415k1149j677637l013916m170657
$$ 60153838 65063521 69307283 72482477 74179892 74158743 72481106 69467190 65296533
3302F5296533m699801m868493m805076m327422l738879l095856k604979k173110
$$ 65296533 60596732 55728239 50923163 46595741 42856862 39761006 37156027 34982917
3294C4982917j759531j307085j045222o79669m39024j60068N7095L31642O10841
$$ 34982917 33223386 31916301 30871079 30191410 29752386 29592318 29649413 29981055 30591896
3285C0591896P05042R01195J262046J561400J789003K282157K722922L054988
$$ 30591896 31296938 32198133 33460179 35021579 36810582 39092739 41815661 44870649
3277D4870649L343469L549063L647758L537195L287858K628633J717267N03322
$$ 44870649 48214118 51763181 55410939 58948134 62235992 64864625 66581892 67085214
3269F7085214p70289j512929k041585k236781k485248k682190k830604k995285
$$ 67085214 66314925 64801996 62760411 60523630 58038382 55356192 52525588 49530303
3261D9530303k999923k917533k771560k701472k446104k292257k069638j752082
$$ 49530303 46530380 43612847 40841287 38139815 35693711 33401454 31331816 29579734
3253B9579734j475988j150518r18405o88932m66219j89222r1313K8343J32264
$$ 29579734 28103746 26953228 26034823 25345891 24879672 24690450 24599137 24627480 24759744
3244B4759744p046K85550L55118L09296L69439J81037J39187K34636L01501L71120
$$ 24759744 24752698 25038248 25393366 25702662 26072101 26253138 26392325 26626961 26928462 27299582
3234B7299582N76674N10742O50096P17619Q08018P27528P89320Q88656J085431
$$ 27299582 27876256 28386998 29037094 29754713 30562731 31290259 32079579 32968235 34053666
3225C4053666J319472J499740J672190J606088J521591J561056J689732J784981
$$ 34053666 35373138 36872878 38545068 40151156 41672747 43233803 44923535 46708516
3217D6708516J903413K200642K596993L215244M145270N451711P082339R373829
$$ 46708516 48611929 50812571 53409564 56624808 60770078 66221789 73304128 82677957
3209H2677957J2388333J5890448J9718835K3099787K5105253K4575977K1646330
$$ 82677957 95066290 110956738 130675573 153775360 178880613 203456590 225102920
3202B25102920J6701285J0626109L954101k975523r712868j5852357k0986259
$$ 225102920 241804205 252430314 256384415 253408892 243696024 227843667 206857408
3195B06857408k3972473k4376036k2750919k0055772j6966563j4004923j1219815
$$ 206857408 182884935 158508899 135757980 115702208 98735645 84730722 73510907
3188G3510907q974632p050084n506700m267722l337124k528829j855260j478157
$$ 73510907 64536275 57486191 51979491 47711769 44374645 41845816 39990556 38512399
3180C8512399j196148j063156r14246q92259q79591q29387o43306m58964k95710
$$ 38512399 37316251 36253095 35338849 34446590 33566999 32737612 32094306 31635342 31339632
3171C1339632p0704R5313K09873L73594N53553O47619O96754O44681M98830L23083
$$ 31339632 31268928 31364241 31574114 31947708 32501261 33148880 33845634 34490315 34989145 35312228
3161C5312228J63199K39614L99201O37795P74115R09809O83844K42091k02411
$$ 35312228 35475427 35715041 36114242 36752037 37526152 38435961 39119805 39361896 39159485
3152C9159485l70520l84597m32274m77414n00640n39186m16322k72069j95843
$$ 39159485 38788965 38404368 37972094 37494680 36994040 36454854 36038532 35766463 35570620
3143C5570620j2131J66250L16441M07146O18732P31181R14642J052603J329519
$$ 35570620 35558489 35724739 36041180 36448326 37067058 37798239 38712881 39765484 41095003
3134D1095003J532989J705608J796646J996537K041782K036032K111803K287609
$$ 41095003 42627992 44333600 46130246 48126783 50168565 52204597 54316400 56604009
3126E6604009K480108L070018L807704M593515N902878P502447R468151J1574187
$$ 56604009 59084117 62154135 65961839 70555354 76458232 83960679 93428830 105003017
3118A05003017J3618855J4969314J5017402J3550061J0994211Q276776O124883
$$ 105003017 118621872 133591186 148608588 162158649 173152860 181429636 187554519
3111A87554519M627333L575328K981394L024110M004626O333746J0024670J4387639
$$ 187554519 192181852 195757180 198738574 201762684 205767310 212101056 222125726 236513365
3103B36513365J8029279J9448391J6234586P287536m122548j1988287j3471006
$$ 236513365 254542644 273991035 290225621 297513157 293390609 281402322 267931316
3096B67931316r495829k411524N541113J1662099J2873404O560195n446808j6582294
$$ 267931316 258435487 256023963 261565076 273227175 286100579 292660774 287213966 270631672
3088B70631672k2089429k1720612j7560943j1461398m452208K297229P760347
$$ 270631672 248542243 226821631 209260688 197799290 193347082 195644311 203404658
3081B03404658J1104221J1620173R206789N395509J814015j46112K14132J971246
$$ 203404658 214508879 226129052 235335841 240731350 242545365 242399253 242613385 244584631
3073B44584631L566425L370612M68147m102432r066110j3420206j6452759j8974308
$$ 244584631 248151056 251521668 251989815 247887383 238821273 225401067 208948308 189974000
3065A89974000k0473902k0187593j8098305j5158304j1957115q736826n371566
$$ 189974000 169500098 149312505 131214200 116055896 104098781 95361955 89990389
3058H9990389j935807J368729M055835N542135N211205K992329m47022m208302
$$ 89990389 88054582 89423311 93479146 99021281 104232486 107224815 106777793 102569491
3050A02569491p304367r060071r448607q825803p571869o117206m787709l752707
$$ 102569491 95265124 86205053 76756446 67930643 60358774 54241568 49453859 45701152
3042D5701152k926251k351032j786617j234279o52998j80488M82509J352124K438175
$$ 45701152 42774901 40423869 38637252 37402973 36749975 36569487 37051996 38404120 40842295
3033D0842295L709599M659766N045560M995934M719476M523192L953311K720769
$$ 40842295 44551894 49211660 54257220 59253154 63972630 68495822 72449133 75169902
3025G5169902P21242j596858l900111n881736p057186p236629o621668n545916
$$ 75169902 75891144 74294286 70394175 64512439 57455253 50218624 43596956 38051040
3017C8051040m410983l250313k457037j895616j449807j256888j080971r97597
$$ 38051040 33640057 30389744 27932707 26037091 24587284 23330396 22249425 21251828
3009B1251828j002902r22606p88150p20013m87221l75746j09466J50059J62856
$$ 21251828 20248926 19326320 18538170 17818157 17330936 16955190 16845724 16995783 17158639
3000A7158639P3431r63k18095l22087m68884n56906m65750n75387o61140n54872
$$ 17158639 17232070 17231107 17013012 16690925 16222041 15665135 15199385 14623998 13962858 13407986
2990A3407986o59815p27647o25666n79333m93502m20612l27975k57293k21626
$$ 13407986 12748171 12020524 11394858 10815525 10322023 9901411 9573436 9316143 9094517
2981I094517k65522k52281j99032j99387j54393j22075k4771j3422R5824K9798
$$ 9094517 8828995 8576714 8377682 8178295 8023902 7901827 7877056 7863634 7959458 7989256
2971G989256J44316K71079L62908L71700M88656M31918M70703M44883M62751P16691
$$ 7989256 8133572 8404651 8767559 9139259 9627915 10059833 10530536 10975419 11438170 12154861
2961A2154861R80023J091532J045457R75578O74753L04504k22760p71984j092499
$$ 12154861 13134884 14226416 15271873 16247451 16922204 17226708 17003948 16231964 15139465
2952A5139465j335098j439224j343935j241296j045389q30406o89195n57077m56216
$$ 15139465 13804367 12365143 11021208 9779912 8734523 7904117 7214922 6657845 6201629
2943F201629l07882k35367j22858j0722K9859J09222J12348K50993P6112j5540
$$ 6201629 5893747 5658380 5535522 5524800 5554659 5663881 5776229 6027222 6103334 6087794
2933F087794q6476j12008k74154k89518k14597k99985k67453j90326k26028n6828
$$ 6087794 6001318 5889310 5615156 5325638 5111041 4811056 4543603 4353277 4127249 4070421
2923D070421p0679P8643M9842l0548m9284l9189n332l4213p2165j42329j79950
$$ 4070421 3999742 4078385 4128227 4097679 4048395 4009206 4003874 3969661 3897496 3755167 3575217
2912C575217j74108j75782k01100j24698j64919n4241j06333j04866r3801j37712
$$ 3575217 3401109 3225327 3024227 2899529 2734610 2680369 2574036 2469170 2375369 2237657
2902B237657o8979m3401n9546r2630l9304r800j376n5044J5268j0481r3118M438
$$ 2237657 2168678 2125277 2065731 1973101 1933797 1923997 1922621 1867577 1882845 1872364 1779246 1783684
2890A783684N3093q3757j4903m582m2754l4039n0251L1469p953n9575k9328l0125
$$ 1783684 1836777 1753020 1738117 1733535 1690781 1656742 1606491 1637960 1630007 1570432 1541104 1510979
2878A510979J6989L936k7800l1801l594N9516n3776m277j9497l6603P7461l1527
$$ 1510979 1527968 1531904 1504104 1472303 1468709 1528225 1474449 1470172 1450675 1414072 1491533 1460006
2866A460006j04809r410j3409l2840k0467p26L2916j9599M7654M8385j6285J3316
$$ 1460006 1355197 1345787 1332378 1299538 1279071 1278345 1311261 1291662 1339316 1387701 1371416 1384732
2854A384732M6094m80l5350R7642L6621k6856K7094M7504K9868K9609o9463P8084
$$ 1384732 1430826 1430346 1394996 1492638 1529259 1502403 1529497 1577001 1606869 1636478 1567015 1645099
2842A645099L6846j3380m7660R444k1999L9907P8238K5175M9758Q3680R0863J7054
$$ 1645099 1681945 1668565 1620905 1630349 1608350 1648257 1726495 1751670 1801428 1885108 1975971 1993025
2830A993025K0446K3275L0100J01078P0652Q517J6102P541L7869L8639M0195M0085
$$ 1993025 2013471 2036746 2066846 2167924 2238576 2247093 2263195 2270736 2308605 2347244 2387439 2427524
2818B427524q625l6183o3280r0399r0610o2504m7422N9498P4162J3797R390o7156
$$ 2427524 2418899 2382716 2319436 2229037 2138427 2075923 2028501 2087999 2162161 2175958 2185348 2118192
2806B118192m0944j14992j18682n4122o6487n2082l6161R8520N5304J42273Q3658
$$ 2118192 2077248 1962256 1843574 1789452 1722965 1670883 1634722 1733242 1788546 1930819 2014477
2795B014477l2752Q617r911M6557N1884O4823P7534R388r18m2754p3866n3396
$$ 2014477 1981725 1990342 1980431 2026988 2078872 2143695 2221229 2230617 2229699 2186945 2113079 2059683
2783B059683k4269j28511j26223j54232j04007r5946j36354k8574j9036l4211
$$ 2059683 2035414 1906903 1780680 1626448 1522441 1426495 1290141 1261567 1242531 1208320
2773A208320n2097J00768K3363J1912j0502J6326j7145l3929l8934k1921r8854
$$ 1208320 1156223 1256991 1280354 1292266 1281764 1298090 1280945 1247016 1208082 1186161 1087307
2762A087307k2533q4216j28103q388j1835m6446p2358k6520n4085l8738o0548
$$ 1087307 1064774 980558 852455 844067 832232 785786 713428 686908 632823 594085 533537
2751E33537m3915J2951J2280K1421o353L4509J6360o268l0132P663p0746k3541
$$ 533537 489622 502573 514853 536274 529921 564430 580790 574522 544390 552053 481307 457766
2739D57766l8645N7048n3328o911k0012o749p9679j04831N1716k5620J685n5794
$$ 457766 419121 476169 422841 415930 395918 389169 309490 204659 256375 230755 232440 176646
2727A76646J8192M9889n4283p987P752k814j8324O7695p806m5058j608K9733J1657
$$ 176646 194838 244727 190444 182457 190209 187395 169071 236766 228960 183902 182294 212027 223684
2714B23684k6782k0797r523m7139J6802p413n4193N9657Q2076j9562k7902m8277
$$ 223684 196902 176105 166582 119443 136245 128832 74639 134296 216372 196810 168908 120631
2702A20631l5672M2821K1586K1690L0345L5637o1927L2732l2916j5864Q868L6978
$$ 120631 84959 127780 149366 171056 201401 237038 175111 207843 174927 159063 167931 204909
2690B04909J9213k8651k5272N095L0565M6390M485k5416M1915j9428j32130O0344
$$ 204909 224122 195471 170199 175294 205859 252249 256734 231318 273233 253805 121675 182019
2678A82019M0048k7568j4282Q534o8137J24394k2042m9765n1495M5159m3189j8062
$$ 182019 222067 194499 180217 188751 120614 245008 222966 173201 121706 166865 123676 105614
2666A05614P659L6243k8530k7735O0314j7709l2823N6742Q2432K1598j0688j4661
$$ 105614 113273 149516 120986 93251 153565 135856 103033 159775 242207 263805 253117 238456
2654B38456n4839J3881l2171p9878j1618K342l9110l8270K5986Q2029N0194k4664
$$ 238456 183617 197498 165327 85449 73831 76173 37063 -1207 24779 106808 157002 132338
2642A32338l9965l322K7789M7190j6265k6342J6982M4457K1887k2305Q1257k5631
$$ 132338 92373 89051 116840 164030 147765 121423 138405 182862 204749 182444 263701 238070
2630B38070N6546L3177n136p0025l4136k9593q9717J0288J2612J2631k8323n8465
$$ 238070 294616 327793 322657 252632 218496 188903 99186 109474 122086 134717 106394 47929
2618D7929L547j5880L0005q195k5924P4188j9591o1783P434j0294m482l4766K8602
$$ 47929 51476 35596 65601 57406 31482 105670 86079 24296 31730 21436 16954 -17812 10790
2605A0790K0621N5217p2490q1456r179O6084J0052J5942L2116L5357k4488l6926
$$ 10790 31411 86628 14138 -67318 -76497 -10413 -361 15581 47697 83054 58566 21640
2593B1640q133k2962l591M0927o3903J3872J516j3301L992K3905k9588N660l1979
$$ 21640 13507 -9455 -13046 27881 -36022 -22150 -20634 -33935 -29943 -6038 -35626 -29966 -61945
2580f1945J6401l3826j6204m417R936Q2198L031n661j3242Q885J765j0209j0079
$$ -61945 -45544 -79370 -95574 -99991 -90055 -7857 -4826 -10487 -23729 -14844 -13079 -23288 -33367
2567c3367k6506K6823k9478N35K1289r854Q991P1376l9487n7528r004j140M1812
$$ -33367 -59873 -33050 -62528 -61993 -40704 -50558 -41567 29809 -9678 -67206 -76210 -77350 -35538
2554c5538l1005L6585M0492m405L294N225m0168l7885K1899Q937O4776p3525k8332
$$ -35538 -66543 -29958 10534 6129 9423 14648 -25520 -63405 -41506 -32569 32207 -41318 -69650
2541f9650O6476L0511j8309k6084K909J460K8667n1635M4659O4334r09p0798k9823
$$ -69650 -3174 27337 9028 -17056 -14147 -12687 15980 -35655 9004 73338 72429 1631 -28192
2528b8192n4498q217J4448k098J2126Q2179J890m0049m6843L0151L8867m201j2652
$$ -28192 -82690 -90907 -76459 -78557 -66431 15748 17638 -22411 -69254 -39103 -236 -4437 -17089
2515a7089k2265Q8139n80j0456M6962m5423k4428j2843Q06J8274K4016J0006j9830
$$ -17089 -39354 48785 48205 37749 84711 39288 14860 2017 2823 21097 45113 55119 35289
2502C5289O779l3253k6075n1910j3845O1169m040O7720j6429R916J9057k871j0459
$$ 35289 42068 8815 -17260 -69170 -83015 -21846 -25886 41834 25405 35321 54378 51507 41048
2489D1048K3635N7600R985l9012M4287J4555n9187k2547n5328j2595Q1743M0035
$$ 41048 64683 122283 132268 93256 137543 152098 92911 70364 15036 2441 84184 124219
2477A24219M3773n9357L405P729K2245n1510K7942M4507K2336o345j8079k7930
$$ 124219 167992 108635 112040 119769 142014 90504 118446 162953 185289 178944 160865 132935
2465A32935l2163m5304k560M4372M5875p142O8197M2708K7515q0605l8209k7632
$$ 132935 100772 55468 52908 97280 143155 136013 204210 246918 274433 193828 155619 127987
2453A27987L2057N8964K6152n0277m8847P266L5610R301Q9522j9975K6801J4082
$$ 127987 160044 219008 245160 194883 146036 153302 188912 198213 287735 267760 294561 308643
2441C08643j4650k1623L168M5176J5267L6956N1166K3550r1267j1422J4133K3117
$$ 308643 293993 272370 275538 320714 335981 372937 424103 447653 356386 344964 359097 382214
2429C82214M8705P020M1188j1293J3494L7509k512K5856P105L3290p0456O2420
$$ 382214 430919 437939 479127 467834 481328 518837 516325 542181 549286 582576 512120 574540
2417E74540M9639K8869L9726R929o274R8738l0023M0726K0008N3289P7385L3959
$$ 574540 624179 653048 692774 702703 696429 795167 765144 805870 825878 879167 956552 990511
2405I90511j2432J19473O0989l6971o1859M6207O3891J2921K5N8786N9183N4182
$$ 990511 978079 1097552 1158541 1121570 1059711 1105918 1169809 1182730 1182755 1241541 1300724 1354906
2393A354906P6073J41951J13412J41151L5726J89242J78189K39101J73525K21806
$$ 1354906 1430979 1572930 1686342 1827493 1863219 2052461 2230650 2469751 2643276 2865082
2383B865082K94688M13617M63005N19326O80420O11088J27108K12501K14753M90447
$$ 2865082 3159770 3573387 4036392 4555718 5236138 5847226 5974334 6186835 6401588 6892035
2373F892035N35989R59499J262570J814803K829086N152534Q042923R311018R785839
$$ 6892035 7428024 8387523 9650093 11464896 14293982 19446516 27489439 36800457 46586296
2364D6586296J5458563N890321r284360j0542063r064273o884823o806675n450451
$$ 46586296 62044859 67935180 58650820 48108757 39044484 32159661 25352986 19902535
2356A9902535m217305l035279k428907j863787j411712q29008m90457j27792k33727
$$ 19902535 15685230 12649951 10221044 8357257 6945545 6116537 5626080 5498288 5264561
2347E264561m69354n02401l75834m62218l06861k75407k36313j81438j00853j42922
$$ 5264561 4795207 4292806 3916972 3454754 3147893 2872486 2636173 2454735 2353882 2210960
2337B210960k3976j32227o2853j13130l555n5570r3760k1658o9030q8810j10815
$$ 2210960 2186984 2054757 1991904 1878774 1875219 1819649 1725889 1704231 1635201 1546391 1435576
2326A435576r2924l7190r9749J0249k7974n2673n0446n3105m7958L6685l5678
$$ 1435576 1342652 1305462 1205713 1215962 1187988 1135315 1084869 1031764 983806 1020491 984813
2315I84813N312r6434k0207r4568K3507J3264j06729m6788k7887P6555L0178q6741
$$ 984813 990125 893691 873484 778916 802423 815687 708958 662170 634283 710838 741016 654275
2303F54275q2432k7141K928K6597p9418M3503k2108m2314M6365P987q1952M583
$$ 654275 571843 544702 547630 574227 494809 538312 516204 473890 520255 528242 446290 450873
2291D50873J9411o9330n0033K653m7408j7810K2421L8894n8235K4379M8172k1708
$$ 450873 470284 400954 350921 353574 306166 288356 310777 349671 291436 315815 363987 342279
2279C42279o8395N3799j2850p9483o2006J9096M012J7020l4780k2059K3913O881
$$ 342279 273884 327683 314833 235350 173344 192440 196452 213472 178692 156633 180546 187427
2267A87427k0816J3725l4275r396k085l2038j0058Q6542l1175O673n0553N2588
$$ 187427 166611 180336 146061 136665 134580 102542 92484 179026 147851 154524 103971 156559
2255A56559k9132j0529m7893l2695O5843O853l8025l4301n462L3054o879o0053
$$ 156559 127427 116898 69005 36310 102153 109006 70981 36680 31218 64272 57393 -2660
2243b660L838J8649N9701k4833M5045k3431M242o911L2055L6928m2993k5390n6877
$$ -2660 1178 19827 79528 54695 99740 76309 80551 73640 105695 142623 99630 74240 17363
2230A7363K5996N6174k0228K801n0477J0229p878n6648K4874j3132P3928K0362
$$ 17363 43359 99533 79305 82106 31629 41858 33980 -22668 2206 -10926 63002 83364
2218H3364k6821n9005K2455J5861k0718n5222O408J0004j5680j8223O6106J6766
$$ 83364 56543 -2462 19993 35854 15136 -40086 -33678 -23674 -39354 -57577 8529 25295
2206B5295K1186k9754n5725M6155m3926l5055O2317l1409l9389Q993L3360j0240
$$ 25295 46481 16727 -38998 7157 -36769 -71824 -9507 -40916 -80305 -71312 -37952 -48192
2194d8192k9412Q148L7272L6233k635k0944l5370j678M722k2363J0440j9012J8202
$$ -48192 -77604 -69456 -32184 4049 1414 -19530 -54900 -56578 -51856 -74219 -63779 -82791 -64589
2181f4589K6907o550P027M889N2496k9910m3774j6264O4918j173J2310n6904j0914
$$ -64589 -37682 -44232 -37205 -32316 20180 -9730 -53504 -69768 -4850 -6023 6287 -50617 -61531
2168f1531p4016J6101P4909K5926M4412m6151j2131K2012j8868J2429K9073l2408
$$ -61531 -135547 -119446 -44537 -18611 25801 -20350 -32481 -10469 -29337 -16908 12165 -20243
2156b0243r797M827J0160l3721j17981o04Q9149P993J6992o8943K0436L3918j5067
$$ -20243 -30040 -25213 -15053 -48774 -166755 -167359 -78210 -70217 -53225 -122168 -101732 -67814 -82881
2143h2881M3943J7081k620O978j073l5853n1639J2263k3012m1404Q1798L3628
$$ -82881 -38938 -21857 -24477 -17499 -18572 -54425 -106064 -93801 -116813 -158217 -76419 -42791
2131d2791K5913o6101K3726j7454o848J5594q5008r416M8574J4461K1859K4767
$$ -42791 -16878 -82979 -59253 -76707 -83555 -67961 -152969 -162385 -113811 -99350 -77491 -52724
2119e2724k103N9194m6095J4251J9168r0382M3323J15l897j3504L5072o864M8517
$$ -52724 -54827 4367 -41728 -27477 -8309 -98691 -55368 -55253 -59150 -72654 -37582 -44446 4071
2106D071k7683j07159P3998Q9404o8126K8357J5416m2998J16397O6608l4413m689
$$ 4071 -23612 -130771 -56773 32631 -35495 -7138 8278 -34720 81677 148285 113872 109183
2094A09183J06950q210l5390m7692M6030p6068r0127m3572K3799J3927l1910k0869
$$ 109183 216133 207923 172533 124841 170871 94803 4676 -38896 -15097 -1170 -33080 -53949
2082e3949l841J2834o838L1854l9175q5577l0717O7851M5831L5540Q782k9382
$$ -53949 -57790 -44956 -51794 -19940 -59115 -144692 -175409 -107558 -61727 -26187 -17405 -46787
2070d6787m7330J5847l145K4939o6506o813K0532k6155n37N9711J9908k194J2685
$$ -46787 -94117 -78270 -81415 -56476 -122982 -129795 -109263 -135418 -135955 -76244 -56336 -58530 -45845
2057d5845J4965k1679O7818q0216n3300J6487M239K184p393q732K6913j0670p9112
$$ -45845 -30880 -52559 15259 -64957 -118257 -101770 -97531 -95347 -102740 -111472 -84559 -95229 -174341
2044a74341K8341P6339J4465m1121K3153m6795m1371K8563R0851j9542j0860N8235
$$ -174341 -146000 -69661 -55196 -96317 -73164 -119959 -161330 -132767 -41916 -61458 -72318 -14083
2032a4083l2304m5762j6399j4011j6741k2345L9543J7701k4721L040M1951J5971
$$ -14083 -46387 -92149 -108548 -122559 -139300 -161645 -122102 -104401 -129122 -126082 -84131 -68160
2020f8160n2741l0527O818J2267M5324K0944r099o0289O009Q011k3027M9007L2745
$$ -68160 -120901 -151428 -144610 -132343 -87019 -66075 -75174 -135463 -129454 -121443 -144470 -95463 -62718
2007f2718o6318J1978k2222J9685r988m6924L1636m1172L7207j7740r767L7526
$$ -62718 -129036 -117058 -139280 -119595 -129583 -176507 -144871 -186043 -148836 -166576 -176343 -138817
1995a38817l7049J19993k8008l1025l3223L5233n0945L0681M6892J1373N0919
$$ -138817 -175866 -55873 -83881 -114906 -148129 -112896 -163841 -133160 -86268 -74895 -23976
1984b3976o4710j06632O6273Q487K5031l5884K2244M1409l9543k4517j3698j0075
$$ -23976 -88686 -195318 -129045 -120558 -95527 -131411 -109167 -67758 -107301 -131818 -145516 -155591
1972a55591J9659K3898M1606K6113r7557M7728L0538j085j0445l435O160j7239
$$ -155591 -135932 -112034 -70428 -44315 -141872 -94144 -63606 -64691 -75136 -78571 -72411 -89650
1960h9650K6634K113j1397J1854o4187j0845J712m215K3130L0447j896M596p4356
$$ -89650 -63016 -60903 -72300 -60446 -124633 -135478 -133766 -137981 -114851 -84404 -86300 -81704 -156060
1947a56060j1949J8632Q7495m7338j7732l125L1979o4139J1446N3438m3562M1582
$$ -156060 -168009 -149377 -61882 -109220 -126952 -130077 -98098 -162237 -150791 -97353 -140915 -99333
1935i9333k884l1722j1513m9730q692P0801M5400J4616J1162J5039p875n9992
$$ -99333 -102217 -133939 -145452 -195182 -203874 -133073 -87673 -73057 -61895 -46856 -54731 -114723
1923a14723l3834M0174m998m2419M7744L9140Q527L0988k5747L36M2950J30p8536
$$ -114723 -148557 -108383 -113381 -155800 -108056 -68916 -60389 -29401 -55148 -54812 -11862 -11732 -90268
1910i0268j8268K3196L02J5279J3730k9432L1696j4069m5858L3158m3055J347
$$ -90268 -108536 -85340 -85038 -69759 -56029 -85461 -53765 -67834 -113692 -80534 -123589 -122242
1898a22242J5978N0575m1560Q369L865j8070M0393k6883J2578k736N896P250K4160
$$ -122242 -106264 -55689 -97249 -88880 -85015 -103085 -62692 -89575 -76997 -79733 -73837 -66587 -42427
1885d2427r35l2310k775Q8919L012r6152p8249K4156K9023o5r373M1717j8930
$$ -42427 -43362 -75672 -78447 10472 13484 -82668 -160917 -136761 -107738 -107803 -117176 -75459 -94389
1872i4389n9969K5952O1120k159p2150K7618M3095m6994m1473J1063M7879K1072
$$ -94389 -154358 -128406 -67286 -69445 -141595 -113977 -70882 -117876 -159349 -148286 -100407 -79335
1860g9335j8388m808j1470K7612q114L2526K5572l0907j544l8732n2674Q1069
$$ -79335 -97723 -102531 -114001 -86389 -94503 -61977 -36405 -67312 -68856 -107588 -160262 -79193
1848g9193j0653n3678J1786M8044K2749J5802m3488m3366j3077Q2978J7520m6520
$$ -79193 -89846 -143524 -131738 -83694 -60945 -45143 -88631 -131997 -145074 -62096 -44576 -91096
1836i1096J1347l3286M1450P297p0814O963N8619m2998o0861K1099M6954j4882
$$ -91096 -79749 -113035 -71585 -64288 -135102 -128139 -69520 -112518 -173379 -152280 -105326 -120208
1824a20208j4623J5972j016J612j9794m0490K7198k2825K4868K2022j212J3349
$$ -120208 -134831 -118859 -119875 -118263 -138057 -178547 -151349 -174174 -149306 -127284 -128496 -115147
1812a15147l450O6986M4347m1685p1387o5173k6273M432J5254K2041J4787M443
$$ -115147 -118597 -51611 -7264 -48949 -120336 -185509 -211782 -207350 -192096 -170055 -155268 -150825
1800a50825N2624M9024n5916p844L4511q472K1226j843l4949J8503J06444n8190
$$ -150825 -98201 -49177 -105093 -112937 -78426 -86898 -65672 -67515 -102464 -83961 22483 -35707
1788c5707j2570n426k3178K363l5992k3075J990O7060J6957j6623P8121o5343
$$ -35707 -48277 -53703 -76881 -74518 -110510 -133585 -131595 -64535 -47578 -64201 13920 -51423
1776e1423m8578M936l8427N8420L0972j7440m928K3470l2440l106J0207n2233
$$ -51423 -100001 -95065 -133492 -75072 -44100 -61540 -66468 -42998 -75438 -78544 -68337 -120570
1764a20570O041K8524k2137J3249M3213L395l3871k2959l2571m9084l1694N3097
$$ -120570 -114529 -86005 -108142 -94893 -51680 -48285 -82156 -105115 -137686 -186770 -218464 -165367
1752a65367K310J8459N8212J65m6956j1378j2450K0221N9506J583j4247l4290
$$ -165367 -163057 -144598 -86386 -86221 -133177 -144555 -157005 -136784 -77278 -75695 -89942 -124232
1740a24232j5305q629O355J5427M4519m1215j1413K8435Q760k908K500L2408j214
$$ -124232 -139537 -148166 -141811 -126384 -81865 -123080 -134493 -106058 -97298 -100206 -97706 -65298 -66512
1727f6512J3280l7735j9961k3552k9765N1435O612k3050O1305K4629o6225l6073
$$ -66512 -53232 -90967 -110928 -134480 -164245 -112810 -106198 -129248 -67943 -43314 -109539 -145612
1715a45612l8038P4099O5752k0641M4350n1142m4810k9670n904k8431K8473O3274
$$ -145612 -183650 -109551 -43799 -64440 -20090 -71232 -116042 -145712 -151616 -180047 -151574 -88300
1703h8300l919l4790l9461L6416L0404O0030o8291l9918k9570M8913M3149K50
$$ -88300 -92219 -127009 -166470 -130054 -99650 -39620 -107911 -147829 -177399 -128486 -85337 -85087
1691h5087J7073j5725q03K2205j7225m9210L5381M5255J3778o5806r209K6378
$$ -85087 -68014 -83739 -84542 -62337 -79562 -128772 -93391 -48136 -34358 -100164 -109373 -82995
1679h2995L53o842j4736j0468R1639l9651p6846j5662N2925m6720J5910L1578
$$ -82995 -82642 -89484 -104220 -114688 -23049 -62700 -139546 -155208 -102283 -149003 -133093 -101515
1667a01515n9595j3463O5568l5146r456j4359O0373J03337o1968j3414k2535j3227
$$ -101515 -161110 -174573 -109005 -144151 -153607 -167966 -107593 -4256 -66224 -79638 -102173 -115400
1655a15400l5598J7083K0044L1498k6215K5892k4568k7338j2795K7990L3923l1978
$$ -115400 -150998 -133915 -113871 -82373 -108588 -82696 -107264 -134602 -147397 -119407 -85484 -117462
1643a17462J7597L2530P936m4042p27L6353p793K9100P419r042m6205R130K2767
$$ -117462 -99865 -67335 -59399 -103441 -104168 -67815 -75608 -46508 -39089 -48131 -94336 -85206 -62439
1630f2439m9505j0577Q6705M656k5773m2485P899N0947m5963l0378j6548J6474
$$ -62439 -111944 -122521 -35816 -31160 -56933 -99418 -91519 -40572 -86535 -116913 -133461 -116987
1618a16987L6116o2792m110R4540k9773J2438N727j0575n4338L0991K1495j1254
$$ -116987 -80871 -143663 -147773 -53233 -83006 -70568 -64841 -75416 -129754 -98763 -77268 -88522
1606h8522O0K6396K5010K5446n5042j7232o4599M8612k9836K4384L0718K2383
$$ -88522 -88462 -62066 -37056 -11610 -66652 -83884 -148483 -99871 -129707 -105323 -74605 -52222
1594e2222L3385J3120q0289r6748P6434L2174J9062m2725L2928n532m70o979j9551
$$ -52222 -18837 -5717 -86006 -182754 -106320 -74146 -55084 -97809 -64881 -70413 -70883 -77862 -97413
1581i7413P4640O0026p5746L929K831K5234l4248o7527L6017k838K7741K359o4485
$$ -97413 -22773 37253 -38493 -34564 -31733 -6499 -40747 -108274 -72257 -75095 -47354 -44995 -109480
1568a09480j294l0481n662K9517j0885L4827J2856J1620J0362l072Q182L5014
$$ -109480 -110774 -141255 -146917 -117400 -128285 -93458 -80602 -68982 -58620 -61692 -53510 -18496
1556a8496k211k1775J151j5249L4085J7231K7065n3514j0920j1632K1756K8080
$$ -18496 -20707 -42482 -41331 -56580 -22495 -5264 21801 -31713 -42633 -54265 -32509 -4429
1544d429n0656K8501M7686l4094k7722j9672N68l3890K2967k1081N6414J586L3611
$$ -4429 -55085 -26584 21102 -12992 -40714 -60386 -59818 -93708 -70741 -91822 -35408 -33822 -211
1531b11n1176K7616J09J5053J372m5814k9787P029Q6472j894o8068j7558J2875
$$ -211 -51387 -23771 -23662 -8609 -7237 -53051 -82838 -75809 10663 8769 -59299 -76857 -63982
1518f3982l1761O2544j1993r0544r661M5378M5643O0253r487l3608o1091L0371
$$ -63982 -95743 -33199 -45192 -135736 -145397 -100019 -54376 5877 -3610 -37218 -98309 -67938
1506f7938o1798j4751M0050j482L3101O5145k0909k2805K9139l7450j2083M8445
$$ -67938 -129736 -144487 -104437 -105919 -72818 -7673 -28582 -51387 -22248 -59698 -71781 -23336
1494b3336n0031n143p377Q121K022p239M0345O458l9684k043J5382k057k4858
$$ -23336 -73367 -78510 -85887 -77766 -75744 -82983 -42638 -36180 -75864 -77907 -62525 -64582 -89440
1481h9440K8334k40K599K0150k3430P543l3075j893N2335L9864j5030n8014L5035
$$ -89440 -61106 -61346 -58747 -38597 -62027 -54484 -87559 -89452 -37117 2747 -12283 -70297 -35262
1468c5262j2530j1626l2665k2193P5547N5412r8096M252l6166J9434l837k7253
$$ -35262 -47792 -59418 -92083 -114276 -38729 16683 -81413 -77161 -113327 -93893 -97730 -124983
1456a24983R763j4703K1464n832K4904k4823M2076L9953L9408L979l4667m0162
$$ -124983 -115220 -129923 -108459 -114291 -89387 -114210 -72134 -32181 7227 11206 -23461 -63623
1444f3623K9711k0956o1035K7562O555J5740J1836m7371L0719o328K1659M1039
$$ -63623 -33912 -54868 -115903 -88341 -81786 -66046 -54210 -101581 -70862 -77190 -55531 -14492
1432a4492J5076K1173n6061n519m031J8239O0882o7904K5002p8884J0086L6417
$$ -14492 584 21757 -34304 -39823 -43854 -25615 35267 -32637 -7635 -86519 -76433 -40016
1420d0016L4214P014n684q5653k1400M0184l4628J6134J5928n1996P1615j5353
$$ -40016 -5802 1212 -4472 -90125 -111525 -71341 -105969 -89835 -73907 -125903 -54288 -69641
1408f9641j5067Q7093n371r875o3115K2269q93L7810m4272J3732l1772l1264p877
$$ -69641 -84708 2385 -2986 -12861 -75976 -53707 -54600 -16790 -61062 -47330 -79102 -110366 -118243
1395a18243O5389K2663l5314k6022j003K1193j5295K8098N9738p2119L3227j1783
$$ -118243 -52854 -30191 -65505 -91527 -92530 -71337 -86632 -58534 1204 -70915 -37688 -49471
1383d9471n9460j0484N7723L4352K4001K6275j1559k9739l6340L9376m0307j5773
$$ -49471 -108931 -119415 -61692 -27340 -3339 22936 11377 -18362 -54702 -15326 -55633 -71406
1371g1406N746O9K7522L2305m1406M0141K6400l036q040K3128j333n5472J707
$$ -71406 -65660 -65591 -38069 -5764 -47170 -7029 19371 16335 8295 31423 30090 -25382 -23675
1358b3675n7332L635j6030R990J5688K469J2985R339J8634n5311n028o7688n579
$$ -23675 -81007 -77372 -93402 -83412 -67724 -65255 -52270 -42931 -24297 -79608 -84636 -152324 -157903
1345a57903R6718l5128K2378L2161k5129k9232O9991J7332n1543K8060K6331K5093
$$ -157903 -61185 -96313 -73935 -41774 -66903 -96135 -26144 -8812 -60355 -32295 -5964 19129
1333A9129o3101k1860J3281O7335j9012m2578J2810L5353n8511M1800J4718j6094
$$ 19129 -43972 -65832 -52551 14784 -4228 -46806 -33996 1357 -57154 -15354 -636 -16730
1321a6730Q15N9602J603l2289p1185L7547j2160m3742M4080O1591L7390n0997
$$ -16730 -15915 43687 45290 13001 -58184 -20637 -32797 -76539 -32459 29132 66522 15525
1309A5525n3107J0556N0905M3897n3959p1894L3768r445J1009q024M909j8765
$$ 15525 -37582 -27026 23879 67776 13817 -58077 -24309 -33754 -22745 -30769 -25860 -44625
1297d4625R0001l4020j4593m8914p2523J0723N0196N5912k3782J647k9361k2420
$$ -44625 45376 11356 -3237 -52151 -124674 -113951 -63755 -7843 -31625 -29978 -59339 -81759
1285h1759L3572J0031J2669k6746p850J3303K954N522j0483k3980n0162M1024
$$ -81759 -48187 -38156 -25487 -52233 -60083 -46780 -43826 -38304 -48787 -72767 -122929 -81905
1273h1905J3780J0632K1245j2444O3649m8525J4941M1550L6653o2283p5745p0817
$$ -81905 -68125 -57493 -36248 -48692 14957 -33568 -18627 22923 59576 -2707 -78452 -149269
1261a49269N6916N1624L6270L3553q5397P7548j5403r252l2096l0142k237K4384
$$ -149269 -92353 -40729 -4459 29094 -56303 21245 5842 -3410 -35506 -65648 -67885 -43501
1249d3501M2144L5918N442j6314n9419l9272J3591J7624m5918P4806P8201o2927
$$ -43501 -1357 34561 40003 23689 -35730 -75002 -61411 -43787 -89705 -14899 63302 375
1237C75K6605p073m1604L795p1625M793J08634K2345p9400o6072P6000j9171J5524
$$ 375 26980 19907 -21697 -17902 -89527 -84734 23900 46245 -33155 -99227 -23227 -42398 -26874
1224b6874j343k8792J0166m3700J2708M4315K685n809j9322M4260k5180n256J4784
$$ -26874 -28217 -57009 -46843 -90543 -77835 -33520 -30835 -36644 -55966 -11706 -36886 -42142 -27358
1211b7358K0792j8229k7569l6340N51P8534j9243l7752K2444k3716j5577O7898
$$ -27358 -6566 -24795 -52364 -88704 -88153 -9619 -28862 -66614 -44170 -67886 -83463 -15565
1199a5565o5871N268L6486O9259j5811M2660p360m7424l8409o1274J1129P439
$$ -15565 -81436 -76168 -39682 29577 13766 56426 49066 1642 -36767 -98041 -86912 -79473
1187g9473L0416Q141L119O859J6124Q051K2960L2980J1282k3271k6348j0046r217
$$ -79473 -49057 -40916 -37797 -30938 -14814 -6763 16197 49177 60459 37188 10840 794 -8423
1174h423J0173l5876j3919M1345M1688m3314m6161q283M735N077J9691J4493M75
$$ -8423 1750 -34126 -48045 -6700 34988 -8326 -54487 -62770 -58035 -52958 -33267 -18774 -18299
1161a8299r050j1414L711k5002N7837q100j6464p5611l1830K8788Q2199K959m465
$$ -18299 -27349 -38763 -35052 -60054 -2217 -10317 -26781 -102392 -134222 -105434 -23235 -20276 -24741
1148b4741l7634l1890N3175k3926L3958L1906L3434k934m203m2001k1644M0785
$$ -24741 -62375 -94265 -41090 -65016 -31058 848 34282 31348 27145 -14856 -36500 4285
1136D285k2114l16k4324J5805J9757N2816p3443r552j4368m6020N9123R431m287
$$ 4285 -17829 -18145 -42469 -26664 -6907 45909 -27534 -37086 -51454 -97474 -38351 -28920 -33207
1123c3207K3643l8779j6569K8584k6153R538l2192J1784k1230J7219J9101J6632
$$ -33207 -9564 -48343 -64912 -36328 -62481 -52943 -85135 -73351 -94581 -77362 -58261 -41629
1111d1629R4788k9630K7565j1976l6380K2821n9187k2455o364R973Q1515L856
$$ -41629 53159 23529 51094 39118 2738 25559 -33628 -56083 -62447 -52474 29041 32897
1099C2897m1102K31J6195L3131l588m1840J0267o768M3941k205q1225o745K7426
$$ 32897 -8205 -7974 8221 41352 37764 -4076 6191 -577 43364 41159 -40066 -46811 -19385
1086a9385K2925m1157N8927J1404p9681r431J9908J2578J3016n1416M0847R035
$$ -19385 3540 -37617 21310 32714 -46967 -56398 -36490 -23912 -10896 -62312 -21465 -12430
1074a2430K1461M327k1938k772m6068M2724O5806o2400j6113n3112N4153K1551
$$ -12430 9031 13358 -8580 -11352 -57420 -14696 51110 -11290 -27403 -80515 -26362 -4811
1062d811k253j0078k7537n0999J0505K151M5681M7481N772j4064L1950l2749m4062
$$ -4811 -7064 -17142 -44679 -95678 -85173 -83022 -37341 10140 15912 1848 33798 1049 -43013
1049d3013J178L3000k076m8656P1344l2561o5481m6945k7812J055M1199j0246
$$ -43013 -41835 -8835 -10911 -59567 11777 -20784 -86265 -133210 -161022 -159967 -118768 -129014
1037a29014L9491Q5449p396p2511J4596L2553l9244o02K0801o478N9708K8812
$$ -129014 -89523 -4074 -11470 -83981 -69385 -36832 -76076 -76678 -55877 -62355 -2647 26165
1025B6165q610j0582k7079k9568K4762N933j8171l5682N9594L9445N05j4868o7655
$$ 26165 17555 6973 -20106 -49674 -24912 -18979 -37150 -72832 -13238 26207 26712 11844 -55811
1012e5811M6327Q273o3001l6980N829L3423m2398M8025K4213Q996J9752k3997
$$ -55811 -9484 -1211 -64212 -101192 -95363 -61940 -104338 -56313 -32100 -23104 -3352 -27349
1000b7349J0400L9143n6773k7193N2186J6419Pn820m0166K1269n4800L414P5169
$$ -27349 -16949 22194 -34579 -61772 -9586 6833 6840 1020 -39146 -17877 -72677 -69263 5906
987E906j1187l8411j165N4850k1642J2568K351l1879l750n4101M9577O0350j3302
$$ 5906 -5281 -43692 -44857 9993 -11649 919 3270 -28609 -32359 -86460 -36883 23467 10165
974A0165N946K5707r483O2715m1840j17476K0022O1494q030J8977m6064l9478
$$ 10165 16111 41818 32335 95050 53210 -64266 -44244 17250 9220 28197 -17867 -57345
962e7345N3360n086O555m6471P709J6627l0411M5371M2481L1601o4476L4510L502
$$ -57345 -3985 -9071 -2516 -48987 -41278 -24651 -55062 -9691 32790 64391 -85 34425 37927
949C7927m7344L824j8674k1742m4847M2041L0270J0580J3L974j7659j9040R254
$$ 37927 -9417 -5593 -24267 -46009 -90856 -48815 -18545 -7965 -7952 -3978 -21637 -40677 -31423
936c1423k3533K3484o9185M7581P516q8J4177K7954J07673q6350O2785K9170l0233
$$ -31423 -54956 -31472 -100657 -53076 -45560 -45648 -31471 -3517 104156 17806 80591 109761 79528
923G9528n786j1706K9670j9656k6361o6956K2164K5855m8580J3309K0964j2539
$$ 79528 73742 62036 91706 72050 45689 -21267 897 26752 -21828 -8519 12445 -94
911i4m8252L8724l3533q661R823J2780K5934J6955p259L0278n653K1577l132r962
$$ -94 -48346 -9622 -43155 -51816 -41993 -29213 -3279 13676 6417 36695 31042 52619 49487 39525
897C9525L295J5039j3058k7642l6331p21K5707J7766k0858Q7N293J6703l0920
$$ 39525 42820 57859 44801 17159 -19172 -19893 5814 23580 2722 2809 8102 24805 -6115
884f115K8435j9925K2620n8109o6320N1459L0143l589M7409K2279n384k2510j6064
$$ -6115 22320 2395 25015 -33094 -99414 -47955 -17812 -21401 26008 48287 42903 20393 4329
871D329l0682j0333J09567m5685q8439m4064K870N8261r243R007O7742o7509k1741
$$ 4329 -26353 -36686 72881 27196 -61243 -105307 -102437 -44176 -53419 -44412 23330 -44179 -65920
858f5920Q2633n9391j0351j3256L6347k8574J5539Q7465m9460l5022L4760K362
$$ -65920 16713 -42678 -53029 -66285 -29938 -58512 -42973 44492 -4968 -39990 -5230 -2868
846b868l8617M6519m6122M3345m1541J6189N883N1698L0280j5509m3323m2879
$$ -2868 -41485 5034 -41088 2257 -39284 -23095 -17212 34486 64766 49257 5934 -36945
834c6945Q2558M8744n5862k0058l2362J2981k2786l5096J2371L8639K7552L0562
$$ -36945 45613 94357 38495 18437 -13925 -944 -23730 -58826 -46455 -7816 19736 50298
822E0298n6517m9908n7907k4117J03365O6437L9469L549m5603j3411J2087L6968
$$ 50298 -6219 -56127 -114034 -138151 -34786 31651 71120 74669 29066 15655 27742 64710
810F4710p5770j3574P5719k429j1943o26M1252J8496m7255k9412l0718Q1545L4792
$$ 64710 -11060 -24634 51085 48656 36713 36087 77339 95835 48580 19168 -11550 69995 104787
797A04787p8026L1445j7982k980j0253k2014P788J8692K1914k8881O9299k5245
$$ 104787 26761 58206 40224 37244 26991 4977 12765 31457 53371 24490 93789 68544
785F8544p5115K5948N1984k5697l7828M7526r050p994K5820l7110j8017J01703
$$ 68544 -6571 19377 71361 45664 7836 55362 46312 38318 64138 27028 9011 110714
773A10714m3255o1294p431J5469J0887k5803j9564Q913J2953M3173N276l8529
$$ 110714 67459 6165 -1266 14203 25090 -713 -20277 -11364 1589 44762 50038 11509
761A1509n035M2047M4369q5683n1504K6962j3156J4332M2276j0032l1144n2315
$$ 11509 6474 48521 92890 7207 -44297 -17335 -30491 -16159 26117 16085 -15059 -67374
749f7374P9340M3020n1063Q4316k8967o9656M5803k8552j4697L3411O9151j164
$$ -67374 11966 54986 3923 88239 59272 -10384 35419 6867 -7830 25581 94732 93568
737I3568l704l8939q1621M9512M0840q44m3609L8105Q600j510p5687L2124L4283
$$ 93568 89864 50925 -30696 18816 59656 58812 15203 53308 61908 60398 -15289 16835 51118
724E1118l9072K2735L5657k0545k6578k5131n397J164M4108K4819k5796k8290
$$ 51118 12046 34781 70438 49893 23315 -1816 -7213 -6049 38059 62878 37082 8792
712H792n0717k4703P4372J818j191O771k3890K2940J8677l0718N60q610j1288
$$ 8792 -41925 -66628 7744 9562 8371 15142 -8748 14192 32869 2151 2711 -5899 -17187
699a7187J9216K0133K1381k2225J6039R571j3371j9958N7357o2961m9768q830
$$ -17187 2029 22162 43543 21318 37357 46928 33557 13599 70956 7995 -41773 -50603
687e0603J3653R859L4339m6079k6502J2246l5785K9133J3119j5576K5096j0268
$$ -50603 -36950 -27091 7248 -38831 -65333 -53087 -88872 -59739 -46620 -62196 -37100 -47368
675d7368M131K4016L0309L0278j8868l5429n895N8871q854L927J693J1081j7267
$$ -47368 -43237 -19221 11088 41366 22498 -12931 -18826 40045 31191 35118 36811 47892 30625
662C0625k5333m9241L9969M1768l320J8319n1705M0373R045m7027l205m6812M3329
$$ 30625 5292 -43949 -3980 37788 34468 52787 1082 41455 50500 3473 268 -46544 -3215
649c215L187K6200k6292k8038Q2046m2052k1141K2510M0497k6818m4708m4998
$$ -3215 -28 26172 -120 -28158 53888 11836 -9305 13205 53702 26884 -17824 -62822
637f2822L5141R5325l2711m2151l0119M3760K5044j8327j9055R160l5375l7694
$$ -62822 -27681 67644 34933 -7218 -37337 6423 31467 13140 -5915 3245 -32130 -69824
625f9824O2742J1970J5926p419o1533O9612J6992K1820j0675K9587m8372J6767
$$ -69824 -7082 4888 20814 13395 -48138 21474 38466 60286 49611 79198 30826 47593
613D7593L7095q3984K8406k6305k5882j9846N2059q0740P1793q2792L2414M1781
$$ 47593 84688 704 29110 2805 -23077 -42923 9136 -71604 189 -82603 -50189 -8408
601h408L1433M2204o2643K856J8189M332k956l9408J7819J7363N0662j3824k1803
$$ -8408 23025 65229 2586 5442 23631 27963 25007 -14401 3418 20781 71443 57619 35816
588C5816o808K9779k2835n4851J8882j7255Q1879L0558M1410q2961m5683N0850
$$ 35816 29008 58787 35952 -18899 -17 -17272 64607 95165 136575 53614 7931 58781
576E8781k2640j233M7395j0745N5o424k9306o9694j6583M8743O5514l104J8052
$$ 58781 36141 34908 82303 71558 71613 65189 35883 -33811 -50394 -1651 63863 60759 78811
563G8811k5305m5178k4129M3899M3108p6668l8191N4130K8438j3419n537Q670
$$ 78811 53506 8328 -15801 28098 71206 -5462 -43653 10477 38915 25496 19959 28629
551B8629K0011L5314j5314k368k7205l1852P500l1029J7383J3677L9032N0580
$$ 28629 48640 83954 68640 66272 39067 7215 14715 -16314 1069 14746 53778 104358
539A04358j02677m7218L4942L7493M618N701j2411O483k8416L6872j720j673J4324
$$ 104358 1681 -45537 -10595 26898 31516 37217 24806 31289 2873 39745 38025 36352 50676
526E0676p1696M7358O0838r8461K9155P0651M6230p839p9457j0692l8161J1675
$$ 50676 -21020 26338 87176 -11285 17870 88521 134751 126912 47455 36763 -1398 10277
514A0277j5751N198m737N148L1058o88O498L0012J4304m7984j6714j7639n1109
$$ 10277 -5474 -276 -5013 135 31193 30505 37003 67015 81319 33335 16621 -1018 -52127
501e2127Q0538J04835o6784n8365Q601m1795M3397o664m0572J3508K55Q994j3798
$$ -52127 28411 133246 66462 8097 16698 -25097 18300 11636 -28936 -15428 -15173 -6179 -19977
488a9977K3072N7494l5744J4045r602l3573k1425K6196l191O6853j8691l0693
$$ -19977 3095 60589 24845 38890 29288 -4285 -25710 486 -2705 64148 45457 14764
476A4764K1060j3830K034K7713l3351m3529L0439J7012O1198p328o6981L6777
$$ 14764 35824 21994 24028 51741 18390 -25139 5300 22312 83510 76182 9201 45978
464D5978J1312j1356j3477k1107K2535L7538K5635K067J0674k0920m4343l3710
$$ 45978 57290 45934 32457 11350 33885 71423 97058 99125 109799 88879 44536 10826
452A0826J6131P890L626K7627k3834m636m8385j9178L2059L785N3253j0302k304
$$ 10826 26957 34847 38473 66100 42266 37630 -10755 -29933 2126 5911 59164 48862 46558
439D6558l8919K2575r463q192q644L0780l2538m4010r816R3944O9527n0039j3867
$$ 46558 7639 30214 20751 12559 3915 34695 2157 -41853 -51669 42275 111802 61763 47896
426D7896L7046j5659l5232l4512m6298K4033M8253q045J5832p316k1099J7334
$$ 47896 84942 69283 34051 -461 -46759 -22726 25527 17482 33314 25998 4899 22233
414B2233m570L1482j3436N7469L211k7840j046J5178k2045p0852J5292M3019K2842
$$ 22233 17663 49145 35709 93178 96389 68549 67503 82681 60636 -10216 5076 48095 70937
401G0937m6423P5821l050j2432R331m0837j6381l1612R197L2746j4127l8744K8733
$$ 70937 24514 100335 97285 84853 94184 53347 36966 5354 14551 47297 33170 -5574 23159
388B3159O3830n0567m2018J9084J7563m997k9158K2576L0858K3970l6278k4756
$$ 23159 86989 36422 -5596 13488 31051 26054 -3104 19472 50330 74300 38022 13266
376A3266M1512Q0213o272l9267n376M9482j7456l0155k6233l8342Q828M4420o2074
$$ 13266 54778 134991 128719 89452 84076 133558 116102 85947 59714 21372 30200 74620 12546
363A2546M5678Q550m4818J9494J4404j2489k3319L8475L2691j7998P498l8586
$$ 12546 58224 66774 21956 41450 55854 43365 20046 58521 91212 73214 80712 42126
351D2126K7050K5600l1984l0532k4325l771l7187N6893K868M607M080j1139m0767
$$ 42126 69176 94776 62792 32260 7935 4164 -33023 23870 26738 31345 35425 24286 -16481
338a6481j1729N5924o663N0048o5132L7289K7242q8181n24Q0829m2546j009O1218
$$ -16481 -28210 27714 21051 71099 5967 43256 70498 -17683 -18207 62622 20076 19067 80285
325H0285m998M5054n1862m9758P0606L6577k042K787j2058l4549j9081M7832L5395
$$ 80285 75287 120341 68479 18721 89327 125904 123862 126649 114591 80042 60961 108793 144188
312A44188k6311l3727m2510j7602J2946K9772l2948l8022M5995K6239J6623k7494
$$ 144188 117877 84150 41640 24038 36984 66756 33808 -4214 41781 68020 84643 57149
300E7149K4298L4830m4232j6500K0717k2585L0077k7735M6904l5615l7359Q613
$$ 57149 81447 116277 72045 55545 76262 53677 83754 56019 102923 67308 29949 38562
288C8562k0606J0762N7945K6886J0458o4059j8164M5860l2155L561J990J3621
$$ 38562 17956 28718 86663 113549 124007 59948 41784 87644 55489 59050 61040 74661
276G4661J1467m5916K4318j9765k1535L5293l8340J5934K0981l7834L2573Q5328
$$ 74661 86128 40212 64530 44765 23230 58523 20183 36117 57098 19264 51837 137165
264A37165o980o8331k9227L4115M3130J9202o2470r1065R5794k1495j8350r828
$$ 137165 130185 61854 32627 66742 109872 129074 66604 -24461 71333 49838 31488 21660
252B1660J4726R196n2832P7284j4088k4047m2964O551M9983K2282j1936q0134
$$ 21660 36386 45582 -7250 70034 55946 31899 -11065 -4514 45469 67751 55815 -24319
240b4319K0295N2009M7301j5319n3287K7246o564k8595J57Q624L6981K5454m4466
$$ -24319 -4024 47985 95286 79967 26680 53926 47362 18767 18924 27548 64529 89983 45517
227D5517j7195L4839L751k8695k7475N4163l9693p934M3072N7052k3116o1845
$$ 45517 28322 63161 66912 38217 10742 64905 25212 17278 60350 117402 94286 32441
215C2441O3421k8100j5196L5331K5326n1457k1783j828j5373k9927j3633J531
$$ 32441 95862 67762 52566 87897 113223 61766 39983 38155 22782 -7145 -20778 -19247
203a9247J04095k7416m5985P492k7366J8187O9127P895J5072M900m5658M8354
$$ -19247 84848 57432 11447 18939 -8427 9760 78887 86782 101854 106754 61096 109450
191A09450o3678k7187m444M5760Q393R971j9929p1256M427j0344J04438K4545
$$ 109450 45772 18585 14141 59901 68294 78265 58336 -12920 -8493 -18837 85601 110146
179A10146l2192k5465n4668O2858k2106J3977L6167m4870N071P216K7316l9257
$$ 110146 77954 52489 -2179 60679 38573 52550 88717 43847 48918 56134 83450 44193
167D4193j0700P573j403K9393O39m5720l4300N1488k668m2379K8783K7800K964
$$ 44193 33493 41066 39663 69056 69695 23975 -10325 41163 38495 -3884 24899 52699 55663
154E5663k2007K3077j3366j377M5012k4145j2795P9323j4070j672p5917N219K2958
$$ 55663 33656 56733 43367 41990 87002 62857 50062 129385 115315 113643 37726 42945 65903
141F5903K8859M482M7694O898j8635k176q332o5918o1661N819J9720L4731Q392
$$ 65903 94762 99244 146938 153836 135201 133025 124693 58775 -2886 2933 22653 57384 65776
128F5776j8787j1749J9754K3743R736k6054j2488m2592N6479L601L9125k5593
$$ 65776 46989 35240 54994 78737 88473 62419 49931 7339 63818 67419 106544 80951
116H0951k6422k467l3015p3288J0231L4989K1186R466l1354j1819m619Q648K9977
$$ 80951 54529 52062 19047 -54241 -44010 -9021 12165 21631 -9723 -21542 -26161 -17513 12464
103A2464M0367K693J0311j6087q414K1297n9341n4842M3023r723j9092k1599K2947
$$ 12464 52831 55524 65835 49748 41334 62631 3290 -51552 -8529 -18252 -37344 -58943 -35996
90c5996L3643k3180L4751j7800L2647J5649p3999l0042L6710J6999L1795J0027
$$ -35996 -2353 -25533 9218 -8582 24065 39714 -34285 -64327 -27617 -10618 21177 31204
78C1204j2893K4865J4383K32j3093q616m331K317M62k9802N2068j4351J0596o806
$$ 31204 18311 43176 57559 57791 44698 36082 31751 34068 34530 4728 56796 42445 53041 46235
64D6235n6131J5954K6321j4350k5763j9691L8630L4735l1050j2286j1805O876
$$ 46235 -9896 6058 32379 18029 -7734 -27425 11205 45940 14890 2604 -9201 -2325
52b325m111Q002L0488k3479J4656l0097K8286L806k5302M042J3830J5282n2487
$$ -2325 -6436 1566 32054 8575 23231 -6866 21420 25226 -76 3966 17796 33078 -19409
39a9409k1690J4196K8127m049m6443l4350K4494L7776K9929k5981J5601M1277
$$ -19409 -41099 -26903 1224 -2825 -49268 -83618 -59124 -21348 8581 -17400 -1799 39478
27C9478k9300l0928l5057M6895M963K7905M1621p7176j9274p5952L0455M3006
$$ 39478 10178 -20750 -55807 -8912 -3949 23956 65577 -11599 -30873 -106825 -76370 -33364
15c3364J0207m7461l1522J0508L2452J6310N369M3010k1287K021r149k0352K980
$$ -33364 -23157 -70618 -102140 -91632 -59180 -42870 -37501 5509 -15778 -13757 -22906 -43258 -40278
2d0278M419o669
$$ -40278 -35859 -42528
0d2528
$$ -42528
$$ Imaginary data points
##PAGE= N=2
##DATA TABLE= (X++(I..I)), XYDATA
16383a616103j4012P482M401N9540K4455K8164M2682N9094K9813l2787P6495L1752
$$ -1616103 -1630115 -1622633 -1618232 -1558692 -1534237 -1506073 -1463391 -1404297 -1374484 -1407271 -1330776 -1299024
16371a299024J4501J1145J6503K5492K1350j9792O0128P3901K8137L3233K1283
$$ -1299024 -1284523 -1273378 -1256875 -1231383 -1210033 -1229825 -1169697 -1095796 -1067659 -1034426 -1013143
16360a013143K4356J1842P2484J9287K5339L5931K2178O5861J0273J7558l870
$$ -1013143 -988787 -976945 -904461 -885174 -859835 -823904 -801726 -735865 -725592 -708034 -711904
16349g11904J8904J3258N8089J8356R912O2122J6099j8107J1131K1289N0813J297
$$ -711904 -693000 -679742 -621653 -603297 -593385 -531263 -515164 -533271 -522140 -500851 -450038 -448741
16337d48741k7991J05888N8821K2374N781M0756N827N8497J6635M4352J0920Q810
$$ -448741 -476732 -370844 -312023 -289649 -283868 -243112 -237285 -178788 -162153 -117801 -106881 -98071
16325i8071L9588R195M4176O1143L5099K5141O1231n59j9241P183K7612J5712
$$ -98071 -58483 -49288 -5112 56031 91130 116271 177502 176943 157702 164885 192497 208209
16313B08209K1130L9545K7375J1167O0960K6358L4113K3063J6464R060K5022L4096
$$ 208209 229339 268884 296259 307426 368386 394744 428857 451920 468384 477444 502466 536562
16301E36562O1055p508N6869M5518n8268M332K1749L1312k071N0958M5612J301
$$ 536562 597617 590109 646978 692496 634228 638560 660309 691621 689550 740508 786120 787421
16289G87421L9822O9475P388m373l7813n729R9921K9575j4086P394J4368L1694
$$ 787421 827243 896718 904106 899733 861920 856191 956112 985687 971601 978995 993363 1025057
16277A025057L4272L4436J325k8866L5929N4365J4907j5097J3796J5776L2926
$$ 1025057 1059329 1093765 1095090 1066224 1102153 1156518 1171425 1156328 1170124 1185900 1218826
16266A218826M7342P699L1952J4631J3802J2142L5157J6062N450N4958j9497P373
$$ 1218826 1266168 1273867 1305819 1320450 1334252 1346394 1381551 1397613 1403063 1458021 1438524 1445897
16254A445897L1818M3191n497Q411N3839P6071q347o5624O2898L8585J8539L1003
$$ 1445897 1477715 1520906 1515409 1523820 1577659 1653730 1645383 1579759 1642657 1681242 1699781 1730784
16242A730784k6606L1578k8262m588O388J5042O9302N0537J0669r241l475k0693
$$ 1730784 1704178 1735756 1707494 1702906 1709294 1724336 1793638 1844175 1854844 1845603 1842128 1821435
16230A821435N0704K558m119K6671O352L1910M9080k2302Q750L0198l4572k557
$$ 1821435 1872139 1874697 1870578 1897249 1903601 1935511 1984591 1962289 1971039 2001237 1966665 1964108
16218A964108N3053O5591L2404r161P470J2452J2218j1928m359N7185K3198J1038
$$ 1964108 2017161 2082752 2115156 2105995 2113465 2125917 2138135 2126207 2121848 2179033 2202231 2213269
16206B213269N229m22l4055L1871l5408m036K22L0490k8994N6468J7284m9569
$$ 2213269 2218498 2218076 2184021 2215892 2180484 2176448 2176670 2207160 2178166 2234634 2251918 2202349
16194B202349m6033K1247N8067R6460N7530j6056j987j3743o104k3206M5174q3209
$$ 2202349 2156316 2177563 2235630 2332090 2389620 2373564 2371577 2357834 2351730 2328524 2373698 2290489
16182B290489P0711O6178J3886M70n7389K7195P5613j6688j5604l9491K0554J04356
$$ 2290489 2361200 2427378 2441264 2441734 2384345 2411540 2487153 2470465 2454861 2415370 2435924 2540280
16170B540280J7618j529j418J916P5116m9863j1969m4699j6497M2549k9811j0411
$$ 2540280 2557898 2556369 2554951 2556867 2631983 2582120 2570151 2525452 2508955 2551504 2521693 2511282
16158B511282M7379n6478M1769j4451k3582J17902O7761l4290k4647k7515j4721
$$ 2511282 2558661 2502183 2543952 2529501 2505919 2623821 2691582 2657292 2632645 2605130 2590409
16147B590409P6519J2653N1127j9147o4046O4196l6095k2225K4497N425o941J2970
$$ 2590409 2666928 2679581 2730708 2711561 2647515 2711711 2675616 2653391 2677888 2683313 2676372 2689342
16135B689342j0510q910m845K6225n171L0927O65l5122M3778K7031q6826Q20K8537
$$ 2689342 2678832 2669922 2665077 2691302 2686131 2717058 2717723 2682601 2726379 2753410 2666584 2667404 2695941
16122B695941J769q277J2740k6098m1132k0812Q165O3663O0966l6054L2793L1599
$$ 2695941 2697710 2689433 2702173 2676075 2634943 2614131 2622296 2685959 2746925 2710871 2743664 2775263
16110B775263P7188j8819l2425L3625p6039n1011J246L0739K8779k2404n0493
$$ 2775263 2852451 2833632 2801207 2834832 2758793 2707782 2709028 2739767 2768546 2746142 2695649
$$ [...]
##END NTUPLES=NMR SPECTRUM
##END=
