##TITLE=1H_TG-2400
 200.13MHz,CDCl3.
 8 sc
 
 4.1.2026
##JCAMPDX= 6.0         $$ Bruker NMR JCAMP-DX V2.0
##DATA TYPE= NMR SPECTRUM
##DATA CLASS= NTUPLES
##ORIGIN= UXNMR, Bruker Analytische Messtechnik GmbH
##OWNER= pz
$$ XWIN-NMR		Version 3.5
$$ Wed Feb  4 14:06:52 2026 Russian Standard Time (UT+4h)  she@DPX200
##.OBSERVE FREQUENCY= 200.1313
##.OBSERVE NUCLEUS= ^1H
##.ACQUISITION MODE= SIMULTANEOUS
##.ACQUISITION SCHEME= undefined
##.AVERAGES= 8
##.DIGITISER RES= 18
##SPECTROMETER/DATA SYSTEM= spect
##.PULSE SEQUENCE= zg30
##.SOLVENT NAME= DMSO
##.SHIFT REFERENCE= (INTERNAL, DMSO, 0, 15.5012)
##AUDIT TRAIL= $$ (NUMBER, WHEN, WHO, WHERE, WHAT)
$$ ##TITLE= Audit trail, XWIN-NMR		Version 3.5
$$ ##JCAMPDX= 5.01
$$ ##ORIGIN= Bruker BioSpin GmbH
$$ ##OWNER= she
$$ F:/spectra/data/she/nmr/H-C/1/pdata/1/auditp.txt
$$ ##AUDIT TRAIL=  $$ (NUMBER, WHEN, WHO, WHERE, WHAT)
(   1,<2026-02-04 14:04:17.45 +0400>,<she>,<DPX200>,
      <created by zg, POWCHK disabled, PULCHK disabled
       configuration hash MD5:
       00 E9 B6 7A A2 85 ED C7 34 08 36 98 17 FE 4E 26
       data hash MD5: 16K
       FC C5 C6 ED 33 1A 13 A3 2A 58 94 83 BE E2 E1 CD>)
(   2,<2026-02-04 14:04:58.10 +0400>,<she>,<DPX200>,
      <Start of raw data processing
       efp BC_mod = 2 LB = 0.25 FT_mod = 6 PKNL = 1 PHC0 = -3710.423 PHC1 = 23.19231 SI = 16K 
       data hash MD5: 16K
       69 2E 0A 3F A8 A6 20 A7 DF BC 76 FD C3 D2 29 93>)
(   3,<2026-02-04 14:05:16.64 +0400>,<she>,<DPX200>,
      <pk PHC0 = 2.001344 PHC1 = -2.2 
       data hash MD5: 16K
       DE 14 9E DD F3 65 7E 97 37 63 FE 7C 75 5B 6C D7>)
(   4,<2026-02-04 14:05:20.50 +0400>,<she>,<DPX200>,
      <abs ABSG = 5 
       data hash MD5: 16K
       E0 F9 76 A8 DF E8 F4 8A 4F D9 39 C1 47 F5 F3 C2>)
$$ ##END=
$$ 
$$ hash MD5
$$ 39 DC B9 85 8A 84 78 8C 5C 9B 12 8C 47 16 9D A3
##$RELAX= 
##$RELAX= 
##$RELAX= 
##$RELAX= 
##$RELAX= 
##$RELAX= 
$$ Bruker specific parameters
$$ --------------------------
##$DU= <F:/spectra>
##$EXPNO= 1
##$NAME= <H-C>
##$PROCNO= 1
##$TYPE= <nmr>
##$USER= <she>
##$AMP= (0..31)
100 100 100 100 100 100 100 100 100 100 100 100 100 100 100 100 100 100 
100 100 100 100 100 100 100 100 100 100 100 100 100 100 
##$AQSEQ= 0
##$AQ_mod= 1
##$AUNM= <au_zg>
##$AUTOPOS= <>
##$BF1= 200.13
##$BF2= 200.13
##$BF3= 200.13
##$BF4= 200.13
##$BF5= 200.13
##$BF6= 200.13
##$BF7= 200.13
##$BF8= 200.13
##$BYTORDA= 1
##$CFDGTYP= 0
##$CFRGTYP= 5
##$CHEMSTR= <none>
##$CNST= (0..31)
1 1 145 1 1 1 1 1 1 1 1 1 1 1 1 1 1 1 1 1 1 1 1 1 1 1 1 1 1 1 1 1 
##$CPDPRG= <>
##$CPDPRG1= <>
##$CPDPRG2= <>
##$CPDPRG3= <>
##$CPDPRG4= <mlev>
##$CPDPRG5= <mlev>
##$CPDPRG6= <mlev>
##$CPDPRG7= <mlev>
##$CPDPRG8= <mlev>
##$CPDPRGB= <>
##$CPDPRGT= <>
##$D= (0..31)
0 0.7 0 0 0 0 0 0 0 0 0 0.03 0 0 0 0 0 0 0 0 0 0 0 0 0 0 0 0 0 0 0 0 
##$DATE= 1770199456
##$DBL= (0..7)
120 120 120 120 120 120 120 120 
##$DBP= (0..7)
150 150 150 150 150 150 150 150 
##$DBP07= 0
##$DBPNAM0= <>
##$DBPNAM1= <>
##$DBPNAM2= <>
##$DBPNAM3= <>
##$DBPNAM4= <>
##$DBPNAM5= <>
$$ [...]
##$SUBNAM3= <"">
##$SUBNAM4= <"">
##$SUBNAM5= <"">
##$SUBNAM6= <"">
##$SUBNAM7= <"">
##$SUBNAM8= <"">
##$SUBNAM9= <"">
##$SW= 18.0517328524113
##$SWIBOX= (0..15)
0 0 2 0 0 0 0 0 0 0 0 0 0 0 0 0 
##$SW_h= 3612.71676300578
##$TD= 16384
##$TD0= 1
##$TE= 0
##$TE2= 300
##$TE3= 300
##$TEG= 300
##$TL= (0..7)
0 120 120 120 120 120 120 120 
##$TP= (0..7)
150 150 150 150 150 150 150 150 
##$TP07= 0
##$TPNAME0= <>
##$TPNAME1= <>
##$TPNAME2= <>
##$TPNAME3= <>
##$TPNAME4= <>
##$TPNAME5= <>
##$TPNAME6= <>
##$TPNAME7= <>
##$TPOAL= (0..7)
0.5 0.5 0.5 0.5 0.5 0.5 0.5 0.5 
##$TPOFFS= (0..7)
0 0 0 0 0 0 0 0 
##$TUNHIN= 0
##$TUNHOUT= 0
##$TUNXOUT= 0
##$USERA1= <user>
##$USERA2= <user>
##$USERA3= <user>
##$USERA4= <user>
##$USERA5= <user>
##$V9= 5
##$VALIST= <valist>
##$VCLIST= <CCCCCCCCCCCCCCC>
##$VD= 0
##$VDLIST= <DDDDDDDDDDDDDDD>
##$VPLIST= <PPPPPPPPPPPPPPP>
##$VTLIST= <TTTTTTTTTTTTTTT>
##$WBST= 1024
##$WBSW= 4
##$XGAIN= (0..3)
0 0 0 0 
##$XL= 0
##$YL= 0
##$YMAX_a= 771789
##$YMIN_a= -983206
##$ZGOPTNS= <>
##$ZL1= 120
##$ZL2= 120
##$ZL3= 120
##$ZL4= 120
##$ABSF1= 15.5089
##$ABSF2= -2.54295
##$ABSG= 5
##$ABSL= 3
##$ALPHA= 0
##$AQORDER= 0
##$ASSFAC= 0
##$ASSFACI= 0
##$ASSFACX= 0
##$ASSWID= 0
##$AUNMP= <proc_1d>
##$AZFE= 0.1
##$AZFW= 0.1
##$BCFW= 0
##$BC_mod= 2
##$BYTORDP= 0
##$COROFFS= 0
##$CY= -3
##$DATMOD= 1
##$DC= 0
##$DFILT= <>
##$DTYPP= 0
##$F1P= 0
##$F2P= 0
##$FCOR= 1
##$FTSIZE= 16384
##$FT_mod= 6
##$GAMMA= 0
##$GB= 0
##$INTBC= 1
##$INTSCL= 3.241238e-09
##$ISEN= 128
##$LB= 0.25
##$LEV0= 0
##$LPBIN= 0
##$MAXI= 10000
##$MC2= 0
##$MEAN= 0
##$ME_mod= 0
##$MI= 1.114404
##$NCOEF= 0
##$NC_proc= -4
##$NLEV= 6
##$NOISF1= 3.799351
##$NOISF2= 2.8
##$NSP= 0
##$NTH_PI= 0
##$NZP= 0
##$OFFSET= 15.50119
##$PC= 1
##$PHC0= -3708.422
##$PHC1= 20.99231
##$PH_mod= 1
##$PKNL= yes
##$PPARMOD= 0
##$PSCAL= 0
##$PSIGN= 0
##$REVERSE= no
##$SF= 200.130004104839
##$SI= 16384
##$SIGF1= 3
##$SIGF2= 2
##$SINO= 0.751879
##$SIOLD= 32768
##$SREGLST= <19F.Aceton>
##$SSB= 0
##$STSI= 16384
##$STSR= 0
##$SW_p= 3612.71676300578
##$SYMM= 0
##$S_DEV= 0
##$TDeff= 16384
##$TDoff= 0
##$TI= <>
##$TILT= no
##$TM1= 0
##$TM2= 0
##$TOPLEV= 0
##$USERP1= <user>
##$USERP2= <user>
##$USERP3= <user>
##$USERP4= <user>
##$USERP5= <user>
##$WDW= 1
##$XDIM= 16384
##$YMAX_p= 307812321
##$YMIN_p= -540863
$$ End of Bruker specific parameters
$$ ---------------------------------
##NTUPLES= NMR SPECTRUM
##VAR_NAME=  FREQUENCY,     SPECTRUM/REAL,   SPECTRUM/IMAG
##SYMBOL=    X,             R,               I
##VAR_TYPE=  INDEPENDENT,   DEPENDENT,       DEPENDENT
##VAR_FORM=  AFFN,          ASDF,            ASDF
##VAR_DIM=   16384,         16384,           16384
##UNITS=     HZ,            ARBITRARY UNITS, ARBITRARY UNITS
##FACTOR=    0.220516191357247, 1,           1
##FIRST=     3102.25325546339, 0,            0
##LAST=      -510.463507542394, 0,           0
##MIN=       -510.463507542394, -540863,     0
##MAX=       3102.25325546339, 307812321,    0
$$ Real data points
##PAGE= N=1
##DATA TABLE= (X++(R..R)), XYDATA
$$ [...]
7749B39077N8162L2213K7286K0982K2989L5745K0155L9012K5951P983J6620k424
7737E43751M974j0015j2973M2259P502Q188j4680K594l0905m2091j7069K007j2058
7724D71484j1812n5365k2211l3389m9568k4998k7693J6445j2097k8595L867o202
7712B19866k6820l782j5318j5083J5255m3231j0434L0745k2860L4268K3802j0363
7700A76045K7426M3728J4508K1468j2293J7399L9208J1496N5870N3552P0351R4349
7688F13107J26307J73458J46171K37874L06494L24553M51818M39492L89439J97919
7678C406632o307j71211l33757l82507l89530l32689k79421k63481k24170j81083
7668H42476j41535r5349p1688p9255m6370l2632m5413k0387R056l0428K8314J2282
$$ y = [239077, 297239, 329452, 356738, 377720, 400709, 436454, 456609, 495621, 521572, 529555, 546175, 543751, 548725, 538710, 525737, 567996, 575498, 583686, 569006, 571600, 540695, 498604, 481535, 483542, 471484, 459672, 404307, 382096, 348707, 299139, 274141, 246448, 262893, 250796, 222201, 226068, 219866, 193046, 189264, 173946, 158863, 174118, 130887, 120453, 151198, 128338, 162606, 186408, 176045, 203471, 247199, 261707, 283175, 270882, 288281, 327489, 338985, 394855, 448407, 518758, 613107, 739414, 912872, 1059043, 1296917, 1603411, 1927964, 2379782, 2819274, 3208713, 3406632, 3400325, 3229114, 2895357, 2512850, 2123320, 1790631, 1511210, 1247729, 1023559, 842476, 700941, 605592, 533904, 454649, 408279, 375647, 330234, 309847, 318903, 288475, 316789, 329071]
7656C29071J8402M6806M1350N2681L1708O1526J08192R2295P2478O0192j0561
7645I04140l5263j5025k122k0441K803L0835M5158J05141R0535J89513K39065
7634A534339K94495L35514L84945K61183J46616k171j34347k79646l47913l06905
7624A886110k68309k88008k26250j85093j65413j26240m5843o8726l7643m4962
7614D29623k5550O033m8968j9280j0450O9150K5765M564M9346M5303N3285Q8520
7602F67341N6655Q3734O6063P3891K9738k160l6845k375m0496r731o527R303m906
7589H83685K4672L472L4722l7466l227O2701k542p473j6800j256j4146k7310l8181
7576H60851r136q9560m7471m0379o8846n8772q7457o3148m7210k9454k9100j4167
$$ y = [329071, 347473, 394279, 435629, 488310, 520018, 581544, 689736, 782031, 854509, 914701, 904140, 868877, 853852, 851730, 831289, 834092, 864927, 910085, 1015226, 1105761, 1295274, 1534339, 1828834, 2164348, 2549293, 2810476, 2957092, 2954921, 2820574, 2540928, 2193015, 1886110, 1617801, 1329793, 1103543, 918450, 753037, 626797, 580954, 512228, 474585, 429623, 404073, 410106, 361138, 341858, 331408, 400558, 426323, 430887, 480233, 525536, 578821, 667341, 723996, 807730, 873793, 947684, 977422, 975262, 938417, 936042, 895546, 885815, 879288, 888591, 883685, 908357, 911829, 946551, 909085, 905858, 968559, 966017, 958544, 941744, 940488, 926342, 899032, 860851, 851715, 762155, 714684, 674305, 605459, 546687, 459230, 396082, 348872, 319418, 290318, 276151]
7564B76151o1207l1207l4627q5445l517n879m9462k9449l797j1347k4012N293
7552e8505m5361k1902k3089k3L2943P497q850R079l823J3795N304J3843J9009
7539f0083L6031M5246K3525n03m98l0989l9910m1245j4149J2875k8377n986j6084
7526a20147q0193k9671l746j3075j6343n278J5734k7879l1031j6828L002O237
7514c19218o738J0953j3731L369k457p012q938o1861J0873J4438J5576N618j1688
7501c70816M982J2512p454P442m90j5682N816R30N3090J4965m107n319j0725K0758
7487b94098N894N513l809j737N952P358J7772l4183k7479o576j8614m1941p973
7474c93921M0834m6586m1758j7672L093P867J1557Q008j0993J8841J7167j7452
$$ y = [276151, 214944, 183737, 149110, 63665, 60148, 54269, 4807, -24642, -28439, -39786, -63798, -58505, -103866, -125768, -148857, -148880, -115937, -108440, -117290, -108211, -112034, -98239, -92935, -79092, -60083, -24052, 21194, 44719, 44216, 43718, 12729, -27181, -68426, -82575, -69700, -98077, -104063, -120147, -200340, -230011, -233757, -246832, -263175, -268453, -252719, -280598, -311629, -328457, -325455, -319218, -325956, -315003, -328734, -325365, -327822, -334834, -343772, -405633, -394760, -380322, -364746, -359128, -370816, -365834, -353322, -360776, -353334, -353824, -369506, -363690, -362760, -309670, -294705, -298812, -304131, -314856, -294098, -288204, -282691, -286500, -288237, -282285, -274927, -257155, -291338, -318817, -325393, -344007, -385948, -393921, -353087, -399673, -441431, -459103, -456010, -448143, -436586, -428578, -439571, -420730, -403563, -421015]
7462d21015k2712J6945J4184m358K950j794J2647k5623j9399L458J1857r473P389
7449d34944j1759N429L0000l81j2424j3504l0794M7827L4698j9973j4848q713
7437d29386m612k6289j5915K8310j5798j4587R452K7420J1384O59k3669r743j3413
7424d76187N623K1461J402j5717k3378l71j4147M6387K272m6455p002Q971K1396
7411d75745J701j999M243J6722J7524j4972j6668M553j5961P909k0059L846J2806
7398d76100Q779r911K7414J1512n852k2202m972M99m2718Q747L8287o0K4931J5904
7384d25742J7922j3266K442J2535J97K3534k3410L026j2489M142J0682j393O720
7371c95100J6506q75J7401j1377N7485J6473K3613K3935J6340K1291M4940N0486
$$ y = [-421015, -443727, -426782, -412598, -416956, -414006, -415800, -403153, -428776, -448175, -444717, -432860, -442333, -434944, -446703, -441274, -411274, -411655, -424079, -437583, -468377, -420550, -385852, -405825, -420673, -429386, -433998, -460287, -476202, -447892, -463690, -478277, -468825, -441405, -430021, -429362, -453031, -462774, -476187, -470564, -449103, -447701, -463418, -486796, -487167, -501314, -454927, -452655, -499110, -506112, -497141, -475745, -474044, -476043, -471800, -455078, -437554, -452526, -469194, -464641, -480602, -472693, -492752, -488906, -476100, -467321, -477232, -449818, -438306, -444158, -466360, -471332, -470833, -513551, -504804, -466517, -466577, -441646, -425742, -407820, -421086, -418644, -406109, -405912, -382378, -405788, -402762, -415251, -411109, -400427, -401820, -395100, -378594, -379469, -362068, -373445, -315960, -299487, -275874, -251939, -235599, -214308, -169368, -118882]
7359a18882Q2138R3962N7019M8754O957O092k290m5057K956K8236m274k6420j9671
7346A09520n6357j14828n3861k8694m5767k6534k2954l1377l299n3396j3430K5211
7334c15766J7536L1082k9100L46J5642K2122r541n105L2782J9297L2999N5819
7322a31887K9597L4731j9276K8725L4620K9542L8689M3309R4310O5703m218j6777
7310B27068k049J9183K2039K4674q225J8806l0515j8469m2666m9257l8548j5761
7298A06280l6310l5058L1910J9884J3674J951K0469k3761k4535n971k9400q772
7286C0361n5893l0812k0601n1845m5754m7791k7692j2144o374j9287j4326J3317
7274b88841p234m1670J1929L7730M2161J5270R996K6241m96M423L1358l6810m6460
$$ y = [-118882, -36744, 57218, 114237, 162991, 169948, 176040, 173750, 128693, 131649, 159885, 155611, 129191, 109520, 53163, -61665, -115526, -144220, -189987, -216521, -239475, -270852, -274151, -327547, -340977, -315766, -298230, -267148, -296248, -295902, -280260, -258138, -267679, -272784, -240002, -220705, -187706, -131887, -102290, -67559, -86835, -58110, -23490, 6052, 44741, 88050, 182360, 248063, 243845, 227068, 225019, 244202, 266241, 290915, 282690, 301496, 270981, 252512, 209846, 160589, 122041, 106280, 69970, 34912, 66822, 86706, 100380, 102331, 122800, 99039, 74504, 68533, 39133, 30361, -25532, -56344, -76945, -128790, -174544, -222335, -250027, -262171, -268545, -287832, -302158, -288841, -296075, -337745, -325816, -288086, -245925, -230655, -220659, -194418, -194914, -190491, -159133, -195943, -242403]
7261b42403k7730j703l142k3790j2376k0390j5294r956k148j0994m5776k697j0802
7248d29201j3436k1343J0481l226q025j0110Q419j8708j2928K1320J997n004n658
7235d85422l6977L2141m379q753J9545j7084J2042K5642l2394p640l7584K3405
7223e17458K4471k9535j473K3480J5682K9982M3835m8713R393K2085J3475J0431
7211d04345j4673N533M9585J7173l2927O69J1414j3253l0951K0756j5089k0155
7199d26263j1738J2403J5390k9912l1691J7861P402R69N0659J5448j1143J564
7187c89051N2506K1557l1788K852J7826J5149k737L3078l837k824n8585j9198
7175c65052m261k3242N606n624j4200j8529L8365J3792j5475j911l607J428m2134
$$ y = [-242403, -270133, -271836, -274978, -298768, -311144, -331534, -346828, -356784, -358932, -369926, -415702, -418399, -429201, -442637, -463980, -453499, -456725, -464750, -474860, -466441, -485149, -498077, -476757, -474760, -479764, -485422, -522399, -490258, -494637, -503390, -483845, -500929, -488887, -463245, -495639, -503279, -540863, -517458, -492987, -522522, -523995, -500515, -484833, -454851, -411016, -459729, -450336, -428251, -414776, -404345, -419018, -413485, -363900, -346727, -379654, -378985, -367571, -380824, -411775, -391019, -406108, -426263, -438001, -425598, -410208, -440120, -471811, -453950, -446548, -445579, -394920, -379472, -390615, -389051, -336545, -314988, -346776, -343924, -326098, -310949, -313686, -280608, -284445, -287269, -345854, -365052, -369313, -392555, -386949, -392573, -406773, -425302, -386937, -373145, -388620, -390531, -394138, -392710, -434844]
7162d34844l7347L9839l4P856J5663J1223J098K7078L1686J5342k6916k9312l6527
7149d15195j7400J9127r93r929J8682m7124l6140K2772Q754r308J6040l0538j942
7136d83194j7037q456J4839J2976j7971J2422K3333n642j3937k2971k0512Q108
7124e18042J8103J7871J8890j9339k5328J4487K1105l3052k6689L7835O86P866
7112d85607M234k1386k0064j745K3382N0354M853L911j3196n372K1680k179j3769
7099d54904l5319k9870K2163o20j3242J6371k327p67L281j3615P019L3150k2522
7086d91202N430k4132j7705o356J7602J721j0345J7252j7072J5148J5604k1296
7074e15351j8740M007M8609j7192K0958J9605k4402j539J1769M0599l2744m4577
$$ y = [-434844, -472191, -432352, -432386, -424530, -408867, -397644, -396546, -369468, -337782, -322440, -349356, -378668, -415195, -432595, -413468, -414461, -424390, -405708, -452832, -488972, -466200, -457446, -466754, -450714, -481252, -483194, -500231, -508687, -493848, -480872, -498843, -486421, -463088, -468730, -482667, -505638, -526150, -518042, -499939, -482068, -463178, -482517, -507845, -493358, -472253, -505305, -531994, -494159, -493473, -485607, -481373, -502759, -522823, -524568, -501186, -450832, -445979, -442068, -455264, -460636, -438956, -441135, -454904, -490223, -520093, -497930, -498550, -511792, -495421, -497748, -498515, -495234, -508849, -501830, -468680, -491202, -485772, -509904, -527609, -533965, -516363, -514642, -524987, -507735, -524807, -509659, -494055, -515351, -534091, -530084, -481475, -498667, -477709, -458104, -482506, -484045, -472276, -431677, -464421, -508998]
7062e08998J019J2784j769n546P473j8235L9197o932k2092l744J4881J9066m822
7049d77718j1644j943K0853L890R49j3952J1536L219l1314J1582P249P150R712
7036d60431r021M585n456L1580k0030k2696K4360j4492J8816k5709J739J2548
7024d64207j7078N539q278J6104J1374Q193L4289j1507l817J0022j6895k3860
7012d60121K089j0370J4127K4486j476j0719j0022J819L0606j3197k0609K486
7000d50901L7250R301j1956J0381m2398o591K2276K6098m35J3271j3254j966j4907
6987d23831Q262k5920K2740J0415k9036j3799L5693L1040K1065R7q875J6889l6130
6974c91390j190r366M891p819j9675J3410r030n874L5227j1451J9110k619m3314
$$ y = [-508998, -507979, -495195, -496964, -502510, -495037, -513272, -474075, -481007, -503099, -506843, -491962, -472896, -477718, -489362, -491305, -470452, -466562, -465613, -479565, -468029, -464810, -496124, -484542, -477293, -470143, -460431, -469452, -464867, -470323, -438743, -458773, -481469, -457109, -471601, -452785, -478494, -476755, -464207, -481285, -475746, -484024, -467920, -456546, -448353, -414064, -425571, -429388, -419366, -436261, -460121, -458032, -468402, -454275, -429789, -431265, -441984, -452006, -450187, -419581, -432778, -453387, -450901, -413651, -404350, -416306, -405925, -448323, -454914, -432638, -406540, -406975, -393704, -406958, -408924, -423831, -415569, -441489, -418749, -408334, -437370, -451169, -415476, -384436, -363371, -363274, -372149, -355260, -391390, -392580, -401946, -397055, -404874, -424549, -411139, -420169, -426043, -390816, -402267, -383157, -385776, -429090]
6961d29090K1161q654k873J1773K9271J5877k2854k9021J6791J0640j2810M065
6949c95724K4253K2795k3752J6269j5191p569Q987J9064p532J5756k364k1782
6937c66790J616K2048K1850j8893n425M8214L912l5087M503j971l604j0976K045
6924c38558J4757k034n107J0636M735q815j2473k12J0182J4632L0218l9230K0918
6911c00351Q767J8988J4224L796k2630K4092q553N263n243k1075M931R237k0461
6898b89015l2467L4242k0126M8876k3050l7654p586L1311J0964K9930j5415j0309
6886b80299K1383J9364k6918l8839L1999J412K681n945K4399L1006n3144j3495
6874b86396J1966j3919j171J3351L8309L0517k6763l5108N049L5823J004m762
$$ y = [-429090, -407929, -416583, -419456, -407683, -378412, -362535, -385389, -414410, -397619, -386979, -399789, -395724, -371471, -348676, -372428, -356159, -371350, -378919, -369932, -350868, -358400, -342644, -345008, -366790, -365174, -343126, -321276, -340169, -345594, -297380, -293468, -328555, -324052, -326023, -329627, -340603, -338558, -323801, -325835, -330942, -320306, -315571, -324386, -336859, -337071, -326889, -312257, -282039, -321269, -300351, -291584, -272596, -258372, -254576, -277206, -253114, -261667, -256404, -261647, -282722, -277791, -268554, -289015, -321482, -287240, -307366, -258490, -281540, -319194, -326780, -295469, -284505, -254575, -269990, -280299, -258916, -239552, -266470, -305309, -273310, -271898, -269217, -275162, -250763, -219757, -272901, -286396, -274430, -288349, -289520, -276169, -237860, -207343, -234106, -269214, -264165, -228342, -227338, -232100]
6862b32100q538J2837j2017Q124K991J1636K2761j2162l588J7202R146j5580m9832
6849b49120L28K8010K3327p398j5094k449M295J1907n285J367O624J0705q384
6836b01167l871L280q553L464j3208L4094m104J7607j4374K7186j4056k1265L7125
6823a57842k6185J3819K3774L9720m2281R451K2915q384j8248m8420J2855L8402
6811a40424j0550l145K1173L4084K5875j2624l1063J4827J1898l288J9403K4817
6799d9017j0140j1999l755P860J6048J3090j7502o598K8569K2566k1520P240j8197
6786d3355j984J4442J8154J8296o749j801J8801K3355k8242q025Q311k6882j895
6773a7574r050N1370K1950j9619j1425J7888l0689k3438K2902K9512q6K427j6814
$$ y = [-232100, -240638, -227801, -239818, -231694, -228703, -217067, -194306, -206468, -210056, -192854, -183708, -199288, -249120, -248792, -220782, -197455, -204853, -219947, -222396, -218101, -206194, -211479, -210112, -203488, -192783, -201167, -205038, -201758, -210311, -206847, -220055, -185961, -190065, -172458, -186832, -159646, -173702, -194967, -157842, -184027, -170208, -146434, -106714, -148995, -139544, -116629, -125013, -143261, -191681, -178826, -140424, -150974, -154119, -132946, -98862, -72987, -85611, -116674, -101847, -89949, -93237, -73834, -49017, -59157, -71156, -74911, -67051, -51003, -37913, -55415, -62013, -33444, -10878, -32398, -25158, -43355, -45339, -30897, -12743, 5553, -1196, -2997, 15804, 39159, 10917, 2892, 11203, -15679, -17574, -26624, 24746, 46696, 27077, 15652, 33540, 2851, -20587, 2315, 31827, 31741, 34168, 17354]
6760A7354M113j7446J2070K1945R591L0465Q974Q71l35O344o80j5754J963M423
6746H3898k3238L815K8139L935l1803J3385K793L8358j0189K0861J1601j2581
6734A28974j3317J3189J7269L4904L218k2794K0012j249j115L8K220M680j921
6721A84108P812J0388R305M871O658J7215r813L00K5433j0925L9503J6466k6345
6708B74976q123L2061K5694J0086N515m348o386J5441J3982K4783l998Q992l361
6695C85314J7750m965o86K2688K424N95L3274L5405J0032l777J7958R613j1649
6682E13976L3989J3438n646n185M6500K9063j0765k7396J6986L4678L2361K891
6670F74890R630J1364K0067j2511K636J6971J4165M7286K0091j2205N0202K5388
$$ y = [17354, 21467, 4021, 16091, 38036, 47627, 78092, 87066, 87937, 87602, 93946, 93266, 77512, 79475, 83898, 60660, 64475, 92614, 96549, 64746, 78131, 80924, 119282, 109093, 129954, 141555, 128974, 115657, 128846, 146115, 181019, 184237, 161443, 181455, 180206, 179091, 179129, 181349, 186029, 184108, 191920, 202308, 211613, 216484, 223142, 240357, 230544, 230844, 256277, 245352, 284855, 301321, 274976, 266853, 298914, 324608, 334694, 340209, 335861, 329475, 344916, 358898, 383681, 379683, 388675, 385314, 403064, 398099, 397413, 420101, 422525, 423120, 456394, 491799, 501831, 498054, 516012, 525625, 513976, 547965, 561403, 555757, 550572, 597072, 626135, 615370, 587974, 604960, 639638, 671999, 674890, 684520, 695884, 715951, 703440, 706076, 723047, 737212, 784498, 804589, 792384, 842586, 867974]
6658H67974q089L0790N1803L5735L2725N810j0818L3348M9993k7684Q961N5975
6646A126523L3202M1074O3980J053M1156P1729K5207k8173J2520P3054O4636M7268
6634A573229L4043M0275M1335N6276M3150N8809Q2334O7230K9503Q0194O1406
6623B167784L7761O5841M8336O8752Q0919O2908O6161R1953Q6880P4698Q5997
6612B937990Q2976P0253O6282O0257P2544Q4473O8205O6755P1549P4045P3736
6601C729065M2205M6507L4037K8479M9947J9954K2290L4455K5126k8974K744Q039
6589D013874k105m2602J0760l8579m9229L486j8022o5920o6842j2522j7816m8169
6577C666314m5627k5139j6913o1533l7162k6451j9675n0979l7500m0888l5066
$$ y = [867974, 859885, 890675, 942478, 978213, 1010938, 1016748, 1005930, 1039278, 1089271, 1061587, 1070548, 1126523, 1159725, 1200799, 1264779, 1265832, 1306988, 1378717, 1403924, 1375751, 1388271, 1461325, 1525961, 1573229, 1607272, 1647547, 1688882, 1745158, 1788308, 1847117, 1929451, 1996681, 2026184, 2106378, 2167784, 2205545, 2271386, 2319722, 2388474, 2469393, 2532301, 2598462, 2690415, 2777295, 2851993, 2937990, 3020966, 3091219, 3157501, 3217758, 3290302, 3374775, 3442980, 3509735, 3581284, 3655329, 3729065, 3771270, 3817777, 3851814, 3880293, 3930240, 3950194, 3972484, 4006939, 4032065, 4003091, 4005835, 4013874, 4011769, 3969167, 3979927, 3941348, 3892119, 3895605, 3877583, 3811663, 3744821, 3732299, 3714483, 3666314, 3620687, 3595548, 3578635, 3517102, 3479940, 3453489, 3433814, 3382835, 3345335, 3304447, 3269381]
6566C269381l7230m9962n1272j8185m2823l7566o8098m0677k1811m8812n0754
6555B802191l247j9106q3297l4310m701o4131m5478M356k1020m7455m9919j0275
6543B423608o6307l0348j9402q3085k9515j771n4671j6192j3346k3477k7786l1324
6531B026384m2280k4872m1417J3939j3035j0929o2804k298l1660j3990j8388p087
6519A771563J2090m1681l2343J149O653l6750k8786k283J7395l8295l8707j4708
6507A575297m5212J795M9270K20j3069k2741k171l6581j4745K8250K8822m8653
6495A500482k0686l125j762J989k5845K217j0755J3493K5519j5585M914N809k2319
6482A454346l8334J5589J7270j2794J342N642J4797O379k105j5848J3697P530
$$ y = [3269381, 3232151, 3182189, 3130917, 3112732, 3069909, 3032343, 2964245, 2923568, 2901757, 2852945, 2802191, 2798944, 2779838, 2696541, 2662231, 2657530, 2593399, 2547921, 2552277, 2531257, 2483802, 2433883, 2423608, 2357301, 2326953, 2307551, 2224466, 2194951, 2193180, 2138509, 2122317, 2108971, 2085494, 2057708, 2026384, 1984104, 1959232, 1917815, 1931754, 1918719, 1907790, 1844986, 1842688, 1811028, 1797038, 1778650, 1771563, 1783653, 1741972, 1709629, 1710778, 1717431, 1680681, 1651895, 1649612, 1667007, 1628712, 1590005, 1575297, 1530085, 1531880, 1581150, 1581370, 1568301, 1545560, 1543389, 1506808, 1492063, 1520313, 1549135, 1500482, 1479796, 1476671, 1474909, 1476898, 1451053, 1453270, 1442515, 1456008, 1481527, 1465942, 1470856, 1476665, 1454346, 1416012, 1431601, 1448871, 1436077, 1437419, 1443061, 1457858, 1464237, 1462132, 1446284, 1459981, 1467511]
6470A467511j0807l2464K6642J9732j9766q757J7260j3056K535O401l3836J4052
6458A435447K9411j2691M625k6833M3810J0635q100j8999K4924J9974j2223Q53
6446A490833L6660j6906j6089K7634l658p477R139J2518J2603J7953N308k2730
6434A545788L3937L667j4476n933m8096k797o11j0283j4539J0317L9912K6382
6422A563268k0193J3627k3149K3330J7247L016j694k4347j66J5848J7285j510
6410A582562K7595K5621P823K2498L1227R860k9024r779O246J5586l3285M6101
6398A703031j6075k7299o139N974m423J436K3350J8512o358m82l221K2416J184
6385A711906P259J5293L5540J5638n1227n104J3253J3753K0665L6786L6887L3037
$$ y = [1467511, 1456704, 1424240, 1450882, 1470614, 1450848, 1442091, 1459351, 1446295, 1448830, 1455231, 1421395, 1435447, 1464858, 1452167, 1456792, 1429959, 1473769, 1484404, 1476304, 1457305, 1482229, 1502203, 1489980, 1490833, 1527493, 1510587, 1494498, 1522132, 1518474, 1510997, 1520136, 1532654, 1545257, 1563210, 1568518, 1545788, 1579725, 1583392, 1568916, 1562983, 1514887, 1512090, 1511479, 1501196, 1486657, 1496974, 1536886, 1563268, 1543075, 1556702, 1533553, 1556883, 1574130, 1577146, 1575452, 1551105, 1550939, 1566787, 1584072, 1582562, 1610157, 1635778, 1643601, 1666099, 1697326, 1707186, 1678162, 1668383, 1674629, 1690215, 1656930, 1703031, 1686956, 1659657, 1653518, 1659492, 1655069, 1656505, 1679855, 1698367, 1692009, 1691527, 1688306, 1710722, 1711906, 1719165, 1734458, 1769998, 1785636, 1734409, 1729305, 1742558, 1756311, 1776976, 1813762, 1850649, 1883686]
6373A883686N406k9625j5906j4991K9778j4872j7801L507J736n851K9028k9576
6361A824519J4276k3626J3723K8202k526k6778M901K8607m2861K0669n708L7620
6349A871018L8576N42j8133M1416k95K9421L3820M5239J4345l5874j3249l3975
6337A972851Q007k7552J6208l422j0594J3412J1622j6209K1428N8890k9223J1532
6325B026950M69j0755k270R731N482N387k7839k287J7170P114L6986J5792j2804
6312B069126R710J0Q231K8746M313l321K2571k4240J8943N526j5837J7429J0455
6299B151662k339Q370k3963j272J1521q848J4571L1014K9678J3119m4045M331
6287B183799J8197j8955M2176M3590L2441K3135K6386K6333m43n6252k5099K4474
$$ y = [1883686, 1889092, 1859467, 1843561, 1828570, 1858348, 1843476, 1825675, 1829182, 1830918, 1825067, 1854095, 1824519, 1838795, 1815169, 1828892, 1857094, 1854568, 1827790, 1832691, 1861298, 1818437, 1839106, 1833398, 1871018, 1909594, 1910136, 1892003, 1933419, 1933124, 1962545, 1996365, 2041604, 2055949, 2020075, 2006826, 1972851, 1980858, 1953306, 1969514, 1966092, 1955498, 1968910, 1980532, 1964323, 1985751, 2044641, 2015418, 2026950, 2027419, 2016664, 2014394, 2024125, 2029607, 2034994, 2007155, 2004868, 2022038, 2029152, 2066138, 2081930, 2069126, 2078836, 2078846, 2087077, 2115823, 2120136, 2116815, 2139386, 2115146, 2134089, 2139615, 2123778, 2141207, 2151662, 2149323, 2157693, 2133730, 2132458, 2143979, 2135131, 2149702, 2180716, 2210394, 2223513, 2179468, 2183799, 2201996, 2183041, 2225217, 2268807, 2301248, 2324383, 2350769, 2377102, 2376659, 2320407, 2295308, 2319782]
6275B319782j5601K6979k2630l6468J6119p490j5461O362K5952K2389j2909j6398
6263B290626q611k6404K4088L5014J5460j0133J2169O1929j0288J7287K427K0971
6251B424535K468L3037j3042l1020o371o194j8572J0739j1506Q654l2723j7276
6239B342729M792K8850J7941J6420J2342J2923k1392k4407J770N126K3892K5296
6227B446282p850j473K8716m295J9898n9349m166L9056M9676m0201Q412K3999
6215B498705m3101P022L1435k778J75j1299J3292K58j3394j5947P080k961K9251
6202B497738J1972J2433P153K7188K7265o050K3682j1022l296J7324o736L2195
6190B629846K727j8085K7826P521j1354Q341J7657L6518K1024M702J8232J9567
$$ y = [2319782, 2304181, 2331160, 2308530, 2272062, 2288181, 2280691, 2265230, 2271592, 2297544, 2319933, 2307024, 2290626, 2282015, 2255611, 2279699, 2314713, 2330173, 2320040, 2332209, 2394138, 2383850, 2401137, 2403564, 2424535, 2427003, 2460040, 2446998, 2415978, 2409607, 2403413, 2384841, 2395580, 2384074, 2392728, 2360005, 2342729, 2347521, 2376371, 2394312, 2410732, 2423074, 2435997, 2414605, 2390198, 2391968, 2397094, 2420986, 2446282, 2438432, 2436959, 2465675, 2461380, 2481278, 2421929, 2417763, 2456819, 2506495, 2466294, 2474706, 2498705, 2455604, 2462626, 2494061, 2491283, 2491458, 2480159, 2493451, 2493709, 2480315, 2464368, 2471448, 2468487, 2497738, 2509710, 2522143, 2529296, 2556484, 2583749, 2577699, 2601381, 2590359, 2587063, 2604387, 2597651, 2629846, 2632573, 2614488, 2642314, 2649835, 2638481, 2646822, 2664479, 2700997, 2722021, 2726723, 2744955, 2764522]
6178B764522r255K9358K1252K4016J4086N6070L2222J2871M3577O5033O4251R3285
6166C211288P2160N0731P4862J16106J06813R7425J13449J92115J74023K62830
6156D471802L57589M65324N18621N73813O46658N31708K32015J2293j71229l05791
6146G332803l73487l04849j78444r6107L0510J10627K23021L61303M50344N17784
6136H073505N93859N67556N11214M07928K03822q450j03939j50119k03473j62084
6126I729819q9028R0383K57546M92669P81455R74665R34061P24934L06534j89897
6116A4013141o16944r08295q95002p95171o75962m51804k32413n3121J08485K29272
6106I722186M47032O22786Q07971R83565J126187J253834J223115J067688P48788
$$ y = [2764522, 2755267, 2784625, 2805877, 2829893, 2843979, 2900049, 2932271, 2945142, 2988719, 3053752, 3118003, 3211288, 3283448, 3334179, 3409041, 3525147, 3631960, 3729385, 3842834, 4034949, 4208972, 4471802, 4829391, 5294715, 5813336, 6387149, 7033807, 7565515, 7797530, 7809823, 7638594, 7332803, 6959316, 6654467, 6476023, 6379916, 6410426, 6521053, 6744074, 7105377, 7555721, 8073505, 8667364, 9234920, 9746134, 10154062, 10357884, 10349434, 10245495, 10095376, 9891903, 9729819, 9640791, 9731174, 9988720, 10481389, 11262844, 12237509, 13171570, 13896504, 14203038, 14013141, 13396197, 12487902, 11592900, 10797729, 10121767, 9669963, 9437550, 9384429, 9492914, 9722186, 10169218, 10792004, 11599975, 12583540, 13709727, 14963561, 16186676, 17254364, 18003152]
6097A8003152K54480k18613o92348r82696j032841r20924o93730m70684k82805
6088A2962991q3475j33343k37872m78454o22308o82232o07711n48169l96964k92983
6078H879480j24516k0512J22413L45823N41657Q37729J442734J919343J962324
6069A5906475Q53682j19801n52922q14798o86294m86820n10468n72729p13365
6060A2302960p08242p14295o97185o64435n52036m66429l72842l01131k26602
6051G599763j02866j3705K8254J60807K16548L05096L93006O57938Q60003J317269
6041A1422113J925455L370466M864145N370092K705137j499939l056316m253563
6033B0847590l765330k620769j970676j492047j150094q65592o00050l87412l34854
$$ y = [18003152, 18257632, 18039019, 17346671, 16363975, 15331134, 14410210, 13716480, 13245796, 12962991, 12879516, 12746173, 12508301, 12029847, 11407539, 10725307, 10117596, 9569427, 9172463, 8879480, 8754964, 8734452, 8856865, 9202688, 9744345, 10582074, 12024808, 13944151, 15906475, 16760157, 16640356, 16087434, 15272636, 14586342, 14099522, 13589054, 13016325, 12302960, 11594718, 10880423, 10183238, 9518803, 8966767, 8500338, 8127496, 7826365, 7599763, 7496897, 7483192, 7511446, 7672253, 7888801, 8193897, 8586903, 9244841, 10104844, 11422113, 13347568, 16718034, 21582179, 26952271, 29657408, 28157469, 25101153, 20847590, 17082260, 14461491, 12490815, 10998768, 9848674, 8983082, 8383032, 7995620, 7660766]
6024G660766k43166k16061j83794j22913p0372k2122l4338N5485J94676K62026
6014G280187K96065L90554N92315P99526J135667J765091K996496M674564N474179
6005B5404644L763169p87417k895045m127710m130432k848449k130862j521798
5997A0726100j171721q18532n20237k42017r5054M9368M8077l0065j08703j33424
5987G703792j76040j30420j42398l5366M156J10296J44520K76484L40243M36133
5977H531400N66651R00833J366585J699230J264736j10909r70069j425845j507085
5968A0315527j157327q51584o18814m54208l13427k18058o6571j5234J00363J61502
5958F882169K07952K37832K92414K83601K53396K65568L26285K63160K09438J28884
$$ y = [7660766, 7417600, 7201539, 7017745, 6894832, 6824460, 6802338, 6768000, 6823485, 7018161, 7280187, 7576252, 7966806, 8559121, 9358647, 10494314, 12259405, 15255901, 19930465, 25404644, 29167813, 28380396, 25485351, 21357641, 17227209, 14378760, 12247898, 10726100, 9554379, 8735847, 8215610, 7973593, 7878539, 7927907, 7975984, 7945919, 7837216, 7703792, 7527752, 7397332, 7254934, 7219568, 7223724, 7334020, 7478540, 7755024, 8095267, 8531400, 9098051, 9998884, 11365469, 13064699, 14329435, 14218526, 13248457, 11822612, 10315527, 9158200, 8306616, 7687802, 7233594, 6920167, 6702109, 6635538, 6620304, 6720667, 6882169, 7090121, 7327953, 7620367, 7903968, 8157364, 8422932, 8749217, 9012377, 9221815, 9350699]
5948I350699K3222j11019k24223m04326m32576m40647m45495m17282l52984m07635
5938F137734l30765k52740k47516k08195j56178j36342r8497l3481m9445m9018
5928D575557N3879M7535P5479R1849J04065J17751J28480P1422N8372m1918j53260
5917E129211k19012k18159k63510k81555k73040k66888k33402j94240j79574j85967
5907B813864j47445j16796j55573j20842q0675j38111j24741q2313o0040o0601
5897A726727o8170n9052o8119m1203l3712o7029k2159j2311m4433l8127k3238
5886A249174n3073k6578l9409k8543l3407m4315L8286l5923m6605p139n6312k7337
5874H88819k0876K3103k2183l9699j3201O992m1418p856n40l8220r408J1366n8795
$$ y = [9350699, 9373921, 9262902, 9038679, 8634353, 8201777, 7761130, 7315635, 6898353, 6545369, 6137734, 5806969, 5554229, 5306713, 5098518, 4942340, 4805998, 4707501, 4674020, 4624575, 4575557, 4629436, 4676971, 4752450, 4844299, 4948364, 5066115, 5194595, 5266017, 5324389, 5282471, 5129211, 4910199, 4692040, 4428530, 4146975, 3873935, 3607047, 3373645, 3179405, 2999831, 2813864, 2666419, 2549623, 2394050, 2273208, 2192533, 2054422, 1929681, 1847368, 1787328, 1726727, 1658557, 1599505, 1531386, 1490183, 1456471, 1389442, 1367283, 1354972, 1310539, 1272412, 1249174, 1196101, 1169523, 1130114, 1101571, 1068164, 1023849, 1062135, 1026212, 979607, 972468, 916156, 888819, 867943, 891046, 868863, 829164, 815963, 822955, 781537, 773681, 773141, 734921, 725513, 736879, 678084]
5861F78084n281j6811k5869k9514l0692J2621l097j3097n123J7133j3157l2750
5849E32447k4336J7423j845l2637J1728J5235k053m8175j9545l607j6693M240
5837D32182n137J4424K0511k6749j8833m786j291l4494L1399o900j4604L2135
5825D17857m0507L639j2268j9978N820l1569P632j1752j7637r774p538J9157M988
5812C08070K4403m997k4088k9379l6206J9500k3026L2482p2J7725q704j4900N992
5799B66800M724M9020m155r516k5263j1533q867m211j5894M7005j9836p163k855
5786B58256J5530K3180l4008j3585K4218k5660O72L3837m423K2910l6441j6422
5774B48064Q910J3614J6594k0183j5790j700m3351L8438J7492K0574K1678N000
$$ y = [678084, 672803, 655992, 630123, 600609, 569917, 582538, 579441, 566344, 561221, 578354, 565197, 532447, 508111, 525534, 523689, 491052, 502780, 518015, 515962, 467787, 448242, 444635, 427942, 432182, 427045, 441469, 461980, 435231, 416398, 411612, 410321, 375827, 407226, 400326, 385722, 417857, 377350, 380989, 368721, 348743, 354563, 322994, 330626, 318874, 301237, 291463, 283925, 303082, 308070, 332473, 327476, 303388, 274009, 237803, 257303, 234277, 266759, 266687, 284412, 275708, 260808, 266800, 271524, 320544, 316389, 306873, 281610, 270077, 261210, 256999, 241105, 288110, 268274, 261111, 258256, 273786, 296966, 262958, 249373, 273591, 247931, 248603, 282440, 278017, 300927, 264486, 248064, 256974, 270588, 287182, 266999, 251209, 249509, 206158, 244596, 262088, 282662, 304340, 309340]
5762C09340K8497R000j3218J2054J8773m479l3718o195Q938p399P650K305L3949
5749C65497j513jm0151J2824k2414l226M948o038n531o218J9636K4568k435p405
5735C32541P303M8087m942p479J8220j195J5719k6079J2260n496k7351p886J036
5722C54738L094Q079l1788n056J5987K2598j2908m2318J9140J8894k8475j1182
5710C10803j0257l828J1244k2688Q768O302O183N036J13N520r917j2037K8486
5697C23728K2852P518K0360J7749n2414j1135j4197j1476k630n347O388J1855
5685C13251J562l49l942j9433O0809J8601n34n397m7005k6928l6686L1450p954
5672B77445k6612j5512J8287k559J2538N4051K5319J5694J0655M7982O355K1964
$$ y = [309340, 337837, 346837, 333619, 345673, 364446, 359967, 326249, 320054, 328992, 321593, 329243, 331548, 365497, 363984, 363983, 323832, 336656, 314242, 311016, 315964, 309926, 304395, 298177, 317813, 342381, 339946, 332541, 339844, 387931, 382989, 375510, 393730, 392535, 408254, 382175, 394435, 388939, 361588, 353702, 354738, 357832, 365911, 334123, 329067, 345054, 367652, 354744, 312426, 331566, 350460, 321985, 310803, 300546, 296718, 307962, 285274, 294042, 300344, 306527, 311563, 311676, 317196, 307279, 295242, 323728, 346580, 354098, 374458, 392207, 339793, 328658, 314461, 302985, 300355, 295008, 301396, 313251, 314813, 314464, 310522, 291089, 351898, 370499, 369965, 364568, 317563, 290635, 253949, 285399, 277445, 250833, 235321, 253608, 251049, 263587, 317638, 342957, 358651, 369306, 417288, 423643, 445607]
5660D45607m5494K4598L1361k273O0532N1592N9169O8805N3246P2243O761k9103
5648G97044k3389l3778n2903m7422m9997J8391L0259j1991L4841J766J6064N6098
5636G34983R4742P8771N1188O1356Q0797j1263k0283j8648m243l5247m0143M1803
5624A013813O1737J49067K21506J96123J42808J07705n231r4702j74154j56918
5614A461754j69219j04208r2537o2366R744L5554Q4535J26666J93001J84061K05169
5603A872154J46256K7349p3966j30853j80755j75850j22618j31074j3416K1000
5593A238227M3511P7280J45394J87332J48493O4852j6759q6050j42055j46231
5583A513994j29165q7072q4058l3723k3319k0151J2564P3026N1128O5852P6452
$$ y = [445607, 400113, 424711, 456072, 453799, 514331, 565923, 625092, 693897, 747143, 819386, 826147, 797044, 773655, 739877, 686974, 639552, 589555, 607946, 638205, 626214, 661055, 662821, 678885, 734983, 829725, 908496, 959684, 1021040, 1101837, 1090574, 1070291, 1051643, 1047400, 1012153, 972010, 1013813, 1075550, 1224617, 1446123, 1642246, 1785054, 1892759, 1887528, 1792826, 1618672, 1461754, 1292535, 1188327, 1095790, 1033424, 1043168, 1078722, 1163257, 1289923, 1482924, 1666985, 1872154, 2018410, 2045759, 1971793, 1840940, 1660185, 1484335, 1361717, 1230643, 1217227, 1238227, 1281738, 1359018, 1504412, 1691744, 1840237, 1905089, 1888330, 1802280, 1660225, 1513994, 1384829, 1297757, 1213699, 1179976, 1156657, 1136506, 1149070, 1222096, 1273224, 1339076, 1415528]
5572A415528K165l8558p1980m6670r6712m0376k1378j8608L8739O2889N3759J00915
5560A339713R0649J10181J31485M7531j079n7131r5659r9830r4496j04799j06526
5549A160039j24502p8815q9344o0534m0146j2295K322k5828m986K580l3543o044
5537F88904L8047N7863J349J1396P9964N2164R493K7189O8633L8907k546m6226
5525A025137m7484n6115m3158n1006l9715k4582l9423l0765n9035l3938k6608
5514E73308m4539j1468j4827l0093l6228L8470k020l9503j291J9352L4792j1065
5502D74888j0016o692N56k1441J2051m1557j470j4944k0559k0163P030R227J5615
5489C82525J861J9478N0853o870l0020l8642k0434k2628m6288L548o37n627J2273
$$ y = [1415528, 1417693, 1379135, 1307155, 1260485, 1163773, 1123397, 1102019, 1083411, 1122150, 1185039, 1238798, 1339713, 1430362, 1540543, 1672028, 1719559, 1718480, 1661349, 1565690, 1465860, 1371364, 1266565, 1160039, 1035537, 956722, 867378, 806844, 766698, 754403, 756725, 730897, 725911, 728491, 694948, 688904, 726951, 784814, 786163, 797559, 877523, 929687, 939180, 966369, 1035002, 1073909, 1071363, 1025137, 977653, 921538, 878380, 827374, 787659, 763077, 723654, 692889, 633854, 599916, 573308, 528769, 517301, 502474, 472381, 436153, 474623, 472603, 433100, 431809, 451161, 485953, 474888, 464872, 458180, 458736, 437295, 449346, 407789, 406319, 391375, 370816, 350653, 357683, 366910, 382525, 384386, 403864, 454717, 447847, 417827, 379185, 358751, 336123, 289835, 293383, 292746, 287119, 299392]
5476B99392m2237L975J3414j1907J2015m655j943j6692j4757l887k0484k180K9332
5463B39386j6820k4833l1498N6530q606Q396J2909j5170J419k5397m950m712k9481
5450A57173n885L3244r40J3745j2789j0347k955l8144N308K1881R900O308m8770
5437A27729K5821j8209K3692l3757J3726K4732j15m405o39j0364K8105j2339J6569
5424A80546K5039Q431n743L4691M3664l793l1970N584K5117j182J7267j4774J0343
5411B93220L404j8765J7805J6675J4959N217p202J613O650J1473k430J4093K8047
5398C84759K8796j5053R107l475L4015L5678k2998q292L8227L5645o247l1830
5386D78332L7452M6776K2348O48j5005o368J5236J0791j4017K518m630K0213L1849
$$ y = [299392, 257155, 261130, 274544, 262637, 274652, 269997, 268054, 251362, 236605, 232718, 212234, 210054, 239386, 222566, 197733, 166235, 222765, 214159, 222555, 235464, 220294, 221713, 196316, 191366, 186654, 157173, 151288, 184532, 183592, 197337, 184548, 174201, 171246, 133102, 138410, 160291, 170191, 176499, 127729, 153550, 135341, 159033, 125276, 139002, 163734, 163619, 159214, 158575, 148211, 176316, 163977, 180546, 205585, 214016, 208273, 242964, 286628, 282835, 250865, 256449, 281566, 280384, 297651, 282877, 293220, 296624, 277859, 295664, 312339, 327298, 332515, 325313, 326926, 333576, 345049, 342619, 356712, 384759, 413555, 398502, 407609, 404134, 438149, 473827, 450829, 442537, 480764, 516409, 510162, 478332, 515784, 562560, 584908, 585556, 570551, 564183, 579419, 590210, 576193, 578711, 574081, 594294, 626143]
5373F26143o872p630j1904J1717M0028j6373J662N2621J992k87J2701O983m384
5360G06397j7498r861K8497J6261k0540m440L1369K7557k9240l760K4327J7136
5348G66205j7054l1844R109J4538M3353Q404K3290K8232J1287p51k87N0172M7566
5335I52220J7218M806M9469K5459J0663K6834K2453J0337O8507M6723L7073K6134
5323A297896P9977O8961O7472R2231P6122R9686Q5095J74663J74478J36089J86500
5312B539170J87475J99735J96618J78656J95385J93229J45445R0420P1303k3267
5302C974169l6885l6752o5905j11682l4783n6666p3635j5540k5266O879M144N8231
5290C586309J10700J23976J51131J98522K14408K76349L22034L48159L85362L84743
$$ y = [626143, 619271, 611641, 599737, 611454, 651482, 635109, 636771, 689392, 691384, 691097, 703798, 710781, 706397, 688899, 679038, 707535, 723796, 703256, 698816, 730185, 757742, 728502, 724742, 749069, 766205, 749151, 717307, 726416, 740954, 784307, 792711, 816001, 844233, 855520, 854769, 854482, 904654, 952220, 969438, 974244, 1023713, 1049172, 1059835, 1086669, 1109122, 1119459, 1187966, 1234689, 1271762, 1297896, 1377873, 1446834, 1514306, 1606537, 1682659, 1782345, 1867440, 2042103, 2216581, 2352670, 2539170, 2726645, 2926380, 3122998, 3301654, 3497039, 3690268, 3835713, 3926133, 3997436, 3974169, 3937284, 3900532, 3834627, 3722945, 3688162, 3631496, 3557861, 3542321, 3517055, 3523934, 3528078, 3586309, 3697009, 3820985, 3972116, 4170638, 4385046, 4661395, 4983429, 5331588, 5716950, 6101693]
5280F101693M11075M08269M10517K95346J93598j6722k16136l81355m47966m78588
5270F279731m24325l96412l25627k72057k41765j18227j34350j55218r3067m9019
5260D069664n7051j3451L8599J0892N0445J09337R2205J05841J64557K10387J61950
5249D943375K14363K89920M01998N53445O80888O79590L68551j42178n94449p66234
5239F629269p39246o71281m88261l71702k48980j27965j4471O4344K3488J7425
5229D072620j3516q5775m1907P450L7932P1144J20324J78977K62838L61908M23716
5218E395711N38505O27569P87363R51348J102056J267144J274071R41661K75338
5209A3160766m27353r17941j143902j115169r81118q23976o34071m97032l66229
$$ y = [6101693, 6512768, 6921037, 7331554, 7626900, 7820498, 7803776, 7587640, 7206285, 6758319, 6279731, 5855406, 5458994, 5133367, 4861310, 4619545, 4501318, 4366968, 4211750, 4118683, 4069664, 4012613, 3999162, 4037761, 4048653, 4099098, 4208435, 4300640, 4406481, 4571038, 4781425, 4943375, 5157738, 5447658, 5849656, 6403101, 7083989, 7763579, 8132130, 7989952, 7395503, 6629269, 5890023, 5218742, 4730481, 4358779, 4109799, 3981834, 3967363, 4031707, 4055195, 4072620, 4059104, 3973329, 3931422, 3938872, 3976804, 4047948, 4168272, 4347249, 4610087, 4971995, 5395711, 5934216, 6561785, 7349148, 8300496, 9402552, 10669696, 11943767, 12885428, 13160766, 12733413, 11815472, 10671570, 9556401, 8575283, 7751307, 7117236, 6620204, 6253975]
5200F253975k12004j06471r3917j39506j47811j32843q8434j8666j5951N0613
5190E348985Q8768J82261K97499L80240M21799N99569P04642R29502J176095J364771
5180A1494131J540150J476484J164920O62599O3730m83882r12600j171136j221150
5171A2613246j205339j123727j016280r11031p70275o13029n31049m85405m23517
5162E533594l18410k58065k66258k02639j28768j16679o7695q914K0524P6942
5152D263632J03244J52460J75468K92890L23548L49372M36444M20625M11851L43419
5142G272953K08406R5884n2783k69408l73805m62166n08325n11693m78961l98259
5132D521843l52515l27480k55565k23722j91621j22899j29137p4226p1265m4657
$$ y = [6253975, 6041971, 5935500, 5841583, 5702077, 5554266, 5421423, 5332989, 5314323, 5298372, 5348985, 5437753, 5620014, 5917513, 6297753, 6719552, 7319121, 8023763, 8953265, 10129360, 11494131, 13034281, 14510765, 15675685, 16338284, 16402014, 15918132, 15005532, 13834396, 12613246, 11407907, 10284180, 9267900, 8356869, 7586594, 6973565, 6442516, 5957111, 5533594, 5215184, 4957119, 4690861, 4488222, 4359454, 4242775, 4175080, 4166166, 4186690, 4263632, 4366876, 4519336, 4694804, 4987694, 5311242, 5660614, 6097058, 6517683, 6929534, 7272953, 7481359, 7577243, 7524460, 7255052, 6881247, 6419081, 5910756, 5399063, 4920102, 4521843, 4169328, 3841848, 3586283, 3362561, 3170940, 3048041, 2918904, 2844678, 2773413, 2728756]
5122B728756r15j195L5276K2699Q3775J21259R6023N9414K6479p583n0403j18292
5110B995293j21465j47264j44101r9041k9939p854j2280n340K3532N557n5917
5099B401181n8872n095q424K2663N7982P8775R8713J17031J66646J69137J33611
5088C173348J50104J91321K72643K87502M34354N19109M42917K96627Q8317j97160
5078E659082l33945m61251n11551m73596m45191l26231k60772k01721j65377j44902
5068B334545r7044p8386m9901m1758J062j2097L8498P8900O2838Q6055R8913J38515
5056B560140J14935K04025K55841L50624M27811N10413N96575N38815L57767J29585
5046F046531j50828l89073n50814n57574n71435n11136m66512l31345k84832k33771
$$ y = [2728756, 2727841, 2726646, 2761922, 2784621, 2868396, 2989655, 3085678, 3145092, 3171571, 3163988, 3113585, 2995293, 2873828, 2726564, 2582463, 2483422, 2453483, 2445629, 2433349, 2428009, 2451541, 2457098, 2401181, 2342309, 2337214, 2328790, 2351453, 2409435, 2488210, 2586923, 2703954, 2870600, 3039737, 3173348, 3323452, 3514773, 3787416, 4074918, 4509272, 5028381, 5471298, 5767925, 5856242, 5659082, 5325137, 4863886, 4352335, 3878739, 3433548, 3107317, 2846545, 2644824, 2479447, 2334545, 2237501, 2159115, 2109214, 2067456, 2068518, 2056421, 2094919, 2173819, 2236657, 2322712, 2421625, 2560140, 2675075, 2879100, 3134941, 3485565, 3913376, 4423789, 5020364, 5559179, 5916946, 6046531, 5895703, 5506630, 4955816, 4398242, 3826807, 3315671, 2849159, 2517814, 2232982, 1999211]
5036A999211j61565j26229j09607j07635o4429o3064m5242l6825j1676M7196M4005
5025A364140K5862N9045J20158K03538K16325K25002K29214J82236J32693M2250
5015B800463p117p8552j51876j53040j88475k12108k20251j82356j71690j45443
5005A289555j50929j00141j22156n6623m4500q7409n8567J495l0188j8315j0727
4994F11495p147M587j789N1282P1920O0827L5441L8014K3789J7435m6128j1075
4982H48651Q98j0656J6287J2339K1022Q1630O7623l236o2145o2551q3524q5508
4970G40830q9016l6759o3228m5266j1764o839l520r145J8023J968J5010K3309
4958E33603p941J9100L8234M6524O5208J00769J25798J67922J68587J67549J62648
$$ y = [1999211, 1837646, 1711417, 1601810, 1494175, 1429746, 1366682, 1321440, 1284615, 1272939, 1320135, 1364140, 1390002, 1449047, 1569205, 1772743, 1989068, 2214070, 2443284, 2625520, 2758213, 2800463, 2793346, 2714794, 2562918, 2409878, 2221403, 2009295, 1789044, 1606688, 1434998, 1289555, 1138626, 1038485, 916329, 859706, 815206, 727797, 669230, 670725, 640537, 622222, 611495, 604348, 608935, 607146, 658428, 730348, 791175, 826616, 864630, 888419, 905854, 859726, 848651, 849549, 838893, 855180, 867519, 888541, 970171, 1037794, 1034558, 972413, 909862, 826338, 740830, 651814, 615055, 551827, 506561, 494797, 487958, 484438, 475293, 493316, 495284, 510294, 533603, 525662, 544762, 582996, 629520, 694728, 795497, 921295, 1089217, 1257804, 1425353, 1588001]
4947A588001J44957J53431J43632J60698P2032J1058p9888j21647j78512j85007
4937A708755j46063j27266j15228j03513p7140n9900n8085m3708j2327r799l243
4926I52483j13R822M0462M5967O5122R6137R0910J21076J64613J96681K15470
4915A998630K19967J74154J65505K19607K78627L25556L17983K43213K21355J15055
4905D279652J03812J33331K62651M66658N51283N55688K75180j20201m73975o91171
4895E342908p57076o26586n51777m50412l38819k02249j60957o7290k0899o226
4885B160617Q9980R0946P5177N0015J09454M8344J56052J33635J92204K84541
4875C390965L22293M48226N28247P47389R78302J240786J342050J105374N65615
$$ y = [1588001, 1732958, 1886389, 2030021, 2190719, 2262751, 2273809, 2193921, 2072274, 1893762, 1708755, 1562692, 1435426, 1320198, 1216685, 1139545, 1079645, 1021560, 977852, 965525, 955726, 952483, 952370, 962192, 1002654, 1048621, 1113743, 1209880, 1300790, 1421866, 1586479, 1783160, 1998630, 2218597, 2392751, 2558256, 2777863, 3056490, 3382046, 3700029, 3943242, 4164597, 4279652, 4383464, 4516795, 4779446, 5246104, 5797387, 6353075, 6628255, 6508054, 6034079, 5342908, 4585832, 3959246, 3407469, 2957057, 2618238, 2415989, 2255032, 2187742, 2166843, 2160617, 2250597, 2341543, 2416720, 2466735, 2576189, 2624533, 2780585, 2914220, 3106424, 3390965, 3713258, 4161484, 4689731, 5437120, 6415422, 7656208, 8998258, 10103632, 10669247]
4866A0669247j62492q78925j259349j363925j235743j015440q04514o13380m53635
4857B881844l27120k71718j56198j07573q3332n0097m7728n8168J2470j7698L3916
4846A808598N6533L6762R9813J10180J48921K21913L24174M40713O21940O69312
4836D538859O72100M03614M957k39765m13664m12411l73362l15077l05071l25138
4826C235042l05946l48624l50176l01694k21765k56725k03707j27171j18340q3673
4816I17221p4697o2795m0900m0197j6120k8266r510k9817j4325J0342J540L5483
4804F47959L2006L7102K3131J0957L9992L9244j2010k0501k7456m2012o6188o7670
4792E94554m3986j1417j482J197k891j8627J2629k4297N162k6608l5781j4630
$$ y = [10669247, 10506755, 9627830, 8368481, 7004556, 5768813, 4753373, 3948859, 3335479, 2881844, 2554724, 2283006, 2126808, 2019235, 1935903, 1885806, 1838078, 1779910, 1792380, 1774682, 1808598, 1865131, 1901893, 2001706, 2111886, 2260807, 2482720, 2806894, 3247607, 3869547, 4538859, 5210959, 5614573, 5619530, 5379765, 4966101, 4553690, 4180328, 3865251, 3560180, 3235042, 2929096, 2580472, 2230296, 1928602, 1706837, 1450112, 1246405, 1119234, 1000894, 917221, 842524, 779729, 738829, 698632, 682512, 654246, 644736, 614919, 600594, 610936, 612476, 647959, 679965, 717067, 740198, 751155, 791147, 830391, 818381, 797880, 770424, 728412, 662224, 594554, 550568, 539151, 537669, 538866, 535975, 517348, 529977, 505680, 510842, 484234, 448453, 433823]
4780D33823J9840J1056K890k2555J6076M5645j3174o596L9677K3176n64K1509
4768E70803O27L6776O6242J07541Q1689J27835J37798J04809M3662Q9264P109
4757A374155o396R537J08r265N2630j3563j0518K0159K5573K5740L8127Q3796
4745A590083Q4079J41062J08419J19547R5772Q1553L5742k0100M774J0099L4643
4734B285673M2664P5438J15396J04183J15931k0671m7841j22644j28329j60680
4724B259120j10591p6297r6660n2222o407O9395M7308N3506P1256J05970J11620
4713B375998J36156J61684J68328J38437J11320P9888J4384l9528r4212j46003
4703B906452j10237p6615o5951o7120p2239j42488j37891j16733j35740j40033
$$ y = [433823, 453663, 464719, 467609, 445054, 461130, 506775, 493601, 487005, 526682, 549858, 549294, 570803, 571430, 608206, 674448, 781989, 863678, 991513, 1129311, 1234120, 1277782, 1367046, 1374155, 1367759, 1377296, 1377404, 1368139, 1420769, 1407206, 1396688, 1416847, 1442420, 1468160, 1506287, 1590083, 1674162, 1815224, 1923643, 2043190, 2138962, 2220515, 2256257, 2236157, 2240931, 2251030, 2285673, 2328337, 2403775, 2519171, 2623354, 2739285, 2718614, 2670773, 2548129, 2419800, 2259120, 2148529, 2072232, 1975572, 1923350, 1916943, 1986338, 2033646, 2087152, 2158408, 2264378, 2375998, 2512154, 2673838, 2842166, 2980603, 3091923, 3171811, 3186195, 3146667, 3052455, 2906452, 2796215, 2719600, 2653649, 2586529, 2514290, 2371802, 2233911, 2117178, 1981438, 1841405]
4693A841405j11784j19394o3296j1207j5565J4327n695L9561N0797N2047Q6375
4682A757571P0477R4561J41289J42852J33890J26778P8395j9851p5466o3037o9870
4671B317589j43389j23671j43460j47381j24046j19367n8167n4877l5472j859
4661A365900K4435O9283Q9259M7082Q1115R4600N6755O9109M0898l7266m6569
4650A854601n0411o9129p3009m5561q7035n5828J1407J4796N7325M4079Q0694
4639A681929Q7053P8052J14085J50278J07808R5988R7390M7029J5530m1958p4228
4628B358956m7521j00441j06487o9894p8989k7304k8936o145J787Q036Q0414J12846
4616B096322Q2125P2142M8718N5963K4921K5171O2543N3694L8413J8742P2873
$$ y = [1841405, 1729621, 1610227, 1546931, 1535724, 1520159, 1534486, 1528791, 1568352, 1619149, 1671196, 1757571, 1828048, 1922609, 2063898, 2206750, 2340640, 2467418, 2545813, 2525962, 2450496, 2387459, 2317589, 2174200, 2050529, 1907069, 1759688, 1635642, 1516275, 1458108, 1403231, 1367759, 1365900, 1390335, 1459618, 1548877, 1595959, 1677074, 1771674, 1828429, 1897538, 1938436, 1901170, 1854601, 1804190, 1735061, 1662052, 1616491, 1529456, 1473628, 1485035, 1499831, 1557156, 1601235, 1681929, 1768982, 1847034, 1961119, 2111397, 2219205, 2315193, 2412583, 2459612, 2475142, 2433184, 2358956, 2311435, 2210994, 2104507, 2034613, 1955624, 1928320, 1899384, 1893239, 1895026, 1903062, 1983476, 2096322, 2178447, 2250589, 2299307, 2355270, 2380191, 2405362, 2467905, 2521599, 2560012, 2578754, 2651627]
4605B651627J22797J08826K4649M8519N3637L9578M9941K2737N7335Q1050L8092
4594C298788Q7695J18234J75443K01425J93205K14482K51271K19283J13288J09843
4584D982957J68472J13827J13023J51139J40873J53245J76741J64354J63850K15815
4574F544296K23830K84671L60787M24430N02032N54040O03135O72397P72098Q34759
4564A1776475R56372J098474J281515J408942J550944J768932K037335K311524
4556B4190513K660122K971465L309388L753820M242755N079372O390643Q677675
4548F1275753J2758346J9024234K7012458L4354418L9144475M0341054L6250337
4541B70161075K6356213J1295033m968065j9271184l0717006l7094042l8321396
$$ y = [2651627, 2774424, 2883250, 2907899, 2956418, 3010055, 3049633, 3099574, 3122311, 3179646, 3260696, 3298788, 3386483, 3504717, 3680160, 3881585, 4074790, 4289272, 4540543, 4759826, 4873114, 4982957, 5151429, 5265256, 5378279, 5529418, 5670291, 5823536, 6000277, 6164631, 6328481, 6544296, 6768126, 7052797, 7413584, 7838014, 8340046, 8894086, 9497221, 10169618, 10941716, 11776475, 12732847, 13831321, 15112836, 16521778, 18072722, 19841654, 21878989, 24190513, 26850635, 29822100, 33131488, 36885308, 41128063, 46207435, 52598078, 61275753, 74034099, 93058333, 120070791, 154425209, 193569684, 233910738, 270161075, 296517288, 307812321, 302844256, 283573072, 252856066, 215762024, 177440628]
4534A77440628l4858226k8970792k2569192j6402883j1712697q343619n920455
4527D8662764m206919l059199k273136j789827j336738q91819l50658L41692J454055
4518C6550215L006036M968912O884580Q322956Q927408Q380389O483416L319327
4510H6843239l64951l657420o299860p928691q353933p776473o720725n572158
4502D0169028m446449l587326k977982k541515k106862j740932j438972j112434
4494B0216556p97964m35588j06394L01214O68862R19668J005605R55075O48288
4485B3375322J85712l01904q34079j246429j498309j579354j475836j210908j057643
4476A4356572q13859o07744m55321k92056j76518p3685n1170K8239J16249K34572
$$ y = [177440628, 142582402, 113611610, 91042418, 74639535, 62926838, 54583219, 48662764, 44455845, 41396646, 39123510, 37333683, 35996945, 35105126, 34754468, 35096160, 36550215, 39556251, 44525163, 51409743, 59732699, 68660107, 77040496, 83523912, 86843239, 86478288, 82820868, 76521008, 68592317, 60238384, 52461911, 45741186, 40169028, 35722579, 32135253, 29157271, 26615756, 24508894, 22767962, 21328990, 20216556, 19418592, 18983004, 18876610, 19177824, 19846686, 20766354, 21771959, 22727034, 23375322, 23561034, 23259130, 22425051, 21178622, 19680313, 18100959, 16625123, 15414215, 14356572, 13542713, 12934969, 12479648, 12187592, 12011074, 11937389, 11886219, 11914458, 12030707, 12265279]
4466A2265279K94802L09889L17711L43246K78066J30532J0595j85759m15280n50561
4456A2798520o77749p20001o57252n32956n08212m71117l52776k38141j15430
4447H524886o531J46609K97475M69639N97442O24656O17436M43345K49030J17636
4437A2081623k881j03018r8411n5697r9259j14264k24564l41346n22778o57670
4427I861735p02232p04944o62370n55928m70206l26079k27623j58828o6681m0005
4417E946839J2796O5278J24451J73634K62942L80507N15120N79090N99099N33963
4407I193719M24562J89579q2352l10205n03457n37370o36733o20702n00399m39832
4397F176810l36245k36750k06057j39558r8605o8060o9290l3149j9007l4026K0841
$$ y = [12265279, 12560081, 12869970, 13187681, 13530927, 13808993, 13939525, 13950120, 13764361, 13349081, 12798520, 12120771, 11400770, 10743518, 10210562, 9702350, 9231233, 8878457, 8640316, 8524886, 8518355, 8664964, 8962439, 9432078, 10029520, 10654176, 11271612, 11714957, 11963987, 12081623, 12078742, 11975724, 11877313, 11821616, 11722357, 11608093, 11383529, 11042183, 10519405, 9861735, 9159503, 8454559, 7792189, 7236261, 6766055, 6439976, 6212353, 6053525, 5986844, 5946839, 5959635, 6024913, 6149364, 6322998, 6585940, 6966447, 7481567, 8060657, 8659756, 9193719, 9618281, 9807860, 9725508, 9415303, 8911846, 8374476, 7737743, 7117041, 6616642, 6176810, 5840565, 5603815, 5397758, 5258200, 5159595, 5091535, 5022245, 4989096, 4970089, 4936063, 4956904]
4386D956904p066o862K3298L0543R235P414O3738J31142J74369J59741J89759
4375E732215K29828K79183K54525L00469L39980L62333L56106M54039N17302N90809
4365I416789O94058Q25469R09753J063324J218908J384478J587741J829075K219211
4356B1148806K681484L312943M299939N554761P122662Q729621J0083458J0623875
4348G3557549J0028058Q201875N156747J310922k654249o032883q486346r729265
4340G1352408r871058r137118p845616o388703n006447l795957k860634k113331
4332B4333544j600639j283427j184398j150993j242043j305552j311617j261386
4324A3993489j185575j062113r66595p99974o83867o04080n16370m05354l99425
$$ y = [4956904, 4949838, 4942976, 4966274, 4996817, 5006052, 5013466, 5077204, 5208346, 5382715, 5542456, 5732215, 5962043, 6241226, 6495751, 6796220, 7136200, 7498533, 7854639, 8308678, 8825980, 9416789, 10110847, 10936316, 11846069, 12909393, 14128301, 15512779, 17100520, 18929595, 21148806, 23830290, 27143233, 31443172, 36997933, 44120595, 52850216, 62933674, 73557549, 83585607, 91787482, 96944229, 98255151, 95600902, 89568019, 81081673, 71352408, 61481350, 52344232, 44498616, 38109913, 33103466, 29307509, 26446875, 24333544, 22732905, 21449478, 20265080, 19114087, 17872044, 16566492, 15254875, 13993489, 12807914, 11745801, 10779206, 9979232, 9295365, 8691285, 8174915, 7769561, 7370136]
4315G370136l33325k99646l05621k45109k28377k57848k25537k11283k10661j85237
4305D867492j76413j55436j17932j31661j59386j21939j40903q0035o4636j02611
4295C616540j34284r0309j00798o7947q5923o5259k2570p4829j10445r7091j02756
4284B664329p2605o2267o8013m9221o5049m3497m7266m1420q7299k9243l8219
4273B060230n4162j8880j8643m3180K299j2887j6739O851L4145j1881p562j6273
4261A903318k2919l1504o6932m9905j4817P3993O3150J29718J72465J92666J75034
4250B524267J10801L1970m3385j00149j56560k12535k38249k19609k16767j41492
4240A338292p3296j14908r4125r0622l5187n8856p5578l9414m3098J908N729j910
$$ y = [7370136, 7036811, 6737165, 6431544, 6186435, 5958058, 5700210, 5474673, 5263390, 5052729, 4867492, 4691079, 4535643, 4417711, 4286050, 4126664, 4004725, 3863822, 3783787, 3719151, 3616540, 3482256, 3391947, 3291149, 3223202, 3137279, 3072020, 3049450, 2974621, 2864176, 2767085, 2664329, 2591724, 2529457, 2461444, 2412223, 2347174, 2303677, 2256411, 2214991, 2127692, 2098449, 2060230, 2006068, 1987188, 1968545, 1925365, 1927664, 1914777, 1898038, 1904889, 1939034, 1927153, 1919591, 1903318, 1880399, 1848895, 1781963, 1732058, 1717241, 1791234, 1854384, 1984102, 2156567, 2349233, 2524267, 2635068, 2667038, 2623653, 2523504, 2366944, 2154409, 1916160, 1696551, 1479784, 1338292, 1264996, 1150088, 1055963, 965341, 930154, 871298, 795720, 756306, 713208, 715116, 720845, 718935]
4228G18935N469K9476L7566M7681P5495K6022M4044N2965l1190j6698m6482q6195
4216H57088q9333j10037o8793l6152l6529j5142l3736n5358l0586q132k3284m139
4204C45867J1280K5994J1663p0j8845M796L2890O952k4376k6827r569J6698J1103
4191C87556l014L221k3110o520k8148j3553J8359j3981k7811p683K6102j222k2810
4178B87386M179q199J1665Q617o938o543m327k5165j8625l3419K115k3241l4314
4165A53191J8897j7568k4700j1099K3741Q409k4158j5512K1545k8762K0559j6780
4153A07763l9564K2102o234j6449k1675M3367M2651Q898M948j0537J5233K777
4141A53280l8437j0720K501j4741n926l1472l7584J4905J8536j3210p115J8827
$$ y = [718935, 724404, 753880, 791446, 839127, 914622, 940644, 984688, 1037653, 1006463, 989765, 943283, 857088, 767755, 657718, 588925, 552773, 516244, 501102, 467366, 412008, 381422, 373290, 350006, 345867, 357147, 383141, 394804, 394734, 375889, 380685, 413575, 420527, 396151, 369324, 359755, 376453, 387556, 384542, 387763, 364653, 358133, 329985, 316432, 334791, 320810, 292999, 285316, 311418, 310196, 287386, 291565, 283366, 295031, 303648, 296710, 290167, 285840, 260675, 242050, 208631, 210746, 187505, 153191, 172088, 154520, 129820, 118721, 142462, 150871, 126713, 111201, 132746, 103984, 124543, 107763, 68199, 90301, 84067, 67618, 45943, 89310, 131961, 140859, 145807, 135270, 150503, 153280, 114843, 104123, 106624, 91883, 85957, 54485, 16901, 31806, 50342, 37132, 30017, 48844]
4129D8844N904j0266j5420M043K1711K0339k6963K8373J4070J028m4754j0582
4117C6327K6083j5125J255k8586j9105P152J4366N730k1013o083m4233r919L1418
4104b1733j454k3251K5012m433K03n462k6696o026J6515L937J9342n729k8955
4091e8730J8328r317R377K6909j0868N952N6408L9616J16056J39264J64643K00113
4079F97751N2704o8020j00458j33966j25434n4671l5174o4757m6984m0891j3318
4068F6782L4989J0709J2617K7877K3541K7540L1870J6337N6961N5375M494P706
4056C76798P976L2427n0392n0420o1811k3301m1708m5009j7125r237k8412r008
4044H0778O62K4843J7555j2504L4548N1182J11745J79716J56652J2497l9549p5971
$$ y = [48844, 54748, 44482, 29062, 33105, 54816, 75155, 48192, 76565, 90635, 91663, 46909, 36327, 62410, 47285, 48540, 19954, 849, 8001, 22367, 28097, 7084, 1001, -43232, -53151, -21733, -23187, -46438, -21426, -25859, -25656, -31118, -57814, -63840, -47325, -43388, -24046, -29775, -58730, -40402, -49719, -40342, -13433, -24301, -18349, 38059, 77675, 193731, 332995, 497638, 697751, 750455, 682435, 581977, 448011, 322577, 267906, 232732, 167975, 120991, 80100, 66782, 101771, 112480, 125097, 152974, 176515, 204055, 235925, 252262, 309223, 364598, 369092, 376798, 384774, 417201, 366809, 316389, 254578, 231277, 189569, 144560, 127435, 118198, 89786, 80778, 81440, 106283, 123838, 111334, 145882, 197064, 308809, 488525, 645177, 657674, 618125, 542154]
4032E42154j35198j48324r0289q3990n8497l4195j9108P593l2373J0471j5527
4021e7283k2299J1949k0476j9438R660j0686q405Q980j4699p532O741k7764M8075
4008a03177l321j8463j1748l565O165J5165J1116J4384k3668m89j1338k1794Q803
3995a41930j3762q579N230J2891m3805J5725J9649r48J8861K208Q408k6171L947
3982a48276K2148j5564J8413p311j8439j8616l5480L254J0851N816P674p899N8645
3969a24784l7218l3294M5983j9582p986J515j3658O445J3788k9021K207J8643
3957a76962J6915J5569J5886j0715m1726m6122l0851J3375L8217K8313j4206K9832
3945a62475K1279j3647j2319l7746j0826J6807o730k2036K4314L8928m297p150
$$ y = [542154, 406956, 258632, 168343, 84353, 25856, -8339, -27447, -19854, -52227, -41756, -57283, -79582, -67633, -88109, -107547, -97887, -108573, -116978, -107998, -122697, -130229, -123488, -151252, -103177, -106498, -124961, -136709, -140274, -134109, -118944, -107828, -93444, -117112, -117601, -128939, -150733, -141930, -155692, -164271, -159041, -146150, -189955, -174230, -154581, -155529, -136668, -134460, -126052, -152223, -148276, -126128, -141692, -123279, -130590, -149029, -167645, -203125, -199871, -189020, -183204, -175530, -183429, -124784, -162002, -195296, -149313, -168895, -176881, -175366, -189024, -182579, -168791, -197812, -195605, -176962, -160047, -144478, -128592, -139307, -181033, -227155, -258006, -244631, -206414, -178101, -192307, -162475, -141196, -154843, -167162, -204908, -215734, -198927, -205657, -227693, -203379, -164451, -168748, -175898]
3933a75898j7282k4437K4803p167j2868J3337J5676m552q35J0386n1491L9606
3921a90722p664Q528K8606j7445k1780m83K3599l203m697O696q088Q327J3597
3908a64729K5490m1858m5756p102Q514n941M6336Q13k2665J3067J8582J1681j4158
3895a77726l6505Q237k815k3488J0094p600M2111j550j7746n059N1881M860M26
3882a54880j6101J5935l0220k3057k8859J9051L8054N90M0278j8290k819j7718
3870a78036j719k0586J4191k550j3634K851K4844L939j4345j105j0138j8238K3495
3857a91031r130j4461o785L3796o626q902L569q544m2231n239N3944J232n03l4658
3843b35569K6773K6956j1389J0126J7765r118j9140K7819q310p716j6235J3862
$$ y = [-175898, -193180, -217617, -192814, -199981, -212849, -199512, -183836, -188388, -189223, -178837, -230328, -190722, -198386, -189858, -161252, -178697, -200477, -200960, -177361, -180564, -185261, -178565, -186653, -178326, -164729, -139239, -181097, -226853, -233955, -225441, -231382, -185046, -184233, -206898, -193831, -175249, -163568, -177726, -214231, -205994, -208809, -232297, -222203, -229803, -187692, -189242, -206988, -212047, -160166, -155306, -154880, -170981, -155046, -185266, -208323, -237182, -218131, -180077, -179487, -139209, -157499, -160318, -178036, -179755, -200341, -186150, -188700, -202334, -199483, -174639, -170700, -185045, -186150, -196288, -214526, -191031, -200161, -214622, -221407, -187611, -194237, -203139, -199570, -208114, -250345, -255584, -201640, -200408, -200911, -235569, -208796, -181840, -193229, -183103, -165338, -174456, -193596, -165777, -174087, -181803, -198038, -184176]
3831a84176r34R196J27K7127J604k2934R481q455J8953m0873j6339M3291p33Q666
3817a55999M849J0776L0942l7228l116J1564K765J9048K3708J0574j9490k0931
3805a22538n887l2606K1834K5584l501j5522O213J5317J9406m1489J6486k4867
3793a41570K9214K3141L5691K5559k224K4038j8923j7827J103k6232m6264k0479
3781a34773L6369J2146j5052l904L7820M1687J8238l6418r457J2355k3160K9157
3769c4992k744n3790K2404j2543J4422J4082L6151K6585j6511q702N2644Q4514
3757A21520P0078K0009r523j940o5036o1373l7543k920j6656O531K3503J6033
3745F2683m6485k0883K8972K3207K4448q958k1503l4882J2583J0710J4108l2644
$$ y = [-184176, -185110, -175914, -175787, -148660, -147056, -169990, -160509, -168964, -150011, -190884, -207223, -163932, -164665, -155999, -151150, -140374, -109432, -146660, -149776, -138212, -135447, -116399, -92691, -82117, -101607, -122538, -128425, -161031, -139197, -113613, -117114, -132636, -126423, -111106, -91700, -133189, -116703, -141570, -112356, -89215, -53524, -27965, -30189, -6151, -25074, -42901, -41798, -68030, -114294, -134773, -98404, -86258, -101310, -105214, -67394, -25707, -7469, -43887, -53344, -40989, -64149, -34992, -37736, -91526, -69122, -81665, -67243, -53161, -17010, 9575, -6936, -15638, 37006, 121520, 191598, 211607, 202084, 200144, 135108, 73735, 36192, 33272, 16616, 23147, 46650, 62683, 16198, -4685, 24287, 47494, 71942, 62984, 41481, 6599, 19182, 29892, 44000, 11356]
3733A1356k9408K6359N0640N01K502J8202K974N8757M7029K7090j5648L2431k8285
3720B04500n5696P401r576q303R994K5765J0564j2980K2356M828K5548L2430k4925
3707B31906l9459K6595m344j5366k0728l3164l2973M372j7735J3279j5669K527
3695I9241M6544l002j8765N1561K5702J8190O953p766J0942P258L7085L7979J0348
3682C22270n885k7723j2020j0490J5151J7982l5255J8050K2678r397R183l1129
3670B73415n0442l0258n163k1409j1773k9966J3460K5864k845l580j2917K8622
3658A73008K8803j458n039j759K4243O419r044j3446L4168J2280j5871j9607M3879
3645B56576J0410N082L7810O2305L729j7309m4888m6356k9325j4340J5768l1301
$$ y = [11356, -18052, 8307, 58947, 59448, 61950, 80152, 83126, 141883, 188912, 216002, 200354, 232785, 204500, 148804, 156205, 146629, 138326, 148320, 174085, 184649, 171669, 194025, 198853, 224401, 256831, 231906, 192447, 219042, 214698, 199332, 178604, 145440, 112467, 116839, 99104, 112383, 96714, 99241, 145785, 142783, 124018, 175579, 201281, 219471, 226424, 218658, 229600, 236858, 273943, 311922, 322270, 316385, 288662, 276642, 266152, 281303, 299285, 264030, 282080, 304758, 295361, 304544, 273415, 222973, 192715, 187552, 166143, 154370, 124404, 137864, 163728, 160883, 157303, 144386, 173008, 201811, 200353, 195314, 193555, 217798, 224217, 215173, 201727, 235895, 248175, 232304, 212697, 256576, 266986, 272068, 309878, 372183, 375912, 358603, 313715, 267359, 238034, 223694, 239462, 208161]
3633B08161l052P061j1830j9815k416L908l5783k0056K611j097r18J476M3465
3620A71715L7887K8489J0242J0269k8768K3987Q748J3173J9564j091L5890J9453
3608C49558k3785j5606J3116j318K7916O592M2115l3880j3249K775N4584m155
3596D04663k6217J4273l343K800k2119j3566J2570j7936q708r090J9741J4529
3584C67597K2862M8649J2850K5795j1719r324J4635K9521Q531J7832J1940J6701
3572E55870k372J8945j9046L4937J594M0687M2940J5665L0481N3637k8927K321
3560G46732p408n447P076K1420m3904O204J2611P121J3518K8802K8227N6301j4562
3547H56691M3089K3375J9172O567M13R0J4627J1526K5519L9089K8068j416l386
$$ y = [208161, 205109, 212170, 200340, 180525, 178109, 182017, 146234, 126178, 128789, 127692, 126774, 128250, 171715, 209602, 238091, 248333, 258602, 229834, 253821, 262569, 275742, 295306, 294215, 330105, 349558, 325773, 310167, 323283, 321965, 349881, 356473, 398588, 364708, 351459, 354234, 408818, 404663, 378446, 392719, 389376, 392176, 370057, 356491, 369061, 351125, 342417, 333327, 353068, 367597, 390459, 439108, 451958, 477753, 466034, 456710, 471345, 500866, 509397, 527229, 539169, 555870, 553498, 572443, 553397, 588334, 589928, 630615, 673555, 689220, 719701, 773338, 744411, 746732, 739324, 733877, 740953, 762373, 718469, 724673, 737284, 744405, 757923, 786725, 814952, 871253, 856691, 899780, 923155, 942327, 948894, 949307, 949397, 964024, 975550, 1001069, 1040158, 1068226, 1066810, 1063424]
3534A063424K4600P4175K1399O0594K8005N3981L5696O6026N6503L6592p986N0810
3522A563819M6086J26870R0948J18135Q3541J48396J45698J50500J12291K14963
3512B801247J87604K97878K97776L20478M00179N90836P34561J093260J693280
3503H417099L130108M766846N656157L966679n19100k510756l874215m097085
3495A4935733k919606k158652j557102j208154q27980n51575k50908j66888k4839
3486E270029K8334Q5379R7074J60219K20026K44452L56572L77549N25865O31441
3476G996940P27676R92084J385940J943259K912170N315525Q962668J1261587
3468D1497849R890894M43385m366679p083647q360018n779392m156677k795553
$$ y = [1063424, 1088024, 1162199, 1183598, 1244192, 1272197, 1326178, 1361874, 1427900, 1484403, 1520995, 1513009, 1563819, 1609905, 1736775, 1827723, 1945858, 2029399, 2177795, 2323493, 2473993, 2586284, 2801247, 2988851, 3286729, 3584505, 3904983, 4305162, 4895998, 5630559, 6723819, 8417099, 11547207, 16314053, 21970210, 25936889, 25417789, 22907033, 19032818, 14935733, 12016127, 9857475, 8300373, 7092219, 6264239, 5712664, 5461756, 5294868, 5270029, 5298363, 5383742, 5480816, 5641035, 5861061, 6105513, 6462085, 6839634, 7365499, 7996940, 8724616, 9716700, 11102640, 13045899, 15958069, 21273594, 30236262, 41497849, 51388743, 51832128, 47465449, 40381802, 32021784, 26242392, 22085715, 19290162]
3460A9290162j965200j181514n63417j0977k9180j91770o28224r27419j088764
3451A2703697j038940r19886p20877n72930m09735k29330r4351J5426J89449M19391
3441I341914O70375J126736K080127L760170M991020M975976J405144j945901
3433B6405561l017013m147860l205456k229880j429328q06773j64886M55533J211284
3424A3071182J574756J426138M74164n23478j352821j679872j717622j495719
3416I776728j271690r98634q90077o57864n61075l74974l29626k52610j88142
3407D252036j57830j65960q6643m5601k2008j8131P346J8780O7287N8515P3764
3396C981555J67407K40481L77153N46873P42667Q41228O85555L37385j06988m72794
$$ y = [19290162, 17324962, 16143448, 15580031, 15569054, 15539874, 15348104, 14719880, 13792461, 12703697, 11664757, 10744871, 10023994, 9451064, 9041329, 8811999, 8717648, 8733074, 8922523, 9341914, 10012289, 11139025, 13219152, 16979322, 21970342, 26946318, 28351462, 26405561, 23388548, 19240688, 16035232, 13805352, 12376024, 11569251, 11404365, 11859898, 13071182, 14645938, 16072076, 16546240, 16022762, 14669941, 12990069, 11272447, 9776728, 8505038, 7506404, 6616327, 5958463, 5397388, 5022414, 4692788, 4440178, 4252036, 4094206, 3928246, 3841603, 3796002, 3773994, 3755863, 3763209, 3781989, 3849276, 3907791, 3981555, 4148962, 4389443, 4766596, 5313469, 6056136, 6897364, 7582919, 7920304, 7813316, 7340522]
3386G340522p52875p72838p20054o27845m86101m26329l48671k75572k37694j35714
3376B556829r7965j43132p5120n9514n8587m8176j0642K0015j3588O672J5782
3365B092574J5965L6374N7524J17905K24189K41728K57472J47216N6024R1829
3355C338800J84606L99435P01529Q37719O23195J72782l36537o31467o83558o09653
3345C996851m87157l51140l27807k28461j90514j24267m0020L7205P5535J15787
3335B476012J96593J62202K6295j2062n4815m4546M6553J27184J69181J64575
3325C257172J67933K52160M75683Q58115J462535J857710J767145Q26240l95741
3316A0528952j099902j512272j385010j093093q23645o65045n19427l92053k34561
$$ y = [7340522, 6587647, 5814809, 5094755, 4466910, 3980809, 3554480, 3205809, 2930237, 2692543, 2556829, 2458864, 2315732, 2240612, 2181098, 2122511, 2074335, 2063693, 2083708, 2070120, 2076792, 2092574, 2108539, 2144913, 2202437, 2320342, 2544531, 2786259, 3043731, 3190947, 3246971, 3338800, 3523406, 3922841, 4624370, 5462089, 6085284, 6258066, 5921529, 5290062, 4606504, 3996851, 3509694, 3158554, 2830747, 2602286, 2411772, 2287505, 2247485, 2284690, 2360225, 2476012, 2672605, 2834807, 2861102, 2849040, 2794225, 2749679, 2796232, 2923416, 3092597, 3257172, 3425105, 3677265, 4152948, 5011063, 6473598, 8331308, 10098453, 10924693, 10528952, 9429050, 7916778, 6531768, 5438675, 4615030, 3949985, 3430558, 3038505, 2803944]
3307B803944j49643n804Q0056K13024L03955L21404Q2610j50980k59108k82830
3297B956628k32983j79858j04087n5427o661N6321K04056L16282N01851P39493
3287D195615Q15701O08220O9971l32316o10238o58128n86234m48447l36723j61031
3277B556390m6910O2647J63986K53893J21820P1955j5671q0770o1629j59088j79044
3266B687579k45930k42153k49650k15810j46784j73217j04160o9839j6306k6065
3256A197665m6787j4848M2031Q723k0476K4597M6900N4313R8291R6525R1742J74990
3244A753666L05109M27130N54029N09077J94758j27208l24210l73020l48528l14715
3234B256088k95352k72821k21483j58524j49954p3131q8002n6280j9622M89k0583
$$ y = [2803944, 2654301, 2648497, 2728553, 2941577, 3245532, 3566936, 3649546, 3498566, 3239458, 2956628, 2723645, 2543787, 2439700, 2384273, 2377612, 2433933, 2637989, 2954271, 3456122, 4195615, 5011316, 5619536, 5689507, 5357191, 4746953, 4088825, 3502591, 3054144, 2717421, 2556390, 2509480, 2572127, 2736113, 2990006, 3111826, 3183781, 3168110, 3087340, 3025711, 2866623, 2687579, 2441649, 2199496, 1949846, 1734036, 1587252, 1414035, 1309875, 1240036, 1223730, 1197665, 1150878, 1136030, 1178061, 1186784, 1166308, 1190905, 1237805, 1292118, 1390409, 1486934, 1578676, 1753666, 2058775, 2485905, 3039934, 3549011, 3743769, 3616561, 3292351, 2919331, 2570803, 2256088, 1960736, 1687915, 1466432, 1307908, 1157954, 1084823, 996821, 940541, 920919, 921408, 900825]
3223I00825j1904k2114J2165P469Q876M0083Q5477P8204Q5106O9983N6387R0337
3211A400894R0879J83098K83630J64074J5735j54279k16509k41319k29444j77117
3201A119642j32894r1724m4837p3465n0373m2804l9147j6365j584j4088K7130
3190F39491J0042J0715M1611p190m403J680L396J4468p773J5545N1657R74J0078
3177G80291O3041K5250k5090k9002k6227n2831q74j4631l3455m641L0194M6696
3165G58721M2819N1002J17305J07570Q0616J19620P6246p347o6666p8245q2641
3154A119000j03173p7195k4808n120n2738O124O1707N6396R6892P2875N0399K8425
3142A228784J1413r516j7635M4031J4997K883J8312J7900K0790N1131R1161R4423
$$ y = [900825, 888921, 866807, 878972, 886441, 895317, 935400, 1020877, 1099081, 1184187, 1254170, 1310557, 1400894, 1491773, 1674871, 1958501, 2122575, 2138310, 1984031, 1767522, 1526203, 1296759, 1119642, 986748, 895024, 850187, 776722, 726349, 683545, 644398, 628033, 626449, 612361, 639491, 649533, 660248, 701859, 694669, 690266, 691946, 695342, 709810, 702037, 717582, 769239, 770213, 780291, 843332, 868582, 843492, 814490, 788263, 735432, 734558, 719927, 686472, 681831, 712025, 758721, 801540, 852542, 969847, 1077417, 1158033, 1277653, 1353899, 1346552, 1279886, 1201641, 1119000, 1015827, 938632, 913824, 908704, 855966, 862090, 923797, 980193, 1077085, 1149960, 1200359, 1228784, 1240197, 1230681, 1213046, 1257077, 1272074, 1274957, 1293269, 1311169, 1331959, 1383090, 1474251, 1568674]
3130A568674J43663K33858J93557J17039K1815n8784j37263j22963j42134j49158
3120A668304p3998n8527k9816M996Q4818J18204J40158J94597K12822K31349J45905
3109B638812l1260j61892k18844k06607j49097j30033j36030q6151o8171l8552
3099A412175k8187L527K8566O165J8552j2632k1068L669m8466o6061o1456l9569
3087A195215j1650k5041m1433R430M347O3299O0932O1666K3289j4124n3717l4684
3075A237529l9790m4012n8160n0367o7475n4190n0339p5131m3313o350L33j6798
3063G31937k6996Q921N5719L7818L3894P6504M6066M0941L1700j7429n1107o1422
3051I06546r5170o2419p8025p1195n6414n1560l3951Q124l6920l8777L7300N179
$$ y = [1568674, 1712337, 1946195, 2139752, 2256791, 2278606, 2219822, 2082559, 1959596, 1817462, 1668304, 1594306, 1535779, 1505963, 1510959, 1595777, 1713981, 1854139, 2048736, 2261558, 2492907, 2638812, 2607552, 2445660, 2226816, 2020209, 1871112, 1741079, 1605049, 1518898, 1450727, 1412175, 1383988, 1387515, 1416081, 1422246, 1440798, 1428166, 1407098, 1410767, 1362301, 1296240, 1234784, 1195215, 1183565, 1158524, 1117091, 1126521, 1130868, 1194167, 1255099, 1316765, 1340054, 1325930, 1272213, 1237529, 1197739, 1153727, 1095567, 1045200, 977725, 923535, 873196, 798065, 754752, 748402, 748735, 731937, 704941, 713862, 769581, 807399, 841293, 917797, 963863, 1004804, 1036504, 1019075, 967968, 906546, 811376, 748957, 670932, 599737, 543323, 491763, 457812, 465936, 429016, 390239, 427539, 432718]
3039D32718Q967m591q711k1194j6362J4368J5038O581M3146J8819M2335P5109
3027F06223R6270J14621J48763J41715J06967L9624j3972j03955j59815j24835
3017H51606q6573j40500r5344p0718n2567k6061k8062k5073l2124M551m2548k3478
3005B33109J4899J4893l8726M235j501O2744J6002k7163Q096N260N1755L1619
2993C75222L4040N7248J4593N489K9553l1517n0418m8983l8373j1130n4934o8034
2981B12756l8440j83j5900P72k4949m5016j6279M763j0707r583M234l614p312
2968E0542j8823k6072N230L0132k223j0447N535P876q812o559k6320l1r6J4812
2954A4744L4102R793k5913l6881Q161K4696r850p023P710k085j2030J5955j9791
$$ y = [432718, 441685, 437094, 428383, 407189, 390827, 405195, 420233, 426814, 469960, 488779, 531114, 606223, 702493, 817114, 965877, 1107592, 1214559, 1254183, 1240211, 1136256, 976441, 851606, 765033, 624533, 529189, 458471, 405904, 379843, 351781, 326708, 294584, 299135, 256587, 233109, 248008, 262901, 224175, 228410, 226909, 289653, 305655, 278492, 286588, 291848, 343603, 375222, 409262, 466510, 481103, 486592, 516145, 484628, 434210, 385227, 346854, 335724, 280790, 212756, 174316, 174133, 158233, 159005, 134056, 89040, 72761, 77524, 66817, 57234, 61468, 57854, 50542, 31719, 5647, 10877, 41009, 38786, 28339, 33874, 41750, 32938, 26379, 59, 28, -68, 14744, 48846, 58639, 32726, -4155, 4006, 28702, 18852, 11829, 19539, 17454, 5424, 21379, 1588]
2941A588k4169j9486P731q374J980K0316k583j1766M00J0025n210l34J9178n800
2927a6504j0627K4887k0879j9446L5043k0846m0J435J8077k6458j7579M032p427
2914e6332R911K3051j551r188M239L67j6816k1416l2839M503J6671K5470j0515
2901f4445j7566N16J1533p92k7288K1209j873j9826L2308K8811m4174k6800M1017
2888f7370J6790j5525j9180j103o444j0560L8550J8211k8433j8922m233m700J39
2875a02780J6352L7914P263j8360j6949J156j9211j0378J7772N202L2375k1544
2863g1188j7465M822o836K0049L750j4002Q576j1071M887J3725k5600K28m186
2850i4311K0161J4752k536J9961j2940j9712J3382m308n489j5611P051j0177j7785
$$ y = [1588, -22581, -42067, -34336, -42710, -40730, -20414, -22997, -34763, -34363, -24338, -29548, -29882, -10704, -16504, -27131, -2244, -23123, -42569, -7526, -28372, -28412, -26977, -8900, -35358, -52937, -48905, -56332, -46421, -23370, -24921, -34109, -29870, -29503, -46319, -67735, -100574, -96071, -79400, -53930, -64445, -82011, -81495, -69962, -70754, -98042, -76833, -78706, -98532, -66224, -37413, -81587, -108387, -67370, -50580, -66105, -85285, -86388, -92832, -103392, -64842, -46631, -75064, -93986, -98219, -102919, -102780, -86428, -48514, -41251, -59611, -76560, -75404, -94615, -104993, -87221, -82019, -49644, -71188, -88653, -83831, -90667, -70618, -66868, -80870, -72294, -83365, -78478, -64753, -90353, -90125, -94311, -74150, -59398, -61934, -41973, -54913, -74625, -61243, -65551, -71040, -86651, -79600, -89777, -107562]
2837a07562j1098R974j6062J6532J7081K3812k5669J7968k215K2829J5976k7332
2825f5766j3133M941k3242j2813J4980j4441Q311J4032o839N311j0662J4138Q602
2812g6581k7261J4774l3152j9121r584K2904O984l659o247K0140j349q966m332
2799a25450L4002J2712n788K40o969L2043l948j3620k4722O995K6857P72J7982
2786d8894j4833l2724k1287J8791K9570J3592l1016l8107R705K4136J314l53j7158
2773a07264j5722J6361P866J6547j158l2347J4207K9163l9780o471O737K6664
2761h5197j4343K123J6848k4793k8270J1389n017J9126P149j4264N647R529q059
2748a08132J0306K4166k4643l9572M0107L28j6182L341M108M1768P668k7905p27
$$ y = [-107562, -118660, -108686, -124748, -108216, -91135, -67323, -92992, -75024, -77239, -54410, -38434, -65766, -78899, -73958, -97200, -110013, -95033, -109474, -101163, -87131, -93970, -88659, -99321, -85183, -76581, -103842, -89068, -122220, -141341, -150925, -128021, -121037, -124696, -130943, -110803, -112152, -121118, -125450, -91448, -78736, -84524, -84284, -91253, -59210, -63158, -76778, -101500, -94505, -67648, -66876, -48894, -63727, -96451, -117738, -98947, -69377, -55785, -86801, -124908, -115203, -91067, -89753, -90106, -107264, -122986, -106625, -98759, -82212, -83370, -115717, -101510, -72347, -112127, -118598, -111861, -85197, -99540, -97417, -80569, -105362, -133632, -122243, -127260, -108134, -100985, -115249, -109602, -100073, -108132, -97826, -73660, -98303, -137875, -97768, -97440, -113622, -110281, -106173, -64405, -56737, -84642, -85369]
2735h5369m670K1266j0494l2995K1897o994k9861L0901j8964l0268L532L7512
2723a04507L2203j9053J977k558m193j9880j1651M091j598k4669L4658R865j7428
2710a22743L4281J0417l8638q627K9618j7104O494o037J4050j7582j1561L0507
2698i6925J1204J4728l6269J4933j2827o532l6986m184M1191R107P2K7583Q797
2685f6108P904k6014L658k8965l696K275k967J0916P73J5393n496j5703l280L473
2671a07837K4343p844o036n176m122J9968J0761L214k0804j8035M946m356l3996
2658a44974K366L3145r523J7852j200J531K1188J8650n779k4601j0365K060n620
2645a05270L2472l5461j3224J3328k768k5442L1772n089o933L3312r875r585j8806
$$ y = [-85369, -90039, -68773, -79267, -112262, -90365, -97359, -127220, -96319, -115283, -145551, -142019, -104507, -72304, -91357, -89380, -91938, -96131, -116011, -127662, -123571, -125169, -149838, -115180, -105315, -122743, -88462, -78045, -116683, -125310, -95692, -112796, -106302, -112339, -98289, -115871, -127432, -96925, -85721, -70993, -107262, -92329, -105156, -111688, -148674, -152858, -111667, -102560, -102488, -74905, -66108, -58204, -84218, -80560, -109525, -113221, -110946, -113913, -102997, -102224, -86831, -92327, -108030, -111310, -107837, -83494, -91338, -97374, -102550, -106672, -86704, -75943, -72729, -93533, -111568, -106622, -110978, -144974, -142608, -109463, -118986, -101134, -102334, -100803, -79615, -60965, -66744, -91345, -101710, -99650, -105270, -72798, -108259, -121483, -108155, -110923, -136365, -104593, -109682, -116615, -83303, -93178, -102763, -121569]
2632a21569j6284K5861K4424j091r526m449L5635l89k0989k4534j2629M524J9703
2619a01313K6030k6073p703J3054R580M350O551k2106j0895N646l7475L641J3381
2606a23332J4558j9217P93J3281j2968j9280L0738J7037J5390k9625q756L1962
2594h9419J6679k2149m889j2773J8216p624L8284M487J1442L9950L7138J1477
2582D0819n852N1930J8528m3226m0735k1674j3411j3868q425j9061N08k1485K983
2569g2969q577n367Q382l1072L285M367K795K8779J2656j0084L809j8979J2263
2556g0712j4306k5837J0468j365j9198L076q972K0151p770j418n086J5610R83
2543a04376k2365L3969m45M45J0341K2690j6995K6359k0716j3964n353j8027J3239
$$ y = [-121569, -137853, -111992, -87568, -88659, -98185, -102634, -66999, -67388, -88377, -112911, -125540, -121016, -101313, -75283, -101356, -109059, -96005, -86425, -82075, -75524, -97630, -108525, -102879, -140354, -136713, -123332, -108774, -127991, -127198, -113917, -126885, -146165, -115427, -98390, -83000, -112625, -121381, -89419, -72740, -94889, -99778, -112551, -94335, -101959, -63675, -59188, -47746, -7796, 29342, 40819, 34967, 86897, 105425, 62199, 21464, -210, -13621, -27489, -35914, -54975, -54467, -75952, -72969, -81546, -86913, -78531, -109603, -106318, -101951, -99156, -70377, -57721, -67805, -63996, -82975, -70712, -85018, -110855, -100387, -101752, -120950, -117874, -126846, -106695, -114465, -115883, -120969, -105359, -104376, -126741, -92772, -93217, -92772, -82431, -59741, -76736, -50377, -71093, -85057, -90410, -108437, -95198]
2530i5198J5045R883O048O740M890m6931j5383j448K8160j2384j0163J8863k5095
2517a16973N241J6842k2860k934K2918J8519L641L741N552L0291j9901m047J2694
2504d7276k0224m6224K9404N778J7439k1706K851j8544j0350K4784O854K1665
2492e5549n2147l612J2347L134k334j8839J3686J5090j4303J2566K3958p272J0256
2479f3019j280p037o025j3820L8686J6463J58m5932O789l200N744n737L6913M807
2465c6490k3977L2461m203l0102J4438m473k2061L717m589K5533m008k2723j4793
2452i1270L0146K2025P089J6766l1243K9245k629o426J581J6587L389j4031m3353
2439f2124J7988K3050R976j4136K9118l2381L945L5598M5917m1038j0409N988
$$ y = [-95198, -80153, -70270, -64222, -57482, -52592, -99523, -114906, -116354, -88194, -100578, -110741, -91878, -116973, -111732, -94890, -117750, -120684, -97766, -79247, -75606, -71865, -66313, -36022, -55923, -59970, -47276, -67500, -113724, -84320, -78542, -61103, -82809, -79958, -98502, -108852, -84068, -77214, -55549, -107696, -111308, -98961, -95827, -98161, -117000, -103314, -88224, -102527, -89961, -66003, -73275, -63019, -64299, -71336, -77361, -91181, -52495, -36032, -35874, -81806, -75017, -78217, -72473, -78210, -41297, -36490, -60467, -28006, -32209, -62311, -47873, -52346, -74407, -70690, -75279, -49746, -53754, -76477, -91270, -61124, -39099, -32010, -15244, -46487, -17242, -19871, -26297, -24716, -8129, -4740, -18771, -62124, -44136, -21086, -11110, -25246, 3872, -28509, -24564, 11034, 56951, 15913, 5504, 11492]
2427A1492J0389J1970k688l8079k050L791j4094n927J9854n266k7917P908K181
2414b8436K036J384l1176N4796K2999K3091j60k6719J9804M770k0907r933j3056
2401a507j6550l1852J7884Q402p184k1317M2220k779K8927J1377K0225K5211j1387
2388F1670J654j0634l3745r887R924K0615j1150K8817K078L991j5451J5393l2085
2375C1190R533N3331J1292o351J4915J4792k2927j203m994o715L6788N4290O0121
2362B44062O12P439j3203j8499J2742j446K0503j400K4403K3473l0733n302K2183
2349B84834j9806N6217J9690M8676N2280N9309j1161O2199J8306J05935M1689
2338G18168J14018J03949J42584J33378J95064K26872L65036K72079K73633L3935
$$ y = [11492, 21881, 33851, 31163, -6916, -8966, -5175, -19269, -25196, -5342, -10608, -38525, -30617, -28436, -26400, -25016, -56192, -1396, 21603, 44694, 44534, 17815, 37619, 42389, 21482, 11549, -1507, -18057, -49909, -32025, -23623, -30807, -52124, -9904, -12683, 16244, 27621, 47846, 73057, 61670, 63324, 52690, 18945, 9058, 18982, 39597, 28447, 57264, 59342, 63333, 47882, 63275, 31190, 40723, 94054, 105346, 98995, 113910, 128702, 105775, 104572, 99578, 92863, 129651, 183941, 244062, 244674, 252113, 238910, 220411, 233153, 231707, 252210, 250810, 275213, 298686, 267953, 262651, 284834, 265028, 321245, 340935, 389611, 441891, 501200, 490039, 552238, 570544, 676479, 718168, 832186, 936135, 1078719, 1212097, 1407161, 1634033, 1999069, 2271148, 2544781, 2578716]
2328B578716J77422k212K93270K14662M36722N26940R57994J094937J926551K918251
2318A1123253O388320Q594517J0164734K030435m335353n186406p571788m919474
2310A6288238l804770k598704k194438j541560j376852p31557n35511j49376o4492
2301C290978Q6788j71316k29145l02165k89551k69347j49063j91308r0915j38534
2291A546422r0924j15456k6174j13393l7819q162j7423m5833O067p7173k0301
2280I99831p8573l7240q9833j8533l6001n784k4405k4471l1157m7071q874p741
2268E90148l0275J7631k9747n146R843K0993l2862l5517p722k400k2759k5807
2256D46380k176k0541l6698j2687j763J415R702m2943R773J4106l8775k2655O784
$$ y = [2578716, 2756138, 2753926, 3047196, 3261858, 3698580, 4225520, 5183514, 6278451, 8205002, 11123253, 17511573, 26106090, 36270824, 38301259, 33965906, 28779500, 21207712, 16288238, 12483468, 9884764, 7690326, 6148766, 4771914, 4040357, 3504846, 3355470, 3290978, 3377766, 3206450, 2977305, 2675140, 2385589, 2116242, 1967179, 1775871, 1684956, 1546422, 1455498, 1340042, 1313868, 1200475, 1162656, 1154494, 1137071, 1091238, 1097305, 1020132, 999831, 921258, 884018, 794185, 775652, 739651, 733867, 709462, 684991, 653834, 606763, 597889, 590148, 559873, 577504, 547757, 542611, 552454, 573447, 540585, 505068, 497346, 494946, 472187, 446380, 444204, 423663, 386965, 374278, 372515, 373930, 383632, 340689, 350462, 364568, 325793, 303138, 309922]
2243C09922M352k2306j9463K7933J2462J974O074k336k4829K5770m934l3006m8994
2230B32619O613m872J5632k1702j5228q615k9860n4944R39N145M4997k942l8555
2217A29227J337L7156m0170L1184n946J1310j7750J8287j1625l2319m911k850
2205A12930j1073k0183o5619M175J7328K5036R301J3429k0144j7381M2057K0419
2193A10275O832K4297k0787k6289j4720J2108j9373k2886r769m273l985l2435
2181a005J6368L3305j2444L1724m881J2169k242J9680l4502q187O240k280P763
2168F1708j5088n499K0851J487L5673m004k8063J9696n706q012K3297k5025k0335
2155E0980M113j0906J3676J9775l1759j5008J9730J4318P045J3391M81l7579j7864
$$ y = [309922, 314274, 291968, 272505, 300438, 312900, 314874, 320948, 318612, 293783, 319553, 314619, 281613, 232619, 239232, 234360, 249992, 228290, 213062, 204447, 174587, 119643, 120582, 125727, 170724, 167782, 129227, 130564, 167720, 127550, 158734, 152788, 164098, 146348, 164635, 153010, 120691, 115780, 112930, 101857, 81674, 16055, 20230, 37558, 62594, 71895, 85324, 65180, 47799, 89856, 110275, 117107, 141404, 120617, 94328, 79608, 91716, 72343, 49457, 39688, 35415, 31430, -1005, 15363, 48668, 36224, 67948, 63067, 75236, 72994, 92674, 58172, 49985, 56225, 53945, 61708, 46620, 41121, 61972, 63459, 99132, 95128, 67065, 86761, 81055, 73043, 96340, 71315, 50980, 55093, 44187, 57863, 77638, 45879, 30871, 50601, 64919, 71964, 85355, 85836, 48257, 30393]
2142C0393P148J4012k5775J0852L712j9228J0832j2945j974r301j8646K8646j693
2129A6033j374J3370P880j4313O65o560o745Q36j1122m233j1347J9118L322p250
2115a720j1676J5841j491m716r525J9478o742J8545j3730j0673R541n919k6227
2102b9014J0092L1645j6888K6235q952m5645k986K3193k7315J5804j903L5611
2090I877n142J95K4995N417j1026p673J2024r395k5783M413O764o23O984n110
2076E917k9191L4592K6959L780k4451Q289K7976l7371k5982M5200k0311l2887
2064a7480M498L5787j409Q834m7730M326M7557k8983j2396J8438j4197J1949P534
2051A6728q464k592M1167P2434L9183j2859K7302k8141j7187J433k8601k4037
$$ y = [30393, 37541, 51553, 25778, 36630, 40342, 21114, 31946, 19001, 17027, 7726, -10920, 17726, 16033, 14659, 28029, 35909, 21596, 22261, 15701, 8956, 9792, -1330, -5563, -16910, 2208, 5530, -1720, -13396, 2445, 954, -3762, -13287, 6191, -551, 17994, 4264, -6409, 3132, -2787, -29014, -18922, 12723, -4165, 22070, 13118, -32527, -35513, -12320, -39635, -23831, -25734, 9877, 4735, 4930, 29925, 35342, 24316, 16643, 28667, 19272, -6511, -2098, 4666, 4043, 11027, 5917, -23274, 11318, 38277, 42057, 17606, 25895, 53871, 16500, -9482, 35718, 15407, -17480, -12982, 22805, 21396, 30230, -17500, -13174, 34383, 5400, -6996, 11442, -2755, 9194, 16728, 8264, 5672, 46839, 119273, 158456, 145597, 172899, 144758, 127571, 129004, 100403, 76366]
2039G6366J5266j0016m2086l144r591r446K6736j0205k4896p585K487l140J8464
2026A9210j5265p022J5170J3187m029J6284l847k5764J613p603K3746j126k66
2013B4288m5851l4140K0095K9510o041K3051j8911O103J2574J8169O096k0320
2001A4623J3313p878l1116J3236L141l3955P9J1449L3479l7839J6595L4905k119
1988B7913k2215m1432Q378L414j6694P605J864K8112M749k2390k2916j3274K4068
1975c2818m602N2077n614k2566p851J8483J818J1160j0456M0916j6181k3866K0202
1962B0702J2198l8027K6581l4212k086K6718k9658j946l430K3551m645k5540J272
1949b8522L2192M634q431l2047o632J1202J3799L1732N710J2265N574o354m016
$$ y = [76366, 91632, 81616, 39530, 36386, 26795, 17349, 44085, 33880, 8984, 1399, 3886, 746, 19210, 3945, -3077, 12093, 25280, 21251, 37535, 33688, 7924, 9537, 1934, 25680, 24554, 24288, -21563, -55703, -35608, -6098, -12139, 10912, -7999, -1896, 10678, 28847, 34943, 14623, 27936, 20058, -11058, 2178, 5319, -28636, -28557, -17108, 16371, -21468, -4873, 30032, 27913, 5698, -35734, -27356, -23942, -40636, -33031, -31167, -3055, 1694, -20696, -43612, -56886, -32818, -37420, 14657, 9043, -13523, -21374, -2891, -1073, 10087, -369, 40547, 24366, 500, 20702, 32900, -5127, 21454, -12758, -14844, 11874, -17784, -19730, -23160, 391, -4254, -29794, -28522, 3670, 8304, -127, -32174, -38806, -27604, -13805, 17927, 23637, 35902, 41476, 35122, 31106]
1936C1106l5804J0569J1431Q798p089j7429J2396l308Q96J698k3798K712J5118
1923G296R369j3818P391K7053k5235K5968m1641J264M231J643L543J8310J64j790
1909B3748K973J237l6873J0141L6688k2925k0812Q614l7589j0871O845n128N3106
1896I154J1246m0769k846J2631j3425K3211J8594j043l9962o959k2363O580K4161
1883b1790M604O418r528k6359K4099N195M2639n389j905j3456J0551p885j0615
1870c421M767j2392j5556J1546K3855o69P319J0656j9163K6855m4529K602J2766
1857D636l0648K5418l239j732J659Q778J5654J9330N099n3392k4525K0352n507
1844a8117M665r478J6584q902k4635k0301P536M2980J4478L0219N10k3461j1400
$$ y = [31106, -4698, 5871, 17302, 26100, 19011, 1582, 13978, 10670, 11566, 13264, -10534, -7822, 7296, 16665, 2847, 10238, 37291, 12056, 38024, -3617, -2353, 1878, 3521, 7064, 25374, 25538, 23748, 26721, 27958, -8915, 1226, 37914, 14989, -5823, 2791, -34798, -45669, -38824, -43952, 9154, 20400, -20369, -23215, -10584, -24009, -798, 17796, 16753, -23209, -30168, -52531, -45951, -21790, -17186, -10768, -20296, -46655, -22556, -17361, 25278, 19889, 17984, 4528, 15079, 7194, -3421, 1346, -11046, -26602, -15056, 8799, 8130, 15449, 26105, 6942, 33797, -10732, -8130, 4636, -26012, -594, -3833, -5565, -3906, 4872, 20526, 39856, 44955, -8437, -32962, -12610, -18117, -13452, -22930, -6346, -15248, -39883, -60184, -52648, -9668, 4810, 35029, 35539, 12078, 678]
1831F78n451k823k9536J5131M3414J1297k6348k684o264R483J9017J6171J112
1818D3197m0978K9756m711o469k1310k7602L4243K826j1639Q996q426M529J7084
1805A9496l2689O545l2668M962J7761K1876j6671J438l494M37K6833j3453l1716
1792c1343K9079J2597M709K1463m6098j958m216J2020l358j3121J3071J9204j8399
1779f350r633k07R682L310j0421m880M1951l091j9235J5406J8450J4298k9834
1766A9446k2145l4017J4432K7291J6507J9119O275k4628k7712K9627j1115j1006
1754B074q67L855J6002j6613k658L660J845j220j1821k9282K5198J9968k0760
1741a0619J4789K3281j6827K4344K9923m1931m422k5384j999j6581l78k08l3570
$$ y = [678, -4773, -7596, -37132, -22001, 21413, 32710, 6362, 3678, -2586, 6897, 25914, 42085, 43197, 2219, 31975, 27264, 20795, -515, -28117, 6126, 8952, -2687, 6309, -2117, 2412, 19496, -13193, -6648, -39316, -34354, -16593, 5283, -11388, -9950, -13444, -13007, 13826, 373, -31343, -2264, 10333, 15042, 36505, -9593, -11551, -15767, -3747, -7105, -20226, -7155, 12049, -6350, -15983, -16190, -6508, -3198, -13619, -18499, 23452, 20361, 1126, 16532, 34982, 49280, 19446, -2699, -36716, -22284, 5007, 21514, 40633, 46908, 22280, -5432, 24195, 13080, 2074, 1207, 5062, 21064, 4451, 1793, 5453, 7298, 6078, -5743, -35025, -9827, 10141, -10619, 4170, 27451, 10624, 34968, 64891, 22960, 18538, -6846, -8845, -25426, -25804, -26012, -59582]
1728e9582K3950J5092o42L2740m761J7684j1124k215J75J4199J8176l7942J036
1715F786k1313J126P786j5679J0908J9255p645m639J6549m800l8777J2523K3237
1702E317J3423Q923j7204k667J9282m231O607j0429j7687j0556k3722l549K8695
1689g798K4974m325l1555j17L0430j3811J0661j0828J0173p085j4413j8938j2556
1676d5188M9107Q701L071k632m128O538J0750l418M198j0197J6063J0348j4727
1663B8486j9192k8771K3073l682J812M541O537r460n50O527J0389o528j6687J4105
1649A0600j1697L1585K0776j6814j4528k3441o630K3688p513J5983k3542p118
1637h651m353Q37j2167L4393k2415J5070k0157M202J0078J7208k553j5457K4028
$$ y = [-59582, -35632, -20540, -21182, 11558, 6797, 24481, 13357, 11142, 11317, 25516, 43692, 5750, 6786, -14527, -13401, -5615, -21294, -10386, 8869, 1224, -3415, 13134, 8334, -30443, -17920, 5317, 18740, 27663, 10459, 7792, 27074, 22843, 29450, 19021, 1334, -9222, -32944, -36493, -7798, 17176, 12851, -18704, -18821, 11609, -2202, 8459, -2369, 7804, 719, -13694, -32632, -45188, 3919, 12620, 15691, 13059, 8931, 15469, 26219, 22801, 26999, 16802, 32865, 43213, 28486, 9294, -19477, 3596, -86, 1726, 6267, 12804, 3344, 2794, 9321, 19710, 13182, -3505, 10600, -1097, 30488, 51264, 34450, 19922, -3519, -10149, 13539, 6026, 22009, -1533, -8651, -13004, -12167, -24334, 10059, -12356, 2714, -17443, -13241, -3163, 14045, 11492, -3965, 20063]
1624B0063j2002k6733K1448k41j2929K1769n434l810J8616o271m973J1213j2377
1611H339l40n215j2271o276M5084L5867k9576r662l4961p868L062L8618L6657
1598F1458m1321K049J5102q662l093o408k3899J0752k32j0881q99J7738P569J4309
1584C3582l2202K6864J1652j5221l6047J8367J8785p220n1829N927J4943J1038
1572a361k573L6397n301o459k3450L4219P561q195q085k6941K2772q372j8291
1559h079o874j37O344J5115l425l826N3835l1997J0296l361j0870j7844p586q276
1545a6685K24J1087K1933R903J7353L720j9828N464j3659k1687j9648k170J3973
1532a0020J1932K526K221L7807J9813l2112K4453m4244k8299O190K1861r951J8464
$$ y = [20063, 8061, -18672, 2776, 2535, -10394, 11375, 5941, 2131, 20747, 14476, 9503, 20716, 8339, 7999, 2784, -9487, -15763, 29321, 65188, 35612, 25950, -9011, -16879, -13817, 24801, 61458, 20137, 22186, 37288, 28626, 25533, 19125, -4774, 5978, 5746, -5135, -6034, 11704, 19273, 33582, 1380, 28244, 39896, 24675, -11372, 6995, 25780, 18560, -33269, -27342, -12399, -1361, -3934, 32463, 27162, 20703, -2747, 31472, 39033, 30838, 22753, -4188, 18584, 10212, -8079, -14953, -15090, -8746, 6369, 2944, -882, 52953, 20956, 31252, 27891, 17021, -823, -8409, -16685, -16461, -5374, 16559, 26462, 43815, 47535, 27707, 33171, 19512, -2175, -21823, -23993, -10020, 1912, 4438, 6659, 44466, 64279, 32167, 56620, 12376, -15923, -9733, 12128, 2177, 20641]
1519B0641o940J536R505J668j2322K3361q339Q755j4438m2663J2226J0215J6202
1506A9407R442l0620k643J3848j1381O396M2386o555k4020k951K3798j8115j3954
1493E038K1642n372k1083K4276J9163k8210L4658K035k9494R724j8503o4j4438
1480f28r429j5394K8236J5461Q00j8872J5396j673k7042K3508K1349m0724J998
1467g014Q46N815M893J2963L3798j8090k2149K4320m036k1629J8053M8326l2807
1454D3289k9433L555J4930j0952j1363K7891n438K768J898L235J0266J3947j90
1441F4403j0668P042k5651j5406K402r04n549q193K3417j0442K8511k8151J245
1428B2056k0992j4189J1726J7017j6430L0054o232K3231m4327J209N303L599Q325
$$ y = [20641, 13701, 15237, 24742, 26410, 14088, 37449, 29110, 37865, 23427, -19236, -7010, 3205, 19407, 28849, -1771, -4414, 9434, -1947, 4449, 46835, 40280, 16260, 13309, 37107, 18992, 5038, 26680, 21308, 225, 24501, 43664, 15454, 50112, 52147, 22653, 32377, 13874, 13810, -628, -10057, -25451, 2785, 18246, 19046, 174, 15570, 13897, -13145, 10363, 31712, -9012, -7014, -6168, -353, 4540, 17503, 51301, 33211, 11062, 35382, 31346, 9717, 27770, 76096, 43289, 13856, 17411, 32341, 21389, 10026, 37917, 32479, 35247, 37145, 40380, 50646, 64593, 64403, 53735, 60777, 35126, 19720, 22122, 21218, 15669, 7476, 30893, 20451, 48962, 20811, 22056, 1064, -13125, -1399, 15618, -812, 29242, 23010, 46241, 1914, 3123, 8426, 12025, 20350]
1415B0350j3835J6352J0667J5741j2963q755J3480j4270Q028O010m0489L7323
1403C7639J5790j9285m4727j3184J34J3416M207n09q398N3523l2021j6641J8874
1390H818r923k487j2947J9715J8523J0171j581j1848r052J0791m931k686J5938
1377B8501j2838J7040m728l2650K1287J81Q710j9973O736J0567q514L1926k6034
1364B0211j4207J9990K2878Q351l9477P005Q106J3566K3544k2829m702j8129N103
1351B9410K2536j0922K7O548k520k6548q276j4489P437J2979o349j4262q184J8152
1337E539M893L0546j2913l63l023J6833R417n9273J2393j844j1162l624q588K2944
1323A775m457j4636j140P47L7677L805j6012J7698J0514l0537J1064N580n865
$$ y = [20350, 6515, 22867, 33534, 49275, 36312, 27557, 41037, 26767, 34795, 40805, 316, 37639, 53429, 34144, -10583, -23767, -23633, -10217, -6010, -6519, -14917, 38606, 6585, -10056, 8818, -1105, -3592, -16539, 3176, 21699, 31870, 30289, 18441, 9389, 20180, 15249, 12563, 28501, 15663, 32703, 27975, -4675, 16612, 16793, 25503, 5530, 12266, 22833, 14319, 46245, 20211, 6004, 25994, 48872, 57223, 17746, 24751, 32857, 46423, 69967, 47138, 42436, 24307, 29410, 51946, 41024, 41051, 47599, 45079, 18531, 10255, -4234, 3203, 16182, 9833, -4429, -12613, 5539, 10432, 40978, 28065, 27702, 24679, 41512, 50929, -8344, 4049, 2205, -8957, -12581, -21169, 1775, -2682, -17318, -18458, -17711, 19966, 23771, 7759, 25457, 35971, 5434, 16498, 22078, 16213]
1310A6213l273J0110K118J0228m65j2695R916M527j4502j139J1005k5910O65K9491
1296C6289J6765l3841j8653K385Q415L3972j8398K283O037l7390q860p927L9911
1283B0988n877j1887K4313j5323J5458R095K4336r199l7680P513L592J4204l5314
1270D219K5262L2470P0l547N483J0986l7196j0705k4161r205N3536J4503j2275
1257D9440k2900J8259L951j7683P609J2601j2732j8179K6133j5131j2808J4038
1245C2598M5400k2859k0849j2503P631J0858j7992k1686K5282N234L937K0881
1233E5932K044q55j6778n556L739J6394N443j1928j4523j8091j5807K3581L590
1220B7185P068n1470N845L8247K6929k3345j0024K1616o086n922k2403M97K0764
$$ y = [16213, 12940, 23050, 25168, 35396, 34931, 22236, 32152, 36679, 22177, 21038, 32043, 6133, 6798, 36289, 53054, 19213, 560, 2945, 11360, 45332, 26934, 29217, 35254, -2136, -10996, -18923, 20988, 15111, 3224, 27537, 12214, 27672, 36767, 61103, 51904, 14224, 21737, 25329, 39533, 4219, 29481, 61951, 62021, 58474, 63957, 74943, 37747, 27042, 2881, -6324, 47212, 61715, 49440, 26540, 44799, 48750, 31067, 38676, 51277, 38545, 20366, 46499, 31368, 18560, 32598, 77998, 55139, 34290, 21787, 29418, 40276, 22284, 598, 25880, 31114, 35051, 55932, 57976, 57121, 40343, 34787, 38526, 54920, 60363, 48435, 33912, 15821, 14, 23595, 27185, 34253, -17217, -11372, 26875, 53804, 30459, 20435, 42051, 35965, 30043, 7640, 8137, 28901]
$$ [...]
##END NTUPLES=NMR SPECTRUM
##END=
