##TITLE=1H_TG-2390
 200.13MHz, CDCl3,
 8 sc
 
 5.9.2025
##JCAMPDX= 6.0         $$ Bruker NMR JCAMP-DX V2.0
##DATA TYPE= NMR SPECTRUM
##DATA CLASS= NTUPLES
##ORIGIN= UXNMR, Bruker Analytische Messtechnik GmbH
##OWNER= pz
$$ XWIN-NMR		Version 3.5
$$ Fri Sep  5 13:56:35 2025 Russian Standard Time (UT+4h)  she@DPX200
##.OBSERVE FREQUENCY= 200.1313
##.OBSERVE NUCLEUS= ^1H
##.ACQUISITION MODE= SIMULTANEOUS
##.ACQUISITION SCHEME= undefined
##.AVERAGES= 8
##.DIGITISER RES= 18
##SPECTROMETER/DATA SYSTEM= spect
##.PULSE SEQUENCE= zg30
##.SOLVENT NAME= CDCl3
##.SHIFT REFERENCE= (INTERNAL, CDCl3, 0, 15.4736)
##AUDIT TRAIL= $$ (NUMBER, WHEN, WHO, WHERE, WHAT)
$$ ##TITLE= Audit trail, XWIN-NMR		Version 3.5
$$ ##JCAMPDX= 5.01
$$ ##ORIGIN= Bruker BioSpin GmbH
$$ ##OWNER= she
$$ F:/spectra/data/she/nmr/H-C/1/pdata/1/auditp.txt
$$ ##AUDIT TRAIL=  $$ (NUMBER, WHEN, WHO, WHERE, WHAT)
(   1,<2025-09-05 13:53:28.37 +0400>,<she>,<DPX200>,
      <created by zg, POWCHK disabled, PULCHK disabled
       configuration hash MD5:
       00 E9 B6 7A A2 85 ED C7 34 08 36 98 17 FE 4E 26
       data hash MD5: 16K
       8D 4B 1C 81 81 1C 11 B6 F9 33 6C 3B 78 AA 15 E8>)
(   2,<2025-09-05 13:54:03.14 +0400>,<she>,<DPX200>,
      <Start of raw data processing
       efp BC_mod = 2 LB = 0.25 FT_mod = 6 PKNL = 1 PHC0 = -1559.294 PHC1 = 10.99228 SI = 16K 
       data hash MD5: 16K
       41 20 E2 4E AD A2 CF 21 9C 83 6B 0C 84 63 C7 AC>)
(   3,<2025-09-05 13:54:30.65 +0400>,<she>,<DPX200>,
      <pk PHC0 = -0.02941318 PHC1 = -2 
       data hash MD5: 16K
       89 81 C7 F1 DF B3 30 76 0C B8 1F 9D DE 9B 0B 59>)
(   4,<2025-09-05 13:54:34.51 +0400>,<she>,<DPX200>,
      <abs ABSG = 5 
       data hash MD5: 16K
       B6 BC 17 C7 F4 10 86 D0 10 EA DE F9 38 5F 28 46>)
$$ ##END=
$$ 
$$ hash MD5
$$ F6 09 52 36 4F AC 4A 55 7E 6D 6F 3C 01 A6 71 21
##$RELAX= 
##$RELAX= 
##$RELAX= 
##$RELAX= 
##$RELAX= 
##$RELAX= 
$$ Bruker specific parameters
$$ --------------------------
##$DU= <F:/spectra>
##$EXPNO= 1
##$NAME= <H-C>
##$PROCNO= 1
##$TYPE= <nmr>
##$USER= <she>
##$AMP= (0..31)
100 100 100 100 100 100 100 100 100 100 100 100 100 100 100 100 100 100 
100 100 100 100 100 100 100 100 100 100 100 100 100 100 
##$AQSEQ= 0
##$AQ_mod= 1
##$AUNM= <au_zg>
##$AUTOPOS= <>
##$BF1= 200.13
##$BF2= 200.13
##$BF3= 200.13
##$BF4= 200.13
##$BF5= 200.13
##$BF6= 200.13
##$BF7= 200.13
##$BF8= 200.13
##$BYTORDA= 1
##$CFDGTYP= 0
##$CFRGTYP= 5
##$CHEMSTR= <none>
##$CNST= (0..31)
1 1 145 1 1 1 1 1 1 1 1 1 1 1 1 1 1 1 1 1 1 1 1 1 1 1 1 1 1 1 1 1 
##$CPDPRG= <>
##$CPDPRG1= <>
##$CPDPRG2= <>
##$CPDPRG3= <>
##$CPDPRG4= <mlev>
##$CPDPRG5= <mlev>
##$CPDPRG6= <mlev>
##$CPDPRG7= <mlev>
##$CPDPRG8= <mlev>
##$CPDPRGB= <>
##$CPDPRGT= <>
##$D= (0..31)
0 0.7 0 0 0 0 0 0 0 0 0 0.03 0 0 0 0 0 0 0 0 0 0 0 0 0 0 0 0 0 0 0 0 
##$DATE= 1757066007
##$DBL= (0..7)
120 120 120 120 120 120 120 120 
##$DBP= (0..7)
150 150 150 150 150 150 150 150 
##$DBP07= 0
##$DBPNAM0= <>
##$DBPNAM1= <>
##$DBPNAM2= <>
##$DBPNAM3= <>
##$DBPNAM4= <>
$$ [...]
##$SUBNAM3= <"">
##$SUBNAM4= <"">
##$SUBNAM5= <"">
##$SUBNAM6= <"">
##$SUBNAM7= <"">
##$SUBNAM8= <"">
##$SUBNAM9= <"">
##$SW= 18.0517328524113
##$SWIBOX= (0..15)
0 0 2 0 0 0 0 0 0 0 0 0 0 0 0 0 
##$SW_h= 3612.71676300578
##$TD= 16384
##$TD0= 1
##$TE= 0
##$TE2= 300
##$TE3= 300
##$TEG= 300
##$TL= (0..7)
0 120 120 120 120 120 120 120 
##$TP= (0..7)
150 150 150 150 150 150 150 150 
##$TP07= 0
##$TPNAME0= <>
##$TPNAME1= <>
##$TPNAME2= <>
##$TPNAME3= <>
##$TPNAME4= <>
##$TPNAME5= <>
##$TPNAME6= <>
##$TPNAME7= <>
##$TPOAL= (0..7)
0.5 0.5 0.5 0.5 0.5 0.5 0.5 0.5 
##$TPOFFS= (0..7)
0 0 0 0 0 0 0 0 
##$TUNHIN= 0
##$TUNHOUT= 0
##$TUNXOUT= 0
##$USERA1= <user>
##$USERA2= <user>
##$USERA3= <user>
##$USERA4= <user>
##$USERA5= <user>
##$V9= 5
##$VALIST= <valist>
##$VCLIST= <CCCCCCCCCCCCCCC>
##$VD= 0
##$VDLIST= <DDDDDDDDDDDDDDD>
##$VPLIST= <PPPPPPPPPPPPPPP>
##$VTLIST= <TTTTTTTTTTTTTTT>
##$WBST= 1024
##$WBSW= 4
##$XGAIN= (0..3)
0 0 0 0 
##$XL= 0
##$YL= 0
##$YMAX_a= 223462
##$YMIN_a= -298538
##$ZGOPTNS= <>
##$ZL1= 120
##$ZL2= 120
##$ZL3= 120
##$ZL4= 120
##$ABSF1= 15.53425
##$ABSF2= -2.517601
##$ABSG= 5
##$ABSL= 3
##$ALPHA= 0
##$AQORDER= 0
##$ASSFAC= 0
##$ASSFACI= 0
##$ASSFACX= 0
##$ASSWID= 0
##$AUNMP= <proc_1d>
##$AZFE= 0.1
##$AZFW= 0.1
##$BCFW= 0
##$BC_mod= 2
##$BYTORDP= 0
##$COROFFS= 0
##$CY= -3
##$DATMOD= 1
##$DC= 0
##$DFILT= <>
##$DTYPP= 0
##$F1P= 0
##$F2P= 0
##$FCOR= 1
##$FTSIZE= 16384
##$FT_mod= 6
##$GAMMA= 0
##$GB= 0
##$INTBC= 1
##$INTSCL= 3.241238e-09
##$ISEN= 128
##$LB= 0.25
##$LEV0= 0
##$LPBIN= 0
##$MAXI= 10000
##$MC2= 0
##$MEAN= 0
##$ME_mod= 0
##$MI= 1.114404
##$NCOEF= 0
##$NC_proc= -7
##$NLEV= 6
##$NOISF1= 3.799351
##$NOISF2= 2.8
##$NSP= 0
##$NTH_PI= 0
##$NZP= 0
##$OFFSET= 15.47364
##$PC= 1
##$PHC0= -1559.323
##$PHC1= 8.99228
##$PH_mod= 1
##$PKNL= yes
##$PPARMOD= 0
##$PSCAL= 0
##$PSIGN= 0
##$REVERSE= no
##$SF= 200.130009619
##$SI= 16384
##$SIGF1= 3
##$SIGF2= 2
##$SINO= 0.751879
##$SIOLD= 32768
##$SREGLST= <19F.Aceton>
##$SSB= 0
##$STSI= 16384
##$STSR= 0
##$SW_p= 3612.71676300578
##$SYMM= 0
##$S_DEV= 0
##$TDeff= 16384
##$TDoff= 0
##$TI= <>
##$TILT= no
##$TM1= 0
##$TM2= 0
##$TOPLEV= 0
##$USERP1= <user>
##$USERP2= <user>
##$USERP3= <user>
##$USERP4= <user>
##$USERP5= <user>
##$WDW= 1
##$XDIM= 16384
##$YMAX_p= 287331838
##$YMIN_p= -820425
$$ End of Bruker specific parameters
$$ ---------------------------------
##NTUPLES= NMR SPECTRUM
##VAR_NAME=  FREQUENCY,     SPECTRUM/REAL,   SPECTRUM/IMAG
##SYMBOL=    X,             R,               I
##VAR_TYPE=  INDEPENDENT,   DEPENDENT,       DEPENDENT
##VAR_FORM=  AFFN,          ASDF,            ASDF
##VAR_DIM=   16384,         16384,           16384
##UNITS=     HZ,            ARBITRARY UNITS, ARBITRARY UNITS
##FACTOR=    0.220516191357247, 1,           1
##FIRST=     3096.7398104773, 0,             0
##LAST=      -515.976952528481, 0,           0
##MIN=       -515.976952528481, -820425,     0
##MAX=       3096.7398104773, 287331838,     0
$$ Real data points
##PAGE= N=1
##DATA TABLE= (X++(R..R)), XYDATA
$$ [...]
8362C77330n2890J53437j48650M5067Q2570q2473k04639J13752J12379m4993j60779
8351A90111Q7327K57227l08080k4174q4234M5452P6685J56747o7745k03500J55592
8340B81408J48191J19906M3150j11980q8903k28928r605J29103K3195O130p8193
8329B33474j1877J33095q8478j77530K06739R27k56273k0467J77811J94227l29845
8318F1803l2221o1712q9666L91698K34840j61031J07742j55736j54362o2764P9891
8307A58482J56243j14661l23680L79400J84486j93156j25587j18990J61237q4492
8297G9282O5928l4268Q7310L5506k38426K5997O5008R5938M9218j01505l8788
8286I1200n448k668J2313J75014m4250O1275J99631M1242j56395J18923m3358
$$ plain form
8362 377330 324440 477877 329227 374294 456864 374391 169752 283504 395883 350890 190111
8351 190111 277438 534665 226585 202411 118177 163629 240314 397061 329316 125816 281408
8340 281408 429599 549505 592655 480675 391772 162844 153239 282342 305537 311667 233474
8329 233474 221597 354692 266214 88684 295423 296350 40077 19610 197421 391648 61803
8318 61803 29582 -32130 -121796 269902 504742 343711 451453 295717 141355 78591 158482
8307 158482 314725 200064 -123616 255784 440270 247114 121527 2537 163774 79282
8297 79282 145210 110942 198252 233758 -4668 21329 86337 182275 231493 129988 91200
8286 91200 85752 83084 95397 270411 226161 287436 487067 528309 371914 490837 447479
8275D47479j00841j56637k0835l9606k14315K10277j11665r4828K14767N5194
8265A88990J55555J12819j59380O1854j25253j90826j0464L9280j44465J11315
8255C9425J9426r6183K3378j46780J74823J79829k6801j624k14286j38423J65334
8244b1882k0778J30613Q2394K26931L2010K8107l94542l03282K00775J25607l6813
8233D9140J84173N8078l8687q6462l394k8572m7680Q7772Q558m8157j11501P538
8221C0806J39278J25774j44672J94981j06831j23042J0564l6682j57983n0291
8211a18098r6576K03865K50198j03183r1984k05607K359j8748p0244J66458l390
8200h4950M8367J1786j05054j33461J40095l02930m8903l45375P91623J171641
$$ plain form
8275 447479 346638 190001 169166 129560 -84755 125522 13857 -80971 133796 188990
8265 188990 344545 457364 297984 359838 234585 43759 33295 72575 -71890 39425
8255 39425 58851 -37332 -13954 -160734 14089 193918 167117 165493 -48793 -187216 -21882
8244 -21882 -42660 87953 170347 397278 429288 457395 62853 -240429 -39654 85953 49140
8233 49140 233313 291391 252704 166242 162848 134276 86596 174368 182926 134769 23268 30806
8221 30806 170084 295858 151186 346167 239336 116294 126858 90176 -67807 -118098
8211 -118098 -214674 -10809 239389 136206 44222 -161385 -159026 -177774 -248018 -81560 -84950
8200 -84950 -36583 -24797 -129851 -263312 -123217 -426147 -475050 -820425 -28802 1142839
8190A142839n14779p9220q9Q9309j6833m2374l36209j60576J58469j05791l9202
8179I5544L6404M561J19665J20172n6035j5455o0663K7500k5091k9568p1502k19309
8167g3777J55304k6737K8401Q0651L51387j01596r8956k04677j46861R2513Q7069
8156A42721j47443J6095L0169m3417j27886N3603K01570k9899J44454j40968P78
8145I9777n2434p8204Q6203R9022n5023k04305R0613K22830q4284J359K3710o5482
8133H3782j83113K21828J19652j82064K2668P0204l2408L5049L6945L0459j07427
8122A15575j7253n4892j2997M0835P5334j80035J45R7676L56037P2829n757n0478
8110D37019l31260J6799j47687K59599n2031j29812n0508o8733k7741J39958P96
$$ plain form
8190 1142839 628060 548840 548751 638060 621227 578853 242644 82068 240537 134746 95544
8179 95544 131948 136509 256174 376346 320311 304856 244193 271693 246602 217034 145532 -73777
8167 -73777 81527 54790 83191 163842 515229 413633 314677 110000 -36861 55652 142721
8156 142721 -4722 11373 41542 -1875 -129761 -76158 125412 95513 239967 98999 99777
8145 99777 47343 -30861 55342 154364 99341 -104964 -14351 208479 124195 125554 149264 83782
8133 83782 -99331 122497 242149 60085 82753 152957 120549 155598 192543 223002 115575
8122 115575 98322 43430 30433 71268 146602 -33433 -33288 64388 420425 493254 487497 437019
8110 437019 105759 122558 -25129 234470 182439 52627 2119 -66614 -94355 45603 46399
8099D6399q9268Q7305j11258j3061k369n0967M5368J43085J28440m2236j9912
8088A21526J31161k47567j75569J91651N6269N3246Q5255j37348K8690j03524
8078C790J70406J30271p4304j32450k7998J74890Q6442l8501O9099J3289j62090
8067B12844j49335J36556J38650j47610J9646L3732J08432P9923q7042m3442N7071
8056C59425j30839J06848k0902j18670o7080K34331R3120o3504o8613L9840q5490
8045B78466L9939n2352J36495o0555j54446J12097n5231o0232L9018K00080M8674
8034D71953o0291m1265L9445L9861J2676j72751j25991O4657j71111j11440L37744
8023B83487L5046R5074L2491m06K256j29450m997J84126m7568j26157q3581j96623
$$ plain form
8099 46399 -42869 44436 -66822 -79883 -82252 -133219 -87851 55234 183674 141438 121526
8088 121526 252687 5120 -170449 21202 77471 130717 215972 78624 107314 3790
8078 3790 174196 304467 230163 97713 69715 244605 331047 292546 361645 374934 212844
8067 212844 63509 200065 338715 191105 210751 244483 352915 432838 345796 302354 359425
8056 359425 228586 335434 314532 195862 128782 363113 456233 392729 324116 363956 278466
8045 278466 318405 266053 402548 341993 187547 299644 244413 184181 223199 423279 471953
8034 471953 411662 370397 409842 449703 462379 289628 163637 228294 57183 -54257 283487
8023 283487 318533 413607 446098 445692 447948 318498 313501 497627 450059 323902 240321 43698
8011D3698J47342o9262J04401R1586q5989L8656m1846L2243O7990J81670L4558
8000E45047k01264j66294J02091j2012l0215j34956J67082J85064o1333k38685
7990A54525O4376r4850K3485O4225p2719j17632L3546N773R0769O9646N1148O1240
7978C33532j12410K8736J083J9380J7942l257J80468J27893R621j14576j78356
7967C10056K45704n9333N1372q6533p7953Q1447j1189j85322j93751J65324J11056
7956C50878O6822N6028k59651o400K00782N4919j68551n1836J16832k34432O7275
7945A92666Q9923k5558J42585l40971M8000n2480J5479O0736J43938j18574p3439
7934H2305J22144r2878k7998J51013J09834j04422J25478P3473J20383l46909
$$ plain form
8011 43698 191040 121778 226179 317765 231776 270432 228586 260829 328819 510489 545047
8000 545047 343783 177489 279580 267568 237353 102397 269479 454543 393210 154525
7990 154525 218901 124051 147536 211761 139042 21410 54956 60729 151498 221144 272292 333532
7978 333532 221122 249858 250941 270321 288263 285006 465474 593367 602988 488412 310056
7967 310056 555760 496427 547799 461266 383313 464760 453571 268249 74498 239822 350878
7956 350878 417700 473728 214077 207677 408459 463378 294827 242991 359823 125391 192666
7945 192666 282589 257031 399616 58645 106645 54165 69644 130380 274318 155744 82305
7934 82305 204449 111571 83573 234586 344420 239998 365476 438949 559332 212423
7924B12423j7744J56257L7392n5002r4196o719j44397j28169K31941q1788q4465
7913B5533J27587N892J62210r7360P8665j08461j12392K38597J4418j19448K0105
7902B35346r2621k1551l1484P9577p6721j28870k1106L55063p1495j3032K32269
7891D45375m1894M1212p5712J21644P8100k65697k1065K69076k08567n6499Q2140
7880C68113j54973m7660J71335K41400k8959p7361j19684l429j08300j06117L6173
7869A70538M5976K34015j2333k29757L9243K54399j05892n4852J86432R6571m5368
7858E78972o8936k26048M8247K63295p8278q3331R051j16988L897j37557M6190
7847B38514K99127K6415j57999O0556o4561P1680q2973Q8731Q8275M739k09244
$$ plain form
7924 212423 194679 350936 388328 333326 239130 232411 88014 -40155 191786 109998 25533
7913 25533 153120 159012 321222 223862 302527 194066 81674 320271 334689 215241 235346
7902 235346 142725 121174 89690 169267 92546 -36324 -57430 297633 226138 213106 445375
7891 445375 403481 444693 368981 490625 568725 303028 281963 551039 342472 285973 368113
7880 368113 213140 165480 336815 578215 549256 471895 352211 348782 240482 134365 170538
7869 170538 216514 450529 438196 208439 247682 502081 396189 341337 527769 624340 578972
7858 578972 510036 283988 332235 595530 517252 433921 442972 325984 329881 192324 238514
7847 238514 537641 564056 406057 466613 402052 473732 390759 479490 567765 572504 363260
7836C63260o4954J95543k8507l0564P8361J38709j7116L734j5208p4555r4456
7825D54247K3763P9082N0230q8303n4045J03727j99311k70538J78693M7524K95981
7814F21050k7305j74395L1252L0775J67187l705k88933o7505J32945O4027R3617
7803E79010j20278j50925q4455O3670K9899l2006O94l9116m7437J3751J48721
7792C61528M0526K0969j64148k08204J00453K30035O7761J10R5746K9369o4577
7781E09568j09018j26698L8190m7836M9694J53923l162l37083J75613K38391k02265
7770C39317J12608K6496P0068r2169L5290k15398J19335K03055K5395M1447P3181
7759G38625P8065m6879r6575J48675j1372L0470L37883J8361m4789L02540J42188
$$ plain form
7836 363260 298306 493849 465342 434778 513139 651848 634732 638466 623258 548703 454247
7825 454247 478010 557092 607322 519019 464974 568701 369390 98852 277545 325069 621050
7814 621050 593745 419350 450602 481377 648564 644859 355926 288421 421366 485393 579010
7803 579010 458732 307807 223352 287022 316921 284915 285609 246493 199056 212807 361528
7792 361528 402054 423023 258875 50671 151124 381159 448920 449030 544776 574145 509568
7781 509568 400550 273852 312042 264206 313900 467823 464661 127578 303191 541582 339317
7770 339317 451925 478421 548489 456320 491610 276212 395547 598602 623997 665444 738625
7759 738625 816690 769811 673236 821911 810539 841009 1178892 1197253 1152464 1455004 1597192
7748A597192J64337J54366J09999L01748l004K7770M784J99599L1237p1988o9745
7737B446295n3439N0191k9801j25487j38718j05879J03174k16121p210k65338
7727A657667m12075M3927q6510Q7705j55152Q7782R6787k39935j7917p8349n7272
7716I26658j13781N676J63310J78361O6347j06208k22503J14236L07596Q1736
7706A401428p2780N0428j7047K5051J41695J67203q1047M7578N0717K21907J46412
7695B081545R3280J36110j9232K81584J19762J19145L08568K58289M89581L51705
7685D220337J01010J57218L29432K76975J9033J80940J75462k7963J39971j31746
7675E440669k66537j34400k90423m1261k29087j44398j74268k96499k47944k88021
$$ plain form
7748 1597192 1761529 1915895 2025894 2327642 2324638 2352408 2357192 2556791 2588028 2516040 2446295
7737 2446295 2392856 2443047 2413246 2287759 2149041 2043162 2146336 1930215 1923005 1657667
7727 1657667 1245592 1289519 1203009 1290714 1135562 1223344 1320131 1080196 1062279 983930 926658
7716 926658 812877 818553 981863 1160224 1226571 1120363 897860 1012096 1319692 1401428
7706 1401428 1328648 1379076 1362029 1387080 1528775 1695978 1614931 1662509 1713226 1935133 2081545
7695 2081545 2174825 2310935 2291703 2573287 2693049 2812194 3120762 3379051 3868632 4220337
7685 4220337 4321347 4478565 4807997 5084972 5104005 5284945 5460407 5432444 5572415 5440669
7675 5440669 5174132 5039732 4749309 4708048 4478961 4334563 4160295 3863796 3615852 3327831
7665C327831j91423j56917k74657J89395r1400k17816j05882j47739j99377l0431
7655B101584N5275k97599l17022L58666o8432j3039l910k23395o1682p4613Q8254
7644A544087K6681j85209j96252J66899j3626l8319J93641K50434j01779j84912
7634A461645q3267J7206o6221K8067P6424J62133k1643k07588n6356p445k68572
7623A034383j20906J81377R4599J85112K13304j87283l2960n2243K2561j26640
7613A211304J2524R9184L447j33987q3727N0197m4333L8125J05938k2347j55987
7602A080338J57208P4258r3389K14037j95309Q047J70728J13532K6502j17941
7592A438011p1480K4431Q6103j29585M3923j13860q457r6663l2175O4305Q9907
$$ plain form
7665 3327831 3136408 2979491 2704834 2894229 2802829 2585013 2479131 2331392 2132015 2101584
7655 2101584 2156859 1859260 1542238 1900904 1832472 1819433 1815523 1592128 1530446 1455833 1544087
7644 1544087 1570768 1385559 1189307 1356206 1342580 1304261 1497902 1748336 1646557 1461645
7634 1461645 1378378 1395584 1329363 1357430 1433854 1595987 1574344 1366756 1310400 1302955 1034383
7623 1034383 913477 1094854 1189453 1374565 1587869 1400586 1367626 1315383 1337944 1211304
7613 1211304 1223828 1323012 1326459 1192472 1108745 1158942 1114609 1152734 1258672 1236325 1080338
7602 1080338 1237546 1311804 1218415 1432452 1237143 1245190 1415918 1529450 1555952 1438011
7592 1438011 1366531 1390962 1477065 1347480 1391403 1277543 1269086 1172423 1140248 1204553 1294460
7581A294460O9687P4087K7483J01820r6415p5820j34478Q8172k270J80825L4290
7570A561841O4317p8516M1421J08172L8002J39847j68093o5362L9371J0471J41612
7559A833083m0334j69282J7664J70126J04649j43843k5965r0787R270K14366L1951
7548A910898N3689k7547J00165J23585l457r7269M634N5148r329k2841N979K80655
7536B374310o6011J33219n7305L0673q661o8428K11146O4281l21520r6266L43526
7525B538964J02004k4838J24613L3266k1817Q3176p3783Q3285K04772P3036o8289
7514C054389k4772N0584j47301R09L3334j2639J07518J59982L33456J15256N0849
7503C721565J32228M1455J9379J23955J85664j97683M6927K14654j3305P4778
$$ plain form
7581 1294460 1364147 1438234 1465717 1567537 1471122 1395302 1260824 1348996 1346726 1527551 1561841
7570 1561841 1626158 1547642 1589063 1697235 1735237 1875084 1706991 1641629 1681000 1691471 1833083
7559 1833083 1792749 1623467 1641131 1811257 1915906 1772063 1746098 1655311 1664581 1878947 1910898
7548 1910898 1964587 1937040 2037205 2160790 2157333 2060064 2064698 2119846 2110517 2087676 2093655 2374310
7536 2374310 2308299 2441518 2384213 2414886 2406225 2337797 2548943 2613224 2291704 2195438 2538964
7525 2538964 2640968 2616130 2740743 2774009 2752192 2835368 2761585 2844870 3049642 3122678 3054389
7514 3054389 3029617 3080201 2932900 2933809 2967143 2954504 3062022 3222004 3555460 3670716 3721565
7503 3721565 3853793 3895248 3914627 4038582 4224246 4026563 4073490 4288144 4274839 4349617
7493D349617J54915O4194J72214q6725L20494J93622Q9012J78500k21030J53820
7483E368633L18638L66987M9353K3304L45321J55477J23061L9406K95075J53426
7473G238681J55159K11893K78770L83852L77820K82829J90209M88581M68887M78014
7463A0554695O85246N90528P18627P52388Q52943Q00573O45836P13087Q62446
7454A7176369J264672J508163J427292J497825J641123K099403K262479K720472
7446C1597798K855828L193481L843384M247934M522266N147620O285762P279123
7438F8973196Q328699R721814J1601708J2860428J3670131J3693301J4028256
7431A52877533J3139282J0417965O314703J713087l437377p777107j1683808j3601736
$$ plain form
7493 4349617 4504532 4568726 4740940 4654215 4974709 5168331 5257343 5435843 5214813 5368633
7483 5368633 5687271 6054258 6103611 6126915 6472236 6627713 6750774 6790180 7085255 7238681
7473 7238681 7393840 7605733 7884503 8268355 8646175 8929004 9119213 9607794 10076681 10554695
7463 10554695 11239941 11830469 12549096 13301484 14154427 14955000 15600836 16313923 17176369
7454 17176369 18441041 19949204 21376496 22874321 24515444 26614847 28877326 31597798
7446 31597798 34453626 37647107 41490491 45738425 50260691 55408311 61694073 68973196
7438 68973196 77301895 87023709 98625417 111485845 125155976 138849277 152877533
7431 152877533 166016815 176434780 182749483 184462570 181025193 173248086 161564278 147962542
7423A47962542j3880767j2600634j0876210r564815q368490p501070o937029o580447
7415G1653080n789524n807360n203413m677862m485252l862764l289015l036289
7407C5501601k709263k129314j923746j643601j917136j602953r83950j072688
7399B1518950j236140q60967p25359p46317o04490p95510m69685n22237m31752
7390A5126493m90530m81405l63140l01333l21521k90054k17364m04860j18496
7381A2137790Q255J9289j24231Q9089K68159L86289M41219N67481L63414K44501
7371A4401255L31102M73816J98245k08934k26041p14643p72212r47168o80880
7362A1854540n16105o21048o18571n43463k01117n44717l62999l51224l78901
$$ plain form
7423 147962542 134081775 121481141 110604931 101040116 92671626 85170556 78233527 71653080
7415 71653080 65863556 60056196 54852783 50174921 45689669 41826905 38537890 35501601
7407 35501601 32792338 30663024 28739278 27095677 25178541 23575588 22591638 21518950
7399 21518950 20282810 19421843 18696484 17950167 17345677 16550167 16080482 15558245 15126493
7390 15126493 14635963 14154558 13791418 13490085 13168564 12878510 12661146 12256286 12137790
7381 12137790 12146045 12165334 12041103 12130192 12398351 12784640 13225859 13793340 14156754 14401255
7371 14401255 14732357 15206173 15404418 15195484 14969443 14254800 13482588 12535420 11854540
7362 11854540 11338435 10717387 10098816 9555353 9354236 8809519 8446520 8095296 7716395
7353G716395n7247l85261l12777j50243j72523N021j06650n049j54324j10238
7343F267104J07342J12244L28496J57841O1426j08053L31309L96265J64909K99301
7333H118184N7093J90307K32998J45480N2711k44996q9392o1213k00352k11246
7323G989574k61970m23187l75165l09783k99038m43426m50075l75215j39410j71331
7313D740974l61757k86216J72034k66042j15639j29032m14978j09480L101j81574
7303C051391j79607j154P9193o0505k46174P6279L5479j87038J03041r5266m8471
7292B527168j3530L2804q9408K30630k9861k59393m4413N102j8169j74569j07355
7281B059006l0663N9838p8221J1251l038J71327O7424j0469m3290j01928M6002
$$ plain form
7353 7716395 7659148 7273887 6961110 6810867 6638344 6643365 6536715 6531666 6377342 6267104
7343 6267104 6374446 6486690 6815186 6973027 7034453 6926400 7257709 7653974 7818883 8118184
7333 8118184 8175277 8365584 8598582 8744062 8796773 8551777 8462385 8401172 8200820 7989574
7323 7989574 7727604 7304417 6929252 6619469 6320431 5877005 5426930 5051715 4912305 4740974
7313 4740974 4379217 4093001 4265035 3998993 3883354 3754322 3339344 3229864 3232965 3051391
7303 3051391 2871784 2870630 2949823 2889318 2643144 2719423 2754902 2567864 2670905 2575639 2527168
7292 2527168 2513638 2546442 2457034 2687664 2657803 2398410 2353997 2359099 2340930 2166361 2059006
7281 2059006 2028343 2088181 2009960 2021211 2018173 2189500 2256924 2246455 2203165 2101237 2147239
7270B147239K25610J89157K33201j45188j06540O2516K56015K6356k4335j24110
7260B739921N6362q8217r4029N8805q869p4978k38907q1256O5703r9932j57314
7249B077289o7265R869n5495r8121O7605n5952j93865j04449j12720p7279n352
7238A384265q8549j6646J57304J26871o0846o80j85942m9489O7933j34924k62580
7227I36717j1714m4377Q4155Q9426q4875J63715j09926m0188J4348j17934Q1025
7216I60372M6806m47071R2641L80030K5188r4483k4643J03429K4365L3496k80538
7205H19592P2091P5803k90682L8662R0542j8774l7108N5570j26337J65204L71647
7194A216210k25201l94632K1663J4426M1030J15972n8848l2424j18094j0863J87329
$$ plain form
7270 2147239 2372849 2562006 2795207 2650019 2543479 2605995 2862010 2888366 2864031 2739921
7260 2739921 2796283 2708066 2614037 2672842 2663973 2588995 2350088 2268832 2334535 2234603 2077289
7249 2077289 2010024 2019893 1964398 1866277 1933882 1877930 1684065 1579616 1466896 1389617 1384265
7238 1384265 1295716 1279070 1436374 1563245 1502399 1501719 1315777 1266288 1334221 1199297 936717
7227 936717 925003 880626 964781 1054207 969332 1133047 1023121 982933 997281 879347 960372
7216 960372 1007178 560107 652748 1032778 1057966 963483 938840 1042269 1066634 1100130 819592
7205 819592 891683 967486 676804 715466 806008 787234 750126 805696 679359 844563 1216210
7194 1216210 991009 596377 618040 632466 673496 789468 730620 698196 580102 569239 756568
7183G56568J12023P7710j52942j80518L2817R1764K24929q6250j01845m0516l5078
7172F98662P7025p5579J58383l0920p7644n6111J7961m2840J64967O5294j13268
7161G85930Q0231j07437n8824Q0717M7950j14524J14186l267l3131K27414l437
7150A015808J9862Q7237m111J09380R7396l9086j06211j68107K6376j20768j61892
7139G55884J25357M0243j7289q7654o6601j9719K95394K53971j98415J813R9437
7128A182421l9509O7660j21761l3416K7889N6053J13296J47412j5288J39947O2210
7117A586914J05933J9887J70963o1007q6519O0189m1515J06528o5931j16067P4270
7106A753645m11893j17796J69756o7048q0963l2790k9412j56718L2591Q9227l7882
$$ plain form
7183 756568 868591 946301 793359 612841 645658 737422 962351 876101 774256 733740 698662
7172 698662 775687 700108 858491 827571 749927 693816 711777 668937 833904 899198 785930
7161 785930 866161 758724 699900 780617 828567 714043 828229 824962 791831 1019245 1015808
7150 1015808 1035670 1122907 1118796 1228176 1325572 1286486 1180275 1012168 1038544 917776 755884
7139 755884 881241 921484 904195 816541 749940 730221 1025615 1279586 1081171 1082984 1182421
7128 1182421 1142912 1210572 1088811 1055395 1083284 1139337 1252633 1400045 1384757 1524704 1586914
7117 1586914 1692847 1712734 1883697 1822690 1736171 1796360 1754845 1861373 1795442 1679375 1753645
7106 1753645 1341752 1223956 1393712 1326664 1245701 1212911 1183499 1026781 1059372 1148599 1110717
7095A110717O727o0819n6779j01860Q4063o5151m2047j04189R0169J94084q4578
7084I70337j44304L439l7774K12153k5243j37207K24969n2923L2941j94510K30378
7073A082256R9303m9356j11594j19482r8119O6728N6201J8336P4557J2437l38146
7062F93121N9589K50083j33856M7608K07071j30211l9978R3891P6177R8699j34786
7051A087408q3137p2236q3657k4129J12959O812j2019K14914n9231J8808j50730
7040I55762J6658K4468J09583J35909n0266j01680m0531K48398K141m3844j66482
7029A090116j4372K34697j31762j2306L3593r3594P6273p8956Q7472K7919j00690
7018A118390P304n0129J73209o3187k0516J83508l7887k03001j76099k26761L5399
$$ plain form
7095 1110717 1117444 1056625 999846 897986 982049 916898 874851 770662 860831 1054915 970337
7084 970337 826033 829472 791698 1003851 978608 841401 1066370 1013447 1046388 851878 1082256
7073 1082256 1181559 1132203 1020609 901127 803008 869736 925937 944273 1018830 1031267 693121
7062 693121 752710 1002793 868937 916545 1123616 993405 953427 1047318 1123495 1222194 1087408
7051 1087408 1004271 932035 848378 824249 937208 944020 932001 1146915 1087684 1106492 955762
7040 955762 972420 996888 1106471 1242380 1192114 1090434 1049903 1298301 1300442 1256598 1090116
7029 1090116 1075744 1310441 1178679 1166373 1199966 1106372 1182645 1103689 1191161 1219080 1118390
7018 1118390 1125694 1075565 1248774 1185587 1165071 1348579 1310692 1107691 931592 704831 740230
7007G40230K63848J78819k13707j10990n3764J45398L00149n4950L6255l14979
6997I16309O0638m8120j69276J28155L1893J74999P8073n3975J45252p4999j19592
6986A069357M8383J50318p5289L2648K21129p2044j96376L8437K6741m68528R1845
6975H66621K15754j14477Q8957j23526j10527J39510j46522r1606n2777R7767
6965G69174n103j5778j20620J67781J51976l4382k5320j50582J81113o1117k61876
6954E95266N4949J27227J6720k0900p1675K1099P788K1754j22595o7511k4235
6943E37887K5890J04065J10913o3231P034J2678Q1792j5900l0038J3182j02309
6932F81963q5402q3884L2209j2757n2111K5804K2768n711R1629K54980j47421
$$ plain form
7007 740230 1004078 1182897 969190 858200 804436 949834 1249983 1195033 1231288 916309
6997 916309 976947 928827 759551 887706 919599 1094598 1172671 1118696 1263948 1188949 1069357
6986 1069357 1117740 1268058 1192769 1225417 1446546 1374502 1178126 1216563 1243304 774776 866621
6975 866621 1082375 967898 1056855 933329 822802 962312 815790 724184 671407 769174
6965 769174 764071 748293 627673 795454 947430 913048 887728 737146 918259 857142 595266
6954 595266 650215 777442 794162 773262 701587 722686 730474 752228 629633 562122 537887
6943 537887 563777 667842 778755 715524 722558 735236 817028 801128 771090 784272 681963
6932 681963 596561 512677 544886 532129 480018 505822 528590 522879 614508 869488 722067
6921G22067P1574j87584j2931J17225r9731n4078o1750j48418N4288O2686J79330
6910F42678P6395m1799k9938k1052M4490K184R0150j79526M8195p36j62024J82949
6898F51966j1294N3007j32739P4963N997n5571J31250j6722P1369L1808O2275
6887H66309O6407j56848L02729O3164j39210j60963j30917L31824j97437o635
6877H38423P307J02213M5692l1848Q1083l52665j28440J0144J4343N2473k58811
6866C79914J58388J96930J85372o0928l8153j41140N4668j35910j06682j5011
6856D77448J3016j19132L4570K53402n5448j82230L71608o3110k21123L4093M4908
6845E88002m6494j13014K0837m8018k20487K61095J30993R1870j23323j8255K01863
$$ plain form
6921 722067 793641 606057 593126 710351 610620 556542 494792 346374 400662 463348 642678
6910 642678 719073 677274 647336 626284 670774 672958 763108 583582 631777 631041 469017 651966
6898 651966 640672 693679 560940 635903 641900 586329 717579 700857 772226 804034 866309
6887 866309 932716 775868 1078597 1141761 1002551 841588 710671 1042495 845058 838423
6877 838423 845730 947943 993635 961787 1042870 690205 561765 571909 586252 638725 379914
6866 379914 538302 735232 920604 859676 821523 680383 735051 599141 492459 477448
6856 477448 490464 371332 405902 659304 603856 421626 793234 730124 509001 543094 588002
6845 588002 541508 428494 449331 401313 180826 441921 572914 664784 541461 523206 725069
6834G25069k97197p9540J03284k51571J26295K40661j34128m7310n5383J72823
6824E03003J01893j02594j07662K68359m1361P944j03019j23269Q829P5341N189
6813D92653j56682J05228J56017n9787M0247P2511J07048m4393J47082L6618n3256
6802H43286j41718J01547L2775j59327m307K0377q1857j18622j13120J58150o3867
6791D73317q6033J94940J43279J3217j56405j51778R5445J39873M442R671o1358
6780F18610l0459j00914K44187O1520j23414r0726J1951N259L2835J2838j93577
6769D48110K2655J19315L4088j33704o3224L2428J53628K18535n3811l33354j5525
6758D29141L7521k9025J72713j4094R1097J29946o8830J05011n299k35764O9600
$$ plain form
6834 725069 427872 348332 451616 200045 326340 567001 432873 385563 330180 503003
6824 503003 604896 502302 394640 662999 621638 629582 526563 403294 412123 487464 492653
6813 492653 335971 441199 597216 537429 577676 650187 757235 712842 859924 896542 843286
6802 843286 701568 803115 835890 676563 672256 692633 610776 492154 379034 537184 473317
6791 473317 387284 582224 725503 738720 582315 430537 525982 665855 670297 679968 618610
6780 618610 588151 487237 731424 792944 669530 578804 590755 596014 628849 641687 448110
6769 448110 470765 590080 624168 490464 427240 459668 613296 831831 778020 444666 429141
6758 429141 466662 437637 610350 596256 687353 817299 748469 853480 848181 612417 682017
6747F82017l397K4822q6286n5555k4277R9632Q1621l3770n9313k87330J9859Q2671
6735D40694j53075m8664J50757L2490R3093q3725L1937M7895J78487K9837l56640
6724C63086M9234k4676k6801r005J90064J40025O7591p6456j46909k27k3938l2080
6712D69908K42163j51701j72537P7782J53370j97095l19679K10077J03963o4176
6702C52075j21171K23121m3298o3116J69411J32997n5823J46098j33569j00726
6692E05999O8067k8078N96k5563j5653p9698J01547j44448M1614R8585j80547
6681C42421J35698J86431P093j97146Q3957J3389Q4323j07885J32350n6449K0216
6670F44398J77418L221l8116n8761N9190j10977K5735Q6903Q2216R3219l3452
$$ plain form
6747 682017 678620 703442 617156 561601 537324 636956 718577 684807 625494 338164 358023 440694
6735 440694 287619 238955 389712 422202 515295 431570 463507 511402 689889 719726 363086
6724 363086 412320 387644 360843 351838 541902 681927 749518 673062 526153 525926 501988 469908
6712 469908 712071 560370 387833 465615 618985 421890 102211 312288 416251 352075
6702 352075 230904 454025 410727 347611 517022 650019 594196 740294 606725 505999
6692 505999 574066 545988 546584 521021 505368 425670 527217 382769 424383 522968 342421
6681 342421 478119 664550 671643 474497 558454 571843 656166 548281 680631 624182 644398
6670 644398 821816 825037 786921 728160 787350 676373 702108 789011 871227 964446 930994
6659I30994l75343M1193J06556j9022j48847k0461q888P8686J00789k1892k9591
6648F34174p5351j30601K11978K27580k7270K0520j2582j29362q5510m5263K03540
6637G91853P9201n8404m1090k15938R6865J5400J01793M5363p7098p8714O5096
6626G24327R7506M6532n791j19596k65937J57070L24626k99020k2128L20732J16448
6615A074769M6142k31300l5164K30425k03901J10559Q3107P2291K5951P3916N5971
6604A302766N4139R068p2776n3684k6006K13539j22223J23135R5459P1215j25962
6593A468670q8454n2399r1659J04743l9594K3288j75734J31714j90957J5914J83627
6582A289159K0464J13245N8534j64628p685Q9734L0642P9907r5278j33028O9876
$$ plain form
6659 930994 555651 596844 703400 684378 535531 515070 506182 584868 685657 663765 634174
6648 634174 558823 428222 640200 867780 840510 861030 848448 719086 633576 588313 791853
6637 791853 871054 812650 771560 555622 652487 667887 769680 815043 737945 659231 724327
6626 724327 821833 868365 862574 742978 477041 634111 958737 659717 637589 958321 1074769
6615 1074769 1120911 889611 854447 1084872 880971 991530 1074637 1146928 1172879 1246795 1302766
6604 1302766 1356905 1365973 1293197 1239513 1213507 1427046 1304823 1427958 1523417 1594632 1468670
6593 1468670 1380216 1327817 1236158 1340901 1301307 1324595 1148861 1280575 1089618 1105532 1289159
6582 1289159 1309623 1422868 1481402 1316774 1309089 1398823 1429465 1509372 1414094 1281066 1350942
6571A350942r1948p7695j20112O7147R5081J09895L3999j24082l40944O0623k7778
6560I35128J47782J50972o0543J11027j8179o3354l8242K1242J27258L3096j20317
6549A225870R4224r1176J9344l7187M9028Q5905O3347r7668J12802N6319l3930
6538A446878J27422K2172J24958J69263k05489J66029K96763J57534R3419R5627
6528B494576r0336J47552K01293Q9560j419m0724l4761j60984j68294K12348j28666
6517B520145m5840j22179J3001K48075k4483l9603j03580o9596J4980N2196J90415
6506B633531N8348K4508M2813P1908j36801N045l3367j11647j27799J24225o8448
6495B482316j32815j85321m260J17812p2217J42575j25258q9540j17140J65886
$$ plain form
6571 1350942 1258994 1181299 1061187 1128334 1223415 1333310 1367309 1243227 902283 962906 935128
6560 935128 1082910 1233882 1173339 1284366 1266187 1202833 1164591 1185833 1313091 1346187 1225870
6549 1225870 1320094 1228918 1248262 1211075 1260103 1346008 1409355 1311687 1424489 1480808 1446878
6538 1446878 1574300 1596472 1721430 1890693 1685204 1851233 2147996 2305530 2398949 2494576
6528 2494576 2404240 2551792 2753085 2842645 2841226 2800502 2765741 2604757 2436463 2648811 2520145
6517 2520145 2474305 2352126 2365127 2613202 2588719 2549116 2445536 2375940 2390920 2443116 2633531
6506 2633531 2691879 2716387 2759200 2831108 2694307 2699352 2665985 2554338 2426539 2550764 2482316
6495 2482316 2349501 2164180 2159920 2277732 2205515 2348090 2222832 2133292 2016152 2182038
6485B182038L94447j10512j54799R9257J70446j08777o5056M1698j79648l2493
6475B236601o611j14736m9900O8171k05465k50943L5290L63757o9830J16768j57770
6464A965332L3791N3905n3673K9860M138M3566M1536J2129K58510j24774M855
6453B269175P2211J16122M9599j999K33709N7618O7526J00337M5157k05442O0260
6442B864273J40563j76210r3335J81061N3023k56954n3936J70534K28682M0934
6432C098635L8772L3852O4394K5137J13410J13063J14769M10349K6311J62428
6422D201120k9608j32428j37096k8580l9350j0458R0263k26743j53054O6215k7490
6411C572791R060j27811O171r3069L0035K60768m789P7068J80645J19653L7486
$$ plain form
6485 2182038 2576485 2465973 2311174 2410431 2580877 2472100 2407044 2448742 2269094 2236601
6475 2236601 2229990 2115254 2065354 2133525 1928060 1677117 1712407 2076164 2006334 2123102 1965332
6464 1965332 1999123 2053028 1999355 2029215 2033353 2076919 2118455 2130584 2389094 2264320 2269175
6453 2269175 2341386 2457508 2507107 2505108 2738817 2796435 2863961 2964298 3009455 2804013 2864273
6442 2864273 3004836 2828626 2735291 2916352 2969375 2712421 2658485 2829019 3057701 3098635
6432 3098635 3137407 3171259 3235653 3260790 3374200 3487263 3602032 4012381 4038692 4201120
6422 4201120 4171512 4039084 3901988 3873408 3834058 3823600 3913863 3687120 3534066 3600281 3572791
6411 3572791 3581851 3454040 3460211 3367142 3397177 3657945 3653156 3730224 3910869 4030522 4068008
6400D068008Q3933k3599j43507K3240J76066k57310n5999Q2912q5550n5692M0476
6389C852978j64624R5811L9335j57553j71281J33622O4274j43544j37214j27510
6379C284294J13556l6033j04849j4348J34457k6636K4942p387K10518J13238j10739
6368C581013l281J29900l0497N7672J2596J7910J77988j53253O7153K47584o1502
6357D043283p4781L3157J87965K46412J11906O0948J18356R0744J85054J98814
6347E201858K27983J64612J95521L91223M78797J21769K50346M06252J35705L79637
6337G953703K89652K02881J32326r2390Q4681K45591k6425J00365R1669J76159
6327I158212K16904K63051K70402L92117M33701M91255N71386O11725Q25045Q24228
$$ plain form
6400 4068008 4151941 4128342 3984835 4008075 4184141 3926831 3870832 3953744 3868194 3812502 3852978
6389 3852978 3688354 3784165 3823500 3665947 3494666 3628288 3692562 3549018 3411804 3284294
6379 3284294 3397850 3361817 3256968 3242620 3377077 3350441 3375383 3367996 3578514 3691752 3581013
6368 3581013 3577732 3707632 3677135 3734807 3747403 3765313 3943301 3790048 3857201 4104785 4043283
6357 4043283 3968502 4001659 4189624 4436036 4547942 4608890 4727246 4817990 5003044 5201858
6347 5201858 5429841 5594453 5789974 6181197 6659994 6781763 7032109 7438361 7574066 7953703
6337 7953703 8243355 8446236 8578562 8486172 8570853 8816444 8790019 8890384 8982053 9158212
6327 9158212 9375116 9638167 9908569 10300686 10734387 11225642 11797028 12408753 13233798 14058026
6317A4058026P96003Q66004J287601J435597J686292J823615K098686K312799
6309B6364623L021041L568913L495412L538362L652262L672737L285556K968269
6301E3567175K618736J140088o950r03597j866009j820398j309187q80163n13944
6292E0025751P5616O65270J566145J934277K479429L545255L905253M475679M549773
6283G3222448N020970N418996M980332L627703K630074Q74354j112020k294229
6275I2368628l241211l794088m391151m400009m252983l891914l200333k627548
6267F2569391k005356j231433o70350j58533M21469J047213J302953J627910J712618
6258F4615882J893800J592092O57248m99183j752352l398248m314789m558458
$$ plain form
6317 14058026 14854029 15720033 17007634 18443231 20129523 21953138 24051824 26364623
6309 26364623 29385664 32954577 36449989 39988351 43640613 47313350 50598906 53567175
6301 53567175 56185911 57325999 57319049 56415452 54549443 52729045 51419858 50539695 50025751
6292 50025751 50101367 50766637 52332782 54267059 56746488 60291743 64196996 68672675 73222448
6283 73222448 78243418 83662414 88642746 92270449 94900523 95774877 94662857 92368628
6275 92368628 89127417 85333329 80942178 76542169 72289186 68397272 65196939 62569391
6267 62569391 60564035 59332602 58662252 58503719 58925188 59972401 61275354 62903264 64615882
6258 64615882 66509682 68101774 68759022 68259839 66507487 63109239 58794450 54235992
6250E4235992m530696l997870l105526l070879k753504k587983k440653k010552
6242B9738329j780720j971593k052419j678677j536609j240320j206422j150679
6234A7120890q58005q43624p24569o25059r74530n12629o22931m19047l26065
6225A1214431n98028l75038k99777k89815l29895m27976l07304l5246l55217j77086
6215H019049k54118k78643k26963l16345R608j95921q6650j29823j18277r6158
6205F325759l43398j29476K3499j56793k74263k29284p4143Q1657l3264k80836
6195D909458j03622Q2526j59338J16311j18659k51809j39226R5225L3644j87343
6185D277167M9491k58373m24484k344L50965k2118j64926R8157n7340J0905k01057
$$ plain form
6250 54235992 49705296 45707426 42601900 39531021 36777517 34189534 31748881 29738329
6242 29738329 27957609 25986016 23933597 22254920 20718311 19477991 18271569 17120890
6234 17120890 16262885 15419261 14694692 14069633 13095103 12582474 11959543 11540496 11214431
6225 11214431 10616403 10241365 9941588 9651773 9321878 8893902 8586598 8551352 8196135 8019049
6215 8019049 7764931 7486288 7259325 6942980 6952588 6756667 6670017 6540194 6421917 6325759
6205 6325759 5982361 5852885 5876384 5719591 5445328 5216044 5141901 5223558 5190294 4909458
6195 4909458 4805836 4888362 4729024 4845335 4726676 4474867 4335641 4430866 4464510 4277167
6185 4277167 4326658 4068285 3643801 3641457 3992422 3970304 3805378 3903535 3846195 3857100 3656043
6174C656043O7263o1737j0638r2085k0243r5878j79097Q0630J11549J2604j37398
6163C331013K13417k77203j06069p6982j390q0526k10588r8688Q6329Q9813k76125
6152B593001p8312K01542O405L6361j85605M4831j3444j55907K23659N5735r4387
6141B633879K1380k19602j0617n0802q9520J01649k9140k220J89924n5419j02730
6130B386782p8540M5048J37463q1278m1936o4496J11247j0864L3335p8985j06960
6119B250816N5835j38672k1924q1847J75736j073k91353P7412M4241J62897P1014
6108B303082R7521k47088j00256N6736J00966J13806k63414j25126L11229O0499
6098B307955q8090j38510j62428m7877J36227p402j88728K51970N5691l2851l0134
$$ plain form
6174 3656043 3723306 3661569 3650931 3558846 3538603 3442725 3263628 3344258 3455807 3468411 3331013
6163 3331013 3544430 3267227 3161158 3084176 3082786 3002260 2791672 2692984 2779313 2869126 2593001
6152 2593001 2514689 2716231 2722636 2758997 2573392 2618223 2604779 2448872 2672531 2728266 2633879
6141 2633879 2655259 2435657 2425040 2374238 2284718 2386367 2357227 2355007 2544931 2489512 2386782
6130 2386782 2308242 2353290 2490753 2409475 2367539 2303043 2414290 2403426 2436761 2357776 2250816
6119 2250816 2306651 2167979 2146055 2064208 2239944 2238871 1947518 2024930 2069171 2232068 2303082
6108 2303082 2400603 2153515 2053259 2109995 2210961 2324767 2061353 1936227 2247456 2307955
6098 2307955 2219865 2081355 1918927 1871050 2007277 1999875 1811147 2063117 2118808 2085957 2055823
6087B055823j21251L2929L0574j1294Q0859l3383j136O8437R633p363J06868k38933
6075A971763o8763J06519j55214L1957K61287R9618o9212M2860M3732q4780j67360
6064B012407N5277q1536J22464o6383O3022K9949n6636M4753j69882j6404n2824
6053A884207m5104J08839J02385J58853r1116r5193n6878J1328J09469R8458K8902
6042B214150J42867O874k49106M8828j24747n0771N2302J66298R2569P9415k70702
6031B107977K8731R9179j68448n7415J82975J13976p1565Q1924M5827p1784L6354
6020B327731J01778R2483j83481j93798L07077J97742M0488K3466J07974k77420
6010B544040R5473L36780N2711Q6251J55310J31018l364P8792j44854p1267J30671
$$ plain form
6087 2055823 1934572 1967501 1998075 1986781 2067640 2034257 2033121 2101558 2111191 2103828 2210696 1971763
6075 1971763 1903000 2009519 1854305 1886262 2147549 2247167 2177955 2220815 2264547 2179767 2012407
6064 2012407 2067684 1986148 2108612 2042229 2105251 2135200 2078564 2123317 1953435 1937031 1884207
6053 1884207 1839103 1947942 2050327 2209180 2118064 2022871 1965993 1977321 2086790 2185248 2214150
6042 2214150 2357017 2363891 2114785 2163613 2038866 1988095 2040397 2206695 2299264 2378679 2107977
6031 2107977 2136708 2235887 2067439 2010024 2192999 2306975 2235410 2317334 2363161 2291377 2327731
6020 2327731 2429509 2521992 2338511 2144713 2451790 2649532 2690020 2713486 2821460 2544040
6010 2544040 2639513 2976293 3029004 3115255 3270565 3401583 3398219 3477011 3332157 3260890 3391561
5999C391561k89783k1936J12649J56319K21898r8101j21769R0048K11119j51819
5989C500186J19748J68594N1520K06158N4023k8024l3598K79414J86822j44719
5979D360124k87588M712J07394k21035j1819J80894j79463r3869J21265k0438
5969C960177k14915m0694K48532q2017j0998L7322L3179M0071j84975K23896J70951
5958D180529p6501K89614k3216j96824j24105q5343n0523J8221p0730j04049j38976
5947C618097k5290l6111j78369P1016J90999Q0350O3025j00196p8661r0165l7870
5936C476825l5854P4570J6540k7291j09183J43548J936J10699P2915P4017P2713
5925C871435n5829L3504j42527J3294L50962K70367m8678J15097M1731J62534
$$ plain form
5999 3391561 3101778 3079842 3192491 3348810 3570708 3472607 3350838 3440886 3652005 3500186
5989 3500186 3619934 3788528 3840048 4046206 4100229 4072205 4038607 4318021 4504843 4360124
5979 4360124 4072536 4077248 4184642 3963607 3951788 4132682 3953219 3859350 3980615 3960177
5969 3960177 3745262 3704568 3953100 3871083 3860085 3897407 3930586 3970657 3785682 4009578 4180529
5958 4180529 4104028 4393642 4370426 4173602 4049497 3964154 3913631 3931852 3861122 3757073 3618097
5947 3618097 3592807 3556696 3378327 3449343 3640342 3720692 3783717 3683521 3604860 3514695 3476825
5936 3476825 3440971 3515541 3532081 3504790 3395607 3539155 3541091 3651790 3724705 3798722 3871435
5925 3871435 3815606 3849110 3706583 3719877 4070839 4341206 4292528 4407625 4449356 4611890
5915D611890K36895K52318K73235K76102Q1674K15013K74325N35274K46534J60926
5905G164186J50625K26742j1829l7889j12148n1619k6012j20289O5916l930k80496
5894F963257K056l8458n2591j57581j02667N4696j9456o5378L3898K1663N4041
5883F693480k2577n90L47807R2661K20368K14234L78814K86911k5880J83910K56103
5872H625241J83405K32098M9368J5568Q6626J0021j44563l09295l98525o5512
5862H284432J08830M9174j46154l254j8474k081j4110J50261J04393j8799J24192
5851H618410J16590J08982J23989K49005J36836j45161O4502R2289L0010l046
5841I392406j76505j76046n3738j21317J18152l0374r8266J47049k89023k41779
$$ plain form
5915 4611890 4848785 5101103 5374338 5650440 5732114 5947127 6221452 6756726 7003260 7164186
5905 7164186 7314811 7541553 7529724 7491835 7379687 7328068 7302056 7181767 7247683 7243753 6963257
5894 6963257 6965313 6926855 6874264 6716683 6614016 6668712 6649256 6583878 6617776 6639439 6693480
5883 6693480 6670903 6670313 7018120 7110781 7331149 7545383 7924197 8211108 8185228 8369138 8625241
5872 8625241 8808646 9040744 9090112 9105680 9192306 9202327 9057764 8748469 8349944 8284432
5862 8284432 8393262 8442436 8296282 8293028 8274554 8272473 8258363 8408624 8513017 8494218 8618410
5851 8618410 8735000 8843982 8967971 9216976 9353812 9208651 9273153 9365442 9395452 9392406
5841 9392406 9215901 9039855 8986117 8864800 8982952 8952578 8854312 9001361 8712338 8470559
5831H470559j25496l86464j31273p5811p0411J10427r2505r2213N1881j27395
5821G531299k30474J97272L38441J34907j9451J49937j71209J2658J09704l976
5811H049108j20454l486J17875o0031k55135j38141J58460j18685o9871N890o1318
5800G504212k75679m8498K05758J8746n393K63506M7042j21382J4158L68P24j7191
5788G586371k7019O2810O3770J0368M7334P0228o9657k24245q4393J14191J26374
5777G676132N3935O5950P1847J31198j4242J12460K21204L3865K00495K0216J74017
5766H747077J58105K69119P6010J97J67467J70249K13398M8640J74176M29698
5756A0454136K14785J75697L28799K84111P8703K65078M00338J65423M61758L57178
$$ plain form
5831 8470559 8345063 7958599 7827326 7751515 7681104 7791531 7699026 7606813 7658694 7531299
5821 7531299 7300825 7498097 7836538 7971445 7951994 8101931 7930722 7943380 8053084 8049108
5811 8049108 7928654 7925168 8043043 7983012 7727877 7589736 7748196 7629511 7559640 7565530 7504212
5800 7504212 7228533 7180035 7385793 7404539 7399146 7662652 7709694 7588312 7602470 7602838 7603562 7586371
5788 7586371 7559352 7622162 7685932 7696300 7743634 7813862 7744205 7519960 7435567 7549758 7676132
5777 7676132 7730067 7796017 7867864 7999062 7984820 8097280 8318484 8352349 8552844 8573060 8747077
5766 8747077 8905182 9174301 9250311 9250508 9417975 9588224 9801622 9850262 10024438 10454136
5756 10454136 10668921 10844618 11173417 11457528 11536231 11801309 12201647 12367070 12828828 13186006
5746A3186006M27000M62010M16390M37174L06834M55001M18708L57558N51020
5737A7017701K96285K63878L96376N64367N02339P09896N07652M01366O51438
5728B1311298Q15836J108979J103485J025902J386193J467586J361183J581626
5720C1162088J800971K105945K301466K494499K737736L043882L534395M191471
5712E3372453M535956M937008M834124M808065M586430M266539L840394K625438
5704H7806407J366054j3613p61191m24980K62267J093450J875649K740730L686418
5695I7631191M957355O490828Q146108R681556J1533399J3021681J3941985J4622173
5687A80026276J3829507J2584686R961954N515367K75899m279911o958181p873778
$$ plain form
5746 13186006 13613006 14075016 14491406 14928580 15235414 15690415 16109123 16466681 17017701
5737 17017701 17313986 17577864 17974240 18538607 19040946 19750842 20258494 20659860 21311298
5728 21311298 22127134 23236113 24339598 25365500 26751693 28219279 29580462 31162088
5720 31162088 32963059 35069004 37370470 39864969 42602705 45646587 49180982 53372453
5712 53372453 57908409 62845417 67679541 72487606 77074036 81340575 85180969 87806407
5704 87806407 89172461 89158848 88397657 87972677 88234944 89328394 91204043 93944773 97631191
5695 97631191 102588546 109079374 117225482 126907038 138440437 151462118 165404103 180026276
5687 180026276 193855783 206440469 216402423 221917790 222193689 217913778 210955597 203081819
5679B03081819p288128o511858n791380m730495l124751j376308R19137L331208
5671A78509244N723280Q867700J2133800J4180119J4513820J5006353J4837830
5664B63772146J3417449R124064J018179o936321j0944105j1600421j1334189
5657B46516802j2153096j4283318j4579436j2781399j0297490q264099o026545
5650A68131419m454660k992933n58110J399493L995019O350873P295631O201968
5642A85368700N044282M435044L178464r94471p888217j4212288j6835539j5471965
5634A42624010j2831375j0595641r186420q233318p224796o494787n874548n419281
5626G6763844n175009m918853m533179l890195l641429l230578l068244k441627
$$ plain form
5679 203081819 195793691 189281833 183490453 178759958 175635207 174258899 175178036 178509244
5671 178509244 184232524 193100224 205234024 219414143 233927963 248934316 263772146
5664 263772146 277189595 286313659 287331838 280395517 269451412 257850991 246516802
5657 246516802 234363706 220080388 205500952 192719553 182422063 174157964 168131419
5650 168131419 163676759 160683826 160125716 161525209 165520228 171871101 179166732 185368700
5642 185368700 190412982 194848026 198026490 197032019 189143802 174931514 158095975 142624010
5634 142624010 129792635 119196994 110010574 101777256 94552460 88057673 82183125 76763844
5626 76763844 71588835 66669982 62136803 58246608 54605179 51374601 48306357 45864730
5618D5864730k256952k235688j730084j780055j537882j460364j185044r23972
5610C2754689j146422q38037o74229r24840o30263p15521p18332n25583l10441
5601B6271021o14424o36186k93342m40922o81161o23865l99034m47822k45958
5592B1888307l99482k89666l66072l19603k04349l45527l69739j47593k60449
5583A9185827m6615j11745m14184k19762j45306l27251l43351l27072r1879j83147
5573A6975515k99932k77906k31484k38708o9222l3030r3204K8021r6931k32071
5563A5431048k4103r4061j55673J30515k13413j44891j04818k92033m45862l30618
5553A3756091j41617l04496j79413j90151q6751k3116l27092k27393k20984l6169
$$ plain form
5618 45864730 43607778 41372090 39642006 37861951 36324069 34863705 33678661 32754689
5610 32754689 31608267 30770230 30096001 29171161 28540898 27825377 27107045 26581462 26271021
5601 26271021 25656597 25020411 24727069 24286147 23604986 22981121 22582087 22134265 21888307
5592 21888307 21488825 21199159 20833087 20513484 20309135 19963608 19593869 19446276 19185827
5583 19185827 19139212 19027467 18613283 18393521 18248215 17920964 17577613 17250541 17158662 16975515
5573 16975515 16675583 16397677 16166193 15927485 15858263 15825233 15732029 15760050 15663119 15431048
5563 15431048 15406945 15312884 15157211 15287726 15074313 14929422 14824604 14532571 14086709 13756091
5553 13756091 13614474 13309978 13130565 12940414 12853663 12830547 12503455 12276062 12055078 12018909
5543A2018909Q3247j77309l16187Q6907j73879k05276Q8001j39822m2161L7864
5533A1260294J73663m5228Q2375r2704M9926K00832j34201j10286K40526N1145
5523A1676342P2385J36563j06629r2055l6129p2888O5570J92023L0472o5293J32565
5512A1932926J83083K6122L68041J97337L4021J74359J15228J60095K67320K40857
5502A3699389K79060Q6741J51694J60975K35018O33792K20256L50241M25033M38374
5492A6680573P57600O53059O91501O43776J104344Q66427J125822J502435J470687
5483B5496224J085316R66457R70183J047409Q99326Q68213O82748L88657M86073
5474C2890606J32460J85122K88284L41084K72119M96215O63285M89906P99283
$$ plain form
5543 12018909 12102156 11924847 11608660 11695567 11521688 11316412 11404413 11264591 11222430 11260294
5533 11260294 11433957 11388729 11471104 11378400 11428326 11629158 11494957 11384671 11625197 11676342
5523 11676342 11748727 11885290 11778661 11686606 11650477 11577589 11643159 11835182 11865654 11800361 11932926
5512 11932926 12116009 12142131 12510172 12707509 12741530 12915889 13031117 13191212 13458532 13699389
5502 13699389 13978449 14065190 14216884 14377859 14612877 15246669 15466925 15817166 16242199 16680573
5492 16680573 17438173 18091232 18782733 19426509 20530853 21397280 22523102 24025537 25496224
5483 25496224 26581540 27547997 28518180 29565589 30464915 31333128 32015876 32404533 32890606
5474 32890606 33023066 33208188 33496472 33837556 34109675 34605890 35269175 35759081 36558364
5465C6558364J249611J046076J371189J675748J723429J762428K007917K361167
5457D9755929K433366K759895L373581L743913M266469M864701N376291O308918
5449H2883063P216475Q038343Q961574R850346J0510169J0981408J0717666J0321258
5441A59480302R596192P952136O266401M045169J777309R27227L69587K82005
5433A90696328K4086m47829j137732j361443n35231Q94361K381759L990800N385012
5424A99890111O716985P668381Q924159R392157R334953Q767719P772137O964339
5416B65430941M798686K507691J24782k472357m872987p197896q985907r707837
5408B39625116r376940q493604p504008o864949o597491n649576m319410k674621
$$ plain form
5465 36558364 37807975 38854051 40225240 41900988 43624417 45386845 47394762 49755929
5457 49755929 52189295 54949190 58322771 62066684 66333153 71197854 76574145 82883063
5449 82883063 90099538 98137881 107099455 116949801 127459970 138441378 149159044 159480302
5441 159480302 169076494 177028630 183295031 187340200 189117509 190044736 190414323 190696328
5433 190696328 190720414 190272585 189134853 187773410 187238179 188132540 190514299 194505099 199890111
5424 199890111 206607096 214275477 223199636 232591793 241926746 250694465 258466602 265430941
5416 265430941 270229627 272737318 272862100 270389743 265516756 258318860 249332953 239625116
5408 239625116 230248176 221754572 214250564 207385615 200788124 195138548 190819138 188144517
5400A88144517j434789m16330J52734O51596J111660O27595J8690j157740k725401
5391A84972532l820400m421697n262504o600356p873859r468373j0519612j0051197
5383A26954534r090099p895774p235490o428770o145663n844968m866073m888040
5375G4559657m307205m225884l480482l403873l186572k639609k399323k206207
5367D8710502j875435j745378j675597j481738j308021j253050j177562j044504
5359C7149217q04300j079674j174248p72267q83339r79593o50153o76238q09340
5350B9320065n44690k82536l74639m13986k01157m81178m53214m63846k55411
5341B5849408l80252q49866q94550n91897n24097p94136m78446m97642o70468
$$ plain form
5400 188144517 186709728 186293398 186446132 187097728 188209388 188836983 188855673 187697933 184972532
5391 184972532 181152132 176730435 171467931 164867575 156993716 147525343 137005731 126954534
5383 126954534 117864435 109968661 102733171 96304401 90158738 84313770 79447697 74559657
5375 74559657 70252452 66026568 62546086 59142213 55955641 53316032 50916709 48710502
5367 48710502 46835067 45089689 43414092 41932354 40624333 39371283 38193721 37149217
5359 37149217 36344917 35265243 34090995 33318728 32435389 31455796 30805643 30129405 29320065
5350 29320065 28775375 28492839 28118200 27704214 27503057 27021879 26568665 26104819 25849408
5341 25849408 25469156 24619290 23724740 23132843 22608746 21814610 21336164 20838522 20168054
5332B0168054n58507m70672n18730m80646k12516k31742q9598l71894l5513R0046
5322A7288282J88302J03618K57866L58458N74520P21925P43526P66114P69095
5313B1771706R98013N55571K12458k68712o31380o74123j022775j095048j082672
5304A8763038r53911p15425p38455m43188o34960n11846l46797m54200m21551
5295A3542705j87189j3878r2268J00425k14901n9611K69150K59708J82071L88865
5285A4175077P41519R98400R55759R34089R29404O90850O69058J76362o84964
5276A9585554q26052r71843r15360q22277j073398p97984p56182m87631o84353
5267A2250474l42348m04442n32850j45708n22839l05927m3099l64093j69291L0873
$$ plain form
5332 20168054 19609547 19138875 18620145 18139499 17926983 17695241 17605643 17233749 17198236 17288282
5322 17288282 17476584 17580202 17838068 18196526 18771046 19492971 20236497 21002611 21771706
5313 21771706 22769719 23325290 23537748 23269036 22637656 21963533 20940758 19845710 18763038
5304 18763038 17809127 17093702 16355247 15912059 15277099 14765253 14418456 13964256 13542705
5295 13542705 13355516 13341638 13249370 13349795 13134894 13075283 13344433 13604141 13786212 14175077
5285 14175077 14916596 15914996 16870755 17804844 18734248 19425098 20094156 20270518 19585554
5276 19585554 18759502 17787659 16872299 16050022 14976624 14178640 13422458 12934827 12250474
5267 12250474 11908126 11503684 10970834 10825126 10302287 9996360 9953261 9589168 9419877 9450750
5257I450750k94248m6939O5710J6231R3812L35276J42473K82684L19871J74655
5247A0540275K53506J15270r8768j13568k25450l12186l49601j58256k16584k81766
5237I152872n9832l9080r1458k32895q5778k5997m50067k39415J8364j08868K9597
5226G867443m09248k57957j07605k51400p6132K31541k78963j57012O7774k35341
5216F393100p9508J25111J15636k0481K9157R5191J35521J59696K32861K80636
5206G466920R9069L4511L24610M35138R2525P8040k2550r4616k534J12251r8891
5195H424473j89838P1370k40224j48105j9720J88835k18841J40884j23422k46362
5185G639050K44803M5702p5196q5592Q8474L98714K04752o2994L22990L32385
$$ plain form
5257 9450750 9156502 9109563 9175273 9191504 9285316 9620592 9763065 10045749 10365620 10540275
5247 10540275 10793781 10909051 10810283 10696715 10471265 10159079 9809478 9651222 9434638 9152872
5237 9152872 9093040 9053960 8962502 8729607 8643829 8617832 8167765 7928350 7946714 7837846 7867443
5226 7867443 7458195 7200238 7092633 6841233 6765101 6996642 6717679 6560667 6628441 6393100
5216 6393100 6313592 6438703 6554339 6533858 6563015 6658206 6793727 6953423 7186284 7466920
5206 7466920 7565989 7600500 7925110 8360248 8452773 8530813 8508263 8413647 8411113 8523364 8424473
5195 8424473 8234635 8306005 8065781 7917676 7897956 8086791 7867950 8008834 7885412 7639050
5185 7639050 7883853 7929555 7854359 7768767 7857241 8255955 8460707 8397713 8720703 9053088
5175I053088L04710J44921J90887M81232N70976M01298N10231M94003L79090L74362
5165A2904798L65728M30494J82142M87445N97233N01701M09424O51123R22525
5156A7452613J068638J333670J140270J362694J502223J973245K313761K366774
5148C0513888K753725L428129L973382M233376M319879M581794M452615L674019
5140F1930807L021503J792507L02395j225478j839471k096212j760240j369787
5132E8756024j158751o77887m1350P14478J040737J598182K397327K918934L362441
5123F8910135L728393L677777L744628L397535K649339J825011J117423j61469
5115H8888772j271249k968937l636937m274641m505369m092847l271691k808715
$$ plain form
5175 9053088 9357798 9502719 9693606 10174838 10745814 11147112 11657343 12151346 12530436 12904798
5165 12904798 13270526 13701020 13883162 14370607 14967840 15469541 15878965 16530088 17452613
5156 17452613 18521251 19854921 20995191 22357885 23860108 25833353 28147114 30513888
5148 30513888 33267613 36695742 40669124 44902500 49222379 53804173 58256788 61930807
5140 61930807 64952310 66744817 67047212 65821734 63982263 61886051 60125811 58756024
5132 58756024 57597273 56919386 56878036 57592514 58633251 60231433 62628760 65547694 68910135
5123 68910135 72638528 76316305 80060933 83458468 86107807 87932818 89050241 88888772
5115 88888772 87617523 84648586 81011649 76737008 72231639 68138792 64867101 62058386
5107F2058386k290051j744387j357248n87149m35390l633N48533Q36806P89633
5098E7815500O70168M54500R3945o02181j665268k467647l534575l455194l418719
5089D3890529l412178k698935k876883k374421j988161j807739j834871j580441
5081B5316900j603945j657350j437741j061759j095016j166862q37781q97342
5073A5559104q06925o69613l02942n75644p12658m12111m99921m31347m84305
5064A0663638m45848m62365l16728l60494j97078k77593n3397k78208o76609k27249
5054G368069q0983k44078p8598l19403k50295p765k52439k62116j04563j21450
5044E646379j00115p8890j37636j58599n5430M8759q0517k17558j77389j46538
$$ plain form
5107 62058386 59768335 58023948 56666700 56079551 55644161 55640528 56189061 57025867 57815500
5098 57815500 58485668 58940168 59034113 58431932 56766664 54299017 50764442 47309248 43890529
5089 43890529 40478351 37779416 34902533 32528112 30539951 28732212 26897341 25316900
5081 25316900 23712955 22055605 20617864 19556105 18461089 17294227 16456446 15559104
5073 15559104 14752179 14082566 13779624 13203980 12491322 12079211 11579290 11147943 10663638
5064 10663638 10217790 9755425 9438697 9078203 8881125 8603532 8550135 8271927 7595318 7368069
5054 7368069 7287086 7043008 6964410 6645007 6394712 6386947 6134508 5872392 5767829 5646379
5044 5646379 5546264 5467374 5329738 5171139 5115709 5164468 5083951 4866393 4689004 4542466
5034D542466l4593m7420j01853l1885j34212R066p9645r2519J30011p2509j76660
5023C910247p8826j8385O7246J8495p283j01983J12435J22490r2500o0365j02014
5012C769557J06845j08976j35865J61147k8712k1826J3641m4263N346p7800O7105
5001C706199r7461j50619K516j3476J84209r4053r6647j37447p0639k17353k0938
4990B994291j29070M3530L43561L285q2570j08135l04634o0654K83986j01960
4980B881630j31346O2412j21530q6690Q3973k8700K15894k41277r0640J23452
4970B667178k4765l00606m4435P6000j52043k4248N8776K32618J36275k4979o2099
4959B537672j47228j54845p3470M6934J25724J73407j70793q4902j9437O5546
$$ plain form
5034 4542466 4507873 4460453 4358600 4326715 4192503 4201569 4121924 4029405 4159416 4086907 3910247
5023 3910247 3831421 3813036 3880282 3898777 3891494 3789511 3901946 4024436 3931936 3871571 3769557
5012 3769557 3876402 3767426 3631561 3792708 3763996 3742170 3755811 3711548 3716894 3639094 3706199
5001 3706199 3608738 3458119 3460635 3447159 3631368 3537315 3440668 3303221 3232582 3015229 2994291
4990 2994291 2865221 2908751 3252312 3255597 3173027 3064892 2760258 2699604 2983590 2881630
4980 2881630 2750284 2812696 2691166 2604476 2688449 2659749 2875643 2634366 2543726 2667178
4970 2667178 2642413 2341807 2297372 2373372 2221329 2197081 2255857 2488475 2624750 2599771 2537672
4959 2537672 2390444 2235599 2162129 2209063 2334787 2508194 2337401 2252499 2233062 2298608
4949B298608P7901P8716J66358j25450q3391J45279J43398r0249L8513J95976
4939B845659K72339M4678k02574j50592K1743q5346m2193r3455n0409j6383Q9297
4928B632764J331J42216J61728j21624q2408k26310J45159K23159K03868J2298
4918C092181Q063K93518J81203J62861J78807K45301L41303K99602L10199N26436
4908E639474K76927K03661K16892K55846J18539L52176Q6422L81001O47050M01240
4898H579228Q48390N35189N97271P80903N93653R53194J163171J447076K004672
4889A7502747K485457K961674L089563K404437K407380K435165J779983p4117
4881C4992289k347571l075984l294764l046388k289349j857584j712543j520859
$$ plain form
4949 2298608 2376509 2455225 2621583 2496133 2412742 2558021 2701419 2611170 2649683 2845659
4939 2845659 3117998 3162676 2960102 2809510 2831253 2745907 2703714 2610259 2559850 2543467 2632764
4928 2632764 2634095 2776311 2938039 2816415 2734007 2507697 2652856 2876015 3079883 3092181
4918 3092181 3100244 3393762 3574965 3737826 3916633 4161934 4503237 4802839 5113038 5639474
4908 5639474 5916401 6120062 6336954 6592800 6711339 7063515 7149937 7530938 8177988 8579228
4898 8579228 9427618 9962807 10560078 11340981 11934634 12887828 14050999 15498075 17502747
4889 17502747 19988204 22949878 26039441 28443878 30851258 33286423 35066406 34992289
4881 34992289 32644718 29568734 26273970 23227582 20938233 19080649 17368106 15847247
4873A5847247j306728j265430j135239j082814q67699p42668o19123o98027p16298
4864G413221m61328m38324n65948l76749k89248k74340k20694n4318q1732l51727
4854D298813k30593L6263k9745j30845j76807k43743l0937K8997J30351m8796
4844C602958l73534j7678J75579Q1230N0600r9150J6264o717j97773j73327k40325
4833B818127J64623M285j29245j2606j18720q9934j24646k5434K08501j33429
4823B561522k24204j12855R3857R2973k25382J18257m6722J03924j05304P7658
4813B333724N1286J49208l26874M6446q9335j54517J11034j72730q2674Q8092
4803A953660R3388L0411J05834j35786k3202J08369l0928k45792J36747R1537
$$ plain form
4873 15847247 14540519 13275089 12139850 11057036 10189337 9446669 8827546 8129519 7413221
4864 7413221 6951893 6513569 5947621 5570872 5281624 5007284 4786590 4732272 4650540 4298813
4854 4298813 4068220 4104483 4074738 3943893 3767086 3523343 3492406 3521403 3651754 3602958
4844 3602958 3229424 3211746 3387325 3468555 3519155 3420005 3436269 3429552 3231779 3058452 2818127
4833 2818127 2982750 2987035 2857790 2845184 2726464 2636530 2511884 2486450 2694951 2561522
4823 2561522 2337318 2224463 2318320 2411293 2185911 2304168 2257446 2361370 2256066 2333724
4813 2333724 2385010 2534218 2207344 2253790 2164455 2009938 2120972 1948242 1865568 1953660
4803 1953660 2047048 2077459 2183293 2047507 2024305 2132674 2101746 1855954 1992701 2084238
4793B084238K52699m9688j9526J0259k39159j8044J65353j20260k40676N2377
4783A877573k8522l4006q7463O1540j73382L90010P9483O6442Q86j87592q0049
4772A884920J46205r3403j74931j95833r1377J18527j07318k06418M52439J22663
4762A855474l07889q7262j91258O9892O0114j6848m370R3364J87074k00355N9936
4751A517872o1396j39736R6364j20111K02824j33994o8903J31451J68926q0108
4741A513189r6094N8040J17946j07719n4981q89J11660k25605m9797M2635q1778
4730A226607J36737M5389M3519L5114M5226k4740O9143J8946k10565K70142L640
4719A659158N6778L1287N2137L0694M6505j27089o8980n6003l2475N7984q204
$$ plain form
4793 2084238 2336937 2287249 2267723 2277982 2038823 2020779 2186132 2065872 1825196 1877573
4783 1877573 1849051 1815045 1727582 1789122 1615740 2005750 2085233 2151675 2152561 1964969 1884920
4772 1884920 2031125 1937722 1762791 1566958 1475581 1594108 1486790 1280372 1732811 1855474
4762 1855474 1547585 1460323 1269065 1338957 1399071 1382223 1377853 1471217 1658291 1457936 1517872
4751 1517872 1456476 1316740 1413104 1292993 1495817 1361823 1292920 1424371 1593297 1513189
4741 1513189 1417095 1475135 1593081 1485362 1430381 1429492 1541152 1315547 1265750 1308385 1226607
4730 1226607 1363344 1408733 1452252 1487366 1532592 1507852 1576995 1595941 1385376 1655518 1659158
4719 1659158 1715936 1747223 1799360 1830054 1876559 1749470 1680490 1624487 1592012 1649996 1641792
4708A641792K3343k9015j8068k7365J23907j934p1368j31742q0604R6795K36292
4697A762033p4451R7500j533L505K24232j49588j7364j21723K18185K22608l3648
4686B129756N4735J81003J91874j97244r3546m119j7477O5103j68829j62263o8720
4675A910273n2623j88661j47998N0130k9520O8454J20350n3066J23452j20313
4665A680478p396k82873M9420o8411J40526J74278j20094p5240l28129j57577
4655A004982K45711J51612J80317p4473M1348J19659q9589o4253M035J59301Q0505
4644A759155Q6751R476m7770k17173J34514o205O6556Q4646j27831k43490K03522
4633A702151j19438j73446j23861J57550J33556O8506k0068j8072m1871J01134
$$ plain form
4708 1641792 1665135 1636120 1618052 1590687 1714594 1712660 1641292 1509550 1428946 1525741 1762033
4697 1762033 1687582 1785082 1783549 1787054 2011286 1861698 1844334 1722611 1940796 2163404 2129756
4686 2129756 2184491 2365494 2557368 2360124 2266578 2262459 2244982 2310085 2141256 1978993 1910273
4675 1910273 1857650 1668989 1520991 1571121 1541601 1610055 1730405 1677339 1800791 1680478
4665 1680478 1673082 1390209 1439629 1371218 1511744 1686022 1565928 1490688 1162559 1004982
4655 1004982 1250693 1402305 1582622 1508149 1549497 1669156 1579567 1515314 1519349 1678650 1759155
4644 1759155 1845906 1855382 1807612 1590439 1724953 1718748 1785304 1869950 1742119 1498629 1702151
4633 1702151 1582713 1409267 1285406 1442956 1576512 1645018 1624950 1606878 1565007 1666141
4623A666141L7842j15118o2935J45475J37950j61058q4084O3348K57694N234n5708
4612A834781L5503P572k6020j97553Q2439j66714j23864K69139K66879j77726
4602A804436J39169Q8519r6151k0901J68753l43638K9789L2293k11921j57195
4592A433153O8242K32999o8710r541Q5919p3078K8419p5256k09088L6514l3844
4581A415729J68309L37242l5777j59258M6973j00302J38459R6909j76717K8287
4571A759854j08337k32860L17278Q1425N2952q3331j53493J32691J14399O975
4561A887553K07802k08487j18089K5937Q8144M2702j7880J13993p8728J51700
4551B094647j17880J30178J14395q4747q0956R2971j81270M3698J89653k26314
$$ plain form
4623 1666141 1703983 1588865 1525930 1671405 1809355 1648297 1564213 1627561 1885255 1890489 1834781
4612 1834781 1870284 1877856 1851836 1654283 1736722 1570008 1446144 1715283 1982162 1804436
4602 1804436 1943605 2032124 1935973 1915072 2083825 1740187 1769976 1802269 1590348 1433153
4592 1433153 1501395 1734394 1665684 1656143 1742062 1668984 1697403 1622147 1413059 1449573 1415729
4581 1415729 1584038 1921280 1885503 1726245 1773218 1672916 1811375 1908284 1731567 1759854
4571 1759854 1651517 1418657 1735935 1817360 1870312 1786981 1633488 1766179 1880578 1887553
4561 1887553 2095355 1886868 1768779 1794716 1882860 1925562 1907682 2021675 1942947 2094647
4551 2094647 1976767 2106945 2221340 2136593 2055637 2148608 1967338 2011036 2200689 1974375
4541A974375p2975N8030J393J28438N723R3736J96843j15719J02914l9768M7775
4530B380765q5950k4562q5422J43510m0555L75613J40426K1862j22028m8463j99348
4519B455848j91029J37406r1819M2777N8336j67547j2534L2604l0746J46763J55040
4508B535099j7067J1743N7906J54376j96382J3022J32729J61816n1334M8741O0771
4497B911420r6600m4195q1771J46450J37044p0514O1626K0353J84316J37848N5487
4486C361464J47213j91491j15730J00395J26727j63367M9087K48255N1195j01138
4476C512610Q8630m7880M3872Q2068R4755j37753o7073Q3887k47537j82976j30667
4465C091936J2733j68033q3413Q4297K2700j10138j62725J38584K08383l2069
$$ plain form
4541 1974375 1901400 1959430 1960823 2089261 2094984 2188720 2385563 2269844 2372758 2332990 2380765
4530 2380765 2294815 2270253 2184831 2328341 2287786 2663399 2803825 2825687 2703659 2655196 2455848
4519 2455848 2264819 2402225 2310406 2353183 2411519 2243972 2231438 2264042 2233296 2380059 2535099
4508 2535099 2518032 2529775 2587681 2742057 2545675 2558697 2691426 2853242 2801908 2850649 2911420
4497 2911420 2814820 2770625 2688854 2835304 2972348 2901834 2963460 2983813 3168129 3305977 3361464
4486 3361464 3508677 3317186 3201456 3301851 3428578 3265211 3314298 3562553 3613748 3512610
4476 3512610 3601240 3553360 3597232 3679300 3774055 3636302 3569229 3653116 3405579 3222603 3091936
4465 3091936 3104669 2936636 2853223 2937520 2960220 2850082 2687357 2825941 3034324 3002255
4455C002255p6994j6676l7171J2670n8603j38623J7367K10805j73366m4203l1699
4444B665762K54720j21968J81883J73965n4546j8240r8929J60753j72124o4100
4434B907176K99004K326o8044p824O3521J18818j45331m5141l2644j88962L5619
4423B938518N7459J45081n6088L6292j00894Q2686j6750Q099J04622R6967j9263
4412C276729j14189N5719L79204q5919n1703o0355j147M4793m9942J02980Q8664
4401C584834K54080K04683Q3340R0131P1949J23072M0113J30106L11287M01253
4391E294848M25834K38399M80216K10102N36414J82731r261j66915l36706j86687
4381F668975k81512k19397l63602k18559o157j1295Q8701j55362j62439p8709
$$ plain form
4455 3002255 2925261 2908585 2871414 2884084 2825481 2686858 2704225 2915030 2741664 2697461 2665762
4444 2665762 2920482 2798514 2980397 3154362 3099816 3081576 2982647 3143400 2971276 2907176
4434 2907176 3206180 3208506 3140462 3132638 3196159 3314977 3169646 3124505 3091861 2902899 2938518
4423 2938518 2995977 3141058 3084970 3121262 3020368 3103054 3086304 3094403 3199025 3295992 3276729
4412 3276729 3162540 3218259 3597463 3511544 3459841 3399486 3398339 3443132 3393190 3496170 3584834
4401 3584834 3838914 4043597 4126937 4217068 4289017 4412089 4452202 4582308 4893595 5294848
4391 5294848 5720682 5959081 6439297 6649399 7185813 7368544 7359283 7192368 6855662 6668975
4381 6668975 6387463 6168066 5804464 5585905 5579748 5568453 5657154 5501792 5339353 5260644
4371E260644J8711o8129j51958K6194O022L9164j70846L088J89629K67158r3997
4360E325680l13272J7422l4342R4451L7244K6167K1226J00696r096J12718O7213
4349E446107M3988M629L05272N5823P5485j02795N7088K1759J54249P8829r9036
4338F041398j57695j88893J04785J09246J95573K9431k98004n4229O0147K42043
4328F083802J76265m0461m1435J23743K8387K5451n9027P8824L8135k9333K63561
4317F647912J58556K16064n1562Q0026J21498p1479K16919M23378R2145N0190
4307G883647N7587K30133J97932L48225L37717M66827J50116M12494J22647J28416
4297A0335741L5811K85411K06306J37371K80051L16613J29694J35696L22877K23158
$$ plain form
4371 5260644 5279355 5211226 5059268 5085462 5091484 5130648 4959802 4962890 5152519 5419677 5325680
4360 5325680 5012408 5029830 4995488 5089939 5127183 5153350 5174576 5275272 5266176 5378894 5446107
4349 5446107 5490095 5494724 5799996 5855819 5931304 5828509 5885597 5907356 6061605 6140434 6041398
4338 6041398 5883703 5694810 5799595 5908841 6104414 6133845 5835841 5781612 5841759 6083802
4328 6083802 6260067 6219606 6178171 6301914 6330301 6355752 6296725 6375549 6413684 6384351 6647912
4317 6647912 6806468 7022532 6970970 7050996 7172494 7101015 7317934 7741312 7833457 7883647
4307 7883647 7941234 8171367 8369299 8717524 9055241 9522068 9672184 10084678 10207325 10335741
4297 10335741 10371552 10656963 10863269 11000640 11280691 11597304 11726998 11862694 12185571 12408729
4287A2408729N31611K79513M6125K19975K68010M79648M31204J80422N62303L22332
4277A5729872K09765K46780N44171L17042J45162L37767L15324J52306L93253
4268A8391442L40156J6802J38509K55598K07961L92997J26893m1256J82139Q9647
4258B0100888Q0362J71249J93979K56130K7869Q6262L12311K37844n523J9745
4248B1481116J45826J48095q5552K56151K66893Q6306M6726J29411J93596J06058
4238B2774626K47396L48695L23655M28223L34990P7555J94112J30888J96263L51308
4228B5407711J71316J21400L58071Q0657J20982J42576K12613L98663O9240M9554
4218B7132783J80176j4866R737q7072O2878J4747k25150n6586J34073q6736j882
$$ plain form
4287 12408729 12940340 13219853 13265978 13485953 13753963 14233611 14664815 14845237 15407540 15729872
4277 15729872 15939637 16186417 16730588 17047630 17192792 17530559 17845883 17998189 18391442
4268 18391442 18731598 18748400 18886909 19142507 19350468 19743465 19870358 19829102 20011241 20100888
4258 20100888 20181250 20352499 20546478 20802608 20830477 20916739 21229050 21466894 21461371 21481116
4248 21481116 21626942 21775037 21689485 21945636 22212529 22298835 22345561 22474972 22668568 22774626
4238 22774626 23022022 23370717 23694372 24122595 24457585 24535140 24729252 24860140 25056403 25407711
4228 25407711 25579027 25700427 26058498 26139155 26260137 26402713 26615326 27013989 27083229 27132783
4218 27132783 27312959 27298093 27307830 27220758 27283636 27298383 27073233 27016647 27150720 27063984 27062102
4207B7062102k24543l20677k42683k22770m38709p5637k90387m33343k14435m29180
4197B4169738j35648m74404m39925k37268k47456j83424k34699l44816m64386
4188B1407712m5960j48267l75082m96408j50412j93094l38975j47612j42314J7628
4178A9387216j7658l32589J86188K3907l1065J77209L00353L59539L04771P75712
4168B1133583O34774P48098Q91763Q52493Q26845R73623J147194R93982N18201
4159B8720556L61164J98855k41122o2650l23113p9359k45459k57644l18754n50669
4149B7201805l74431l44431j66780m90277q34330p93390n97024r29606q59845
4140B1811691j100415r07640r72431r15364p92685n38842n21379l45182n72474
$$ plain form
4207 27062102 26837559 26516882 26274199 26051429 25612720 25537083 25246696 24813353 24598918 24169738
4197 24169738 24034090 23559686 23119761 22882493 22635037 22451613 22216914 21872098 21407712
4188 21407712 21361752 21213485 20838403 20341995 20191583 19998489 19659514 19511902 19369588 19387216
4178 19387216 19369558 19036969 19223157 19247064 19215999 19393208 19693561 20053100 20357871 21133583
4168 21133583 21768357 22516455 23408218 24260711 25087556 26061179 27208373 28202355 28720556
4159 28720556 29081720 29280575 29039453 28976803 28653690 28574331 28328872 28071228 27752474 27201805
4149 27201805 26827374 26482943 26316163 25825886 24991556 24198166 23601142 22671536 21811691
4140 21811691 20711276 19803636 18831205 17915841 17123156 16584314 16062935 15717753 15145279
4131A5145279n85332m14268k82250k97753k16460o5419j87471l41210k83638p2196
4121A2399282p1747M2119J74852j22839J18116O4088P5333P2659N8218K56141
4111A3066222M41243L09370L47434L95130O50680L53049L82080L04334J42186
4102A6391728K07889K24093Q5343J33960J21619O0324p863r7179K1504q9288L5267
4091A7087397L8930j09415j53365K42227j59837j95187k50756l11754k67340j45778
4081A5775122m79204l95231j06765k3250q6912k34982j44181j28272j02914K14553
4071A4287964j82784o9985k8010J91180n0254j64991J59552L0081M8736N9948
4061A4281437P0963K5625J99959k7638n802K68521J93224L99069N3728m5180J76449
$$ plain form
4131 15145279 14559947 14145679 13863429 13565676 13349216 13283797 13096326 12755116 12471478 12399282
4121 12399282 12327535 12369654 12544506 12421667 12539783 12603871 12679204 12751863 12810081 13066222
4111 13066222 13507465 13816835 14164269 14559399 15210079 15563128 15945208 16249542 16391728
4102 16391728 16599617 16823710 16909053 17043013 17164632 17224956 17217093 17119914 17141418 17052130 17087397
4091 17087397 17126327 17016912 16863547 17105774 16945937 16750750 16499994 16188240 15920900 15775122
4081 15775122 15295918 14900687 14793922 14770672 14683760 14448778 14304597 14176325 14073411 14287964
4071 14287964 14105180 14035195 14007185 14198365 14148111 13983120 14142672 14172753 14221489 14281437
4061 14281437 14352400 14378025 14577984 14550346 14544544 14813065 15006289 15405358 15459086 15413906 15590355
4050A5590355K1793q9806q1681K3232J46138J78669J18012K00079J6047n3271
4040A6069567J65476J59826K14330J18317r4519j5593J78662K5853k6255K41770
4030A7037434K62481M7354j3361k0569m6077J6079P040Q6063J84938L89039K18868
4019A8169289J98493j05176O1147L68752L47408M75564J47749L42435O17228O82304
4009B1305193K98847P71849P13252R69649J046208J333468J192597J207591J612020
4000C0450674J886851J828653J785587J592348J146554J301191Q77795L31268
3992D1200921L15096n1918r6604m7128j43065K63264P9926K03914j78884l79129
3982D1166393p23899n40802r99820j133690j207464j498990j491063j531187j949111
$$ plain form
4050 15590355 15612148 15522342 15440661 15463893 15610031 15788700 15906712 16106791 16122838 16069567
4040 16069567 16235043 16394869 16609199 16727516 16632997 16617404 16796066 16821919 16795664 17037434
4030 17037434 17299915 17347269 17333908 17313339 17267262 17283341 17290381 17376444 17561382 17950421 18169289
4019 18169289 18367782 18262606 18323753 18692505 19039913 19515477 19663226 20005661 20622889 21305193
4009 21305193 21604040 22375889 23089141 24058790 25104998 26438466 27631063 28838654 30450674
4000 30450674 32337525 34166178 35951765 37544113 38690667 39991858 40869653 41200921
3992 41200921 41516017 41464099 41367495 41320367 41177302 41440566 41520492 41724406 41545522 41166393
3982 41166393 40442494 39901692 38901872 37768182 36560718 35061728 33570665 32039478 30090367
3973C0090367j712312j292766j309507j090374q89840q97027j036494r69945p23338
3964B0168764n60186n81776m65023l67935m58443l24028j96877k25014m47457
3955A6542025k53913n8940j38106j65396j75709j882r8215K34368o5517k56352
3945A5562363N0334J12476O4538M4881K66207L589O1306K28498J74403k024J50285
3934A6716856M56380Q4583j06312K25771L00546J38729J47468J60860q9995j2145
3924A8022741j1708J43987J15591J00448r4296L35265K13517J24715J92637Q9183
3914A9232080M49352K08835l3922K89382K53012J79167K50422M32844N25300O67559
3904B2454031N89105M72823O51007N56877P16890P29582P37686R58547R39130
$$ plain form
3973 30090367 28378055 27085289 25775782 24685408 23795568 22898541 21862047 20892102 20168764
3964 20168764 19608578 19026802 18561779 18193844 17735401 17411373 17214496 16989482 16542025
3955 16542025 16288112 16229172 16091066 15925670 15749961 15748079 15649864 15884232 15818715 15562363
3945 15562363 15612697 15725173 15789711 15834592 16100799 16104388 16165694 16394192 16568595 16566571 16716856
3934 16716856 17173236 17257819 17151507 17377278 17677824 17816553 17964021 18124881 18034886 18022741
3924 18022741 18011033 18155020 18270611 18371059 18276763 18612028 18825545 18950260 19142897 19232080
3914 19232080 19681432 19890267 19856345 20145727 20398739 20577906 20828328 21261172 21786472 22454031
3904 22454031 23043136 23515959 24166966 24723843 25440733 26170315 26908001 27866548 28805678
3895B8805678Q21590P46644Q31850J041615Q35171Q35870R69794J062831R08894
3886C6859937O64299Q80520J081786P84529R06403R32918Q22542J044901J265604
3877D5243439J193162J126975J112075J458578J139632J088617J024498R90795
3869E4377771R50054P08790O26700O35755Q33170Q06172J049667R80147O61737
3860F1629963J034366Q11264J109414Q64865Q01625N93900L69101M13142M55426
3851F8083066K41103L99950M52313O67046J046961J267771J065871Q60075Q16960
3842G4901116P94391M14538J96898m56100n88279l66871n88886l65214n53221
3833G3388372l38789n36597o48338n10409p83386q69639q81755j510994j318034
$$ plain form
3895 28805678 29627268 30373912 31205762 32247377 33082548 33918418 34888212 35951043 36859937
3886 36859937 37524236 38404756 39486542 40271071 41177474 42110392 42932934 43977835 45243439
3877 45243439 46436601 47563576 48675651 50134229 51273861 52362478 53386976 54377771
3869 54377771 55327825 56036615 56663315 57299070 58132240 58938412 59988079 60968226 61629963
3860 61629963 62664329 63475593 64585007 65449872 66251497 66845397 67214498 67627640 68083066
3851 68083066 68324169 68724119 69176432 69843478 70890439 72158210 73224081 74084156 74901116
3842 74901116 75695507 76110045 76306943 75850843 75262564 74895693 74306807 73941593 73388372
3833 73388372 73049583 72512986 71864648 71354239 70570853 69701214 68819459 67308465 65990431
3824F5990431j577612j425702j734184j806568j684767k020601j989881j402372
3816E2348744j340684j292390j248680j294320j288474r60629q88723j153818
3808D2881026q63631p01674o75269q39347o39468n13664o07203n56411o51215
3799C6833144n19416n12783m65462m69613o57127p03142m94051o98117o26675
3790C1686758m44685n59273p84669o87657q15401q13147o11620p48768n71790
3781B5649748n46103n30052p55209q60385n03221n50019n74860n74292p53559
3772B0002048n95096l51012k22431l64942o19295l89855m03470j69478k73709
3763A6612760m25786k07829l65943j86803j96261l55650k01984k89141k96577
$$ plain form
3824 65990431 64412819 62987117 61252933 59446365 57761598 55740997 53751116 52348744
3816 52348744 51008060 49715670 48466990 47172670 45884196 44923567 44034844 42881026
3808 42881026 42017395 41315721 40640452 39801105 39161637 38647973 38040770 37484359 36833144
3799 36833144 36313728 35800945 35335483 34865870 34208743 33505601 33011550 32313433 31686758
3790 31686758 31242073 30682800 29898131 29210474 28395073 27581926 26970306 26221538 25649748
3781 25649748 25103645 24573593 23818384 22957999 22454778 21904759 21329899 20755607 20002048
3772 20002048 19406952 19055940 18833509 18468567 17849272 17459417 17055947 16886469 16612760
3763 16612760 16186974 15979145 15613202 15426399 15230138 14874488 14672504 14383363 14086786
3754A4086786j93619k45605j25702l88319k90879J42418l4572k52610k97008l35123
3744A2065767j79889k19081k95465k89081j58321j03631r420r1774j35660j38056
3734A0445389r6765N5440q4276j90878k52627j3599k58947n7635r1842l35544
3724I118716j26243j65926r2918p8351j33641j65570m3592j19362l9169m3766
3714H110178q2044q1595j03528k86622n9605R68n4492k85123K1991o4416O528
3703G122240j55071j28482k12720L721K6530l7235N8852m5830N523j09613k38826
3692F289089j24108J03141O5189j05637j46945j97287p3394J90933k51744M7733
3682E796970k433j43350k6410j58303K8945p6325o0255k308j76368j87147M9968
$$ plain form
3754 14086786 13893167 13647562 13521860 13133541 12842662 12985080 12950508 12697898 12400890 12065767
3744 12065767 11885878 11666797 11371332 11082251 10923930 10820299 10810879 10719105 10583445 10445389
3734 10445389 10348624 10404064 10319788 10128910 9876283 9862684 9603737 9546102 9454260 9118716
3724 9118716 8992473 8826547 8733629 8655278 8521637 8356067 8312475 8193113 8153944 8110178
3714 8110178 8028134 7946539 7843011 7556389 7496784 7497752 7443260 7158137 7180128 7115712 7122240
3703 7122240 6967169 6838687 6625967 6629688 6656218 6618983 6677835 6632005 6637528 6527915 6289089
3692 6289089 6164981 6268122 6333311 6227674 6080729 5883442 5810048 6000981 5749237 5796970
3682 5796970 5794537 5651187 5624777 5466474 5495419 5419094 5358839 5356531 5180163 4993016 5042984
3671E042984O2731k8259j29171j04076Q1888o7092m93K9915M0899J35360q480
3660E056206r8009m100j37699P2331p0582m4883J07186l627O277J81768N9256
3649E124124j29116k84005j3370J49802k06450n992J93341m5327p9410J12891
3639D816488q0722j86380q3963L6928K72031l9861J45322k13913r0174K68507
3629D844263m5083n9407j05554J52281k0849Q455J46097J68519J91225k43396
3619E036551J6138j08978Q278N8616R4939O8144P3574K6530k78157J21772l6843
3608E080564j41972K13835M8710L6076J33881N3076l4029J03841n351J51335K7799
3597E667765k08513M2321K6077J02412N1338L3249Q23P1189O8481J09105j1266
$$ plain form
3671 5042984 5105715 5077456 4948285 4844209 4926097 4859005 4858512 4888427 4929326 5064686 5056206
3660 5056206 4958197 4954097 4816398 4888729 4818147 4773264 4880450 4876823 4883100 5064868 5124124
3649 5124124 4995008 4711003 4697633 4847435 4640985 4634993 4828334 4783007 4703597 4816488
3639 4816488 4735766 4549386 4465423 4502351 4774382 4734521 4879843 4665930 4575756 4844263
3629 4844263 4799180 4739773 4634219 4786500 4765651 4774106 4920203 5088722 5279947 5036551
3619 5036551 5052689 4943711 4951989 5010605 5105544 5173688 5247262 5273792 4995635 5117407 5080564
3608 5080564 4938592 5152427 5201137 5237213 5371094 5424170 5390141 5493982 5488631 5639966 5667765
3597 5667765 5459252 5501573 5527650 5630062 5681400 5714649 5715472 5786661 5855142 5964247 5952981
3586E952981j06927J59267J27126j14057q3173k8069K09962J8763k2682J4769
3576F127960J88300J24211J02387L26874k4873J24741L3388N1457J11746O9401
3566G235592l1463J14977n8312L8609O6924n0537J09797O0546K59531l9534n711
3555G700419R1057R5422n1636K04431j00258R5778P1164J8778p5345J03545Q496
3544H161851J97637K66158K23039l5758P05L563L01512K90652j75506K36571M8049
3533I518473j03286K5505K70929M9924P7915k58144k0770L49907R3316k3869o5155
3522I914745J09099j45216K66355K1824k535L08357j7652K71828J68877J33244
3512A1028926L08439J86768J53639M12385J96582J24593L71271L22176J05083
$$ plain form
3586 5952981 5846054 6005321 6132447 6018390 5935217 5907148 6117110 6135873 6113191 6127960
3576 6127960 6316260 6440471 6542858 6869732 6844859 6969600 7002988 7054445 7166191 7235592
3566 7235592 7204129 7319106 7260794 7299403 7366327 7315790 7425587 7486133 7745664 7706130 7700419
3555 7700419 7791476 7886898 7835262 8039693 7939435 8035213 8106377 8125155 8049810 8153355 8161851
3544 8161851 8359488 8625646 8848685 8812927 8813632 8817195 9118707 9409359 9233853 9470424 9518473
3533 9518473 9415187 9440692 9711621 9761545 9839460 9581316 9560546 9910453 10003769 9979900 9914745
3522 9914745 10023844 9878628 10144983 10166807 10164272 10472629 10454977 10726805 10895682 11028926
3512 11028926 11337365 11524133 11677772 12090157 12286739 12411332 12782603 13104779 13209862
3503A3209862N12170O36457L24061N17469N16482M74084M61349M98940M74594
3494A7625468N48114M60731P45202N52677M81834P32145Q31257J021008R96162
3485B3994598J012490Q96471R60005J005255R75776P36912O28671N54420O09331
3476C1373929K06761M180m06562k80394m92978n66357o21769n34761m45558m82661
3466B7753830k71416l27780j88563O4661J21062L43594N80123O62474O95889N27299
3456B9961173K53973k24582p60013r12632j094708j152074j328463j308991j114588
3447B2319095p56692o69980n43915m79680m42429n07020j30531J68958L04170
3438A9261976Q0490L6867L18928L25427O53580R18236P62025Q82643J537185J764579
$$ plain form
3503 13209862 13722032 14358489 14682550 15200019 15716501 16190585 16651934 17150874 17625468
3494 17625468 18173582 18634313 19379515 19932192 20414026 21146171 21977428 22998436 23994598
3485 23994598 25007088 25903559 26863564 27868819 28844595 29581507 30210178 30764598 31373929
3476 31373929 31580690 31584870 31178308 30897914 30404936 29838579 29216810 28682049 28236491 27753830
3466 27753830 27482414 27154634 26966071 27030732 27151794 27495388 28075511 28737985 29433874 29961173
3456 29961173 30215146 29990564 29230551 28317919 27223211 26071137 24742674 23433683 22319095
3447 22319095 21562403 20892423 20348508 19868828 19426399 18919379 18788848 18957806 19261976
3438 19261976 19342466 19379333 19698261 20023688 20677268 21595504 22357529 23240172 24777357 26541936
3428B6541936J975359K061432J991049J919118J376777L20809q31661j857311
3420C3497508j922888k376868k102251j889138j785052j441748j166349r68381
3412A9844833q89565p62247j050547p53087m43295k97798l70597p8234j9698o41569
3402A4538196J88798L52261L3938K11683N76243O30630O70553Q02374O55158O95340
3392A9355174P01066J63612n39687o82167j079559r76397r16787j038336r75133
3383A4011786o93882n98519o20668o07012o12618l81072n65730l07098q2022l23095
3373I220070k66248j10533k77060l21396l29714M781l82091k12360k4746j27415
3363G173288J18522J67288J32443K16871J14567n215j08634l94118k08312n4873
$$ plain form
3428 26541936 28517295 30578727 32569776 34488894 35865671 36186480 35354819 33497508
3420 33497508 31574620 29197752 27095501 25206363 23421311 21979563 20813214 19844833
3412 19844833 18955268 18193021 17142474 16389387 15946092 15648294 15277697 15199463 15179765 14538196
3402 14538196 14726994 15079255 15113193 15324876 15901119 16531749 17202302 18004676 18659834 19355174
3392 19355174 20056240 20219852 19680165 18997998 17918439 16942042 16025255 14986919 14011786
3383 14011786 13317904 12719385 12098717 11491705 10879087 10498015 9932285 9625187 9543165 9220070
3373 9220070 8953822 8843289 8566229 8244833 7915119 7919900 7537809 7325449 7300703 7173288
3363 7173288 7291810 7459098 7591541 7808412 7922979 7917764 7809130 7415012 7206700 7151827
3353G151827j51882l76237k19212k86314K2486P3177j16343j45389j25859Q243
3343E834497k18508p8832O2409J20572k9592j01701J03975P4772q9467p5214J19620
3332E722531J14144K210J92663J6171p2063r408k61219k57696j53386l39303k00945
3321D753699j06127R2341O6308j28216k81825p3396J03349q5088j9803k59347
3311D061895J9587o4774r8103L4408J17570J18336o4649j10267k10554j02389
3301C701060m2716j8768j52259m7201m5365K21261Q4353l35072M8311J65185p3505
3290C505284k33624J39094n399k09373J61979K40091j55002p7509n7527p4988
3280C233026q523m1227Q83N5256j52753r657p1827J56745J34235j23144N18O9728
$$ plain form
3353 7151827 6999945 6623708 6404496 6118182 6140668 6213845 6097502 5952113 5826254 5834497
3343 5834497 5615989 5537157 5599566 5720138 5690546 5588845 5692820 5767592 5678125 5602911 5722531
3332 5722531 5836675 5838885 6031548 6047719 5975656 5966248 5705029 5447333 5293947 4954644 4753699
3321 4753699 4647572 4739913 4806221 4678005 4396180 4322784 4426133 4341045 4321242 4061895
3311 4061895 4081482 4016708 3918605 3953013 4070583 4188919 4124270 4014003 3803449 3701060
3301 3701060 3658344 3639576 3487317 3440116 3394751 3616012 3700365 3365293 3413604 3578789 3505284
3290 3505284 3271660 3410754 3405355 3195982 3357961 3598052 3443050 3365541 3308014 3233026
3280 3233026 3224503 3183276 3184159 3239415 3086662 3077005 3005178 3161923 3296158 3173014 3173532 3243260
3268C243260j12378k85896K2377J73536n3367l9880j6335J3887K43333P7531o2374
3257C203694m9554j6600q729n1199m9619J9277J6947l8626Q6626O9953Q8010J8521
3245C288701Q524J15539J87990j64149l2540K54055M8990J87495L1328n7556P866
3234C876243K94274K6644N3115L992K82237K77624P0954R7356O5990L20038J91442
3223E559909J53266K75698L11873J61328K31827J1309o4575l6069N9295J33380
3213F797241J43287J95053o3811J54117K76368L02293K38682Q328q0328q3821
3203G887409n4739j56404n4556j77822r5228J31067R5415J25626K50515K6468
3193G977751J73361L54640J85696K19664K33544N25388M03586J86900J80691o7974
$$ plain form
3268 3243260 3130882 2844986 2867363 3040899 2987532 2947652 2931317 2945204 3188537 3266068 3203694
3257 3203694 3154140 3137540 3128811 3077612 3027993 3047270 3064217 3025591 3112217 3182170 3270180 3288701
3245 3288701 3297225 3412764 3600754 3436605 3404065 3658120 3707110 3894605 3925933 3868377 3876243
3234 3876243 4170517 4197161 4250276 4254268 4536505 4814129 4885083 4982439 5048429 5368467 5559909
3223 5559909 5713175 5988873 6300746 6462074 6693901 6705210 6640635 6604566 6663861 6797241
3213 6797241 6940528 7135581 7071770 7225887 7502255 7804548 8043230 8051558 7971230 7887409
3203 7887409 7832670 7676266 7621710 7443888 7348660 7479727 7575142 7700768 7951283 7977751
3193 7977751 8151112 8505752 8691448 8911112 9144656 9670044 10073630 10260530 10441221 10373247
3183A0373247j26719R5696m3907Q3292j54724J57651J23134J58956K98500L1609
3173A0996735J41518l4725j62893o2263l09290J6003j35291l74938l9423j02342
3163I933091n3358O558m5466j8704L45029K83166m7254k8344K48870m3985L9862
3152A0619465J36734J31914J393J25566P0962L7902K28735L47466o4088L48108
3142A1984157J45291L36433J18372L0365K12771l1150k57073k47699k40445j89577
3132A1861445j37113j30815l00768l61412R2194k68158o7468j09832K80245J83646
3122A1041964o8216m5298j13791R1517K778R5094j28284n3295o7657k13531L44387
3111A0885668J15325k67604j23751J67069m7595j20301l11626l88202l21610n9645
$$ plain form
3183 10373247 10246528 10342224 10298317 10381609 10226885 10384536 10507670 10666626 10965126 10996735
3173 10996735 11138253 11103528 10940635 10878372 10569082 10585085 10449794 10074856 10035433 9933091
3163 9933091 9879733 9886291 9840825 9822121 10167150 10450316 10403062 10374718 10623588 10579603 10619465
3152 10619465 10756199 10888113 10889506 11015072 11086034 11123936 11352671 11700137 11636049 11984157
3142 11984157 12129448 12465881 12584253 12614618 12827389 12796239 12539166 12291467 12051022 11861445
3132 11861445 11724332 11593517 11292749 10931337 11023531 10755373 10687905 10578073 10858318 11041964
3122 11041964 10973748 10928450 10814659 10906176 10908954 11004048 10875764 10822469 10754812 10541281 10885668
3111 10885668 11000993 10733389 10609638 10776707 10729112 10608811 10297185 9908983 9587373 9527728
3101I527728l14953r6815N6458j38831m98545j37857M0567j38271k87543j09408
3091G902530j58389k86644n1162j2195k72924n0045P3124k28905k70675j63655
3081F481060n3780k17983l52707p9675p8933j75784N632l24790j20446j87092
3071D895502J6161j22767k77087j14041j74595l9471k9155n2172k85553n396p1667
3060C739759j72178J00979K0132K0782m3041l61326k84600J07941N7132P9181
3050C264761J5457k75036j80142n6097J32709L8260r2015k2266n8148j38757q6451
3039B542275j32232q3170N5835J77624j9894j57613p0560j78028J31580K4392
3029B290209j7490j8505k1599k22140m1620J33174J83635n5234o8835n1813k96715
$$ plain form
3101 9527728 9212775 9115960 9172418 9033587 8535042 8397185 8437752 8299481 8011938 7902530
3091 7902530 7744141 7457497 7406335 7394140 7121216 7071171 7144295 6915390 6644715 6481060
3081 6481060 6427280 6209297 5856590 5776915 5697982 5522198 5527830 5203040 5082594 4895502
3071 4895502 4911663 4788896 4511809 4397768 4223173 4183702 4154547 4102375 3816822 3811426 3739759
3060 3739759 3567581 3668560 3688692 3709474 3666433 3305107 3020507 3128448 3185580 3264761
3050 3264761 3280218 3005182 2825040 2768943 2901652 2939912 2847897 2825631 2767483 2628726 2542275
3039 2542275 2410043 2326873 2382708 2560332 2540438 2382825 2312265 2134237 2265817 2290209
3029 2290209 2272719 2254214 2232615 2010475 1968855 2102029 2285664 2230430 2161595 2109782 1813067
3018A813067j91140r476q7501R0425j00745m4022k9207L5406J0549K24480N7308
3007A769144j50450j83925o3487r019j22998l7452J06353N5602Q8468K0762k41649
2996A231349j12642q8556R1234Q0108j36008O3003J02131p7758k2098M9276k7399
2985A152640q5213j69294N9719M3874j19935j99332J16197P1197M9528J61843
2975A081224m4466l7216k2716K45580j91389l7141j91949J03193K01547j94264
2965I12403K1588L6423r9407j90271M3645q6428Q7649J8003n0880K37827q9193
2954H41359N6696j2477o3907O0544n1253j2549J10849r2245R8109J12427j62724
2943H84829J81072J5494j29580p6811q1291n8349k39879Q5720J74270O4789r1637
$$ plain form
3018 1813067 1621927 1612451 1524950 1615375 1514630 1470608 1441401 1476807 1487356 1711836 1769144
3007 1769144 1618694 1434769 1371282 1362263 1239265 1201813 1308166 1363768 1452236 1472998 1231349
2996 1231349 1118707 1030151 1121385 1201493 1065485 1128488 1230619 1152861 1130763 1180039 1152640
2985 1152640 1067427 898133 957852 1001726 881791 682459 798656 869853 919381 1081224
2975 1081224 1036758 999542 976826 1222406 1031017 993876 801927 905120 1106667 912403
2965 912403 933991 970414 871007 680736 724381 637953 725602 743605 692725 930552 841359
2954 841359 898055 885578 821671 882215 830962 818413 929262 837017 935126 1047553 884829
2943 884829 1065901 1081395 951815 875004 793713 735364 495485 581205 755475 820264 728627
2932G28627j37767n2733J74750l12386j84616l0287K29227N9331k4129J55498
2922F05515j34970N8506Q445j34458k2398J22020l8523k7899m1268p936N7239
2911D44273k0621P6947o0928J37999Q5469r5319q4430j41052k9160n5449P8060
2900C35789J53100n2671j90531m7697k8227R607J83552K0063j21219J00966N3417
2889D16149J54177R5602N3893m9446k7541P2457N6526J30450J52949j29338k74429
2878F51449k19705L7238J85075J0467p226l6715j69107P4881m4853r3778K14015
2867F01741j30554q274o8380K6748J30321P3063n7174l85503N2555K28519J065
2856D64127j72521l6683m5878R3367R3338p8032K04476q6269r8k02720r6749J58056
$$ plain form
2932 728627 590860 538127 712877 400491 215875 185588 414815 474146 450017 605515
2922 605515 470545 529051 537496 403038 380640 502660 464137 436238 394970 387034 444273
2911 444273 423652 500599 439671 577670 663139 567820 483390 342338 313178 257729 335789
2900 335789 488889 436218 245687 197990 169763 179370 362922 382985 261766 362732 416149
2889 416149 570326 665928 719821 670375 642834 715291 771817 902267 1055216 925878 651449
2878 651449 431744 468982 654057 664524 657298 620583 451476 526357 481504 387726 601741
2867 601741 471187 462913 394533 421281 551602 624665 567491 181988 234543 463062 464127
2856 464127 291606 254923 209045 302412 395750 317718 522194 435925 435827 233107 136358 294414
2844B94414j31550j24585l4097K48916J81285j28361j06108q557N8502m0702k31551
2833b2394O9095L5741J44786l3105k4012J87128J89314j25222j41783k4110M9013
2822C04451j79052K3887K7942K48326R6698p1382k32130l180k2398l506J88124
2811C77780j92466j601r3956Q7614j6217J94226o7734j29016M4597M1273N584
2800B50084j8760j84208J35058J12138p3500j7624k4448Q3202J14440j85281P0980
2789B62081k6643l9325n0875J20091j21335r9567L8975L1147J07467j76151K3146
2778F9011p6375q4608J27452p3365R7260L9083j55695l6725l0678J90031o2357
2767C034J55220k9233P2279j90333R4886o1866Q7316m3601j99585P7837n0262
$$ plain form
2844 294414 162864 38279 4182 253098 434383 306022 199914 191357 249859 209157 -22394
2833 -22394 46701 82442 227228 194123 170111 357239 546553 421331 279548 255438 304451
2822 304451 125399 149286 177228 425554 522252 450870 218740 215560 193162 189656 377780
2811 377780 185314 183713 89757 177371 161154 355380 287646 158630 203227 244500 250084
2800 250084 231324 47116 182174 294312 220812 203188 178740 261942 376382 191101 262081
2789 262081 235438 196113 145238 265329 143994 44427 83402 114549 222016 45865 69011
2778 69011 -7364 -91972 35480 -37885 59375 98458 -57237 -93962 -124640 65391 3034
2767 3034 158254 129021 201300 10967 105853 43987 131303 87702 -111883 -34046 -84308
2756h4308P726K13326Q5754n2130o3312O385R9307j10859q5921k28175J40494
2745g1713o3089N2444J42904j01112r3211K1739K8011P4899j04410J30054M1566
2734E8082l2882J47993j29307m0962j92702Q7646J30329R4374k8786K6411m4017
2723G6179j69991j33054J6535M88476k10722k06604J38888p7303m2533J66957
2713D6828j32043m3994Q1035M2517J67098j45389j07979K6799l8762M7965K40959
2702A85034j66957J7885n1792j3763J06690o9054k1995K45662j81024k86152o1676
2691b97142L55382K36773k45853O2805N2308o8426N8360r3851J24054n879j98231
2680a9700j6363N5179j74109j37616L25333L8451j92246L9415J16182j5106Q9261
$$ plain form
2756 -84308 -76582 136744 222498 170368 107056 113441 212748 101889 15968 -212207 -71713
2745 -71713 -134802 -82358 60546 -40566 -133777 -112038 -84027 -9128 -113538 16516 58082
2734 58082 25200 173193 43886 2924 -189778 -102132 28197 122571 93785 120196 76179
2723 76179 -93812 -226866 -210331 278145 67423 -139181 -293 -77596 -120129 46828
2713 46828 -85215 -129209 -48174 -5657 161441 16052 -91927 -65128 -103890 -55925 185034
2702 185034 18077 35962 -15830 -29593 77097 8043 -13952 231710 50686 -235466 -297142
2691 -297142 58240 295013 49160 111965 164273 95847 154207 60356 184410 178531 -19700
2680 -19700 -36063 19116 -154993 -292609 32724 71175 -121071 -81656 34526 19420 108681
2669A08681j36348r3076q3383J82785J44304J37439j99557j87591K69076j12034
2659C0296j8959Q020j16931O1017O6298J93428q4438j9358l9491J11144r3028
2648I7998l228K05739j32297k76334k9484k930R2669L9806K6528K1460J68596
2637B08523j39973o655P8457j83894k762K8719M8510J68812O5674k21931k01994
2626a58514J23019J06469J9440N8468K8570m3374q042Q3141k5884n4365j61482
2615c2554o5107R219Q5996J74140j7548P7962J1445n9630k0590l3292k6951j60406
2603e7316J39291J65561o9681j47379l5851J37681J85189K3778N5273j00041j00939
2592A95566k01727K14799j46474j14330J16232J07852K9128J6342j77463j73420
$$ plain form
2669 108681 -27667 -120743 -204126 -21341 122963 260402 60845 -126746 142330 30296
2659 30296 11337 19357 -97574 -36557 29741 223169 138731 119373 79882 191026 97998
2648 97998 94770 300509 168212 -108122 -137606 -140536 -47867 -8061 18467 39927 208523
2637 208523 68550 61895 140352 -43542 -46304 -17585 30925 199737 265411 43480 -158514
2626 -158514 -35495 70974 90414 148882 177452 134078 126036 209177 183293 128928 -32554
2615 -32554 -97661 -88442 -2446 171694 154146 232108 243553 183923 163333 130041 103090 -57316
2603 -57316 81975 247536 177855 30476 -5375 132306 317495 341273 396546 296505 195566
2592 195566 -6161 208638 62164 -52166 64066 171918 201046 217388 39925 -133495
2582a33495L0155Q1314L8801J8836r3229m9600K92534q55p5411m2511l7753j10274
2570h1488J54275q8527k2683Q0960J5450J27036R968j33345j9445J43940J27772
2559C13913j30424R9073l2775j68404q9568p3088N5407k52511R0151Q4479N6253
2548d7494R2577J14718k464p8760O5677m9077R7146l5598o1921l2201j64206J52902
2536E1299N3506j36810r3073O5720K20246j63636J29999R051k45203N70j83005
$$ plain form
2582 -133495 -103340 -22026 16775 35611 -57618 -107218 185316 184461 109050 66539 28786 -81488
2570 -81488 72787 -15740 -38423 42537 57987 185023 194991 61646 42201 186141 313913
2559 313913 183489 282562 249787 81383 -8185 -81273 -25866 -278377 -188226 -103747 -47494
2548 -47494 45083 159801 157337 78577 144254 95177 192323 156725 94804 62603 -101603 51299
2536 51299 104805 -32005 -125078 -59358 160888 -2748 127251 136302 -108901 -108331 -291336
$$ [...]
##END NTUPLES=NMR SPECTRUM
##END=
