##TITLE=1H_TF-2390-4
 200.13MHz, CDCl3,
 8 sc
 
 11.9.2025
##JCAMPDX= 6.0         $$ Bruker NMR JCAMP-DX V2.0
##DATA TYPE= NMR SPECTRUM
##DATA CLASS= NTUPLES
##ORIGIN= UXNMR, Bruker Analytische Messtechnik GmbH
##OWNER= pz
$$ XWIN-NMR		Version 3.5
$$ Thu Sep 11 14:00:03 2025 Russian Standard Time (UT+4h)  she@DPX200
##.OBSERVE FREQUENCY= 200.1313
##.OBSERVE NUCLEUS= ^1H
##.ACQUISITION MODE= SIMULTANEOUS
##.ACQUISITION SCHEME= undefined
##.AVERAGES= 8
##.DIGITISER RES= 18
##SPECTROMETER/DATA SYSTEM= spect
##.PULSE SEQUENCE= zg30
##.SOLVENT NAME= CDCl3
##.SHIFT REFERENCE= (INTERNAL, CDCl3, 0, 15.5287)
##AUDIT TRAIL= $$ (NUMBER, WHEN, WHO, WHERE, WHAT)
$$ ##TITLE= Audit trail, XWIN-NMR		Version 3.5
$$ ##JCAMPDX= 5.01
$$ ##ORIGIN= Bruker BioSpin GmbH
$$ ##OWNER= she
$$ F:/spectra/data/she/nmr/H-C/1/pdata/1/auditp.txt
$$ ##AUDIT TRAIL=  $$ (NUMBER, WHEN, WHO, WHERE, WHAT)
(   1,<2025-09-11 13:58:16.96 +0400>,<she>,<DPX200>,
      <created by zg, POWCHK disabled, PULCHK disabled
       configuration hash MD5:
       00 E9 B6 7A A2 85 ED C7 34 08 36 98 17 FE 4E 26
       data hash MD5: 16K
       A5 60 3D 27 58 44 97 65 FC E3 D2 62 FE 47 DF E5>)
(   2,<2025-09-11 13:58:19.54 +0400>,<she>,<DPX200>,
      <Start of raw data processing
       efp BC_mod = 2 LB = 0.25 FT_mod = 6 PKNL = 1 PHC0 = -1556.226 PHC1 = 6.19228 SI = 16K 
       data hash MD5: 16K
       99 37 85 AA 5C 07 4B E0 78 B0 67 0F 5E 4C AF 55>)
(   3,<2025-09-11 13:58:36.21 +0400>,<she>,<DPX200>,
      <pk PHC0 = -0.1454449 PHC1 = 0 
       data hash MD5: 16K
       18 41 77 48 F2 73 E6 03 75 25 55 61 A9 56 24 6A>)
(   4,<2025-09-11 13:58:40.03 +0400>,<she>,<DPX200>,
      <abs ABSG = 5 
       data hash MD5: 16K
       D7 F9 E7 AE 39 D9 D2 EB 08 D6 62 77 30 CF C8 B6>)
(   5,<2025-09-11 13:59:02.32 +0400>,<she>,<DPX200>,
      <pk PHC0 = -0.2195125 PHC1 = 0 
       data hash MD5: 16K
       1E 2E 67 11 81 AE B3 78 81 06 8E 79 BC 69 66 C0>)
(   6,<2025-09-11 13:59:06.40 +0400>,<she>,<DPX200>,
      <abs ABSG = 5 
       data hash MD5: 16K
       4C CC 62 61 C0 38 8C 68 44 CB 54 AD 52 8B D8 09>)
$$ ##END=
$$ 
$$ hash MD5
$$ 66 19 85 9D E2 40 2B B7 44 31 38 5E 2B 82 ED EA
##$RELAX= 
##$RELAX= 
##$RELAX= 
##$RELAX= 
##$RELAX= 
##$RELAX= 
$$ Bruker specific parameters
$$ --------------------------
##$DU= <F:/spectra>
##$EXPNO= 1
##$NAME= <H-C>
##$PROCNO= 1
##$TYPE= <nmr>
##$USER= <she>
##$AMP= (0..31)
100 100 100 100 100 100 100 100 100 100 100 100 100 100 100 100 100 100 
100 100 100 100 100 100 100 100 100 100 100 100 100 100 
##$AQSEQ= 0
##$AQ_mod= 1
##$AUNM= <au_zg>
##$AUTOPOS= <>
##$BF1= 200.13
##$BF2= 200.13
##$BF3= 200.13
##$BF4= 200.13
##$BF5= 200.13
##$BF6= 200.13
##$BF7= 200.13
##$BF8= 200.13
##$BYTORDA= 1
##$CFDGTYP= 0
##$CFRGTYP= 5
##$CHEMSTR= <none>
##$CNST= (0..31)
1 1 145 1 1 1 1 1 1 1 1 1 1 1 1 1 1 1 1 1 1 1 1 1 1 1 1 1 1 1 1 1 
##$CPDPRG= <>
##$CPDPRG1= <>
##$CPDPRG2= <>
##$CPDPRG3= <>
##$CPDPRG4= <mlev>
##$CPDPRG5= <mlev>
##$CPDPRG6= <mlev>
##$CPDPRG7= <mlev>
##$CPDPRG8= <mlev>
$$ [...]
##$SUBNAM3= <"">
##$SUBNAM4= <"">
##$SUBNAM5= <"">
##$SUBNAM6= <"">
##$SUBNAM7= <"">
##$SUBNAM8= <"">
##$SUBNAM9= <"">
##$SW= 18.0517328524113
##$SWIBOX= (0..15)
0 0 2 0 0 0 0 0 0 0 0 0 0 0 0 0 
##$SW_h= 3612.71676300578
##$TD= 16384
##$TD0= 1
##$TE= 0
##$TE2= 300
##$TE3= 300
##$TEG= 300
##$TL= (0..7)
0 120 120 120 120 120 120 120 
##$TP= (0..7)
150 150 150 150 150 150 150 150 
##$TP07= 0
##$TPNAME0= <>
##$TPNAME1= <>
##$TPNAME2= <>
##$TPNAME3= <>
##$TPNAME4= <>
##$TPNAME5= <>
##$TPNAME6= <>
##$TPNAME7= <>
##$TPOAL= (0..7)
0.5 0.5 0.5 0.5 0.5 0.5 0.5 0.5 
##$TPOFFS= (0..7)
0 0 0 0 0 0 0 0 
##$TUNHIN= 0
##$TUNHOUT= 0
##$TUNXOUT= 0
##$USERA1= <user>
##$USERA2= <user>
##$USERA3= <user>
##$USERA4= <user>
##$USERA5= <user>
##$V9= 5
##$VALIST= <valist>
##$VCLIST= <CCCCCCCCCCCCCCC>
##$VD= 0
##$VDLIST= <DDDDDDDDDDDDDDD>
##$VPLIST= <PPPPPPPPPPPPPPP>
##$VTLIST= <TTTTTTTTTTTTTTT>
##$WBST= 1024
##$WBSW= 4
##$XGAIN= (0..3)
0 0 0 0 
##$XL= 0
##$YL= 0
##$YMAX_a= 637697
##$YMIN_a= -1030831
##$ZGOPTNS= <>
##$ZL1= 120
##$ZL2= 120
##$ZL3= 120
##$ZL4= 120
##$ABSF1= 15.49127
##$ABSF2= -2.560579
##$ABSG= 5
##$ABSL= 3
##$ALPHA= 0
##$AQORDER= 0
##$ASSFAC= 0
##$ASSFACI= 0
##$ASSFACX= 0
##$ASSWID= 0
##$AUNMP= <proc_1d>
##$AZFE= 0.1
##$AZFW= 0.1
##$BCFW= 0
##$BC_mod= 2
##$BYTORDP= 0
##$COROFFS= 0
##$CY= -3
##$DATMOD= 1
##$DC= 0
##$DFILT= <>
##$DTYPP= 0
##$F1P= 0
##$F2P= 0
##$FCOR= 1
##$FTSIZE= 16384
##$FT_mod= 6
##$GAMMA= 0
##$GB= 0
##$INTBC= 1
##$INTSCL= 3.241238e-09
##$ISEN= 128
##$LB= 0.25
##$LEV0= 0
##$LPBIN= 0
##$MAXI= 10000
##$MC2= 0
##$MEAN= 0
##$ME_mod= 0
##$MI= 1.114404
##$NCOEF= 0
##$NC_proc= -6
##$NLEV= 6
##$NOISF1= 3.799351
##$NOISF2= 2.8
##$NSP= 0
##$NTH_PI= 0
##$NZP= 0
##$OFFSET= 15.52873
##$PC= 1
##$PHC0= -1556.59
##$PHC1= 6.19228
##$PH_mod= 1
##$PKNL= yes
##$PPARMOD= 0
##$PSCAL= 0
##$PSIGN= 0
##$REVERSE= no
##$SF= 200.129998592886
##$SI= 16384
##$SIGF1= 3
##$SIGF2= 2
##$SINO= 0.751879
##$SIOLD= 32768
##$SREGLST= <19F.Aceton>
##$SSB= 0
##$STSI= 16384
##$STSR= 0
##$SW_p= 3612.71676300578
##$SYMM= 0
##$S_DEV= 0
##$TDeff= 16384
##$TDoff= 0
##$TI= <>
##$TILT= no
##$TM1= 0
##$TM2= 0
##$TOPLEV= 0
##$USERP1= <user>
##$USERP2= <user>
##$USERP3= <user>
##$USERP4= <user>
##$USERP5= <user>
##$WDW= 1
##$XDIM= 16384
##$YMAX_p= 270585553
##$YMIN_p= -441348
$$ End of Bruker specific parameters
$$ ---------------------------------
##NTUPLES= NMR SPECTRUM
##VAR_NAME=  FREQUENCY,     SPECTRUM/REAL,   SPECTRUM/IMAG
##SYMBOL=    X,             R,               I
##VAR_TYPE=  INDEPENDENT,   DEPENDENT,       DEPENDENT
##VAR_FORM=  AFFN,          ASDF,            ASDF
##VAR_DIM=   16384,         16384,           16384
##UNITS=     HZ,            ARBITRARY UNITS, ARBITRARY UNITS
##FACTOR=    0.220516191357247, 1,           1
##FIRST=     3107.76479159154, 0,            0
##LAST=      -504.951971414244, 0,           0
##MIN=       -504.951971414244, -441348,     0
##MAX=       3107.76479159154, 270585553,    0
$$ Real data points
##PAGE= N=1
##DATA TABLE= (X++(R..R)), XYDATA
$$ [...]
8786 14227215 13732489 13211238 12904443 12557998 12166582 11873160 11614892 11371203 10980959
8777 10980959 10726099 10645408 10390748 10392394 10241657 10052707 9799684 9708863 9617807 9673992
8767 9673992 9500767 9557729 9562140 9510720 9472028 9291471 9228873 9257693 9135623 9046932 9083606
8756 9083606 8998669 8893310 8787934 8639194 8625360 8755245 8869793 8971439 9216883 9329806
8746 9329806 9451091 9560425 9802693 10039858 9874879 9543479 9436158 9288903 8842694 8525944
8736 8525944 8342113 8093320 7829733 7496179 7152735 6959582 6580204 6316610 6007616 5876240
8726 5876240 5646327 5462562 5325935 5095159 4873855 4780992 4608271 4674948 4593435 4408812
8716 4408812 4295730 4088476 4010005 3958531 3989961 3810026 3725886 3617044 3613014 3648868 3531632
8705 3531632 3494846 3471939 3399946 3265486 3318860 3157566 3038669 3031831 3103799 3116664 3018792
8694 3018792 2783597 2791229 2815258 2810300 2773768 2608621 2627867 2729257 2714880 2715859 2687870 2506712
8682 2506712 2488705 2573104 2481467 2425620 2345540 2375345 2336818 2270131 2192931 2114258 2155176
8671 2155176 2267195 2230128 2216879 2192296 2098514 1906405 2102497 2106988 2073380 2009086 1983694
8660 1983694 1950168 2063464 2155378 1930532 1863876 1854017 1821281 1893251 1863749 1766694 1896046
8649 1896046 1836273 1781811 1780160 1765876 1727897 1737380 1781934 1727602 1650464 1697482 1657558 1639725
8637 1639725 1655741 1658420 1695657 1660247 1682107 1809746 1861607 1931635 1832220 1769921 1779648 1779086
8625 1779086 1651726 1714907 1676898 1700912 1807280 1841237 1880883 1976497 1909926 1921723 1948455
8614 1948455 1934102 1933047 1932793 2012569 2048627 1879029 1962897 2068870 2160416 2210986 2165137 2190383
8602 2190383 2227457 2322123 2373586 2462726 2426006 2578294 2641730 2610886 2725068 2697174 2869990
8591 2869990 3003467 2969850 3028615 3152426 3226213 3439760 3625076 3876534 4182998 4319849
8581 4319849 4611410 4903668 5047367 5519149 5738468 6011134 6639265 7026110 7709817 8613413
8571 8613413 9520756 10365382 11461940 12568653 13880888 15451831 17286047 19613222 22170854
8562 22170854 25090969 28095840 31055279 33755724 35792785 37143672 37453071 36571987
8554 36571987 34855595 32822378 30599545 28406621 26285547 24240023 22658693 21336727
8546 21336727 19927011 18650976 17400763 16291690 15116132 13967092 12984621 11944159
8538 11944159 10946092 9908998 9055259 8370073 7780774 7258810 6837951 6355626 5974808
8529 5974808 5680303 5340020 4959704 4856890 4737468 4546510 4417022 4196948 3927171 3776088
8519 3776088 3682832 3699865 3640791 3503769 3454802 3378621 3329542 3251970 3196400 2938291 2850533
8508 2850533 2877679 2811963 2632919 2613178 2634890 2323485 2270386 2283134 2226925 2234952 2293546
8497 2293546 2213631 2045398 2049078 2058072 1978575 2062528 2006709 1853356 1818282 1899507 1817505
8486 1817505 1770233 1758524 1826983 1942476 1928845 1836513 1740647 1840397 1834372 1933263 2054476
8475 2054476 2186490 2114498 2329428 2271065 2333926 2472670 2526344 2633543 2680235 2782147
8465 2782147 2902635 3124688 3307176 3390424 3731253 4106845 4404074 4958059 5493940 5936415
8455 5936415 6533507 7021492 7432355 7660124 7709032 7561367 7185252 6991458 6592018 6234322
8445 6234322 5910202 5548244 4992671 4486536 4180457 3847904 3560885 3252504 3013631 2748212
8435 2748212 2557581 2505461 2354804 2144029 2079205 1875822 1766045 1673235 1619235 1565770
8425 1565770 1662835 1667284 1653286 1470383 1274685 1252284 1286385 1281948 1323056 1312020 1212148
8414 1212148 1184826 1089505 1023772 1074932 1190127 1057216 906086 934333 970701 931153 956346
8403 956346 892339 777837 708230 673586 697917 697726 754367 742562 522521 659653 539135
8392 539135 592813 659792 447249 345096 394150 395049 417868 469620 570008 464316 449015
8381 449015 389577 407445 461814 514142 416724 327173 367824 426290 364595 281584 354635 502954
8369 502954 505478 407518 322373 318362 440735 427862 358311 252578 245725 378033 464249 505761
8357 505761 505711 480351 537501 513471 457161 363881 216922 202877 305348 495970 537238 511101
8345 511101 387886 272376 306094 356625 396535 231569 283416 254851 234255 273096 253055
8334 253055 314334 274723 191406 198736 171246 370557 242892 168568 220011 205033 120224
8323 120224 124967 134374 90309 203919 207758 171314 233536 292348 391388 308799 273748 267511
8311 267511 228680 189800 47696 -3551 149798 154612 183954 205835 181162 192408 187488 153694
8299 153694 112941 128572 51581 -44484 -62552 -59553 -46593 8442 65151 88114 20245 -47745
8287 -47745 -76964 10781 30005 70414 105599 138 65780 85385 43162 155736 99568
8276 99568 56812 1766 946 66311 72269 100341 138043 -11843 98068 127857 175368 83403
8264 83403 39349 -32749 -52785 -62716 -11979 88138 34260 -41238 -47197 -21971 -109312 -183104
8252 -183104 -103312 -26866 30988 32014 34913 87800 26324 10668 -41508 5426 145330 149059
8240 149059 152323 48414 12993 -112082 -165798 13555 -66110 -25780 -50159 15503 43520
8229 43520 -138381 -186096 -154700 -93198 -76202 -53238 -11309 -49684 5076 -84731 -73372 -98664
8217 -98664 624 10084 55164 -13236 -36611 -5711 45922 -112341 -13504 107519 -25059
8206 -25059 -163767 -88628 -35836 -31694 -66042 -31438 -95007 -44476 -109469 55375 116834 238439
8194 238439 197737 1031843 1633644 -70958 -202376 -130036 -86880 -103683 -198702 -219130 -147006
8183 -147006 -62663 -60193 -178868 -76833 -115823 -210836 -117271 -274552 -243715 -142343 -72748
8172 -72748 -167937 -179747 -112044 -87600 -158582 -173651 -164856 -193892 -111825 -225884 -281385 -164703
8160 -164703 -221868 -170197 9717 10320 -3175 -62258 -157107 -40147 -49970 -88847 -72819 -72851
8148 -72851 -175073 -66756 -123257 -69034 -26589 -128476 -204950 -146935 -25131 43278 -47288
8137 -47288 -21590 70681 2549 -62360 -215909 -160231 -26401 20971 -9827 33421 27649 46608
8125 46608 1595 -21988 -2192 255 -14553 -102224 -22619 -53434 -19634 81458 226874 316776
8113 316776 189099 115768 86766 45447 106543 52899 -119375 -120332 3880 -3550 -141195
8102 -141195 -45037 76709 -16851 -36744 -48768 -78675 -91284 -79251 87123 10697 -250075
8091 -250075 -217660 -209494 -264152 -228661 -157511 -53305 30591 6954 34009 29687 -122979 -195661
8079 -195661 -68918 -108270 -214601 -187329 -232703 -184164 -237941 -154889 -114094 -238613 -380258
8068 -380258 -365635 -288188 -295912 -275297 -60684 -132362 -195201 -264699 -298660 -341850 -351941 -416020
8056 -416020 -343631 -188056 -253689 -249206 -176572 -241706 -327206 -154863 -129086 -59221 -168172
8045 -168172 -223280 -156917 -254168 -205187 -239663 -301824 -217260 -120720 -176268 -277625 -282930 -255531
8033 -255531 -205613 -319325 -266674 -314474 -259812 -282387 -310135 -330922 -348968 -331523 -270680
8022 -270680 -208237 -179394 -191296 -306501 -286851 -143659 -169794 -222345 -184147 -251046 -335412
8011 -335412 -237378 -134547 -170332 -115628 -109435 -123724 -98365 -174602 -202424 -174411 -186835 -170292
7999 -170292 -211791 -120020 -231387 -347745 -296095 -280551 -221677 -81081 -180088 -109719 -106794
7988 -106794 -159867 -104751 -101787 -60447 -143850 -284773 -320099 -265148 -173956 -144477 -208103 -148627
7976 -148627 -175668 -155846 -58745 -22070 26870 -24324 -14115 -5582 -13815 -106957 -114524 -55502
7964 -55502 -110359 -166387 -123324 -47619 35584 69165 19565 -157881 -220593 -11724 -83441
7953 -83441 15864 -96346 44951 60538 90086 -17522 72471 150942 196851 256457 199719
7942 199719 264905 314229 262733 195993 189033 189925 360930 389316 385222 289396 178480 215096
7930 215096 407067 532453 648786 674855 645725 648656 723935 640501 692241 599472 448819
7919 448819 410015 427302 221934 288186 302633 239832 193189 134814 99777 110977 156400
7908 156400 115269 130152 70793 8245 -103975 -74120 -71045 -113090 -4673 -42853 45324
7897 45324 109434 69189 83881 27303 52039 60167 2631 29675 -35888 -36289 -106182 -115758 -83902
7884 -83902 -103413 -196988 -268353 -149781 20270 7359 -104645 -88843 -130052 -55098 63993
7873 63993 -71358 -169567 -144638 -275539 -259947 -214035 -107293 -194220 -195566 -206264 -346083
7862 -346083 -337496 -258999 -300911 -137447 -69726 -219713 -283733 -328481 -197425 -116179 -222913
7851 -222913 -169672 -173496 -214111 -211389 -293173 -237886 -247766 -306441 -341166 -417306 -297788 -288411
7839 -288411 -245211 -247932 -274218 -256448 -251272 -148286 -168706 -288925 -292657 -122321 -154915 -254547
7827 -254547 -175543 -142365 -169971 -204176 -207579 -202150 -258476 -141976 -77841 -151186 -202207 -152541
7815 -152541 14433 9083 -52145 15821 33412 108667 89464 224380 -56212 -377156 -240290
7804 -240290 -191551 -297274 -308550 -150974 -108137 -115407 -106860 -124701 -214725 -295929 -171694
7793 -171694 -99762 -184003 -69597 23520 12878 19571 -154804 -270132 -254839 -255406 -141728
7782 -141728 -171272 -161922 -84078 -194445 -264450 -294463 -219498 -149143 -182009 -54301 -139195
7771 -139195 -148693 -129529 -87309 -133865 -177684 -73719 -154115 -151787 -47823 -72949 -108417 -99216
7759 -99216 -102007 -39307 -21288 20799 -86239 -61467 -64616 -89180 -32841 -109366 -225310 -222215
7747 -222215 -184441 -78262 -191993 -183935 -172418 -234631 -189117 -164362 -244710 -218665 -177176
7736 -177176 -217131 -163112 -104685 -78135 -102714 -76744 -121905 -52135 -137223 -188662 -108476 -1419
7724 -1419 -184424 -140387 -159319 -9165 50065 56655 113052 106506 -7249 -101221 131846 210752
7712 210752 182978 139619 130327 131564 235496 254129 210469 176778 176721 156241 170910 194208
7700 194208 113123 218924 225177 113220 178946 208540 335715 347029 361479 390624 459689
7689 459689 410945 391470 391469 371965 347780 280033 300364 301533 212627 196802 174019 286894
7677 286894 413355 350418 176706 61533 58496 134173 150168 244434 198600 135281 112693
7666 112693 238414 315317 349541 252169 141264 391566 323592 333675 402022 338761 256552
7655 256552 171780 165406 220054 184847 184622 109745 65166 119304 242290 180336 98856 160993
7643 160993 134169 58959 164314 205493 166407 117309 166282 220349 174999 209299 280753
7632 280753 261369 152229 26208 33332 97421 132151 216041 269869 300730 313749 220533
7621 220533 210508 229586 268958 205518 261690 362423 364127 220310 213780 184541 134493 193365
7609 193365 261987 284853 301683 313072 352384 360992 306347 401943 328568 488298 537002 428492
7597 428492 353578 305095 362278 364276 289897 408402 343382 180718 223811 353388 333381
7586 333381 400412 489007 452484 257257 321328 382745 446415 312238 381742 445311 413898
7575 413898 426299 436887 475265 364571 377545 412041 430010 475191 502261 347327 225719
7564 225719 297103 302340 191976 167424 350197 388783 386730 497574 453999 443923 388310
7553 388310 425771 418164 364689 428065 454783 439528 380264 388136 392151 423747 461179 364377
7541 364377 493349 438545 527850 509041 523403 529086 382974 384151 412489 451823 534595 495158
7529 495158 496089 423350 374742 484153 415776 422547 418187 437933 441277 387747 423014 564309
7517 564309 528983 489633 458001 409751 533105 506168 499506 540097 561108 517474 639234
7506 639234 729893 691365 734839 717705 635087 564444 633550 620195 595847 666149 576155 671192
7494 671192 567173 649123 779916 649294 598563 739085 663940 621447 780136 832954 701671
7483 701671 705557 847856 769680 785185 908781 983568 1037644 1008626 936583 1041591 1019465
7472 1019465 1070998 1101208 1170237 1200833 1153977 1077374 1059889 1203776 1322500 1344452 1319990
7461 1319990 1397178 1507700 1468348 1517382 1555542 1664340 1795846 1861461 1927160 2051603 2084707
7450 2084707 2255292 2247480 2320378 2404203 2553045 2594520 2791668 2992359 3106195 3405845
7440 3405845 3659729 4045937 4249776 4558182 4980633 5425131 5804974 6406263 7014582 7499875
7430 7499875 7867913 8339171 8866744 9352782 9607970 9662277 9890285 10085494 10299416 10302509
7420 10302509 10411798 10761379 10943163 11147072 11510904 12099036 12562440 12850719 13299242
7411 13299242 13879274 14646641 15522330 16422030 17455489 18676294 20057430 21786889 23597280
7402 23597280 25691127 28132852 31054260 34261806 37519736 41024378 44458692 47839370
7394 47839370 51038847 53737150 55718509 56918935 57228708 56637908 55417481 53779016
7386 53779016 52000253 50240944 48234180 46071951 43892660 41810589 39828922 37688841
7378 37688841 35614755 33791182 31727629 29766191 28006371 26197616 24507954 22816782
7370 22816782 21240607 19868804 18410176 17278720 16256153 15277772 14338178 13584641 13009480
7361 13009480 12441953 11891278 11411175 11019351 10644062 10252738 9905190 9572849 9312953
7352 9312953 9139697 8811475 8551270 8432823 8251807 8056566 8005984 7882055 7741595 7602499
7342 7602499 7659947 7806795 7872894 8103445 8394257 8602247 8895922 9274061 9728403 10251286
7332 10251286 10860919 11458350 11986939 12513235 12822059 12941415 12869168 12736302 12432387 12031243
7322 12031243 11593997 11213734 10868466 10371090 10019830 9575847 9183572 8722747 8361970
7313 8361970 7978779 7693879 7348306 6966840 6515250 5998423 5618126 5272724 5024524 4748869
7303 4748869 4536954 4259090 4091248 3925804 3763195 3701451 3475381 3339859 3142770 3063615
7293 3063615 2955599 2783569 2682232 2684421 2594677 2528046 2424148 2264826 2323768 2118820
7283 2118820 2071603 2055469 2071687 2041037 1934555 1825732 1803991 1748599 1697303 1701523 1767561
7272 1767561 1726265 1775701 1708073 1735373 1797133 1668740 1683289 1574874 1437722 1506639 1451504
7261 1451504 1342625 1365889 1407851 1252022 1310329 1401369 1258539 1140172 1184067 1329653
7251 1329653 1260038 1333469 1211389 1158250 1036560 1161505 1107786 970943 889968 937161 1054496
7240 1054496 1078776 1017415 895127 865969 792315 795029 945481 923265 893992 935147 773209
7229 773209 735180 663047 689859 682537 631256 624707 665961 518041 485612 463124 496765 516320
7217 516320 567065 610992 625531 461608 371664 512941 523552 411229 416552 469113 531774
7206 531774 638404 577772 500335 594683 616996 523137 570982 540957 518658 577742 528476
7195 528476 554925 569868 514701 602093 591983 525929 540744 606569 693417 727431 722972 672667
7183 672667 583630 579797 628489 692417 716420 625550 567994 642461 618738 603892 626966 626100
7171 626100 592791 520005 592824 550897 445565 430537 408302 477935 451833 425311 419437 423570
7159 423570 274840 207258 402432 453654 363491 263592 170614 314137 208053 142529 213812
7148 213812 200789 126178 147990 237490 133101 150230 222336 124858 81837 206427 236281
7137 236281 215874 213095 104630 31270 49409 87925 166664 227133 216714 274902 120610
7126 120610 116773 158285 243541 294974 173846 146518 28654 55081 163730 236583 94933
7115 94933 179564 147194 85976 135284 144557 175129 341050 349398 311537 219987 222123 279726
7103 279726 273456 312074 328651 342729 289515 373938 390801 281031 229599 355783 323409
7092 323409 310576 365231 417076 430215 414447 634156 739696 770545 655179 577392 709366
7081 709366 809342 873893 892347 929374 842512 817728 703563 680956 648294 668265 642722
7070 642722 503595 485963 524235 515320 456352 445587 462104 513101 516753 374711 290741 261744
7058 261744 370388 383790 249389 191701 164815 122706 41147 -11404 68836 175546 142820
7047 142820 114430 149238 248539 193655 305384 263655 108365 -711 -7453 50723 129861
7036 129861 164255 164541 155274 226495 121164 95738 46336 147011 135281 89475 135608 143912
7024 143912 132818 16494 -49750 -30665 19651 159906 262042 201995 253341 118402 91951
7013 91951 -12311 117157 70533 105334 131442 31770 198032 132291 39820 96565 -27906
7002 -27906 -40394 -36981 82747 114071 46254 105427 19229 59592 193481 191025 112088 -21670
6990 -21670 17834 11210 -40365 -170446 -123245 154237 118700 248394 194528 158555 233720
6979 233720 258725 256594 259969 211147 296409 309959 268502 201108 73370 66297 78226 22510
6967 22510 113756 112866 52421 70316 109428 185797 170363 140614 239319 214624 175983 201400
6955 201400 106009 105366 169672 186576 279207 294085 161408 139717 144159 261479 253924 205323
6943 205323 176585 98960 -10293 102814 192643 172945 47053 77042 11841 -86811 -72791
6932 -72791 -61709 -10037 74279 62603 789 -68557 -136811 -184295 -44277 -102417 51457
6921 51457 -109218 -132481 4177 -137016 -68974 12096 -42924 -80763 -12735 12755 -442
6910 -442 -118545 14856 55873 -83347 -55879 -101033 32171 24815 784 36679 -21822 131255
6898 131255 82749 83356 5378 -56315 -34623 83917 -42456 -134177 -55950 -15574 -91919 35642
6886 35642 -47921 -171085 -123110 -107000 -204097 -168267 -186855 -240720 -220174 -178240 -68568
6875 -68568 23768 136754 118507 12321 -46367 -52275 -21467 -60784 43468 -34064 -82532
6864 -82532 -5067 -118183 39126 155459 70451 -65390 -100199 -21626 -20235 48457 16962
6853 16962 -75685 -115222 -56886 -97472 -108290 22144 72687 -67814 -68805 53376 -60190
6842 -60190 -82380 -97110 -86710 -52259 -66508 -71182 6886 119916 37125 20787 135287 62193
6830 62193 21073 169892 178706 211934 179803 83056 -13026 -3534 -89219 -232255 -161137 -81015
6818 -81015 -41485 128729 139017 28496 54213 -42059 126186 233140 94100 115478 113711
6807 113711 67915 159801 110661 -50762 -11376 11813 -23707 88426 157912 185294 14402
6796 14402 82358 132123 20569 12041 -1939 51819 136276 180715 94200 -30397 -6135 -85634
6784 -85634 47800 114907 223139 118596 54076 81645 1593 37695 156908 260393 327209
6773 327209 235507 224867 302985 255929 5768 14870 47801 59486 -1649 19830 72241 34746
6761 34746 -4661 -3519 38975 -68216 2373 97397 195824 195645 149586 12124 106007 215106
6749 215106 117267 119376 127382 -509 9271 75378 119278 196311 134111 214114 241640 245037
6737 245037 244901 337616 242497 189673 287998 211214 216406 144899 -58858 -19166 146463 184965
6725 184965 203855 185940 122187 158690 253841 240045 367602 286183 389708 395723 416269
6714 416269 315747 492028 476513 623377 705372 502947 453317 560371 627816 544829 492543
6703 492543 631850 760553 808816 659731 591265 607740 609078 702088 676144 678299 695712
6692 695712 623887 649933 638808 716348 732486 755579 776258 822855 792150 723907 699304 810518
6680 810518 831806 673851 587331 629944 788710 565146 561584 658721 663499 657652 608163 592928
6668 592928 525701 656608 671758 607869 604841 561298 622328 596858 528033 517875 567370 681492
6656 681492 728403 650538 560837 499130 565217 599335 536096 416632 501369 563441 576565
6645 576565 444081 550291 670800 617911 571873 709419 673506 488681 427244 453553 434523
6634 434523 594375 620482 640977 688930 509144 440984 391246 397546 576086 575487 607182 450789
6622 450789 407093 472911 527458 537157 513678 499772 671662 657418 614140 516582 481246 527787
6610 527787 634075 702127 672870 696413 853383 768658 667128 708480 687385 741907 781533
6599 781533 897203 839053 804414 772840 856380 968525 993469 1004219 1000049 1061749 1149081
6588 1149081 1216041 1181738 1154161 1223033 1157893 1202034 1307609 1204859 1194376 1222126 1295601
6577 1295601 1511645 1476690 1442540 1370144 1454083 1529420 1497879 1507654 1576912 1585525 1584185 1529353
6565 1529353 1597801 1620731 1756063 1858725 1754544 1718552 1759928 1799385 1883829 1977279 2002020
6554 2002020 1993023 2075813 2086713 2259165 2365551 2386414 2518504 2531879 2552016 2702896 2680683
6543 2680683 2810783 2967634 2782667 2769207 2992916 2957507 2979100 3069355 3019703 3034881 3102991
6532 3102991 3102228 3156046 3164118 3015475 2829212 2925640 2992658 2951894 2858415 2918162 2951554 3021463
6520 3021463 2996606 2946947 3020666 3108816 3263249 3285053 3288726 3350963 3498183 3686565 3868445
6509 3868445 3985600 4043262 4026466 4210789 4135946 4148452 4117111 4081805 4172588 4150007 4168277
6498 4168277 4318892 4561585 4652793 4687770 4833722 4933320 5157106 5462142 5603795 5810393
6488 5810393 6035539 6241990 6468589 6750771 6916084 6899525 7124067 7315999 7330414 7372800
6478 7372800 7409850 7341671 7232272 7294116 7262050 7205211 7069926 7085896 7122660 7035511 7117986
6467 7117986 7174397 7047376 7126659 7202368 7212885 7213093 7226094 7167055 7044936 7020350 7000910
6456 7000910 6980725 6938053 7136468 7104128 7245278 7382831 7303574 7453645 7458656 7473917 7577564
6445 7577564 7556117 7666048 7643835 7715070 7801744 7942913 7982049 8138855 8354101 8513670
6435 8513670 8747477 9009398 9285343 9569048 9740442 10134478 10600631 10986669 11394561 11764253
6425 11764253 12209636 12954814 13596405 14204339 15051414 16053167 17055429 18347899 19640374
6416 19640374 21156532 22793402 24470374 26247664 28072933 29939311 31630838 33085631
6408 33085631 34362244 35322249 35775691 36091773 36268607 36564954 37016006 37797569 38857826
6399 38857826 40060441 41560151 43466412 45744634 48256638 51305533 54844537 58705310
6391 58705310 62788583 66652767 70341807 73717984 76493443 78262306 79051742 78888082
6383 78888082 78269745 77212873 76125151 74766107 73470636 72577472 71981484 71681507 71959792
6374 71959792 72492616 73505582 75075201 77069378 79403096 82134329 85139950 87957305
6366 87957305 90613918 92489739 93505582 93745384 92945560 91148787 88659131 85536430
6358 85536430 82258632 78985341 75982657 73291749 70707226 68529201 66430145 64662309
6350 64662309 63115297 61905137 60756176 59963355 59403235 58927233 58507697 57893961 57258523
6341 57258523 56296653 54996203 53252053 51291014 49163678 46966816 44880260 42803476
6333 42803476 40760930 38961139 37349722 35689735 34177948 32752335 31318763 30043331
6325 30043331 28605581 27282142 26178060 25176327 24052572 23037392 22086060 21197385
6317 21197385 20317528 19621563 19007165 18504385 18002522 17627087 17310090 16889431 16579170
6308 16579170 16157531 15763704 15694188 15468441 15320444 15112419 14886565 14776486 14629496 14620205
6298 14620205 14532302 14438036 14396207 14389511 14389402 14440781 14506620 14724603 14832553 15147056 15390678
6287 15390678 15618276 15968315 16092457 16282682 16713063 17145944 17723130 18273003 18776505
6278 18776505 19410310 19927864 20477176 21003430 21868990 22810972 23796719 24791573 25920565
6269 25920565 27266528 28699851 30279974 32084584 34088889 35904372 37984418 39938187
6261 39938187 41999803 44308623 46518496 48776282 50976783 53137626 55222280 57180545
6253 57180545 58816026 60289886 61638900 62697049 63871178 64990011 66051152 67171629
6245 67171629 68570600 70018844 71715961 73548103 75524278 77597344 79665885 81647598
6237 81647598 83437067 85272901 86963743 88315812 89425599 90296801 90882147 91309391 91265569
6228 91265569 90948302 90353381 89381631 88164671 86874402 85534010 84113621 82579427 81204067
6219 81204067 80109502 79012254 77964343 77157981 76361113 75543961 74620022 73667304 72643689
6210 72643689 71391568 69926734 68567698 67125484 65350756 63597195 61689545 59702027
6202 59702027 57747229 55610885 53359471 50995454 48793200 46640014 44509325 42329616
6194 42329616 40457908 38711909 36901237 35145416 33688834 32251214 30897821 29698068
6186 29698068 28469070 27498394 26549816 25562665 24739391 23884403 23091257 22283737 21657499
6177 21657499 21022749 20231718 19810022 19467957 18971749 18438338 18031815 17628342 17338413
6168 17338413 17167647 16838992 16550991 16345615 16250680 16249310 16034993 15842929 15747278 15649336
6158 15649336 15462544 15205605 14934020 14647144 14412584 14175565 13913502 13662283 13480746
6149 13480746 13514147 13418923 13306093 13244280 13244753 13171033 13320212 13326222 13349311 13449469 13429251
6138 13429251 13707538 13739531 13634597 13635825 13515422 13465312 13334166 13200764 13238896 13355218
6128 13355218 13318962 13298635 13320239 13296013 13374306 13561829 13684921 13939279 14209875 14508411
6118 14508411 15030362 15412276 15716769 16067657 16427726 17046924 17553050 18240727 18938205
6109 18938205 19568376 20295590 20870610 21695684 22187530 22630534 22806364 23053667 23282737
6100 23282737 23384327 23407589 23335861 23431411 23763701 23813165 23994985 24371793 24813069 25283500
6090 25283500 25872482 26765642 27517671 28468135 29506036 30545642 31537690 32388710 32942357
6081 32942357 33521154 33671849 33506108 33160644 32510376 31944931 31406818 30624529 29903688
6072 29903688 29142747 28488941 27965738 27516651 26860892 26566890 26418145 26302677 26318552 26255485
6062 26255485 26272426 26228962 26267670 25951897 25672574 25340230 24882104 24261000 23404819 22556522
6052 22556522 21886977 21086119 20274745 19433907 18759784 18056363 17253040 16595655 15981112
6043 15981112 15434076 14887764 14286650 13714370 13316066 12848031 12273894 11847050 11497983
6034 11497983 11055604 10596184 10233701 9957567 9644336 9431487 9236545 9031807 8901481
6025 8901481 8764087 8559244 8404340 8292706 8174369 8056369 8003303 7898899 7826210 7610731
6015 7610731 7517487 7373761 7377243 7253340 7232082 7166534 7033182 7086265 7056388 6943722 6896771
6004 6896771 6892022 6884077 6794327 6830462 6773791 6665863 6663375 6629435 6659347 6543011 6560336 6577302
5992 6577302 6689056 6679003 6544967 6511534 6554568 6527230 6645789 6531905 6580855 6654444 6785280
5981 6785280 6721076 6706700 6735101 6713072 6774649 6832421 6809209 6832822 6840170 6852888 6920042 7068598
5969 7068598 7124240 7056848 7010861 7105370 7262989 7127581 7128018 7072376 7195607 7288216 7310612
5958 7310612 7284120 7155797 7200751 7329125 7430533 7661470 7855665 8039251 8153589 8077679
5948 8077679 8134273 8162545 8227120 8359053 8460191 8507858 8707664 8844001 8997354 9178126
5938 9178126 9272794 9385042 9389726 9530206 9711370 9925332 10161016 10335972 10468665 10567545
5928 10567545 10770171 10935249 11143658 11433165 11668614 11826700 12136938 12346262 12643843
5919 12643843 12949887 13323445 13631680 13943804 14651814 15190452 15696613 16222318 16737178
5910 16737178 17344070 18087455 18696328 19406765 20360043 21215889 22246616 23234243 24357552
5901 24357552 25620349 26997039 28512769 30265251 32308792 34506722 37082834 39846165
5893 39846165 43092173 46727712 50818962 55328918 60248107 65566136 71137996 76775540
5885 76775540 82193388 87381136 91623607 94905424 97455779 98712269 99239778 99309488 99309084
5876 99309084 99805933 100729025 102093097 103896548 106326986 109238816 112891611 117097741
5868 117097741 121492495 125795603 129599989 132610890 134448607 134832626 133514810 130876128
5860 130876128 127109321 122646910 117894675 113155595 108514645 104107958 99894600 96061432
5852 96061432 92488310 89072704 85790763 82884233 80299348 77879904 75485278 73465397
5844 73465397 71840471 70268827 68772662 67791859 67299321 66986168 67156639 67687354 68512570
5835 68512570 69859948 71803999 74106558 77003947 80619511 85010002 90249001 96176264
5827 96176264 102921553 109937962 117162849 124317880 130510434 135114608 138112613 139723262
5819 139723262 140004016 138972282 137680345 136560271 135477855 134577085 133695740 132562155
5811 132562155 131277929 129987137 128430774 126890090 125442089 124079575 123023396 122408341
5803 122408341 122241742 122641775 123466383 124591054 126013681 127376730 128630924 129434169 129411799
5794 129411799 128862683 128236375 127583398 127167393 127232410 127951832 129156288 130671030 132559255
5785 132559255 134567470 136694367 139164163 141621009 143958096 146354161 148334400 150351967
5777 150351967 152111225 153432005 154086721 153923863 152553969 150351494 147161329 142968005
5769 142968005 138106986 133011249 127891322 122979862 118471877 114142330 110391933 107011901
5761 107011901 104074824 101512526 99299442 97597063 96235274 95384077 94587480 93778268
5753 93778268 92961936 92066615 90695530 88947311 86387412 83568961 80260392 76911272
5745 76911272 73713407 70516070 67560881 64773198 62019264 59396451 56965403 54313112
5737 54313112 52001349 49833727 47698382 45637697 43812793 41931861 40183894 38425934
5729 38425934 36717972 35378264 34077123 32789586 31691170 30648985 29799742 29073430
5721 29073430 28487248 27806854 27079766 26606987 26039952 25606232 25275961 24841312 24490080
5712 24490080 24427008 24157941 23816426 23769382 23494740 23263226 23281447 23276431 23107852 23015542
5702 23015542 23139738 23271641 23404735 23605382 23900602 24179677 24585740 25067329 25674816
5693 25674816 26352320 27061580 27878001 28811581 29951288 30982491 32038015 33112539 33982116
5684 33982116 34805235 35487714 35941406 36201789 36290096 36221748 36119813 35964913 35844955 35907516
5674 35907516 36025140 36342041 36690215 37211071 37976400 38796566 39902576 41035841 42336172
5665 42336172 43738369 45097610 46605585 47908298 48925801 49667378 50172116 50172704 50233740
5656 50233740 49852463 49254535 48547548 47833553 47304956 46987251 46695725 46568067 46677222
5647 46677222 47093137 47454806 48003824 48755932 49666834 50915743 52329093 53786901 55236838
5638 55236838 56671705 57987045 58980416 59724688 60343939 60616567 60654343 60617786 60579199 60560845
5628 60560845 60744951 61048546 61374299 62367398 63582950 64637240 65732782 66939629 68244893
5619 68244893 69584576 70896330 72255219 73429335 74386638 75164160 75615532 75880418 75961472
5610 75961472 76020904 75743643 75403882 75191414 75118715 75000558 75186385 75514680 76043948 77027166
5600 77027166 77958080 79197889 80635447 81851190 83125750 84354412 85510740 86392061
5592 86392061 87069114 87567182 87833185 88120199 88396724 88807273 89367022 90015775 90783193
5583 90783193 91775284 92939383 93841039 94715335 95575247 96616409 97873302 99617500 101475858
5574 101475858 103602734 106089641 108498569 110830945 113041577 115088473 116660064 117954103
5566 117954103 118952381 119748824 120423738 121193701 122097566 122595728 122813995 122782620 122705570 122672819
5556 122672819 123240744 124481189 126082958 127700535 129701669 131596436 133580715 135583329
5548 135583329 137036232 137707211 137486496 136739415 135544169 134239425 133072054 131635008
5540 131635008 129484816 126997034 124493656 121717269 118665883 115354697 112215214 109547469
5532 109547469 107395512 105758501 104771311 103844122 103078943 102331882 101319241 100045351 98149544
5523 98149544 95591190 91845956 87835414 83654117 79447878 75583408 71983481 68581149
5515 68581149 65417197 62620402 59957945 57417505 54995900 52746316 50825349 48937291
5507 48937291 47256634 45651646 44037440 42802101 41781964 40958947 40444484 40068455 39772746
5498 39772746 39628361 39445808 39088535 38732018 38198407 37459592 36849719 36238147 35769541
5489 35769541 35318992 34845025 34592570 34446282 34617113 34816169 35283841 35952274 36675096
5480 36675096 37620176 38651234 39492443 40372281 41194727 41677130 41755507 41471655 40999939
5471 40999939 40340605 39509569 38925455 38305125 37337551 36472425 35775942 34991593 34357541
5462 34357541 33953906 33846565 33762319 33837345 34136162 34493700 34846383 35317970 35714641 35620628
5452 35620628 35437981 35097879 34321399 33151102 31869605 30604684 29486733 28341005 27309033
5443 27309033 26286785 25373215 24522919 23733274 22898342 22081067 21421177 20555478 19877393
5434 19877393 19046653 18409237 17886063 17323567 16852146 16379326 15930181 15599555 15303471
5425 15303471 15019341 14833252 14708136 14755643 14570467 14430238 14410473 14336892 14441497 14326499
5415 14326499 14385907 14375075 14452529 14816685 14910405 15104820 15267698 15209633 15310335 15488541
5405 15488541 15666568 15804489 15874612 16096947 16300293 16576826 16706517 16996216 17237558 17567400
5395 17567400 18059681 18246775 18486899 18761917 19131730 19607831 19995295 20234494 20600226
5386 20600226 21007894 21341421 21704541 22110680 22514662 23153074 23776612 24363020 25149063
5377 25149063 25812786 26587718 27356440 28058424 28908910 29854697 30921183 31964607 33119004
5368 33119004 34743090 36493755 38342984 40471322 43018064 45626632 48520518 51883719
5360 51883719 55654845 59707315 63894100 68347581 72608709 76370212 79429666 81799027
5352 81799027 83004562 83280936 82962502 82258242 81490606 80847967 80339790 80156065 80286368
5343 80286368 80963377 82002115 83443847 85477058 87639885 90218247 92893552 95713601
5335 95713601 98332193 100549237 102305144 103838098 104724896 104944765 104165667 102372744 99968452
5326 99968452 97094647 94139890 91281360 88649981 86278894 84205260 82438081 80969087
5318 80969087 79883666 79078720 78616902 78242706 78018116 77807818 77615080 77299836 76520331
5309 76520331 75473463 74057999 72175919 69991461 67826623 65667176 63813634 62189161
5301 62189161 60746163 59672936 58632546 57531020 56650358 55720120 54634589 53556368
5293 53556368 52183407 50548951 48640674 46909330 45311933 43691792 42310496 41273945
5285 41273945 40439967 39617605 39098424 38749654 38617893 38552870 38616965 38856939 39153039 39479520
5275 39479520 39523239 39678224 39627398 39453066 39140102 38509520 37681813 36741657 35523988 34333648
5265 34333648 33228888 32258149 31364513 30380054 29647776 29070099 28514333 27894498 27646412
5256 27646412 27416831 27048575 26774136 26548914 26115899 25656496 25037160 24350342 23431342
5247 23431342 22642702 21691895 20684526 19818428 18989786 18189719 17434189 16792929 16107657
5238 16107657 15337898 14738326 14165650 13745017 13164151 12500964 11981319 11520503 11055781
5229 11055781 10600638 10141163 9700969 9441365 9132101 8969372 8764154 8546430 8293687
5220 8293687 8088557 7900956 7636464 7494648 7324072 7146806 6988242 6741865 6621412 6520126
5210 6520126 6279495 6170617 6073645 5880944 5662619 5665552 5574676 5335473 5082203 4920195
5200 4920195 4899376 4919494 4827387 4720359 4618546 4511101 4393338 4353153 4285041 4143142
5190 4143142 4099576 4068877 4052390 4013009 3955349 3877506 3898497 3781551 3600503 3535356 3554674
5179 3554674 3508047 3389443 3322890 3343667 3197899 3119022 3147665 3083977 3094486 3011951 2951890
5168 2951890 2944034 2957274 2908595 2928621 2881750 2811835 2734281 2709458 2752435 2739868 2765358 2745135
5156 2745135 2708599 2632793 2488645 2396896 2496576 2592381 2448747 2275437 2392915 2376114 2400383
5145 2400383 2372087 2367127 2331166 2318758 2327015 2339662 2356836 2299803 2267654 2294534 2363508 2357548
5133 2357548 2261877 2321862 2321323 2345668 2377169 2466788 2438373 2502921 2562077 2486943 2581306 2817331
5121 2817331 2873918 2932571 3124576 3135768 3235709 3371424 3520258 3674078 3755598 3997976
5111 3997976 4178017 4196836 4112115 4148946 4065908 3964402 4012587 3806973 3835080 3957714 4053795
5100 4053795 4087951 4161610 4324876 4358465 4385624 4605001 4727428 4694559 4849540 5004042
5090 5004042 5107831 5191416 5271661 5218644 4998877 5006223 4954378 4614573 4589368 4588125 4537681
5079 4537681 4480285 4334994 4290353 4220491 4174752 4155461 4124951 4034663 4159324 4209458 4059874
5068 4059874 3973274 3932282 3797147 3658957 3560860 3356271 3282136 3248501 3123485 2960832
5058 2960832 2789701 2673618 2663304 2531002 2355501 2301149 2328560 2200917 2092703 2020066
5048 2020066 1975587 1890773 1833636 1864827 1804644 1800061 1570208 1537239 1618823 1678849 1714528
5037 1714528 1632130 1592597 1699914 1604495 1606932 1574390 1626041 1555596 1607416 1564083 1407929
5026 1407929 1480436 1396378 1481534 1491559 1444085 1391687 1409548 1466270 1615384 1555565 1475142
5015 1475142 1419400 1523627 1529495 1478949 1474996 1599796 1660130 1547420 1498306 1603640 1598621
5004 1598621 1485725 1491025 1535155 1680774 1654249 1420020 1258339 1389742 1428975 1441361 1408000
4993 1408000 1374135 1419716 1492494 1603795 1683349 1740117 1786345 1639482 1568109 1589046 1662005
4982 1662005 1653367 1830815 1866942 1912386 1828371 1637093 1701917 1841386 1809521 1890869 1838726
4971 1838726 1897004 1897524 1868698 1960442 1940691 2138449 2252740 2351966 2475726 2342514 2216392
4960 2216392 2150652 2058104 1978631 1981151 1857182 1838401 1764491 1670043 1645978 1667980 1588031
4949 1588031 1480113 1480299 1500727 1509763 1456997 1411658 1371448 1351412 1306262 1272126 1189458 1203581
4937 1203581 1050378 1104669 1066658 1100332 1185098 1090728 1078043 998502 954483 986675 964644
4926 964644 876988 928352 1047987 1106741 1080495 1104378 1158910 894654 1017596 1072559 1222798
4915 1222798 1140119 1187129 1174340 1165590 1223642 1154679 1232234 1277932 1182205 1125546 1132763 1360265
4903 1360265 1349740 1402110 1501508 1530451 1476652 1568907 1724967 1727135 1713978 1803418 1921105
4892 1921105 1900029 1998066 1874051 1785219 1813966 1695096 1566806 1566357 1543749 1433187 1436680
4881 1436680 1496086 1406844 1245436 1254458 1317681 1193395 1060366 1123174 1164377 1158968 1226703
4870 1226703 1118639 1129483 1071535 1033340 1206090 1244430 1187143 1271361 1415877 1380245 1345827
4859 1345827 1407069 1368150 1319413 1375655 1332597 1283509 1328350 1251925 1235353 1262399 1255635 1143782
4847 1143782 1132369 1120840 1317705 1288392 1217141 1091161 1025769 1073571 945854 976069 1026926
4836 1026926 953681 954126 928918 901461 914943 1021791 1002783 1068564 881471 826792 821433 862125
4824 862125 823164 842347 858617 819840 813872 867621 962113 916515 948936 969804 869187 857471
4812 857471 930615 822870 779770 927980 940265 915145 818753 863021 899812 843512 895803
4801 895803 863804 868521 791259 748564 745317 794324 838609 944733 754072 685625 817065
4790 817065 803461 748515 838817 715276 662525 794501 730953 696853 763305 743051 698404
4779 698404 699826 758632 793564 712419 775353 944539 855468 717494 679447 772351 797354
4768 797354 849951 830913 866790 852992 781774 811582 760740 681406 732817 786025 920617
4757 920617 959472 970434 885432 967368 902693 802631 907027 918149 1123188 1121159 1014570
4746 1014570 1015679 986037 933630 932580 1041834 917864 843434 883264 1018225 1120461 1107178
4735 1107178 1166732 1087791 1063890 1061697 1023611 1123130 1372092 1284231 1254263 1241046 1253020
4724 1253020 1200698 1150958 1234600 1142218 1088451 1270208 1231524 1227999 1184867 1180633 1280675
4713 1280675 1274105 1319626 1234307 1289981 1426323 1431668 1446253 1400253 1325222 1369999 1405115 1449834
4701 1449834 1520658 1598973 1558116 1416105 1487646 1609418 1603046 1658823 1726908 1825821 2019702
4690 2019702 2113964 2100904 2244460 2562744 2716432 2662351 2652783 2801624 2918484 3060447
4680 3060447 3165522 3255879 3220436 3082379 3281048 3239692 3172477 3081229 2930366 2934358 2788525
4669 2788525 2642392 2522791 2585859 2522683 2459122 2457977 2358162 2231357 2311395 2369920 2431380
4658 2431380 2573644 2509899 2615014 2711685 2670209 2797114 3064032 3231736 3359239 3429691
4648 3429691 3684593 3782696 3519878 3384841 3264370 3092146 3035813 2916656 2863021 2789398
4638 2789398 2710314 2658370 2572200 2530502 2409302 2371438 2343493 2158485 2147028 2188862 2100843
4627 2100843 1991618 2024164 2020587 1972169 1900440 2015402 1926968 1835462 1888520 1837592 1800125
4616 1800125 1850508 1789510 1717235 1722659 1588178 1689569 1653721 1715011 1873850 1954920 1978679
4605 1978679 1871906 1860165 1841609 1907219 1956532 1937228 1982600 1908708 1897692 1939684 1960154
4594 1960154 1830320 1873518 1770479 1634036 1685967 1932985 2062530 2006524 1907574 1838875
4584 1838875 1987738 2022382 1931710 2038840 2056688 2041181 2239366 2290607 2179019 2133789 2238668
4573 2238668 2227814 2332221 2423543 2358806 2259866 2291896 2355573 2363617 2346842 2411680 2327546
4562 2327546 2331066 2388395 2418226 2469692 2441882 2441765 2442947 2450124 2489440 2553835 2566527 2588161
4550 2588161 2571059 2687760 2654612 2606043 2707177 2703208 2786001 2800803 2909824 2978522 2919036
4539 2919036 2968330 2973829 2911695 2937971 3060959 3242115 3160497 3033752 3025157 3051286 3146043
4528 3146043 3022648 2995491 3013168 3030765 2945317 3010715 3087814 3127545 3053289 3034323 3107523
4517 3107523 3182877 3184887 3206031 3252683 3147408 3160827 3288181 3422469 3353517 3505513 3496593
4506 3496593 3426458 3635728 3704806 3642408 3614523 3606118 3664542 3702865 3768975 3657634 3699785
4495 3699785 3932869 3783492 3841861 3895122 3862487 3823466 3923472 4063859 4148337 4163473 4242022
4484 4242022 4134357 4172284 4220875 4277371 4246191 4360268 4463577 4365732 4361777 4420508 4390487
4473 4390487 4389473 4456011 4430743 4550348 4739916 4733590 4713014 4783325 4655041 4571896 4499754
4462 4499754 4553858 4569357 4659576 4810634 4891921 4863673 4918712 4841836 4845711 4834782 4842763 4797413
4450 4797413 4853636 5032768 5092415 5065231 5139301 5147919 5161097 5142634 5148357 5162734 5213111 5247030
4438 5247030 5380229 5518818 5569860 5527257 5500640 5646345 5747042 5660030 5756897 5795282 5877758
4427 5877758 6082737 6123694 6149410 6139916 6248061 6341872 6284839 6402484 6496686 6506150 6467202
4416 6467202 6589005 6714600 6646337 6673292 6806653 6832946 6971848 7051425 7114663 7082659 7048955
4405 7048955 7079002 7155402 7257818 7352567 7511270 7581447 7583669 7555075 7707436 7780384 7933989
4394 7933989 8081733 8201744 8279449 8332061 8363149 8338895 8381909 8489601 8569609 8797691 8948823
4383 8948823 9165965 9087747 9237117 9434984 9506454 9622412 9784973 9939914 9838036 9908292
4373 9908292 10157989 10199890 10319359 10453697 10643059 10674672 10783706 10932416 11143873 11313224
4363 11313224 11439373 11432818 11617140 11855758 11829621 12030092 12166864 12312285 12518437 12564617
4353 12564617 12761322 12951797 12967082 13144222 13526586 13900139 14144211 14525492 14886231 15237980
4343 15237980 15763109 16201129 16613614 16933151 17446182 17893771 17973417 17759338 17456606 17373269
4333 17373269 17069646 16945652 16891317 16784883 16789092 16717531 16666960 16622343 16525891 16596686 16722324
4322 16722324 16790523 16761620 16850801 16914463 16689040 16602366 16856961 17079115 17050134 17092991 17200074
4311 17200074 17233159 17447045 17588125 17676260 17762409 17900451 18111886 18380598 18542372 18738809
4301 18738809 18844293 19079195 19314134 19462150 19688954 19945976 20200759 20474976 20659478
4292 20659478 20978147 21277408 21522601 21874292 22239342 22543831 22878389 23263641 23753137
4283 23753137 24189401 24524940 25026053 25409229 25896134 26301319 26899899 27502722 28060396
4274 28060396 28540525 29096175 29807486 30526334 31298361 32076141 32964683 33841038 34560152
4265 34560152 35392111 36239559 37109208 37829117 38452466 39320586 40053627 40608400 41377192
4256 41377192 42195767 43102498 43972718 44752200 45486395 46189143 47054167 47947888 48653164
4247 48653164 49445232 50279096 51030455 51807588 52540118 53387558 54094923 55004922 55697585
4238 55697585 56385248 57105772 57846370 58425362 59035547 59554016 60136383 60634448 61114487
4229 61114487 61630275 62181965 62833659 63440417 64024537 64574817 65158738 65829301 66478108
4220 66478108 67196430 67908983 68580169 69221320 69977039 70751890 71448198 72568645 73638785
4211 73638785 74588573 75742970 76840148 77917881 79300951 80647255 82089718 83488018
4203 83488018 85131597 86619358 88091959 89703486 91303953 93035943 94684014 96359971
4195 96359971 98092265 99841170 101729634 103518182 105302163 107126220 108809348 110520617
4187 110520617 112222553 113696479 115132248 116639303 118281789 119683930 121117796 122435479
4179 122435479 123735068 125005525 126215721 127471771 128459449 129453795 130291446 130844386 131426218
4170 131426218 132131592 132506893 132861536 133114632 133187511 133185995 133229701 133160343 132822980 132441096
4160 132441096 132049831 131247697 130403112 129584800 128572193 127447311 126074499 124693634 123133445
4151 123133445 121484246 119809175 118053266 116075852 114170179 112152290 110025364 107938028
4143 107938028 105527855 102980817 100731861 98399684 95965079 93616701 91203748 88901895
4135 88901895 86598459 84070137 81761655 79454697 77094860 74961318 72921541 70964010
4127 70964010 69100525 67206662 65293754 63482473 61666032 59879149 58262455 56735947
4119 56735947 55188267 53631909 51985732 50468264 49015524 47654659 46317989 44930634
4111 44930634 43671653 42406012 41246012 40122650 38955878 37929320 36960185 35912203
4103 35912203 34845194 33988444 33145372 32122219 31227551 30555760 29800283 29007871 28343033
4094 28343033 27801180 27322314 26749796 26235383 25728526 25338113 24929335 24453126 24130566
4085 24130566 23955662 23797275 23562819 23409646 23187839 22854985 22640499 22594871 22613127 22433770
4075 22433770 22408393 22391970 22328134 22404862 22418509 22485124 22668480 22725111 22890386 23043764 23193909
4064 23193909 23481387 23678227 23999242 24139205 24283515 24278581 24611617 24891927 24990595 25098174
4054 25098174 25227767 25377211 25541437 25699143 26034251 26293177 26397260 26549542 26660910
4045 26660910 26646819 26709469 26791547 26830693 26895878 26997688 27056875 27077533 27128137 27338090 27294428
4034 27294428 27434633 27562619 27715329 27870037 27977246 28137651 28331131 28616589 28891415
4025 28891415 29336478 29616976 30128683 30715991 31284802 32094028 33022394 34081190 35196425
4016 35196425 36394732 37887930 39526463 41410565 43549011 45872643 48333157 51047598
4008 51047598 54027448 57127193 60416189 63611832 66715874 69672126 72308348 74664667
4000 74664667 76729861 78616388 80090376 81223530 82248579 83196751 83911770 84460479 84820962
3991 84820962 85011073 85009782 84861307 84251072 83266718 82109707 80528360 78373260 76062105
3982 76062105 73456698 70902124 68344717 65842782 63242784 60926242 58852822 56747847
3974 56747847 54882398 53235470 51557889 50023115 48571428 47302732 46368255 45399368
3966 45399368 44614515 44074107 43561000 43157263 43007025 42948138 42991598 43086146 42990247 42960054
3956 42960054 42950419 42963777 43065124 43216815 43316491 43358986 43610327 43847301 43949161 44105456
3946 44105456 44388160 44674459 44765776 44904128 45026390 45295957 45554840 45690359 45877962 46270582
3936 46270582 46718476 47224467 48021884 48816530 49608165 50656780 52003640 53310525 54947936
3927 54947936 56788804 58840425 61071003 63616788 66501873 69727585 73158192 76837602
3919 76837602 81218366 85764023 90599320 95920718 101745906 107902993 114311729 121026407
3911 121026407 127689887 134608433 141470342 148056428 154519276 160694231 166722665 172466035
3903 172466035 177907013 183470788 189160914 194424801 199350138 203988665 208057985 211669558
3895 211669558 214518000 216545883 217543597 217682162 216925749 215593055 213702915 211309064
3887 211309064 208662635 205749101 202530168 199152272 195714881 191846860 187758358 183464074
3879 183464074 179113159 174649553 169997134 165466179 160713853 156456713 152452451 148788273
3871 148788273 145496042 142590698 140010417 137922504 136517049 135369989 134835213 134922162
3863 134922162 135430375 136518567 138398003 140798026 143920087 147848053 152493720 157968526
3855 157968526 164075811 170698629 177920220 185224098 192709875 200129798 206974699 213142784
3847 213142784 218551083 223170457 227067045 230333238 232977271 235299981 237472973 239306382
3839 239306382 240959047 242459444 243668291 244345918 244333605 243647878 242201548 239987126 236650053
3830 236650053 232854123 228633184 224204455 219803655 215667980 211849771 208395451 205781201
3822 205781201 203633883 202045346 201077517 200574575 200513825 200981648 201695661 202924593 204346886
3813 204346886 206236182 208497409 210834872 213613817 216362655 219405104 222442394 225430043
3805 225430043 228353822 231235518 234014086 236572532 238852837 240890005 242548229 243931156
3797 243931156 244956206 245518086 245733718 245752089 245483413 244817848 243798860 242738388 241503336
3788 241503336 239974275 238320927 236470443 234561072 232291311 229934204 227639444 225405585
3780 225405585 223230355 221131375 219134379 217283039 215662979 214408110 213538476 213086951
3772 213086951 212787214 212967747 213493104 214371095 215419506 216729028 217998155 219437226 220993722
3763 220993722 222584347 224150184 225786496 227279837 228964356 230890223 232429591 233920014
3755 233920014 235211713 236269839 236942585 237298575 237014929 236425004 235435023 234011000 232111408
3746 232111408 229652454 226932955 223763453 220382023 216640549 212556799 208206430 203516614
3738 203516614 198501109 193215362 187787457 182315374 176637447 170825704 164966726 159095806
3730 159095806 153244336 147604706 142018234 136548628 131030648 125719411 120566846 115667169
3722 115667169 110833226 106245500 101820197 97543205 93522992 89849191 86282958 83021287
3714 83021287 80032484 76962287 74120872 71559087 69070761 66793810 64471464 62419945
3706 62419945 60447954 58460130 56735324 55024822 53306954 51823124 50507749 49211597
3698 49211597 47992551 46774620 45732501 44582503 43509261 42467833 41548707 40489629
3690 40489629 39538900 38640057 37788863 36989969 36258235 35398265 34680287 33986560 33201945
3681 33201945 32452446 31931345 31304591 30671774 29849344 29239524 28595144 28041438 27466351
3672 27466351 26899483 26369070 25831258 25321970 24781123 24186420 23660885 23247212 22778452
3663 22778452 22278812 21891044 21398111 20970565 20563908 20272471 19957023 19482659 19154243
3654 19154243 18942710 18594085 18282709 18018044 17793351 17531948 17270844 17013745 16518655
3645 16518655 16258914 16030782 15836059 15682807 15474186 15156347 14903092 14745527 14448102
3636 14448102 14217237 13970291 13711716 13610402 13464815 13259022 13194280 12999735 12991098 12755388
3626 12755388 12637841 12486132 12311678 12234265 12079534 12002686 11981737 11926775 11821945 11720413
3616 11720413 11485221 11440843 11260829 11110598 11218412 11282547 11082881 11077675 10962841 10785950
3606 10785950 10552807 10493684 10466574 10395124 10243711 10112488 10002428 9888827 9788471 9714869
3596 9714869 9664556 9568990 9356068 9435830 9530051 9378888 9266202 9124372 9033496 8956697 8849807
3585 8849807 8778322 8716998 8711738 8552897 8481506 8462201 8384227 8353649 8292733 8236221 8327383
3574 8327383 8324298 8314830 8191376 8143013 8185152 8209254 8127526 8192123 8136617 8036834 7944858 7813988
3562 7813988 7861480 7933128 7926593 8016326 8009797 7967888 7974520 8084670 8095911 8013409 8077523 8091118
3550 8091118 8024652 8098018 8165957 8194454 8144398 8087162 8056390 8082567 7975969 7981805 8025654
3539 8025654 8005515 8111242 8095169 8064730 8030015 7990223 7993312 8037404 8037171 7966337 8026490 8050102
3527 8050102 8175217 8230135 8288955 8300708 8320864 8545328 8554752 8698264 8756349 8845080 8844769
3516 8844769 9029590 8967881 9002056 9160166 9262160 9326378 9488746 9637048 9824903 9841102
3506 9841102 9809157 9923105 10086937 10106728 10224454 10393470 10459036 10569260 10678732 10786311
3496 10786311 10992735 11163440 11188692 11225499 11403819 11604937 11660324 11824601 11912523 12083130
3486 12083130 12234685 12406966 12753993 12833310 12951297 13014104 13130522 13379337 13635079 13860938
3476 13860938 13991167 14247251 14430014 14782003 15088052 15380213 15599045 15883318 16171388
3467 16171388 16543084 16763249 16806703 17287019 17721500 18164756 18657665 19140001 19566183 20123936
3457 20123936 20600087 21145163 21763343 22433683 23230184 23870038 24633088 25532360 26526194
3448 26526194 27501318 28563508 29945457 31329731 32604694 34026370 35632901 37088007
3440 37088007 38673138 40208294 41874000 43491840 45063772 46554023 48012704 49100536
3432 49100536 49924094 50710286 51110549 51208142 50710100 49964270 48798899 47494771 45931285
3423 45931285 44195059 42450064 40673970 38904488 37287076 35693987 34086291 32688191
3415 32688191 31169299 29945324 28707140 27500542 26544517 25291623 24303535 23513176 22714127
3406 22714127 21919469 21339136 20868654 20354486 20057271 19759615 19506929 19257482 19036111
3397 19036111 18591573 18087438 17493773 16813483 16369412 15715148 15381937 14939680 14447229
3388 14447229 14018686 13572593 13206487 12869191 12598798 12231496 11912229 11563103 11388703
3379 11388703 10994832 10643474 10449924 10342181 10114192 9799911 9547212 9627703 9582201 9500976
3369 9500976 9485829 9477620 9405946 9299119 9087876 8838462 8667906 8466834 8259700 8013198
3359 8013198 7831273 7671421 7599951 7380078 7310710 7212674 7151380 6936461 6819593 6533405
3349 6533405 6314665 6237961 6214246 6204309 6130488 5852513 5867731 5892750 5706766 5668103 5453751
3338 5453751 5300870 5288996 5227479 5143458 5020833 5197948 5163580 5087366 5041370 4826454 4754152
3327 4754152 4838356 4736823 4695717 4658503 4612476 4601490 4561449 4635020 4532495 4378190 4413437
3316 4413437 4353688 4280970 4266168 4224818 4090171 4005086 3939053 3706094 3723989 3812294 3988845
3305 3988845 3991050 3944072 3868440 3870957 3825730 3763478 3820720 3793543 3788477 3722478 3689394 3709741
3293 3709741 3629215 3575740 3589215 3593370 3450920 3384858 3399292 3303179 3308201 3269951 3273806 3221685
3281 3221685 3299047 3342777 3185974 3063556 3118023 3204816 3159518 3015476 2888109 2834787 2799604
3270 2799604 2806341 2728941 2760471 2822613 2805580 2721673 2781448 2833585 2791732 2741116 2659564 2562073
3258 2562073 2629836 2700292 2721306 2617200 2585321 2536637 2539480 2513244 2521906 2466931 2504521 2396654
3246 2396654 2485662 2443448 2367694 2396820 2428276 2411169 2328768 2325623 2290591 2222466 2219960 2380605
3234 2380605 2368207 2311381 2259221 2240076 2281507 2159134 2158580 2093299 2179591 2171060 2104033 2146534
3222 2146534 2113112 2136482 2073893 2067644 2101341 2189024 2278125 2131702 2079982 1981083 2072761
3211 2072761 2147406 2099966 2087281 1963214 1880376 1973703 2074735 2087795 2151729 2041326 2126457
3200 2126457 2096139 2144769 2241085 2286976 2343792 2351897 2363458 2301192 2261652 2264277 2240128 2257342
3188 2257342 2200835 2230853 2210707 2203820 2282190 2274978 2219518 2316869 2398450 2457233 2374641 2392310
3176 2392310 2603292 2662843 2539795 2606399 2720601 2721113 2725385 2772322 2882961 2933725 3036484
3165 3036484 3228045 3346949 3370889 3331222 3333113 3372009 3434875 3370082 3411921 3457952 3598904
3154 3598904 3695216 3819883 3647537 3600764 3750072 3752763 3733573 3737973 3782785 3851381 3930395
3143 3930395 4058654 4277263 4343590 4339402 4458125 4572238 4821843 4946800 5125735 5423669
3133 5423669 5610657 5908828 6350535 6432922 6555016 6940064 7161677 7395747 7565773 7795855
3123 7795855 8032967 8313365 8455433 8793963 8958611 9091719 9213752 9361299 9572724 9592390
3113 9592390 9632354 9798641 10025321 10092591 10267302 10383482 10499530 10752511 11008247 11254325
3103 11254325 11440709 11601834 11862902 12166193 12492930 12936644 13316350 13763207 14198379
3094 14198379 14821556 15325045 15698860 16075186 16145077 16164419 15892489 15579244 15232477 14742425
3084 14742425 14439044 14073787 13773316 13455416 13118995 12867823 12732983 12594835 12480025
3075 12480025 12271583 12181943 12204769 11923705 11795954 11851635 11740655 11671061 11606795 11620478
3065 11620478 11778242 11776404 11879809 11798400 11650248 11688338 11515663 11307467 11084305 10818492
3055 10818492 10412200 10221068 10163876 9722682 9350752 9162349 8827093 8673879 8647876 8465111
3045 8465111 8219631 8053914 7783209 7609956 7396995 7266176 7051519 6857588 6544667 6313925
3035 6313925 6163458 5995970 5914590 5587344 5455870 5202497 5045351 4890471 4769167 4695433
3025 4695433 4480850 4241319 3937408 3873060 3775215 3690734 3648041 3474079 3362543 3280923
3015 3280923 3234844 3167284 2985189 2954510 2955841 2921694 2878223 2795468 2654393 2603961 2492254
3004 2492254 2315585 2327302 2204996 2175701 2153202 2095560 2012542 1949492 1973626 1956559 1825013
2993 1825013 1907106 1866114 1792176 1760391 1756915 1729548 1559526 1606247 1689168 1747005 1634227
2982 1634227 1564066 1399975 1308142 1363153 1408083 1335183 1324191 1344756 1166447 1229764 1174821
2971 1174821 1152186 1242595 1216558 1114196 1023347 977831 955034 933503 855321 932738 1069442
2960 1069442 1019059 986544 1041495 1040040 968661 923795 859894 842512 943150 923029 903756
2949 903756 832885 768412 801136 787875 835402 752727 819477 802921 786490 792735 788007 742389
2937 742389 658042 675098 564558 591866 605624 552596 672676 663184 514552 449703 487874
2926 487874 649746 493115 509732 460519 441165 365858 427265 477484 277851 263766 323929
2915 323929 268393 191759 319639 326238 332675 315577 277259 305545 299741 218165 183863 227793
2903 227793 345415 362774 306661 334376 269944 191635 228307 107753 137743 231894 253105
2892 253105 101987 70972 198528 225624 185133 181219 72842 107171 206700 142859 8385
2881 8385 -34807 6345 123708 204577 86591 6661 -80577 -113927 -39181 76182 59350
2870 59350 31410 44630 133731 47297 -59586 99071 4176 32000 109186 207931 211687 70417
2858 70417 91034 106879 113690 60954 -40 51467 56622 126857 165714 110617 136345 -21002
2846 -21002 -111208 -166744 -63773 -27 33652 96305 190436 264438 99689 163765 90434
2835 90434 23384 7080 38520 137138 67901 112386 51176 20023 -16163 -110059 -67815 89131
2823 89131 121990 103043 -6651 -5061 -29119 -93865 -166156 -96326 12016 57039 -2210 -577
2811 -577 24903 146144 177248 123131 82024 142313 63021 -2467 76545 -25182 -3987 28323
2799 28323 48386 89211 130927 48426 90174 4481 7656 22181 14268 30720 6342 127488
2787 127488 76145 -23372 -47049 -2596 82266 -34120 -97018 -121452 -66813 -221632 -167230
2776 -167230 -114167 -93575 -151046 -163276 -63328 -83763 69840 82764 43814 -113994 -159790
2765 -159790 -204723 -143074 -235419 -211986 -77820 -34522 -68000 -91131 71673 43374 -68610
2754 -68610 -137666 -209884 -80117 -114777 -109129 -29349 -136098 -92771 -114896 -110590 -64915 -78797
2742 -78797 -84012 -88882 -4406 -80562 -118389 -104868 -145623 -244923 -162658 -37130 -97514 -80279
2730 -80279 -38485 -50827 -159934 -207683 -245879 -212682 -324174 -352955 -250621 -123550 -94000
2719 -94000 -264084 -315593 -323038 -154440 -140065 -95600 -110509 -166482 -103280 -68640 -8051 -905
2707 -905 -28909 -39603 -92563 -62905 -71178 -89436 -99647 -103719 -109566 -187744 -176212 -260001 -134934
2694 -134934 -232908 -322679 -221684 -205949 -243337 -109466 -90379 -135336 -152990 -97003 -86252
2683 -86252 -125398 -119959 -194895 -175333 -226784 -188398 -45848 -204821 -291811 -263146 -307923 -354358
2671 -354358 -337589 -257922 -128761 -165403 -277711 -247257 -203512 -194013 -217450 -232524 -164107
2660 -164107 -251170 -192040 -154900 -276299 -248402 -202701 -197080 -325453 -244700 -190336 -254628
2649 -254628 -197866 -241452 -152265 -227452 -354408 -311356 -225116 -217596 -324229 -331077 -215199
2638 -215199 -293864 -288218 -142954 -274966 -205193 -224600 -68733 -62210 -17416 -3902 -79882
2627 -79882 -69840 -230166 -200954 -295874 -281227 -376640 -327570 -192314 -189518 -198030 -156176 -182748
2615 -182748 -195976 -148562 -148075 17808 -184865 -235265 -164608 -165168 -169291 -104172 -172843 -276284
2603 -276284 -243134 -313607 -311772 -138744 -74953 -39240 -66480 -165101 -234797 -287411 -260793 -262501
2591 -262501 -263690 -205705 -185722 -149161 -85171 -16379 -137076 -220932 -117423 -128380 -67117
2580 -67117 -141611 -300286 -348165 -441348 -403917 -226712 -166226 -175057 -183645 -201771 -227774 -202618
2568 -202618 -35438 -62622 -214363 -111581 -128047 -113052 -49754 -152201 -223286 -132689 6091
2557 6091 -27865 -27751 29337 -17361 -92992 -64914 -100346 -191130 -235096 -259517 -350347 -230570
2545 -230570 -88810 -92870 -202846 -185073 11352 8771 -173511 -264106 -242913 -157907 -227524
2534 -227524 -216417 -232394 -314625 -175839 -271921 -185899 -93949 -46291 -105340 -345232 -268310
2523 -268310 -102255 -130919 -131325 -20532 -64285 -149644 -211889 -254535 -311609 -190374 -170504
2512 -170504 -278616 -228031 -175568 -106494 -70297 -284420 -231953 -53958 -100841 -155028 -213171
2501 -213171 -105696 -161096 -75484 -111889 -117878 -126449 -111993 -164241 -202957 -73230 -78420 -102414
2489 -102414 -105421 -173570 -222868 -264837 -270887 -211208 -265195 -273665 -89606 -123631 -275696 -219172
2477 -219172 -151475 -129988 -145312 -171925 -236201 -147973 -9717 -75373 -165373 -118943 -87148
2466 -87148 -141319 -162557 -238763 -271921 -200972 -268406 -202127 -245369 -140162 -66874 -140071 -224480
2454 -224480 -250918 -195495 -184603 -99560 -42025 -195000 -129184 20820 -179420 -239800 -198262
2443 -198262 -119393 -138697 -150646 -185954 -110440 -95198 -157584 -187226 -125518 14777 2436
2432 2436 -31747 -95177 -109183 -106182 -113171 -74525 -15468 -191287 -270983 -187029 -233644 -281943
2420 -281943 -228280 -172794 -93830 -64964 -225614 -264734 -188061 -225814 -96145 54504 -117121
2409 -117121 -285792 -136492 -69810 -251308 -197301 -10121 -9727 -46164 76212 -17181 -108496
2398 -108496 -33666 -69276 -67725 -69561 -30521 65340 5503 18153 -65195 -64261 -115875 -81479
2386 -81479 -125740 -179203 -90679 -113595 -77416 -94992 -199969 -127188 -162460 -172915 -3621
2375 -3621 -19059 -35554 42147 97915 123969 61270 93843 35120 18531 165888 87314 37680
2363 37680 -1067 192161 278067 175202 106103 198263 197101 130380 269603 238171 150034
2352 150034 183146 157836 135565 115027 160787 252082 313036 335349 481581 498083 393511
2341 393511 351378 368392 440832 487795 456307 438172 503974 547680 601989 621501 632453 748792
2329 748792 716816 776877 755390 758583 825645 843189 995135 1161604 1122698 1197858 1337794
2318 1337794 1464987 1665296 1716057 1896463 2016950 2265527 2524473 2675496 2892981 3195588
2308 3195588 3384096 3891726 4318615 4828615 5438384 5942594 6487992 7273660 8391772
2299 8391772 9539047 10923957 12758107 14969001 16617031 18020649 19426769 20950090
2291 20950090 20853497 18950482 17397206 16052278 14813716 13535080 12169358 11230256 10507145
2282 10507145 9899352 9314930 8736615 8160341 7681808 7144358 6561421 5949649 5401999
2273 5401999 4825663 4374210 4025166 3663177 3359332 3027057 2722110 2547286 2346540 2158794
2263 2158794 2205656 2066403 1888437 1832877 1678983 1624103 1523422 1526574 1385349 1342893 1280978
2252 1280978 1179530 1124464 1069435 1127103 1001682 1073213 939821 846917 832171 838419 658863
2241 658863 647520 618666 668761 720143 609640 641556 448728 406293 470029 428156 369335
2230 369335 325993 387958 347320 354360 440998 495605 427862 307300 317703 376342 311680 401457
2218 401457 358239 246800 334280 418806 312334 77668 203323 275381 203452 204071 251240
2207 251240 248877 254216 231483 108060 190700 193699 244064 296719 232709 163907 205935 241306
2195 241306 152140 126402 100380 -10647 -21447 156726 191681 143966 194000 108556 107887 144756
2183 144756 122082 68409 101883 4435 -58695 -23599 57437 77401 59825 -43363 -62943
2172 -62943 19332 30007 -45407 -70950 15093 68920 72403 -19876 -10864 11841 -28834 -102718
2160 -102718 6422 -48804 -135140 -1262 -19267 21321 -1586 21643 65902 -45452 -34156
2149 -34156 11530 10789 3404 88376 57324 -33683 -40007 -35585 -45522 -14645 30794 117097 90277
2136 90277 -98747 -200471 -82447 -94262 -138749 -178054 -198881 -134900 -140628 -120693 -27921
2125 -27921 -109248 -33889 3287 -74097 -47831 -64069 -76078 -79596 -1167 12514 -121746 -188847
2113 -188847 -207864 -210400 -215837 -211058 -44717 6019 -51808 19976 -79366 44061 143839 15033
2101 15033 -190175 -111753 -101799 -156010 -127526 -187830 -225282 -102423 -92740 -87202 -90327 -29063
2089 -29063 -85382 -186408 -140093 -78151 -14826 -90463 -5768 25476 -75701 -1441 20569
2078 20569 -15267 -97063 -226182 -161623 -48311 -12884 -58082 -175721 -147290 -87157 -87200 -230109
2066 -230109 -92174 -56658 -74286 26052 -14912 -8925 -167242 -212963 -98053 -130908 -230584
2055 -230584 -291791 -227160 -112577 -52472 -115937 -168939 -114303 -45480 -58196 -99416 -102522 -130146
2043 -130146 -50202 -89062 8351 -71855 -169874 -125570 -116698 -136529 -62103 -168734 -119754 -84122
2031 -84122 34341 -100975 -57767 50342 21897 -18850 -63471 7146 84008 125444 25595
2020 25595 -91670 25336 24403 -19163 73080 148768 -33283 -33207 23196 -30115 -16256 94299
2008 94299 -125316 -131303 -15804 -40552 -62858 -6904 82943 14088 -26950 -79691 -26154 -51235
1996 -51235 -58146 -130449 -104602 -208430 -248012 -222091 -149576 47055 42931 -53519 -91880 -139365
1984 -139365 -70155 -165278 -142401 -227056 -211241 -253800 -250257 -207543 -156951 -101714 -129175 -73437
1972 -73437 -104618 -19372 55797 27748 14149 65379 -79927 -93482 -88658 -116341 -90762 -202514
1960 -202514 -79001 -61739 -70843 -23371 3060 -24181 11966 17062 -81731 -47572 -148204 -181152
1948 -181152 -316495 -277984 -128649 -75072 -40014 -69718 52777 49863 -64935 -149307 -114719
1937 -114719 -108134 -133737 -211051 -203246 -133299 -63898 -130807 -90610 -133687 -35293 -128861 -81657
1925 -81657 -20856 -36986 24499 -59144 -42765 -111864 -63028 -111362 -139112 -68323 -73676 -64216
1913 -64216 -95023 -172108 -310778 -260977 -66461 -83372 -125190 -8050 -51783 -76370 -53173
1902 -53173 -9705 -87623 -210692 -69761 -159498 -82544 -189425 -166959 -132056 -111538 -108228
1891 -108228 -178817 -124305 -262754 -291111 -355487 -217430 -565 -10384 13909 -17587 -53078
1880 -53078 -67135 81910 -43118 -63691 -18402 -42314 -78682 -117580 -24535 -67398 -35908
1869 -35908 -129117 -123095 -138351 -71579 18430 58402 82328 73031 -28751 605 102 -2433 -19144
1856 -19144 -65059 -14349 -127764 -263282 -175456 -157925 -122870 -239675 -206773 13382 11532
1845 11532 136316 94845 46759 10769 -30248 -8301 -10492 -61250 -111271 -119237 -2693 75223
1833 75223 80131 -55336 -41819 -13030 -60140 -133437 -147987 -161559 -52278 -47478 -13289 -17009
1821 -17009 -71746 -95432 17668 -176468 -285225 -134335 -130877 -34021 -119589 -154904 -178385
1810 -178385 -169572 -154152 -143931 -153686 -129694 -126484 -175812 -220932 -204211 -229061 -80604 -108841
1798 -108841 -126530 -45002 -48099 -68374 -121512 -293236 -248747 -130037 -87589 -116169 -139424
1787 -139424 -132758 -117075 -187211 -73243 -14564 -17206 32135 43384 76974 20818 -124147 -104222
1775 -104222 154627 10773 -76371 -68039 -25016 -5089 847 -6851 -21817 -55750 78665 -54554
1763 -54554 -45683 93257 -12670 -68579 -61309 -77669 -55690 -61400 -135931 -169585 -151713 -119401
1751 -119401 -106161 -114320 -188497 -51182 -39836 -162931 -94334 -40607 35655 -59746 -68876 -123131
1739 -123131 -130043 -62172 37374 33031 -27942 -27534 -46626 -52093 -57749 -11957 -139449 -132188 -84104
1726 -84104 -61248 28713 21198 36066 48436 -107936 57918 -113212 -77832 -103768 -165110
1715 -165110 -115631 -18301 9889 32249 24860 -16572 -56771 -63125 -154339 -188764 -126167 758
1703 758 -7396 -153773 -18158 -46504 -7696 -9533 70170 -22000 -105877 -118688 -176312 -238633
1691 -238633 -81883 -134418 -248491 -208689 52288 82097 -6468 -43027 -103494 -124124 -112227
1680 -112227 -123853 -63345 -112512 -178037 -125861 -177068 -126571 -61129 -69736 -7560 -12794 -41595
1668 -41595 -103206 -105182 18109 55929 55516 -142289 -195285 -111177 16690 48482 -73277 -40486
1656 -40486 -17055 -13561 35110 80300 20611 -30605 -49850 -48747 -32439 -126417 -87175 -78991
1644 -78991 -155487 -107576 -37980 -5197 85975 78423 20778 -46562 -70883 -128019 16253 -53322
1632 -53322 -148981 -79701 74803 65378 98591 66768 -61577 40661 64773 107551 161259
1621 161259 104280 -68104 -134067 37655 86105 27088 -114308 -120896 -101405 -148768 -56045
1610 -56045 9539 -15549 62852 91237 40604 137591 167180 -2298 -102845 -111020 -17358 4138
1598 4138 26702 -9725 38570 136305 22924 65513 28209 -15118 -7486 -7500 -2283 38976 3376
1585 3376 17118 157393 151024 -61509 -138526 -66711 14445 41403 16983 -91728 -183355 -188609
1573 -188609 -21780 45198 -73028 -46891 -1054 36800 47575 31523 64329 19681 -142923
1562 -142923 -88939 -25803 -32680 56910 39953 42166 -29970 -97631 -107172 -37764 39848 53042
1550 53042 -66539 -14894 15412 -60291 -53370 43196 29323 116765 35370 94302 111417 -4513
1538 -4513 9950 -84892 -63163 36902 7285 17579 -82678 -96538 -70645 -108573 -148363 4568
1526 4568 169621 14448 -69517 -33522 -76845 -162414 -57020 -55709 -48576 11889 42939 -6427
1514 -6427 12603 -53395 61229 33672 21962 44127 -7375 84961 57190 -40035 -69454 -47174
1502 -47174 -47339 16675 -30454 -42552 -70360 -76863 40846 -23929 47301 85158 112033 118824
1490 118824 -111047 -15098 35206 -87163 -163036 -138024 -93188 -112750 -63638 -160306 -203717
1479 -203717 -155287 -74507 -194154 -148706 64087 60996 -13643 8521 -33357 -67370 -12574
1468 -12574 -3240 138441 63358 2881 80016 81490 90367 48563 34867 23542 -36783 -30904
1456 -30904 -36991 -105464 -27438 34783 -22482 -47596 27997 -5110 5460 -10517 35859 24760
1444 24760 18206 152215 96585 134956 53071 -3106 75727 82449 68001 13111 -97729 -165308
1432 -165308 -92539 -122466 -169414 8135 8907 -6468 -12508 78131 163506 108998 74298 54188
1420 54188 -67519 -194967 19715 -15873 70787 54019 4570 30278 1997 -48787 -26996
1409 -26996 48809 18011 40579 92169 40667 -4575 -36448 -39359 192894 132905 14083 39785
1397 39785 -42925 64296 52141 116733 79869 25358 -35803 -211869 -175240 -111322 -123150
1386 -123150 -118371 -65845 -42240 -9487 -45960 -49079 -152358 -127497 -154522 -102814 -150358 -70022
1374 -70022 -26573 -100970 -51139 -63154 2491 -73958 -168073 -51922 -38821 -37294 8972 143376
1362 143376 67726 -58579 -130385 -24760 -2695 -81405 -56496 -105714 -45828 -35553 -85124
1351 -85124 -63179 -45170 -71390 63109 138376 131232 80328 125296 167384 36009 -65921
1340 -65921 -10084 -44092 -102465 -19118 43686 51644 34922 -36101 -9027 -22684 -39475 6266
1328 6266 141528 87938 88271 53721 1923 -28447 -51238 76636 31160 115683 50825 86143
1316 86143 103632 47994 32125 120797 138572 27889 35492 129516 189974 210009 167533 142213
1304 142213 34793 -134903 -110517 -67251 -167907 -124207 655 -41608 -84566 -113637 -104686
1293 -104686 -172642 -76725 28241 -47573 47284 20440 59867 -45393 9104 124444 39817
1282 39817 32086 26242 32702 8471 75273 -18808 -26489 -6636 8907 111069 4750 -99610
1270 -99610 29877 -5472 72660 64607 50489 -56040 -62307 21589 86698 163713 103173 986
1258 986 -210518 -52972 92758 44557 -72700 -82870 39250 -7644 165238 127039 -37818
1247 -37818 -30360 -32471 53989 132407 34459 -19683 79380 69606 24513 6511 49573 73321
1235 73321 2708 -49397 -47791 -66649 -49204 -105961 19879 -47963 -37209 27541 42906 124832
1223 124832 15539 4274 9429 39404 -25136 -11053 79906 100350 73456 54918 1668 -7033
1211 -7033 62161 130236 93947 41172 38299 -34645 -93555 -41641 -59687 49251 57736 74838
1199 74838 74861 70813 76341 -77598 -139220 -40408 33725 -47650 -52397 -21996 -36927 -19596 -27424
1186 -27424 7990 32961 27321 111853 97682 38055 -7634 -41520 -24637 -24592 29999 48567 -55730
1173 -55730 -22829 117746 36185 -43423 29257 96006 7738 -83985 -23774 -72046 -34821 96771
1161 96771 28225 23693 -82083 -95755 -15156 -47459 26294 40467 59375 33463 52275 88105
1149 88105 117704 67936 60723 -121957 -137351 76877 119062 927 -41999 -73535 56377
1138 56377 49510 7958 -151474 -35167 185168 139963 25848 66819 148637 4546 -7275
1127 -7275 66464 58384 93339 66518 50061 96613 42055 -2129 95167 89824 137574 192237
1115 192237 9062 9005 -51812 -24335 -14638 38091 30582 -14116 21976 94119 5474 -51012
1103 -51012 42698 91468 19381 -48832 -96661 -52829 112536 47476 -27184 43128 54362 24214
1091 24214 -54459 39293 149836 141644 128782 97966 -49044 -88636 -17896 51784 62306 55312
1079 55312 113269 150727 70709 128694 83378 71073 15597 41781 73696 49666 114959 246084
1067 246084 74922 -28370 -81618 -78067 30168 35448 -52074 -121733 101135 31731 -2599
1056 -2599 20466 9776 -189066 -263456 -80161 87824 -81804 -53765 136032 231956 183540
1045 183540 184816 143951 -743 -93207 -8062 80077 90873 189190 206410 197610 113297 92170
1033 92170 135158 141589 110758 71921 38057 -102806 -81028 -30963 54654 13050 -21513 72699
1021 72699 164835 97602 -113924 -207401 -152246 12841 34951 -66732 -53289 -164947 -106664
1010 -106664 68022 55828 68972 21442 40678 86629 40827 72799 118593 86510 76459
999 76459 114020 39027 -57297 -20710 -30615 5897 -7271 56495 101411 152989 28826 -52611
987 -52611 39895 124976 1833 71486 34844 -21484 -33290 -57812 28840 34592 -30827 -62046
975 -62046 -1763 31671 70087 -2563 33186 21779 82506 48977 -151547 -152612 56303 25145
963 25145 -20443 3561 -47392 63842 42709 134452 158961 98884 25892 23983 9731 -85498
951 -85498 23813 141258 73646 98675 -9884 -91909 101183 114010 63245 -2682 32071
940 32071 75741 46842 159554 165916 -52852 -16605 46790 134271 16329 24679 -15762 -157093
928 -157093 -205536 -85650 5665 1898 21416 -26846 30456 -50736 1549 59169 22265 101731
916 101731 44815 -73198 34811 36477 117216 90378 18257 -69257 -111534 -37573 44740 87206
904 87206 92542 90089 83053 106737 -2235 58668 17537 -44105 78811 -3959 65734 73164
892 73164 95046 130735 45173 4748 -21723 44272 104147 199769 223063 151217 152270 -6754
880 -6754 -4958 69145 68427 178509 107445 119641 83673 -18344 11423 -6980 56531 -36677
868 -36677 -50112 100642 84347 30783 -19571 -12653 -33018 113329 49676 7902 -16323 116222
856 116222 33289 -120978 -110350 -59480 -67340 -41837 75398 70098 -11963 -50905 80356 118056
844 118056 61148 -40277 -15987 88612 171584 81925 -51699 -46975 39929 84373 134022
833 134022 100973 62821 148955 224263 167453 35000 -89713 -69307 -33436 -17531 -109861
822 -109861 -107259 64920 158011 2756 -4076 207920 146464 45895 -12448 36872 133781
811 133781 179509 62480 69162 23581 68920 96431 28870 65560 -945 67533 22407 34651
799 34651 -4541 73326 47286 6135 18616 42834 84326 19098 -120400 -79485 53296 63578
787 63578 95407 57999 78951 103497 14001 34 177238 166635 45113 7586 46255 -82949
775 -82949 48876 64453 15676 86037 111398 73899 34056 40143 10462 82607 38628 77770
763 77770 -4302 83789 99564 36521 32709 75711 71389 24103 91415 153704 132406 88781
751 88781 125837 175141 67947 86584 128633 160022 114052 16548 184998 119322 25454 -63755
739 -63755 -10734 74653 122524 105872 115941 -2938 77273 -73888 -33664 27104 20477 -21323
727 -21323 -39625 10624 -14190 35547 83891 149629 142276 51345 -153540 -19833 -22866 79066
715 79066 103353 78774 -63716 8056 34565 -26856 -79589 -91813 1812 3109 -9527 -24291
703 -24291 -6381 -91947 -40918 -24394 -7128 134258 88662 73967 31853 39517 108033 65229
691 65229 58949 -4489 -5647 36086 140314 174364 7712 -109885 -46560 6845 -61754 -41329
679 -41329 18852 110563 81258 183085 201124 119467 100313 14199 44617 51489 87979 145743
667 145743 -21757 -74371 24458 -6472 141465 127122 9851 -78823 -24424 149363 166493
656 166493 33692 72470 36312 -13191 181 -5671 -15034 -9533 94681 115657 84235 36827
644 36827 -69334 -134696 -28528 -26297 18546 58706 -13504 73078 67924 26809 40861 32109
632 32109 12806 -35403 28274 98363 51800 -110240 -62083 26491 138502 95653 77975 1721
620 1721 -9535 104057 49589 67412 16091 21708 -2856 -122813 34993 124056 -499 29974
608 29974 149507 -29632 22945 80389 43927 47410 -12536 73308 73266 11656 92763 167825
596 167825 40659 -32129 34489 45385 -75467 37576 10407 5793 43663 28586 33802 3620
584 3620 -40295 140649 64632 58086 79543 65965 -25260 32449 73117 -61517 -81874 -102812
572 -102812 -92892 -32207 -18391 -4502 31177 -67518 -60323 -81861 -75458 -125325 -156953 -143749
560 -143749 -59387 113296 82324 48302 25418 -29533 43256 145656 158910 44975 -29883
549 -29883 -58660 43665 84773 149 14122 66152 140 -15477 35029 15998 19130 -51420
537 -51420 -71397 67079 130533 187928 108811 63088 30305 -59709 -121007 -119232 -88230 -35367
525 -35367 -109417 -76492 -75294 -48288 -62236 1913 3778 11392 130879 217609 157715 -10922
513 -10922 75234 256197 257059 145903 193952 128331 -23299 -27791 56017 -6097 65852 -152686
501 -152686 -105344 -156473 -114888 -52428 -38813 22607 -42828 -28129 -112702 -83770 23533 -77917
489 -77917 66895 93369 -50000 -50539 -182917 -68903 -101052 -68382 -19875 13367 74426 146211
477 146211 124726 172369 94945 -49009 -63708 -9119 8597 -103182 -91415 75162 67428
466 67428 59501 -10773 22058 8167 11586 108464 72807 92453 157595 107115 199665 110045
454 110045 1745 -14455 69943 -7805 -23585 -72523 -49097 -24271 -7949 23483 -17580 -10823
442 -10823 -16534 169916 145392 75039 -71582 44244 -19062 145187 93915 -34535 -48717
431 -48717 76072 122869 38304 -1441 -28369 -19937 -45192 -19515 -968 -28637 -12740 -33636
419 -33636 -108511 -112530 -123788 -47339 -125936 -126436 -124589 97948 108221 12772 -16220 34518 -48099
406 -48099 199 32568 36619 13193 6094 121064 56215 18475 83077 144270 33900 116210
394 116210 17548 30453 69842 63190 21228 -73241 73599 81890 66451 112082 119564 26257
382 26257 -47558 6605 65810 139806 10096 -4490 -18752 49799 14538 -175 47478 90259
370 90259 92051 131747 89903 64073 166186 118430 54094 8436 31935 21137 54733 28818
358 28818 -21058 -80605 71150 136506 97264 171900 109728 98850 18368 25158 30779 74661
346 74661 43100 113263 1178 -126003 -72771 -79653 -22052 -1190 69622 -27586 -131501 -74438
334 -74438 -21044 -34905 -95453 -69199 74822 18964 -51285 8362 135533 211 59576
323 59576 45700 31076 100338 2329 -16593 -9490 -31479 -78080 -81699 -16834 -11485 6140 47344
310 47344 66145 30774 -9518 7040 -33241 69848 58398 7092 44083 127688 150729 75720
298 75720 -4928 -91052 -60054 9511 -28382 6417 157240 161739 56830 13199 71029 -7164
286 -7164 -13794 91110 -32972 47427 88843 178760 217041 181434 67353 22037 -11428 -93343
274 -93343 -122365 -83061 -19354 12871 74858 109170 91843 48676 -17919 -44889 61961 78050
262 78050 61697 90852 110777 -40484 -58669 106459 93639 -19297 -54111 -22347 -15324 38426
250 38426 288268 138219 114286 12462 5132 -25360 43820 -10958 -10423 167682 114825 95913
238 95913 77585 -19784 -78544 -28638 34676 11067 -57628 -55946 -72219 61835 160757 56244
226 56244 49349 -55934 -105686 -86741 -815 19967 48332 53405 -27415 -53210 70392 97775
214 97775 49891 74133 71224 62475 -38643 -56468 63026 84689 34530 -5567 -2131 100147
202 100147 -55723 -21892 76319 118968 10965 -11066 -46027 49577 134167 124995 31713 -1145
190 -1145 -15948 -15015 36672 -6856 -24801 73889 -2131 -105675 -62694 -52392 -56649 -60420 -73592
177 -73592 -77010 -172387 -134095 -110488 -57447 16605 55427 -10216 -35153 47592 97958 -106091
165 -106091 -141107 1814 -45054 -55848 85615 26565 130802 163225 23234 -7850 -50876
154 -50876 -11303 -7705 195948 45917 46260 13618 -87706 -76679 62969 102197 59684 128125
142 128125 26846 121364 176626 51901 41489 39014 -52247 -61180 -69205 -73033 -45856 -13657
130 -13657 42021 70759 62499 -34998 -101715 26879 63808 99110 31783 -52227 -76991 -70767
118 -70767 -124076 -70175 -9340 -45148 -9151 -31665 6722 13303 58673 -19049 45559 14933
106 14933 -38091 -110738 -73977 -14357 -90250 -139223 -56855 39274 -34245 -22720 -2565 -55961
94 -55961 -6979 -87313 -75624 -11579 2342 35020 -9033 -7222 6659 69515 -92170 -103290
82 -103290 -143146 -69376 63298 35527 -11231 67665 130058 105742 14543 22299 176648 105275
70 105275 112495 66405 -103493 -13810 81154 78427 104069 23491 151948 46808 -6622 -53192
58 -53192 -11098 -37239 -41408 11914 43443 23718 24233 -12220 -94170 -73955 -107696 -73837 -37862
45 -37862 -1581 38990 -26269 -4257 23293 54815 110882 -31573 -74290 -6913 30297 -26464
33 -26464 -21608 -24169 4976 -5334 11182 -67592 -130892 -32140 19406 5581 -11107 -59588 -166910
20 -166910 -58105 -19034 -60371 -375 -6827 -17764 -93428 -48927 -18592 11114 -16185 25193
8 25193 13054 62445 -18384 -29988 10407 -41836 -14030 -18063
0 -18063
$$ Imaginary data points
##PAGE= N=2
##DATA TABLE= (X++(I..I)), XYDATA
16383 -2484107 -2435498 -2317783 -2350681 -2350164 -2274367 -2202592 -2088342 -1995099 -1939679 -1944393 -1955404
16372 -1955404 -1901300 -1809296 -1726171 -1782836 -1775398 -1662950 -1599522 -1614116 -1551918 -1574393 -1463457
16361 -1463457 -1397474 -1282494 -1232042 -1297198 -1272566 -1127129 -1019453 -1029476 -988538 -956700 -912580
16350 -912580 -902568 -838512 -852659 -780104 -675888 -611385 -598871 -490115 -455827 -414314 -337256
16339 -337256 -301113 -299550 -318230 -194723 -186202 -152103 -147000 -129851 40165 54694 72244 16132
16327 16132 88914 59795 128998 217384 290553 408273 507697 532633 524987 592747 723862
16316 723862 664204 699137 910091 831851 877780 876227 922612 1020253 1124832 1155982 1230709
16305 1230709 1244289 1199744 1200172 1226682 1264334 1337894 1356360 1467827 1430055 1512756 1495449
16294 1495449 1557203 1624358 1620725 1702786 1580232 1610751 1762078 1775920 1905880 1891914 1912348
16283 1912348 1996397 2007575 2095151 2147592 2066646 2086833 2209716 2238173 2284534 2341900 2407050
16272 2407050 2294928 2358052 2467744 2496342 2569264 2605399 2690875 2701231 2665448 2743330 2666852
16261 2666852 2705418 2769249 2836308 2840636 2894907 2940586 2976054 3023813 2991085 3038012 3010072
16250 3010072 3082594 3172900 3111211 3179120 3196505 3246277 3226117 3219603 3213469 3248975 3263238 3416913
16238 3416913 3305747 3212947 3280133 3410372 3445654 3487261 3566781 3557772 3522574 3488623 3652998
16227 3652998 3737196 3643989 3596490 3784700 3809026 3735140 3701423 3731960 3756697 3868797 3946143
16216 3946143 3899527 3848802 3820834 3936267 3920027 3897344 3911580 4027650 4044502 3932462 4037388
16205 4037388 4187817 4172248 4196131 4239546 4354006 4362503 4337261 4410928 4434920 4393172 4417748
16194 4417748 4500647 4415664 4437821 4478450 4570196 4450347 4324821 4382725 4470096 4514861 4578799
16183 4578799 4504775 4563809 4486032 4563657 4512800 4515314 4555543 4464794 4482652 4623912 4701717
16172 4701717 4589018 4648668 4716387 4666192 4766574 4853941 4782694 4826235 4832393 4789401 4736157
16161 4736157 4557654 4588312 4788953 4858116 4816234 4810108 4858608 4914375 4975919 5050003 4943348
16150 4943348 4832634 4833781 4891130 4845404 4811927 4835776 4936720 5016762 5003413 4988958 4922295
16139 4922295 4999790 4935581 4853419 4861211 5116278 5041909 5059883 5057081 5002652 5077638 5185812
16128 5185812 5167823 5124275 5132857 5108762 5252807 5253025 5243300 5118666 5134865 5213220 5156218 5159692
16116 5159692 5151497 5090754 5153644 5214102 5183576 5227882 5213561 5192542 5299483 5241278 5148251
16105 5148251 5267140 5256795 5314366 5331867 5263986 5158052 5124164 5283047 5276715 5376421 5337176
16094 5337176 5178300 5169584 5122700 5169253 5265077 5319663 5218272 5218001 5286725 5307259 5255622
16083 5255622 5273684 5241556 5291470 5329785 5211562 5148961 5136059 5230461 5336101 5449593 5364342
16072 5364342 5386924 5384661 5368230 5320492 5257201 5156866 5325446 5387384 5380627 5377095 5458582
16061 5458582 5507150 5484731 5455431 5417753 5311176 5327637 5400350 5395929 5309279 5328441 5370460
16050 5370460 5317518 5404421 5360863 5275520 5358623 5364657 5332604 5570513 5398706 5344485 5326030
16039 5326030 5266204 5283398 5370378 5347665 5336869 5370616 5420137 5367044 5339782 5329518 5483069
16028 5483069 5396789 5448829 5466941 5324253 5340735 5240608 5263919 5382276 5338454 5372632 5479819
16017 5479819 5514976 5465674 5525404 5405957 5417327 5507762 5346509 5369197 5406599 5382677 5370890
16006 5370890 5375709 5382258 5323711 5322107 5313092 5245086 5300914 5346330 5463027 5426554 5371480 5348170
15994 5348170 5265970 5192323 5329866 5336718 5325199 5352803 5338784 5330826 5364067 5389858 5523597
15983 5523597 5474649 5389114 5410732 5396956 5373814 5377407 5371468 5334580 5345897 5353450 5439862 5549220
15971 5549220 5566474 5484037 5449543 5475905 5466731 5283317 5354594 5389570 5499515 5504166 5530340
15960 5530340 5559450 5446513 5380285 5420092 5471987 5491552 5446305 5364834 5425656 5382180 5343546
15949 5343546 5368300 5443147 5440974 5432421 5411452 5387213 5351315 5520857 5573012 5618988 5627742 5537585
15937 5537585 5453649 5515599 5448983 5402445 5367511 5430829 5467666 5575561 5485071 5473580 5515239
15926 5515239 5499385 5457247 5247868 5304137 5396853 5398270 5337275 5268890 5448315 5410474 5509662
15915 5509662 5515613 5482184 5497385 5414246 5420029 5411919 5392946 5437433 5451579 5423506 5508481 5506786
15903 5506786 5557544 5638657 5530077 5376542 5433446 5453588 5560160 5544416 5448589 5462743 5496338
15892 5496338 5506201 5476120 5518224 5522507 5509644 5484357 5533480 5582624 5436259 5445924 5542760 5579999
15880 5579999 5571221 5716632 5611823 5616506 5588608 5561852 5484548 5437093 5434435 5483060 5470205
15869 5470205 5480083 5421320 5350267 5508445 5611649 5533972 5538423 5557193 5494748 5350264 5359598
15858 5359598 5528521 5640058 5658621 5666971 5610538 5603981 5536153 5482592 5442625 5405299 5383954
15847 5383954 5521657 5409506 5387654 5433666 5448609 5498440 5425391 5519252 5478841 5481597 5539834
15836 5539834 5550467 5496007 5562408 5577862 5583548 5644175 5681189 5582760 5463890 5597115 5597549
15825 5597549 5612077 5520831 5350812 5423312 5447284 5603999 5597425 5572952 5589099 5521365 5442592
15814 5442592 5514365 5496595 5393486 5450372 5450932 5405646 5446069 5388219 5391047 5505311 5578014
15803 5578014 5616815 5625541 5671823 5586244 5579826 5562777 5533628 5567076 5538172 5628213 5525714
15792 5525714 5606228 5694711 5618016 5533971 5522166 5581094 5648129 5641222 5627895 5486260 5562239
15781 5562239 5498291 5498180 5613409 5601081 5556108 5602722 5634524 5579892 5491243 5560561 5573019
15770 5573019 5547371 5446980 5498669 5536705 5458375 5582962 5460471 5498489 5519138 5627444
15760 5627444 5669295 5703953 5677442 5552511 5467384 5357117 5549057 5578526 5534193 5656106
15750 5656106 5614646 5498552 5486666 5559246 5462209 5472974 5523520 5569820 5562584 5538696 5453626
15739 5453626 5430309 5515651 5536040 5688404 5846668 5722199 5621849 5648015 5621310 5429897
15729 5429897 5440401 5500963 5546923 5653711 5620048 5606975 5572982 5475771 5513942 5465073 5477885
15718 5477885 5548064 5498086 5541683 5469598 5499588 5486974 5456524 5541430 5591464 5626643 5512528
15707 5512528 5524231 5616971 5645256 5628273 5554840 5520853 5566435 5622060 5556270 5577715 5548906
15696 5548906 5560015 5604657 5544672 5637263 5602459 5561167 5590813 5496875 5447926 5552743 5593317
15685 5593317 5532664 5455667 5491765 5530329 5466421 5538014 5563965 5510235 5539795 5660257 5693867
15674 5693867 5529061 5582638 5567789 5527364 5597916 5632988 5632309 5568343 5548518 5577925 5711622
15663 5711622 5760237 5678728 5645913 5773525 5709777 5710106 5586573 5430772 5447461 5536912 5684828
15652 5684828 5646305 5669362 5644321 5674385 5694494 5688046 5693647 5737848 5702483 5632799 5682278 5718882
15640 5718882 5635160 5581964 5606362 5601066 5644559 5679265 5638092 5643084 5684105 5646976 5673908 5698920
15628 5698920 5663601 5576776 5471278 5575232 5678806 5620106 5682631 5647318 5550327 5490016 5469418
15617 5469418 5523119 5650514 5765897 5676318 5657826 5729111 5616614 5564593 5594859 5647058 5662728
15606 5662728 5655882 5534933 5474544 5549718 5686336 5660639 5710825 5599582 5627797 5775614 5657675
15595 5657675 5622374 5618233 5617921 5477054 5451249 5492527 5526697 5528935 5541145 5547579 5467569 5433929
15583 5433929 5423506 5442809 5576251 5510374 5550664 5685392 5709507 5781233 5771264 5684941 5679038
15572 5679038 5629867 5667121 5762689 5702538 5665816 5666571 5696637 5647891 5799735 5814295 5801259
15561 5801259 5806083 5667926 5732379 5660495 5727140 5676177 5669501 5676590 5671534 5689905 5608049 5580554
15549 5580554 5468048 5522742 5522040 5463861 5597575 5660272 5620825 5594679 5670011 5717890 5673722
15538 5673722 5677655 5702745 5624345 5588955 5490885 5549190 5675279 5593828 5581050 5681610 5692575
15527 5692575 5675239 5708720 5744567 5820935 5792645 5846778 5799434 5778221 5645814 5755072 5788340
15516 5788340 5707497 5727472 5740687 5738412 5795693 5742046 5711761 5726249 5633056 5732734 5855319
15505 5855319 5799355 5782785 5753688 5816404 5865881 5728764 5652557 5638512 5741561 5702523 5690595
15494 5690595 5765826 5891601 5786482 5719144 5680746 5703628 5804472 5844631 5801602 5804239 5767808
15483 5767808 5719559 5808791 5775672 5738797 5746520 5794205 5807563 5793537 5726953 5721598 5786610 5819414
15471 5819414 5681318 5580019 5616010 5694035 5726294 5735135 5819331 5752461 5750089 5685486 5635961
15460 5635961 5607284 5685028 5560094 5629493 5608627 5645125 5699618 5631086 5791137 5925186 5878555
15449 5878555 5882173 5920297 5826464 5723443 5771969 5855125 5725821 5805870 5817484 5721185 5687005
15438 5687005 5721915 5669365 5651298 5710367 5669973 5776566 5799135 5664135 5691070 5727094 5793106
15427 5793106 5746764 5666166 5669838 5758837 5735755 5791829 5873589 5708172 5721172 5905087 5800500
15416 5800500 5857945 5910288 5887745 5752807 5669813 5716688 5768576 5811037 5738136 5731690 5671931
15405 5671931 5714086 5812469 5888627 5937686 5880065 5780232 5770027 5825167 5691752 5724407 5735101
15394 5735101 5724327 5879987 5950149 6012271 5925142 5856211 5875332 5933703 5914206 5850127 5903754
15383 5903754 5853094 5775611 5758102 5800539 5727880 5890366 5923137 5720758 5777297 5831687 5822043
15372 5822043 5779343 5843230 5818310 5726507 5818508 6006007 5954043 5953107 5911789 5860988 5901904
15361 5901904 5873529 5889385 5812460 5790648 5845603 5815453 5837271 5793220 5833576 5851837 5800418
15350 5800418 5811967 5700458 5746388 5788253 5982154 5989280 5799151 5779198 5891132 5917142 5849304
15339 5849304 5780106 5697729 5660780 5692616 5758527 5719424 5759070 5774814 5807587 5809201 5873733
15328 5873733 5908656 5913962 5838749 5864774 5858936 5905658 5937587 5824889 5880235 5945343 6008867
15317 6008867 6007098 6022429 6042646 5927165 5815620 5843122 5943126 5842622 5801420 5841510 5789868
15306 5789868 5897966 5875097 5846594 5974518 6031922 5952425 5812105 5737325 5808095 5904972 5802294
15295 5802294 5802228 5843588 5857693 5837061 5839707 5900876 5881232 5967575 5827824 5842088 5891025 5726891
15283 5726891 5758498 5867316 5961519 5883318 5942910 5949864 5968164 6008932 5998421 5851965 5855621
15272 5855621 5900616 5869200 5888730 5881384 5844681 5873799 5952252 5933805 5887346 5927654 5967938
15261 5967938 6066559 5933138 5880486 5961530 5899745 5964038 5922310 5874486 5755575 5844168 5900485
15250 5900485 5897413 5800810 5887707 5942100 5870851 5778884 5810226 5780793 5738354 5802819 5819198
15239 5819198 5840567 5750592 5883802 5919802 5981421 6090833 6057331 5986834 5980322 5933459 5891100
15228 5891100 5817967 5851567 6043161 5989476 5895152 5882471 5973652 5996357 6006377 5994883 5913459
15217 5913459 5881178 5957017 6016729 5951969 5988178 5918692 5886049 5909104 5938183 5980856 5906663
15206 5906663 5829234 5864961 5879980 5987021 6010818 5948858 5906555 5844233 5909559 5934246 5952345
15195 5952345 5885571 5877816 5978267 5911965 5854757 5893822 5915788 5941118 5906418 5892519 5861811
15184 5861811 5827498 5868599 5923230 5932085 5981172 5838388 5838129 5957495 5932591 5987997 6017940
15173 6017940 5950266 6012022 6001057 5991690 5909549 5815137 5935701 5944978 5862451 5858227 5838674 5859666
15161 5859666 5897755 5961771 5918454 5879977 5889271 5960674 5983058 6040979 6043477 5996847 5878454
15150 5878454 5880894 5949811 5954361 5960267 5884283 5830112 5861707 5777901 5819905 5868307 5766570 5871492
15138 5871492 5883962 6033885 6048563 6028178 6075516 5988549 5929986 5902756 5929098 5883269 5905655
15127 5905655 5979390 6089875 6072253 6118583 6031733 5837269 5845956 5805829 5894945 5871308 5880836
15116 5880836 5849501 5914952 5886816 5979927 5915658 5896352 6004973 6050505 5870070 5834578 5836809
15105 5836809 5855456 5896482 6037564 6084986 6028992 5933924 5842062 5965100 6063700 5983004 5955473
15094 5955473 5931952 5872436 5868553 5897351 6008354 6077990 6111117 6052195 6040162 5974040 6017654
15083 6017654 6099423 6008184 5889717 5941355 5962061 6027194 6033000 5934375 5884257 5896243 6015741
15072 6015741 6036385 6060116 6122904 6026996 6091524 6145147 6091164 6066259 6081026 6028810 5952900
15061 5952900 5948723 5986834 5993280 6027609 5982088 5996075 5994075 5983894 6004558 5955632 5914513 5872415
15049 5872415 5887996 5902978 6012094 6030266 6087742 5971670 5902448 5914301 5901634 5959151 5978856
15038 5978856 5991446 5910515 5862249 6039412 6109175 5855037 5950965 6067974 6025200 6045056 6035477
15027 6035477 6028858 6087348 6040050 5997399 6092501 6160407 6010764 5908075 5909195 5954501 6019132
15016 6019132 6101442 6056416 6059486 6035475 5936176 6039435 6078360 6030627 6142227 6126008 6191121
15005 6191121 6191512 6057099 6068890 6117856 6172006 6097684 6104078 6128586 6010505 5994119 5961485
14994 5961485 6123958 6110369 6043182 5965563 5805835 5978588 5990481 6005232 6175132 6232213
14984 6232213 6284999 6271351 6070754 5967913 5942562 5927412 5836175 5956785 6116731 5997418
14974 5997418 6101700 6140896 6059601 6011737 5985759 5981182 6080934 6168057 6211667 6138063 6050919
14963 6050919 6167560 6140052 5974859 5953277 5954186 6003534 6045791 5989276 5944932 5953002 5905283
14952 5905283 5923045 6087312 6037117 6047475 6092993 6126374 6095123 6050249 6136114 6130847 6069087
14941 6069087 6040630 5977645 6083511 6164247 6176100 6265768 6227944 6152896 6168663 6170238 6087494
14930 6087494 6074788 6066487 6077424 6066351 6057287 6057469 5936931 6026982 6146971 6165700 6162293 6109239
14918 6109239 6126480 6249324 6187997 6260561 6142566 6087963 6000265 6010392 6066253 6118117 6013064
14907 6013064 6075484 6100790 6066512 6144313 6115433 6152305 6155677 5985633 5938645 6047592 6089106
14896 6089106 6227290 6316746 6090333 5934524 6007541 6076671 6121248 6140851 6116062 6190743 6240021
14885 6240021 6167368 6257084 6132002 6102754 6125344 6126449 6109055 6176692 6034465 5955155 6045886
14874 6045886 6075517 6215359 6228642 6135204 6037404 6034551 6041858 5996764 6078706 6125351 6228952
14863 6228952 6232586 6047176 6050627 6150720 6111497 6074709 6189574 6091627 6023955 6088413 6092368
14852 6092368 6090135 6165126 6218442 6178099 6168078 6092536 6265578 6322886 6291802 6128854 6084949
14841 6084949 6144250 6225139 6136422 6120431 6178632 6174949 6166906 6194256 6226997 6148188 6169497 6183364
14829 6183364 6193778 6152847 6171284 6232210 6235168 6299803 6331550 6314538 6156598 6149101 6215368
14818 6215368 6349567 6211539 6123526 6147647 6022765 5989925 6084375 6244755 6289352 6211768
14808 6211768 6305178 6314656 6190335 6262500 6210807 6251134 6275936 6217048 6109554 6073170 6185980
14797 6185980 6105589 6052752 6069830 6153765 6193756 6240967 6233014 6272696 6276620 6237141 6294508 6267235
14785 6267235 6277643 6204896 6294046 6240070 6259333 6242409 6109178 6197017 6145632 6134933 6177131
14774 6177131 6123786 6223579 6252025 6219688 6180478 6255510 6129968 6150008 6248325 6276688 6249020
14763 6249020 6264948 6296636 6237382 6188513 6182469 6129406 6202296 6214645 6255223 6265285 6189748
14752 6189748 6271382 6313681 6211739 6276711 6251823 6300799 6331113 6177529 6153226 6150223 6138775
14741 6138775 6111007 6213456 6285458 6207162 6238996 6308839 6338023 6412549 6325054 6206640 6237143
14730 6237143 6332716 6364753 6340257 6231228 6158795 6097451 6196613 6305971 6257359 6332792 6202779
14719 6202779 6241803 6211165 6268178 6301108 6242652 6275490 6189794 6178336 6188326 6247370 6268362
$$ [...]
##END NTUPLES=NMR SPECTRUM
##END=
