##TITLE=1H_TG-2390-3
 200.13MHz, CDCl3,
 8 sc
 
 8.9.2025
##JCAMPDX= 6.0         $$ Bruker NMR JCAMP-DX V2.0
##DATA TYPE= NMR SPECTRUM
##DATA CLASS= NTUPLES
##ORIGIN= UXNMR, Bruker Analytische Messtechnik GmbH
##OWNER= pz
$$ XWIN-NMR		Version 3.5
$$ Mon Sep  8 13:51:28 2025 Russian Standard Time (UT+4h)  she@DPX200
##.OBSERVE FREQUENCY= 200.1313
##.OBSERVE NUCLEUS= ^1H
##.ACQUISITION MODE= SIMULTANEOUS
##.ACQUISITION SCHEME= undefined
##.AVERAGES= 8
##.DIGITISER RES= 18
##SPECTROMETER/DATA SYSTEM= spect
##.PULSE SEQUENCE= zg30
##.SOLVENT NAME= CDCl3
##.SHIFT REFERENCE= (INTERNAL, CDCl3, 0, 15.5089)
##AUDIT TRAIL= $$ (NUMBER, WHEN, WHO, WHERE, WHAT)
$$ ##TITLE= Audit trail, XWIN-NMR		Version 3.5
$$ ##JCAMPDX= 5.01
$$ ##ORIGIN= Bruker BioSpin GmbH
$$ ##OWNER= she
$$ F:/spectra/data/she/nmr/H-C/1/pdata/1/auditp.txt
$$ ##AUDIT TRAIL=  $$ (NUMBER, WHEN, WHO, WHERE, WHAT)
(   1,<2025-09-08 13:50:18.21 +0400>,<she>,<DPX200>,
      <created by zg, POWCHK disabled, PULCHK disabled
       configuration hash MD5:
       00 E9 B6 7A A2 85 ED C7 34 08 36 98 17 FE 4E 26
       data hash MD5: 16K
       9B DB E1 A5 3E 18 61 AE 8E 58 F7 1C 71 7D D1 2F>)
(   2,<2025-09-08 13:50:21.45 +0400>,<she>,<DPX200>,
      <Start of raw data processing
       efp BC_mod = 2 LB = 0.25 FT_mod = 6 PKNL = 1 PHC0 = -1559.821 PHC1 = 12.79228 SI = 16K 
       data hash MD5: 16K
       11 45 E1 08 1F F8 E0 87 DE 53 03 1C F9 04 8C 55>)
(   3,<2025-09-08 13:50:41.81 +0400>,<she>,<DPX200>,
      <pk PHC0 = 1.758315 PHC1 = -1.4 
       data hash MD5: 16K
       25 AF F7 41 C3 1B A0 AD A7 8E 07 93 CC CE FC 8B>)
(   4,<2025-09-08 13:50:45.68 +0400>,<she>,<DPX200>,
      <abs ABSG = 5 
       data hash MD5: 16K
       C9 AF 4F 6F 4B 6C 9C 07 94 78 E2 59 C3 58 D9 EC>)
$$ ##END=
$$ 
$$ hash MD5
$$ A3 19 FA 38 F4 7D 72 17 9F 43 B6 51 DA 91 0F 63
##$RELAX= 
##$RELAX= 
##$RELAX= 
##$RELAX= 
##$RELAX= 
##$RELAX= 
$$ Bruker specific parameters
$$ --------------------------
##$DU= <F:/spectra>
##$EXPNO= 1
##$NAME= <H-C>
##$PROCNO= 1
##$TYPE= <nmr>
##$USER= <she>
##$AMP= (0..31)
100 100 100 100 100 100 100 100 100 100 100 100 100 100 100 100 100 100 
100 100 100 100 100 100 100 100 100 100 100 100 100 100 
##$AQSEQ= 0
##$AQ_mod= 1
##$AUNM= <au_zg>
##$AUTOPOS= <>
##$BF1= 200.13
##$BF2= 200.13
##$BF3= 200.13
##$BF4= 200.13
##$BF5= 200.13
##$BF6= 200.13
##$BF7= 200.13
##$BF8= 200.13
##$BYTORDA= 1
##$CFDGTYP= 0
##$CFRGTYP= 5
##$CHEMSTR= <none>
##$CNST= (0..31)
1 1 145 1 1 1 1 1 1 1 1 1 1 1 1 1 1 1 1 1 1 1 1 1 1 1 1 1 1 1 1 1 
##$CPDPRG= <>
##$CPDPRG1= <>
##$CPDPRG2= <>
##$CPDPRG3= <>
##$CPDPRG4= <mlev>
##$CPDPRG5= <mlev>
##$CPDPRG6= <mlev>
##$CPDPRG7= <mlev>
##$CPDPRG8= <mlev>
##$CPDPRGB= <>
##$CPDPRGT= <>
##$D= (0..31)
0 0.7 0 0 0 0 0 0 0 0 0 0.03 0 0 0 0 0 0 0 0 0 0 0 0 0 0 0 0 0 0 0 0 
##$DATE= 1757325017
##$DBL= (0..7)
120 120 120 120 120 120 120 120 
##$DBP= (0..7)
150 150 150 150 150 150 150 150 
##$DBP07= 0
##$DBPNAM0= <>
##$DBPNAM1= <>
##$DBPNAM2= <>
##$DBPNAM3= <>
##$DBPNAM4= <>
$$ [...]
##$SUBNAM3= <"">
##$SUBNAM4= <"">
##$SUBNAM5= <"">
##$SUBNAM6= <"">
##$SUBNAM7= <"">
##$SUBNAM8= <"">
##$SUBNAM9= <"">
##$SW= 18.0517328524113
##$SWIBOX= (0..15)
0 0 2 0 0 0 0 0 0 0 0 0 0 0 0 0 
##$SW_h= 3612.71676300578
##$TD= 16384
##$TD0= 1
##$TE= 0
##$TE2= 300
##$TE3= 300
##$TEG= 300
##$TL= (0..7)
0 120 120 120 120 120 120 120 
##$TP= (0..7)
150 150 150 150 150 150 150 150 
##$TP07= 0
##$TPNAME0= <>
##$TPNAME1= <>
##$TPNAME2= <>
##$TPNAME3= <>
##$TPNAME4= <>
##$TPNAME5= <>
##$TPNAME6= <>
##$TPNAME7= <>
##$TPOAL= (0..7)
0.5 0.5 0.5 0.5 0.5 0.5 0.5 0.5 
##$TPOFFS= (0..7)
0 0 0 0 0 0 0 0 
##$TUNHIN= 0
##$TUNHOUT= 0
##$TUNXOUT= 0
##$USERA1= <user>
##$USERA2= <user>
##$USERA3= <user>
##$USERA4= <user>
##$USERA5= <user>
##$V9= 5
##$VALIST= <valist>
##$VCLIST= <CCCCCCCCCCCCCCC>
##$VD= 0
##$VDLIST= <DDDDDDDDDDDDDDD>
##$VPLIST= <PPPPPPPPPPPPPPP>
##$VTLIST= <TTTTTTTTTTTTTTT>
##$WBST= 1024
##$WBSW= 4
##$XGAIN= (0..3)
0 0 0 0 
##$XL= 0
##$YL= 0
##$YMAX_a= 235144
##$YMIN_a= -383081
##$ZGOPTNS= <>
##$ZL1= 120
##$ZL2= 120
##$ZL3= 120
##$ZL4= 120
##$ABSF1= 15.51661
##$ABSF2= -2.535239
##$ABSG= 5
##$ABSL= 3
##$ALPHA= 0
##$AQORDER= 0
##$ASSFAC= 0
##$ASSFACI= 0
##$ASSFACX= 0
##$ASSWID= 0
##$AUNMP= <proc_1d>
##$AZFE= 0.1
##$AZFW= 0.1
##$BCFW= 0
##$BC_mod= 2
##$BYTORDP= 0
##$COROFFS= 0
##$CY= -3
##$DATMOD= 1
##$DC= 0
##$DFILT= <>
##$DTYPP= 0
##$F1P= 0
##$F2P= 0
##$FCOR= 1
##$FTSIZE= 16384
##$FT_mod= 6
##$GAMMA= 0
##$GB= 0
##$INTBC= 1
##$INTSCL= 3.241238e-09
##$ISEN= 128
##$LB= 0.25
##$LEV0= 0
##$LPBIN= 0
##$MAXI= 10000
##$MC2= 0
##$MEAN= 0
##$ME_mod= 0
##$MI= 1.114404
##$NCOEF= 0
##$NC_proc= -8
##$NLEV= 6
##$NOISF1= 3.799351
##$NOISF2= 2.8
##$NSP= 0
##$NTH_PI= 0
##$NZP= 0
##$OFFSET= 15.5089
##$PC= 1
##$PHC0= -1558.063
##$PHC1= 11.39228
##$PH_mod= 1
##$PKNL= yes
##$PPARMOD= 0
##$PSCAL= 0
##$PSIGN= 0
##$REVERSE= no
##$SF= 200.130002561693
##$SI= 16384
##$SIGF1= 3
##$SIGF2= 2
##$SINO= 0.751879
##$SIOLD= 32768
##$SREGLST= <19F.Aceton>
##$SSB= 0
##$STSI= 16384
##$STSR= 0
##$SW_p= 3612.71676300578
##$SYMM= 0
##$S_DEV= 0
##$TDeff= 16384
##$TDoff= 0
##$TI= <>
##$TILT= no
##$TM1= 0
##$TM2= 0
##$TOPLEV= 0
##$USERP1= <user>
##$USERP2= <user>
##$USERP3= <user>
##$USERP4= <user>
##$USERP5= <user>
##$WDW= 1
##$XDIM= 16384
##$YMAX_p= 402222389
##$YMIN_p= -1381489
$$ End of Bruker specific parameters
$$ ---------------------------------
##NTUPLES= NMR SPECTRUM
##VAR_NAME=  FREQUENCY,     SPECTRUM/REAL,   SPECTRUM/IMAG
##SYMBOL=    X,             R,               I
##VAR_TYPE=  INDEPENDENT,   DEPENDENT,       DEPENDENT
##VAR_FORM=  AFFN,          ASDF,            ASDF
##VAR_DIM=   16384,         16384,           16384
##UNITS=     HZ,            ARBITRARY UNITS, ARBITRARY UNITS
##FACTOR=    0.220516191357247, 1,           1
##FIRST=     3103.79613443271, 0,            0
##LAST=      -508.920628573066, 0,           0
##MIN=       -508.920628573066, -1381489,    0
##MAX=       3103.79613443271, 402222389,    0
$$ Real data points
##PAGE= N=1
##DATA TABLE= (X++(R..R)), XYDATA
$$ [...]
6470A3340247M91542l92017k39805K02497L00248m5221j7912k32455L64263N65973
$$ 13340247 13831789 13439772 13199967 13402464 13702712 13657491 13639579 13407124 13771387 14337360
6460A4337360K10882M38961K46099K48035L00269M48339l75197N17181Q25052
$$ 14337360 14548242 14987203 15233302 15481337 15781606 16229945 15854748 16371929 17196981
6451A7196981N14925M88255k95942J27371K90246J00472P34108M24746M17878
$$ 17196981 17711906 18200161 17904219 18031590 18321836 18422308 19156416 19581162 19999040
6442A9999040R10548O30898N20753K75539J85336K49316J054944P92278P20874
$$ 19999040 20909588 21540486 22061239 22336778 22522114 22771430 23826374 24618652 25339526
6433B5339526J92959O80620q0125q5369J88246L50417K72264k82494K06924J90654
$$ 25339526 25532485 26213105 26132980 26047611 26235857 26586274 26858538 26576044 26782968 26973622
6423B6973622M46469Q75920Q91543M10095P55290P15608J052479J345190P20374
$$ 26973622 27420091 28296011 29187554 29597649 30352939 31068547 32121026 33466216 34186590
6414C4186590J208673J950194J444072O56198O33224O53305R81639Q95431O96734
$$ 34186590 35395263 37345457 38789529 39445727 40078951 40732256 41713895 42609326 43306060
6405D3306060Q70778L86293Q34578J429424J683750Q57785R02738J348040L91656
$$ 43306060 44176838 44563131 45397709 46827133 48510883 49368668 50271406 51619446 52011102
6396E2011102Q77615Q14581R76665P86938Q40917O61615R87910R33493J403979
$$ 52011102 52888717 53703298 54679963 55466901 56307818 56969433 57957343 58890836 60294815
6387F0294815J552248J655826J366218J120466R13795J706044J926906J807634
$$ 60294815 61847063 63502889 64869107 65989573 66903368 68609412 70536318 72343952
6379G2343952K058160J601277J531653J425902Q00998P6981K98508k50218Q07984
$$ 72343952 74402112 76003389 77535042 78960944 79761942 79838923 80137431 79887213 80695197
6370H0695197n65297q50181K07930K67079m68146J31743O65258O84791Q41860
$$ 80695197 80129900 79279719 79487649 79754728 79286582 79418325 80083583 80768374 81610234
6361H1610234N03166M47656O93578R6853Q50831Q12851P55894O13378J65961n6948
$$ 81610234 82113400 82561056 83254634 83351487 84202318 85015169 85771063 86384441 86550402 86493454
6351H6493454L79805r47017o37027o16000o71526j76984p87909K25079m36711
$$ 86493454 86873259 85926242 85289215 84673215 84001689 83824705 83036796 83261875 82825164
6342H2825164j11746l02602l60964O7476n65322k79291l68163j034135r20386
$$ 82825164 82713418 82410816 82049852 82117328 81552006 81272715 80904552 79870417 78950031
6333G8950031j053734n12807l80568j199914m97698n62342J122L70938o23595
$$ 78950031 77896297 77383490 77002922 75803008 75305310 74742968 74744090 75115028 74491433
6324G4491433P443J88883K32471O00808L44183K9806p596N64110n3800q78768
$$ 74491433 74498876 74687759 74920230 75521038 75865221 75895027 75887431 76451541 76397741 75518973
6314G5518973j76215K01638N22391q2169j94375N71092l3974L67852N18943j15774
$$ 75518973 75342758 75544396 76066787 75984618 75790243 76361335 76327361 76695213 77214156 77098382
6304G7098382P37335K99871Q69424J126637J138112P84880J61877J312476K089675
$$ 77098382 77835717 78135588 79005012 80131649 81269761 82054641 82216518 83528994 85618669
6295H5618669J706983J517734K706629L099955K956431L855086L771988M415571
$$ 85618669 87325652 88843386 91550015 94649970 97606401 101461487 105233475 109649046
6287A09649046M655954N611112N895454N270731L597087K291006M12345j350184
$$ 109649046 114305000 119916112 125811566 131082297 134679384 136970390 137382735 136032551
6279A36032551k029431k494436j937534k316571j766767j328508k60332J241556
$$ 136032551 134003120 131508684 129571150 127254579 125487812 124159304 123898972 125140528
6271A25140528J355933K072703K790123M572300N440024O749487P275918O598671
$$ 125140528 126496461 128569164 131359287 135931587 141371611 148121098 155397016 161995687
6263A61995687N848257L894441K671890P23898q59904k543869m104403n257805
$$ 161995687 167843944 171738385 174410275 175134173 174274269 171730400 167625997 162368192
6255A62368192o402574o152993o571231n767676n135495l606911k285515k066282
$$ 162368192 155965618 149812625 143241394 137473718 132338223 128731312 126445797 124379515
6247A24379515q72760P13042J661157J911987K751677L677820M213307L321021
$$ 124379515 123506755 124219797 125880954 127792941 130544618 134222438 138435745 141756766
6239A41756766J719807p02558k694995m793966o331797p093562o433609o617279
$$ 141756766 143476573 142774015 140079020 135285054 128953257 121859695 115426086 108808807
6231A08808807n851817m581057l881066l663008k448946k516848j263626j338978
$$ 108808807 102956990 98375933 94494867 90831859 88382913 85866065 84602439 83263461
6223H3263461p18570M1424p1195L45235K71772j48527m71251j287003j435454
$$ 83263461 82544891 82586315 82515120 82860355 83132127 82983600 82512349 81225346 79789892
6214G9789892j986290k393065k263649k823828l128232k283867k051196k025100
$$ 79789892 77803602 75410537 73146888 70323060 67194828 64910961 62859765 60834665
6206F0834665j210059j529664o32398r95499o99207l13377n93429J79308J213132
$$ 60834665 59624606 58094942 57462544 56467045 55767838 55454461 54861032 55040340 56253472
6197E6253472P83972J4603l3720M73717n35464p61240j181238k108457j542333
$$ 56253472 57037444 57052047 57018327 57492044 56956580 56195340 55014102 52905645 51363312
6188E1363312j809373j880891j772267j612427j138043j549318j271864j041409
$$ 51363312 49553939 47673048 45900781 44288354 43150311 41600993 40329129 39287720
6180C9287720j763151r07698m38125j068078p90025p20487q30545n64004j41027
$$ 39287720 37524569 36616871 36178746 35110668 34320643 33600156 32769611 32205607 32064580
6171C2064580l84980J47355k76057j28095j18445r9999N0557l10392r0072m28258
$$ 32064580 31679600 31826955 31550898 31422803 31304358 31204359 31254916 30944524 30854452 30426194
6161C0426194o69661K64743j96736o41712l47887o25654o31866p85382m31317
$$ 30426194 29756533 30021276 29824540 29182828 28834941 28209287 27577421 26792039 26360722
6152B6360722j53065n63818k96867l43935k16917J76355L2107n07439n06390m83744
$$ 26360722 26207657 25643839 25346972 25003037 24786120 24962475 24994582 24487143 23980753 23497009
6142B3497009J64954K79614j85140P38698M6222J99406j1090l00896M79184j20216
$$ 23497009 23661963 23941577 23756437 24495135 24541357 24740763 24729673 24428777 24907961 24787745
6132B4787745K83603R5575J299J40508J20987J72062J25682J96199L11205L96964
$$ 24787745 25071348 25166923 25168222 25308730 25429717 25601779 25727461 25923660 26234865 26631829
6122B6631829P48325O70754R9146J41774O75046K10179K32627K17526j33100N2417
$$ 26631829 27380154 28050908 28150054 28291828 28966874 29177053 29409680 29627206 29494106 29546523
6112B9546523L45694K09785k47144J36848K67555O60158K89694L60278R99010
$$ 29546523 29892217 30102002 29854858 29991706 30259261 30919419 31209113 31569391 32568401
6103C2568401J329055P51330R32107J005260R62828R98564L74049P02833M07182
$$ 32568401 33897456 34648786 35580893 36586153 37548981 38547545 38921594 39624427 40031609
6094D0031609O79944P09396M60157M29366K39782L04213M91829J210706L24473
$$ 40031609 40711553 41420949 41881106 42310472 42550254 42854467 43346296 44557002 44881475
6085D4881475N58366K40214L32089M48429J97063m05913q01078q04605p76l96493
$$ 44881475 45439841 45680055 46012144 46460573 46657636 46251723 45450645 44646040 44645264 44248771
6075D4248771l42271J86445J94792j07358O0623O72055K83498N83289J010358
$$ 44248771 43906500 44092945 44287737 44180379 44241002 44913057 45196555 45779844 46790202
6066D6790202J051531J241889Q71176J158375J277789N66327m64815n97625r86994
$$ 46790202 47841733 49083622 49954798 51113173 52390962 52957289 52492474 51894849 50907855
6057E0907855j327355j703770k605326j605857k028714j781619j506252j235700
$$ 50907855 49580500 47876730 45271404 43665547 41636833 39855214 38348962 37113262
6049C7113262l34668p3657o93548p93531l41673L63187N71317K77537L78375N87461
$$ 37113262 36778594 36704937 36011389 35217858 34876185 35239372 35810689 36088226 36466601 37054062
6039C7054062Q00930N16837p2553o68992j116050j053489j283840j638415j416736
$$ 37054062 37854992 38371829 38299276 37630284 36514234 35460745 34176905 32538490 31121754
6030C1121754j263390j294255j345671j172625j034969j94861m63522q50294O6964
$$ 31121754 29858364 28564109 27218438 26045813 25010844 24815983 24352461 23502167 23569131
6021B3569131k89437n04189p57418n46608n37309j68538l4302J40335j33798p3108
$$ 23569131 23279694 22775505 22018087 21471479 20934170 20765632 20731330 20871665 20737867 20664759
6011B0664759j67384j03448n33991Q5551O43922L99285k19777j28138J57426K16079
$$ 20664759 20497375 20393927 19859936 19945487 20589409 20988694 20768917 20640779 20798205 21014284
6001B1014284P57817j9118j68038K27910K23975k03563K80902j64795J54985O39119
$$ 21014284 21772101 21752983 21584945 21812855 22036830 21833267 22114169 21949374 22104359 22743478
5991B2743478m05760O89177O04481P0080J34156m6152M74302k63298L33665J41462
$$ 22743478 22337718 23026895 23631376 23701456 23835612 23789460 24263762 24000464 24334129 24475591
5981B4475591J66858K83352Q32935L86790q782Q38024P04523J60059N51234J042456
$$ 24475591 24642449 24925801 25758736 26145526 26136744 26974768 27679291 27839350 28390584 29433040
5971B9433040J88787r8777L87406M20512K02242o0707L8639L42757J90614N59262
$$ 29433040 29621827 29523050 29910456 30330968 30533210 30472503 30511142 30853899 31044513 31603775
5961C1603775M1097M67081M01982L81776O31504O09931J070366Q20010Q35017
$$ 31603775 31644872 32111953 32513935 32895711 33527215 34137146 35207512 36027522 36862539
5952C6862539O40919R12974J125410J118819J450408J711893J294304J366914
$$ 36862539 37503458 38416432 39541842 40660661 42111069 43822962 45117266 46484180
5944D6484180J539323J428500Q84483J357508J162166l37693o1952J95488N0139
$$ 46484180 48023503 49452003 50336486 51693994 52856160 52518467 52456515 52652003 52702142
5935E2702142P80875L36815M84818O42874P14257J573549O50657J884114J897332
$$ 52702142 53483017 53819832 54304650 54947524 55661781 57235330 57885987 59770101 61667433
5926F1667433J962672K250745K691037L500617L251372L944083M510439N978403
$$ 61667433 63630105 65880850 68571887 72072504 75323876 79267959 83778398 89756801
5918H9756801O538644P520558Q940562R236802J0735428J2377325J3536400J5198911
$$ 89756801 96295445 103816003 112756565 121993367 132728795 145106120 158642520 173841431
5910A73841431J8122215J9480431K0209211K0135314J5957040Q515180o27099
$$ 173841431 191963646 211444077 231653288 251788602 267745642 276260822 275633723
5903B75633723q865197j4596449j8969175j9550673j8566629j7516843j4424910
$$ 275633723 266768526 252172077 233202902 213652229 195085600 177568757 163143847
5896A63143847j2471595r798826p772060n947222m935097m635778l531792k518548
$$ 163143847 150672252 140873426 133101366 127154144 122219047 117583269 114051477 111532929
5888A11532929k224124j320308j357565q01939J92059J229618J068110J663062
$$ 111532929 109308805 107988497 106630932 105828993 106021052 107250670 108318780 109981842
5880A09981842J405513J690323J947814K455394K636709J943329K401278K049463
$$ 109981842 111387355 113077678 115025492 117480886 120117595 122060924 124462202 126511665
5872A26511665K328121J841703J335739K093596K399947K897233L389641L005419
$$ 126511665 128839786 130681489 132017228 134110824 136510771 139408004 142797645 145803064
5864A45803064M387734M386223M424658M529390N177245L912987K028737J405097
$$ 145803064 150190798 154577021 159001679 163531069 168708314 172621301 174650038 176055135
5856A76055135K4637r53548p58345j287074j594056j143839n43305r97139m79971
$$ 176055135 176079772 175126224 174367879 173080805 171486749 170342910 169799605 168802466 168322495
5847A68322495j165456k226902l150725m084951m849102n580503n152035m983601
$$ 168322495 167157039 164930137 161779412 157694461 152845359 147264856 142112821 137129220
5839A37129220m994871m214140l486179k441986k247867k157538j251505j340697
$$ 137129220 132134349 127920209 124434030 121992044 119744177 117586639 116335134 114994437
5831A14994437q86128q07764q08253r39606p96247j073979r70068q29929r71963
$$ 114994437 114108309 113300545 112492292 111552686 110756439 109682460 108712392 107882463 106910500
5822A06910500p74878r04333n92587m82331o64050J70222O29609L62446L77769
$$ 106910500 106135622 105231289 104638702 104156371 103492321 103662543 104292152 104654598 105032367
5813A05032367P47601J468360J425188R66282J556848J697543J256086J313148
$$ 105032367 105779968 107248328 108673516 109639798 111196646 112894189 114150275 115463423
5805A15463423J547619K166451K428396J946313K811929L246505L060928J742221
$$ 115463423 117011042 119177493 121605889 123552202 126364131 129610636 132671564 134413785
5797A34413785K118882K394552K135767K087899J621989K163084K422352J856334
$$ 134413785 136532667 138927219 141062986 143150885 144772874 146935958 149358310 151214644
5789A51214644K235027K917000L662336L635869K610156J420766r53913l043791
$$ 151214644 153449671 156366671 160029007 163664876 166275032 167695798 166741885 163698094
5781A63698094n658935p192712q230441p934483p322370o354777n979090m903259
$$ 163698094 158039159 150846447 142616006 134681523 127359153 121004376 115025286 110122027
5773A10122027m477719l635384l022616k394104j924753j646194r29310j084738
$$ 110122027 105644308 102008924 98986308 96592204 94667451 93021257 92091947 91007209
5765I1007209o97509m05482p9121l2721J08328K31485J66248l52421l20466k99281
$$ 91007209 90309700 89904218 89825097 89792376 89900704 90132189 90298437 89946016 89625550 89326269
5755H9326269M28838L45675M3015P6568N76251L24527M89797J51812L49068M11853
$$ 89326269 89755107 90100782 90143797 90220365 90796616 91121143 91610940 91762752 92111820 92523673
5745I2523673j197920k75691Q6928n43920m28486p6254j70782p3033M17431Q65170
$$ 92523673 91325753 91050062 91136990 90593070 90164584 90088330 89917548 89844515 90261946 91127116
5735I1127116m416L72141J328643J053005R84008O30734J416819J930696J406060
$$ 91127116 91122700 91494841 92823484 93876489 94860497 95491231 96908050 98838746 100244806
5726A00244806J005270J025244R25224M03326k83346q22864j73289N26803m34319
$$ 100244806 101250076 102275320 103200544 103603870 103320524 102497660 102324371 102851174 102416855
5717A02416855l17875l05059j3483r68525j054702r32888l70298n50282o44169
$$ 102416855 102098980 101793921 101780438 100811913 99757211 98824323 98454025 97903743 97259574
5708I7259574o4312J91791k46647k59391J29397K96876J67839L32221l5433o00663
$$ 97259574 97195262 97387053 97140406 96881015 97010412 97307288 97475127 97807348 97771915 97171252
5698I7171252j055284j111530q55104p21054l16789j41786N08196J15257J90121
$$ 97171252 96115968 95004438 94149334 93428280 93111491 92969705 93477901 93593158 93783279
5689I3783279N63873J669292J849976K285086K722412K797511K575608K230098
$$ 93783279 94347152 96016444 97866420 100151506 102873918 105671429 108247037 110477135
5681A10477135J85417k34103J7886m36067k68929P69395J091139J692524J909994
$$ 110477135 110662552 110428449 110446335 110010268 109741339 110510734 111601873 113294397 115204391
5672A15204391L265770M041462M876910N607049N491679N041082M261358K478385
$$ 115204391 118470161 122511623 127388533 132995582 138487261 143528343 147789701 150268086
5664A50268086k75814r28443k181277k774266k328463k262744j072745N3070J172675
$$ 150268086 149992272 149063829 146882552 144108286 141779823 139517079 138444334 138497404 139670079
5655A39670079K244662L839783N291817O112200O607076O234925N443691N094857
$$ 139670079 141914741 145754524 151046341 157158541 163765617 170000542 175444233 180539090
5647A80539090M432025M029804L660020K557740J524054K24153j959988m161387
$$ 180539090 184971115 189000919 192660939 195218679 196742733 196966886 195006898 190845511
5639A90845511n458675o134779o442590n981993m980329m294098k152322j536691
$$ 190845511 185386836 179252057 172809467 166827474 161847145 157553047 155400725 153864034
5631A53864034j159736J89568J85064P43429J549494J650759K804029K760918
$$ 153864034 152704298 152893866 153078930 153822359 155371853 157022612 159826641 162587559
5623A62587559K882400K365621J102545l4843j708495l790327l889059n041793
$$ 162587559 165469959 167835580 168938125 168903282 167194787 163404460 159515401 154473608
5615A54473608m698135l081054k979508k779889j796268j334490j316706l15943
$$ 154473608 149775473 146694419 143714911 140935022 139138754 137804264 136487558 136171615
5607A36171615k50421k91637j372922j014178j585876k254742k092721j847720
$$ 136171615 135921194 135629557 134256635 133242457 131656581 129401839 127309118 125461398
5599A25461398j172390j176253l13003N6662r00060j081777m56541o32825o04715
$$ 125461398 124289008 123112755 122799752 122856414 121956354 120874577 120418036 119785211 119180496
5590A19180496J87786k58113j81161k62786m37994j98931k9426o38679q89832
$$ 119180496 119368282 119110169 118929008 118666222 118228228 118029297 117999871 117361192 116471360
5581A16471360q85928p47266n17628o16280M29362K63841J85592P32602L81551
$$ 116471360 115585432 114838166 114320538 113704258 114133620 114397461 114583053 115315655 115697206
5572A15697206l11703p09243q21723k228963k516835k448195k923752k460611
$$ 115697206 115385503 114676260 113854537 111625574 109108739 106660544 103736792 101276181
5564A01276181k381026k152321k335320k565721k738762k287993k210015j893413
$$ 101276181 98895155 96742834 94407514 91841793 89103031 86815038 84605023 82711610
5556H2711610r02111p89326j21908J63562l35770k7090J3754o4929q68864j401748
$$ 82711610 81809499 81020173 80898265 81061827 80726057 80698967 80712721 80647792 79778928 78377180
5546G8377180j904596k397487k717481k836990l310127k548733k175519k118439
$$ 78377180 76472584 74075097 71357616 68520626 65210499 62661766 60486247 58367808
5538E8367808k385864k479257k549932j391715j691234j882036j443325j032565
$$ 58367808 55981944 53502687 50952755 49561040 47869806 45987770 44544445 43511880
5530D3511880k113012j394510j202180j279898r22236n10808n49606r86765m21968
$$ 43511880 41398868 40004358 38802178 37522280 36600044 36089236 35539630 34552865 34130897
5521C4130897p15429p25260r88286r03878p43209l68825l58759l76386r04269
$$ 34130897 33415468 32690208 31701922 30798044 30054835 29686010 29327251 28950865 28046596
5512B8046596m06099m54651j94639q44439j014596q94629m29400p42805n69831
$$ 28046596 27640497 27185846 26991207 26146768 25132172 24237543 23808143 23065338 22495507
5503B2495507j70743k19766l91904m16016n10909J36138n15109j62240k30461
$$ 22495507 22324764 22104998 21713094 21297078 20786169 20922307 20407198 20244958 20014497
5494B0014497j83947j11573n00833j74600K57289o14948m76945l14779J77110
$$ 20014497 19830550 19718977 19218144 19043544 19300833 18685885 18208940 17894161 18071271
5485A8071271L4736j62301k01563m08604j29510l45711L56385L13459j32669K04249
$$ 18071271 18106007 17943706 17742143 17333539 17204029 16858318 17214703 17528162 17395493 17599742
5475A7599742m19352J60645Q7667l38106o55594J49156j56337l02900J28771k03307
$$ 17599742 17180390 17341035 17428702 17090596 16435002 16584158 16427821 16124921 16253692 16050385
5465A6050385J12468j95581p20441n6904K26786l72632J14643O22883J95302P4784
$$ 16050385 16162853 15967272 15246831 15189927 15416713 15044081 15158724 15781607 15976909 16051693
5455A6051693j52523L85284M04697r6925M87255K72175J35913n8244L21980j2928
$$ 16051693 15899170 16284454 16689151 16592226 17079481 17351656 17487569 17429325 17751305 17738377
5445A7738377R43025J73956N36522j8741N17943J277027J273897J783355K242212
$$ 17738377 18681402 18855358 19391880 19373139 19891082 21168109 22442006 24225361 26467573
5436B6467573K857360K504581R84123p55914k160484j660116k023305q80859j471977
$$ 26467573 29324933 31829514 32813637 32057723 29897239 28237123 26213818 25332959 23860982
5427B3860982j731840j695620j120950j039095o76800l97416p03493q75995j95078
$$ 23860982 22129142 20433522 19312572 18273477 17596677 17199261 16495768 15619773 15424695
5418A5424695L53775m66310l02423l12016l8824m74933l3251n12762k90456N49636
$$ 15424695 15778470 15312160 15009737 14697721 14658897 14183964 14150713 13637951 13347495 13897131
5408A3897131K62099n94121k58094j88373j17216L35442O8462J09854j78621J53042
$$ 13897131 14159230 13565109 13307015 13118642 13001426 13336868 13405330 13515184 13336563 13489605
5398A3489605J47768r1572L06645J05234M41891K55744M65938O69035K68124N09348
$$ 13489605 13637373 13545801 13852446 13957680 14399571 14655315 15121253 15790288 16058412 16567760
5388A6567760K84697M07589J081175R97584N40872J69378J379218J116429J395978
$$ 16567760 16852457 17260046 18341221 19338805 19879677 20049055 21428273 22544702 23940680
5379B3940680J964052J377563R29643J505123R16288O67348N07465m75827n02131
$$ 23940680 25904732 27282295 28211938 29717061 30633349 31300697 31808162 31332335 30830204
5370C0830204n79812m60257p57812j41469n14112m41620J76425L42422N18604
$$ 30830204 30250392 29790135 29032323 28890854 28376742 27935122 28111547 28453969 28972573
5361B8972573J293474J148854O00221J092671J362504J373057Q86390M58587K77573
$$ 28972573 30266047 31414901 32015122 33107793 34470297 35843354 36729744 37188331 37465904
5352C7465904O55076o81187o54261j118048j157858j363744j193681q10586j220817
$$ 37465904 38120980 37439793 36785532 35667484 34509626 33145882 31952201 31141615 29920798
5343B9920798j357049j332455o93815L10853o84255J53196Q3744L5691M61547
$$ 29920798 28563749 27231294 26537479 26848332 26164077 26317273 26401017 26436708 26898255
5334B6898255k79706M04666J03798M9394n41152p29218j075244p07665j382285
$$ 26898255 26618549 27023215 27127013 27176407 26635255 25906037 24830793 24123128 22740843
5325B2740843j275589j175227j094095j430278m94150m31531r75375p92077r05378
$$ 22740843 21465254 20290027 19195932 17765654 17271504 16839973 15864598 15072521 14167143
5316A4167143j46005m89929n48821l81146j60489n00057n72043j25875p4252K70607
$$ 14167143 14021138 13531209 12982388 12601242 12440753 11940696 11368653 11242778 11168526 11439133
5306A1439133n29313q54392n2637o24573j1544K12843j134808q3864L32193p7795
$$ 11439133 10909820 10055428 10002791 9378218 9366674 9579517 8444709 8360845 8693038 8615243
5296H615243m5977k10308m50081q27750k46094M20902j10494q3970k23971K26211
$$ 8615243 8569266 8358958 7908877 7081127 6835033 7255935 7145441 7061471 6837500 7063711
5286G063711l58368j50124K40062l77105K22572q65216k12920j62866L46627K24811
$$ 7063711 6705343 6555219 6795281 6418176 6640748 5775532 5562612 5399746 5746373 5971184
5276E971184m39189j78748K60369l00162j7879J89840j10375n4347m39739K4449
$$ 5971184 5531995 5353247 5613616 5313454 5295575 5485415 5375040 5320693 4880954 4905403
5266D905403N6174r8906j30456j5534L68678j74130k36664p08654j38943R3430
$$ 4905403 4961577 4862671 4732215 4716681 5085359 4911229 4674565 3965911 3826968 3920398
5256C920398r460K70825j87114L32431k5985k42746m13222j38387K8302j8096
$$ 3920398 3910938 4181763 3994649 4327080 4301095 4058349 3645127 3506740 3535042 3516946
5246C516946L13429j65593l31031N08104j4131q1856J86481k95471l06345k02470
$$ 3516946 3830375 3664782 3333751 3841855 3827724 3745868 3932349 3636878 3330533 3128063
5236C128063k78780P68976l3819j34207l13628J28872L35273k10716L59265n73612
$$ 3128063 2849283 3618259 3584440 3450233 3136605 3265477 3600750 3390034 3749299 3175687
5226C175687j47366L80808l55470k46441k98611O03542L27215O072Q0439J18880
$$ 3175687 3028321 3409129 3053659 2807218 2508607 3112149 3439364 3445436 3525875 3644755
5216C644755j14698o15659o53183N16057K69513n5860m06049K01785k12258n04122
$$ 3644755 3530057 2914398 2261215 2777272 3046785 2990925 2584876 2786661 2574403 2070281
5206B070281O31681K61815j15793j42722p2210J90120J44897m68400l1030j92688
$$ 2070281 2701962 2963777 2847984 2705262 2633052 2823172 2968069 2499669 2468639 2275951
5196B275951M543M29748K4003Q9273N3153l90986N44601j27254p49806J87812
$$ 2275951 2280494 2710242 2734245 2823518 2876671 2485685 3030286 2903032 2153226 2341038
5186B341038L07966L31651n38311j64458N28247m9784l37733q6901K85297K16118
$$ 2341038 2649004 2980655 2442344 2277886 2806133 2756349 2418616 2331715 2617012 2833130
5176B833130n5622R517L53138p08634Q9112K22172O9230N31815K24863o31857
$$ 2833130 2777508 2787025 3140163 2431529 2520641 2742813 2812043 3343858 3568721 2936864
5166B936864l67418l12843k11706M59922O20683k58050m87737l45492K78886O8245
$$ 2936864 2569446 2256603 2044897 2504819 3125502 2867452 2379715 2034223 2313109 2381354
5156B381354K39767M79391j5195l17214l25482J23768P6298l01066J13389J50286
$$ 2381354 2621121 3100512 3085317 2768103 2442621 2566389 2642687 2341621 2455010 2605296
5146B605296r8951q9536j13202K17166j218K11882Q8904j39289l10962l26421
$$ 2605296 2506345 2416809 2303607 2520773 2519555 2731437 2820341 2681052 2370090 2043669
5136B043669M10491j963M87195m22000l3732Q0646m89565l48071K15789K50669
$$ 2043669 2454160 2452197 2939392 2517392 2483660 2564306 2074741 1726670 1942459 2193128
5126B193128k48471k6628j35304j39571L59331l182q1817M32689N03190L27199
$$ 2193128 1944657 1918029 1782725 1643154 2002485 1999303 1917486 2350175 2853365 3180564
5116C180564q2465l37152k10845J7065K38746J19880L965k7200n97616j16535
$$ 3180564 3098099 2760947 2550102 2567167 2805913 2925793 2929758 2902558 2304942 2188407
5106B188407L62917L59646M9284k67248l2635P4294l04444P5473j46817j39504
$$ 2188407 2551324 2910970 2960254 2693006 2660371 2734665 2430221 2505694 2358877 2219373
5096B219373k948k51707J89787Q94975n7189J72567m59675k43590K46543J96959
$$ 2219373 2216425 1964718 2154505 3049480 2992291 3164858 2705183 2461593 2708136 2905095
5086B905095k62003m37220k49112n57M63592J34794o65947l8590K53276K83159
$$ 2905095 2643092 2205872 1956760 1956203 2419795 2554589 1888642 1850052 2103328 2386487
5076B386487j54243J04136J73939M38989j13100j66530J27987K7628j86412L26142
$$ 2386487 2232244 2336380 2510319 2949308 2836208 2669678 2797665 2825293 2638881 2965023
5066B965023q9723J37764p5475n82464r06411M61937P50537j871k02575K32756
$$ 2965023 2875300 3013064 2937589 2355125 1448714 1910651 2661188 2659317 2456742 2689498
5056B689498J72819Q9881k6916k43496J32232k63281q2776J41429K26788J46610
$$ 2689498 2862317 2952198 2925282 2681786 2814018 2550737 2467961 2609390 2836178 2982788
5046B982788J32497j25506O9709N9948j55916j06480r3572K43519J21765o01805
$$ 2982788 3115285 2989779 3059488 3119436 2963520 2857040 2763468 3006987 3128752 2526947
5036B526947J71608J40333M5826j20226J38656j23847J75126k670M70848l48558
$$ 2526947 2698555 2838888 2884714 2764488 2903144 2779297 2954423 2951753 3422601 3074043
5026C074043k08915l31527O14343K97660J12448L3004j08258m79346j03086o4794
$$ 3074043 2865128 2533601 3147944 3445604 3558052 3591056 3482798 3003452 2900366 2835572
5016B835572l78324K79758j74118M32275j20755j4361K26635K68937J98781o14983
$$ 2835572 2457248 2737006 2562888 2995163 2874408 2860047 3086682 3355619 3554400 2939417
5006B939417K74540L32946K02183p6548k6696l23005l6217j43329K41805N88343
$$ 2939417 3213957 3546903 3749086 3672538 3645842 3322837 3286620 3143291 3385096 3973439
4996C973439j49662p13987j45016Q03501L80510o15241j39827M698k33727j50465
$$ 3973439 3823777 3109790 2964774 3768275 4148785 3533544 3393717 3398415 3164688 3014223
4986C014223Q5679k37972n05744L48467j68874K93305O07692J63811l88647M75779
$$ 3014223 3099902 2861930 2356186 2704653 2535779 2829084 3436776 3600587 3211940 3687719
4976C687719M52480l38583l59862l61814K95900p0457k74317M6734J91115O64456
$$ 3687719 4140199 3801616 3441754 3079940 3375840 3305383 3031066 3077800 3268915 3933371
4966C933371K11423J12252q7001p9519J8115l64767l49281M42591N58402m20245
$$ 3933371 4144794 4257046 4170045 4090526 4108641 3743874 3394593 3837184 4395586 3975341
4956C975341j49358l6216j72515p790J28203O12363m14140Q9992k41878R8931
$$ 3975341 3825983 3789767 3617252 3609462 3737665 4350028 3935888 4025880 3784002 3882933
4946C882933M23079q0891l9083L65755k78597j8677j70635M41820J4806k72129
$$ 3882933 4306012 4225121 4186038 4551793 4273196 4254519 4083884 4525704 4540510 4268381
4936D268381k84455k64828K27125Q7708R8631m17665J30197L52892R6127k18659
$$ 4268381 3983926 3719098 3946223 4033931 4132562 3714897 3845094 4197986 4294113 4075454
4926D075454J58770j47148M56230L73326J55202q8101l1270k91384m17463M56000
$$ 4075454 4234224 4087076 4543306 4916632 5071834 4983733 4952463 4661079 4243616 4699616
4916D699616j15096m44614J56793R3974J83112k95917O65397L99823L47929L19659
$$ 4699616 4584520 4139906 4296699 4390673 4573785 4277868 4943265 5343088 5691017 6010676
4906F010676k8237m36678m67555k37648j11270j77032K29860Q36292k36533Q2896
$$ 6010676 5982439 5545761 5078206 4840558 4729288 4552256 4782116 5618408 5381875 5464771
4896E464771l50989L30722j06772l55570K56074M72584l81k48568K85760p46462
$$ 5464771 5113782 5444504 5337732 4982162 5238236 5710820 5710439 5461871 5747631 5001169
4886E001169o5640Q79798k13051K29545l39124l25056K49068r1223R3079j99430
$$ 5001169 4935529 5815327 5602276 5831821 5492697 5167641 5416709 5325486 5418565 5219135
4876E219135j28486Q55484K7649j66482j64851K03110R0919J30174J99565j13233
$$ 5219135 5090649 5946133 5973782 5807300 5642449 5845559 5936478 6066652 6266217 6152984
4866F152984o5468L7370M00767n60142q7146K26266L5126K75259M84101J39368
$$ 6152984 6087516 6124886 6525653 5965511 5878365 6104631 6139757 6415016 6899117 7038485
4856G038485m34190j81213N17881r7984l70626r2646M55009M37772o8315j94330
$$ 7038485 6604295 6423082 6940963 6842979 6472353 6379707 6834716 7272488 7204173 7009843
4846G009843J48680L300j79434L06054j2880l23618M87804O1198J84642O9549
$$ 7009843 7158523 7161823 6982389 7288443 7275563 6951945 7439749 7500947 7685589 7755138
4836G755138l90429J26524k03710o48013l504L35625L26213M42769R9705J64339
$$ 7755138 7364709 7491233 7287523 6639510 6636006 6971631 7297844 7740613 7840318 8004657
4826H004657J02014L8113K88167J33075j84171n37769M85881J84000k6857k70376
$$ 8004657 8106671 8144784 8432951 8566026 8381855 7844086 8329967 8513967 8487110 8216734
4816H216734J67764l15420j71639M92854l60883P16034K37928Q8462m5003J42068
$$ 8216734 8384498 8069078 7897439 8390293 8029410 8745444 8983372 9071834 9026831 9168899
4806I168899J41125J80923J52660k54781k34612Q633N90976R9458l7696o8732
$$ 9168899 9310024 9490947 9643607 9388826 9154214 9162847 9753823 9853281 9815585 9746853
4796I746853n2816k17338j25968n9497j23010O32472M7923K32284J96973j671
$$ 9746853 9694037 9476699 9350731 9291234 9168224 9800696 9848619 10080903 10277876 10276205
4786A0276205P7781j67824J5350L38209O3714M3967M07456l6691Q9631l22441
$$ 10276205 10353986 10186162 10201512 10539721 10603435 10647402 11054858 11018167 11107798 10785357
4776A0785357j6130L55814Q2153n9486J44089K44883J95792R7192L24940l5617
$$ 10785357 10769227 11125041 11207194 11147708 11291797 11536680 11732472 11829664 12154604 12118987
4766A2118987j46586l01773J56409p3693M08312K80064k79053k78566J39478M019
$$ 12118987 11972401 11670628 11827037 11753344 12161656 12441720 12162667 11884101 12023579 12027598
4756A2027598K23364P1980m42245O05273Q15694k00482J26078l21826l52713K43622
$$ 12027598 12250962 12322942 11880697 12485970 13301664 13101182 13227260 12905434 12552721 12796343
4746A2796343L37344M52964K43701Q2942k60831m79230N07737R02613l54780K32453
$$ 12796343 13133687 13586651 13830352 13913294 13652463 13173233 13680970 14583583 14228803 14461256
4736A4461256l56222j1253M57881N28411K34668l48430r8057l58977K9809O19992
$$ 14461256 14105034 14093781 14551662 15080073 15314741 14966311 14868254 14509277 14539086 15159078
4726A5159078P4992M45333M0164L25226l11071Q2151m71803N04379J55079k56562
$$ 15159078 15234070 15679403 15719567 16044793 15733722 15815873 15344070 15848449 16003528 15746966
4716A5746966J40868J74901L05744J3518J12199L10458j87449K69433Q0257j66248
$$ 15746966 15887834 16062735 16368479 16381997 16494196 16804654 16617205 16886638 16966895 16800647
4706A6800647l85884K10177k53382J01944N23292K58507k89440J44158P0959q1782
$$ 16800647 16414763 16624940 16371558 16473502 16996794 17255301 16965861 17110019 17180978 17099196
4696A7099196P3429K7060L50287J955L91658J35539N9273J228l28254K38774M0016
$$ 17099196 17172625 17199685 17549972 17551927 17943585 18079124 18138397 18139625 17811371 18050145 18090161
4685A8090161K31777N63229k17983M62416K56391k9985L57371N65082J30083J63991
$$ 18090161 18321938 18885167 18667184 19129600 19385991 19356006 19713377 20278459 20408542 20572533
4675B0572533K48172P52117j57256k93983j122933m14635j05712M06507l77765
$$ 20572533 20820705 21572822 21415566 21121583 19998650 19584015 19478303 19884810 19507045
4666A9507045j7332p7480N2720m27636k81970j12763J51611J97272q903j36459
$$ 19507045 19489713 19412233 19464953 19037317 18755347 18642584 18794195 18991467 18982564 18846105
4656A8846105k01940L97726J82293l48135m49868l7395K98242j86413j64863o0330
$$ 18846105 18644165 19041891 19224184 18876049 18426181 18388786 18687028 18500615 18335752 18275422
4646A8275422N4231J21586J42645n72857L18001l39016l5833J70429K2091m65993
$$ 18275422 18329653 18451239 18593884 18021027 18339028 18000012 17964179 18134608 18156699 17690706
4636A7690706K82233l4673k9354O38999p48725m09286L60569P4995j37375J91069
$$ 17690706 17972939 17938266 17908912 18547911 17799186 17389900 17750469 17825464 17688089 17879158
4626A7879158J46314j57838k64217k16943l40653K38654k56341K7537K25543L7983
$$ 17879158 18025472 17867634 17603417 17386474 17045821 17284475 17028134 17055671 17281214 17319197
4616A7319197m25991M57677O7910K3682p49021m37429N62345L29762l16540m18641
$$ 17319197 16893206 17350883 17418793 17442475 16693454 16256025 16818370 17148132 16831592 16412951
4606A6412951O6813k07750n8184M65829m40155N288J86462J71812M0878l88402
$$ 16412951 16479764 16272014 16213830 16679659 16239504 16244792 16431254 16603066 16643944 16255542
4596A6255542l95841Q02645J28442q83821k3772K57743m4918o23610j48735N80920
$$ 16255542 15859701 16662346 16790788 15906967 15883195 16140938 16096020 15472410 15323675 15904595
4586A5904595l38512n5191k84885j8790l76159j34299R7269K03461J0067k98736
$$ 15904595 15566083 15510892 15226007 15207217 14831058 14696759 14794028 14997489 15007556 14708820
4576A4708820o513J04009l38190M24074k85574q25641K65927K45194J04629p6429
$$ 14708820 14702307 14806316 14468126 14892200 14606626 13780985 14046912 14292106 14396735 14320306
4566A4320306o51089J16343k39828K40897J97584k40813q7744P9982l05448M47836
$$ 14320306 13669217 13785560 13545732 13786629 13984213 13743400 13655656 13735638 13430190 13878026
4556A3878026n8607j93286k1607l46935N27330j43797K3671l79268L30278j14154
$$ 13878026 13819419 13626133 13604526 13257591 13784921 13641124 13664795 13285527 13615805 13501651
4546A3501651l00536m12386N3331j7678K15373l84124k67068j94267q1745J21799
$$ 13501651 13201115 12788729 12842060 12824382 13039755 12655631 12388563 12194296 12112551 12234350
4536A2234350M5658j79946K1712K06662m68887L36735K31460l06115j57921n37486
$$ 12234350 12280008 12100062 12121774 12328436 11859549 12196284 12427744 12121629 11963708 11426222
4526A1426222J11609K59550m7018m4741M67985l53509p50251M92646Q93100K61850
$$ 11426222 11537831 11797381 11750363 11705622 12173607 11820098 11069847 11562493 12455593 12717443
4516A2717443l41448n08327l07842k6460r1946K55011J67458P4259k04473K86082
$$ 12717443 12375995 11867668 11559826 11533366 11441420 11696431 11863889 11938148 11733675 12019757
4506A2019757P6337J36599j5579o89481J81121j98691j64646j26082N20271m46226
$$ 12019757 12096094 12232693 12217114 11527633 11708754 11510063 11345417 11219335 11739606 11293380
4496A1293380m88686j91996L66468k29902j9695N63269L48692m06643J46802k6095
$$ 11293380 10804694 10612698 10979166 10749264 10729569 11292838 11641530 11234887 11381689 11355594
4486A1355594n43789L4607n5692j92564J13533K74377L01327K44930j12481J17306
$$ 11355594 10811805 10846412 10790720 10598156 10711689 10986066 11287393 11532323 11419842 11537148
4476A1537148J80651l32325k85912K98823J55656j48861j78399J70424k03552
$$ 11537148 11717799 11385474 11099562 11398385 11554041 11405180 11226781 11397205 11193653
4467A1193653k73046j33676K19595m00190j90865J21382L26005l54326O5584K26874
$$ 11193653 10920607 10786931 11006526 10606336 10415471 10536853 10862858 10508532 10574116 10800990
4457A0800990l37726j82891j38248M46661j26633j91705r5452k06346K48337K23704
$$ 10800990 10463264 10280373 10142125 10588786 10462153 10270448 10174996 9968650 10216987 10440691
4447A0440691K00624K07596l3375l39827K85425L50516k64353J06217k04779l02992
$$ 10440691 10641315 10848911 10815536 10475709 10761134 11111650 10847297 10953514 10748735 10445743
4437A0445743K91623l31753K01221J23808k20336M9062M66k05179k01594L56742
$$ 10445743 10737366 10405613 10606834 10730642 10510306 10559368 10559834 10354655 10153061 10509803
4427A0509803j21205J9307M62016p8862J614M37091K21124l99614J45927k94046
$$ 10509803 10388598 10407905 10869921 10791059 10792673 11229764 11450888 11051274 11197201 10903155
4417A0903155J97793J78517K55409k9343k30105R6834J17762M15540J23506k01532
$$ 10903155 11100948 11279465 11534874 11505531 11275426 11372260 11490022 11905562 12029068 11827536
4407A1827536O1458Q5275j44591K81464J18411m46492K22665L52012L02208M28599
$$ 11827536 11888994 11974269 11829678 12111142 12229553 11783061 12005726 12357738 12659946 13088545
4397A3088545l92321n5542K67501J19871l46711k23467N89468M81794j46597l77552
$$ 13088545 12696224 12640682 12908183 13028054 12681343 12457876 13047344 13529138 13382541 13004989
4387A3004989J6491M46793L61082L74878M5093O3957j5903q5219K33786K00474
$$ 13004989 13021480 13468273 13829355 14204233 14249326 14313283 14297380 14212161 14445947 14646421
4377A4646421m1875K63097M50420j06934K07847p2619P4738J55207M31889K0384
$$ 14646421 14604546 14867643 15318063 15211129 15418976 15346357 15421095 15576302 16008191 16028575
4367A6028575n3831J43716o3531K90317R41332K65315P89103L19475l32156J55969
$$ 16028575 15974744 16118460 16054929 16345246 17286578 17551893 18340996 18660471 18328315 18484284
4357A8484284j61336K23985l81247m59034O55384j28463m35229L47049k35734
$$ 18484284 18322948 18546933 18165686 17706652 18362036 18233573 17798344 18145393 17909659
4348A7909659P90229N73847k42259J19335M39279q4470P5155K36379M59909N21920
$$ 17909659 18699888 19273735 19031476 19150811 19590090 19505620 19580775 19817154 20277063 20798983
4338B0798983J86278j82832K44834K23707O04583N32253L88746K07215J74273
$$ 20798983 20985261 20802429 21047263 21270970 21875553 22407806 22796552 23003767 23178040
4329B3178040L31624Q79448P62282P25273J05533l58250O93245J337914J36066
$$ 23178040 23509664 24389112 25151394 25876667 25982200 25623950 26317195 27655109 27791175
4320B7791175O712O64311J25583M57324R2951L30121J272943Q63732O67580J87106
$$ 27791175 27797887 28462198 28587781 29045105 29138056 29468177 30741120 31604852 32272432 32459538
4310C2459538K60547O17147R52674P65979J027769R00779K56768R71555J084643
$$ 32459538 32720085 33337232 34289906 35055885 36083654 36984433 37241201 38212756 39297399
4301C9297399Q10348O97051J312042J719024J509886Q46699J150779J516896J505754
$$ 39297399 40107747 40804798 42116840 43835864 45345750 46192449 47343228 48860124 50365878
4292E0365878J036227J468184K081073J947508J209116J298787J351958J995630
$$ 50365878 51402105 52870289 54951362 56898870 58107986 59406773 60758731 62754361
4284F2754361K268164J477405J951582K232707J449299K272732K524434J718290
$$ 62754361 65022525 66499930 68451512 70684219 72133518 74406250 76930684 78648974
4276G8648974K604171K571862K080741K618103K354989K256533K001339K027173
$$ 78648974 81253145 83825007 85905748 88523851 90878840 93135373 95136712 97163885
4268I7163885J744479J816108K360058J763085J402375K065396K289289J111348
$$ 97163885 98908364 100724472 103084530 104847615 106249990 108315386 110604675 111716023
4260A11716023J918523J982962J449078J035103J180662J154780P34463M34240
$$ 111716023 113634546 115617508 117066586 118101689 119282351 120437131 121171594 121605834
4252A21605834L66888Q20968O71288K80034Q70713Q53614K65414O83836Q8665
$$ 121605834 121972722 122793690 123464978 123745012 124615725 125469339 125734753 126418589 126507254
4243A26507254J50958L66699L41830N88182l32978K92661M56721O32980l5229
$$ 126507254 126658212 127024911 127366741 127954923 127621945 127914606 128371327 129004307 128969078
4234A28969078M19325J050065N67844P10571N71537P94430Q08529J138605O79983
$$ 128969078 129388403 130438468 131006312 131716883 132288420 133082850 133891379 135029984 135709967
4225A35709967P98107J184482Q37009J133904J214794R19541R82318N10488J084371
$$ 135709967 136508074 137692556 138529565 139663469 140878263 141797804 142780122 143290610 144374981
4216A44374981J287187R46321J074217R98338J737658J524012L14377P77034Q60951
$$ 144374981 145662168 146608489 147682706 148681044 150418702 151942714 152257091 153034125 153895076
4207A53895076J076893M96315O13139M20394M97835R12066M49142M75830M68941
$$ 153895076 154971969 155468284 156081423 156501817 156999652 157911718 158360860 158836690 159305631
4198A59305631J12046N1929K6905O03836Q69715L15203j45285k10899l8405M1544
$$ 159305631 159417677 159469606 159496511 160100347 160970062 161285265 161139980 160929081 160890676 160932220
4188A60932220K31093l33093k28896k48459l24186j69382R753q25942j435255
$$ 160932220 161163313 160830220 160601324 160352865 160028679 159859297 159869050 159043108 157607853
4179A57607853o66764o40909j314337j085648r23333j715472j708064j320254
$$ 157607853 156941089 156300180 154985843 153900195 152976862 151261390 149553326 148233072
4171A48233072j846265k261491j952703k148568j770604j960702k448587k311403
$$ 148233072 146386807 144125316 142172613 140024045 138253441 136292739 133844152 131532749
4163A31532749k659991k378553k475175l617772k786136k839052k743127k536161
$$ 131532749 128872758 126494205 124019030 120401258 117615122 114776070 112032943 109496782
4155A09496782k999811k428776l042255l432983k529005k845767k399350k761047
$$ 109496782 106496971 104068195 101025940 97592957 95063952 92218185 89818835 87057788
4147H7057788k554893k380833k753481k425407k295545k690272k136037j731640
$$ 87057788 84502895 82122062 79368581 76943174 74647629 71957357 69821320 68089680
4139F8089680k040072k213725k237447j367422j347939j894924j494304j324214
$$ 68089680 66049608 63835883 61598436 60231014 58883075 56988151 55493847 54169633
4131E4169633j393653j026160j174749j514048j248647r69329r94063m96323n80557
$$ 54169633 52775980 51749820 50575071 49061023 47812376 46843047 45848984 45352661 44772104
4122D4772104m18088q62883n76330p72859m60109n60103o2769o82323J59946m07959
$$ 44772104 44354016 43491133 42914803 42141944 41681835 41121732 41058963 40376640 40536586 40128627
4112D0128627k95692Q2169p49400l52061M3129n7226J08385J41334M4512m86003
$$ 40128627 39832935 39915104 39165704 38813643 38856772 38799546 38907931 39049265 39093777 38607774
4102C8607774j01960L61041O5450k13910K69286K90515m7986M65915M68289J86973
$$ 38607774 38505814 38866855 38932305 38718395 38987681 39278196 39230210 39696125 40164414 40351387
4092D0351387j74839J81866L9225M45805M85290N39614R72907O38568K20515K85552
$$ 40351387 40176548 40358414 40397639 40843444 41328734 41868348 42841255 43479823 43700338 43985890
4082D3985890L40829R04418L90072P00577N79870L23310M27522M82894P18719
$$ 43985890 44326719 45231137 45621209 46321786 46901656 47224966 47652488 48135382 48854101
4073D8854101Q12988O60382J094090R96768P36756J205065O06464Q20432Q37950
$$ 48854101 49667089 50327471 51421561 52418329 53155085 54360150 54966614 55787046 56624996
4064E6624996J057940J450056R55146J80862M75408J271461Q05625P43948J047213
$$ 56624996 57682936 59132992 60088138 60269000 60744408 62015869 62821494 63565442 64612655
4055F4612655O96048J371312Q96001J083678J463409J115628J289285J646740
$$ 64612655 65308703 66680015 67576016 68659694 70123103 71238731 72528016 74174756
4047G4174756J498599J268858R54629J848361K005636K358257K803785K326529
$$ 74174756 75673355 76942213 77896842 79745203 81750839 84109096 86912881 89239410
4039H9239410L132694L428113M703430M840931N437826O379418P321044P769838
$$ 89239410 92372104 95800217 100503647 105344578 110782404 117161822 124482866 132252704
4031A32252704Q496161R802707J0966572J1783240J1939834J1851677J1343460
$$ 132252704 140748865 150551572 161518144 173301384 185241218 197092895 208436355
4024B08436355J0427677R076359P062795M799499K133779J054949P9771l0810
$$ 208436355 218864032 227940391 235003186 239802685 241936464 242991413 243071184 243040374
4016B43040374j185677j144031j080226q14234r01990q08858j813579l209018
$$ 243040374 241854697 240710666 239630440 238816206 237914216 237105358 235291779 232082761
4008B32082761m159955o166041p319979r280505j0384891j1136133j1130125j1731834
$$ 232082761 227922806 221756765 214436786 205156281 194771390 183635257 172505132 160773298
4000A60773298j0133265q684149q031486p238411o554975n777670n505321m104392
$$ 160773298 150640033 141955884 133924398 126685987 120131012 114353342 108848021 104743629
3992A04743629l631844l347499l616946k055900j988054k268496k004671j459397
$$ 104743629 101111785 97764286 94147340 92091440 90103386 87834890 85830219 84370822
3984H4370822p71044r45099o01240l91943Q5150M3952L16328p9001N7099N68779
$$ 84370822 83599778 82654679 82053439 81661496 81746646 81790598 82106926 82027925 82085024 82653803
3974H2653803N57487M56218M57371R11609J152884J043741R51591Q08230J975293
$$ 82653803 83211290 83667508 84124879 85036488 86189372 87233113 88184704 88992934 90968227
3965I0968227J782518J641266J815935J141900J173770J495125K193221K425405
$$ 90968227 92750745 94392011 96207946 97349846 98523616 100018741 102211962 104637367
3957A04637367J888261K273406K341381K809323K561292K766647K650905K816035
$$ 104637367 106525628 108799034 111140415 113949738 116511030 119277677 121928582 124744617
3949A24744617L553520L381947L701522M139837M701274M861572N507492O096455
$$ 124744617 128298137 131680084 135381606 139521443 144222717 149084289 154591781 160688236
3941A60688236N976326O421553O758098P119523P475522P707137P878195Q986005
$$ 160688236 166664562 173086115 179844213 186963736 194439258 202146395 210024590 219010595
3933B19010595Q246279P819565P690967P449950O735242P300220O721929O601205
$$ 219010595 227256874 235076439 242767406 250217356 256952598 264252818 270974747 277575952
3925B77575952O296309N526556O120062N300858M781317M438908M951079L534956
$$ 277575952 283872261 289398817 295518879 300819737 305601054 310039962 314991041 318525997
3917C18525997L051239K705690J423888J208688O70797L57445j32753q10787k70215
$$ 318525997 321577236 324282926 325706814 326915502 327586299 327943744 327810991 327000204 326729989
3908C26729989q70850j515311j498457j990400k697508k696230l001128l643580
$$ 326729989 325859139 324343828 322845371 320854971 318157463 315461233 312460105 308816525
3900C08816525m076326l986752l379752l986705l249286k842746l189256l010856
$$ 308816525 304740199 300753447 297373695 293386990 290137704 287294958 284105702 281094846
3892B81094846l136744k358792k652687k382618k685971k297583j906638j850094
$$ 281094846 277958102 275599310 272946623 270564005 267878034 265580451 263673813 261823719
3884B61823719j346266j514044n07097M69342J501228J968369K542130L681010
$$ 261823719 260477453 258963409 258456312 258925654 260426882 262395251 264937381 268618391
3876B68618391M237292N340155N049105N649256N085803L784238K866063J587606
$$ 268618391 272855683 278195838 283244943 288894199 293980002 297764240 300630303 302217909
3868C02217909O71637j51936r01054j351107j673543j689090j679952q99590m77001
$$ 302217909 302889546 302737610 301836556 300485449 298811906 297122816 295442864 294543274 294066273
3859B94066273j593920q23948j203100k051977l038327l855219m124632m568144
$$ 294066273 292472353 291648405 290445305 288393328 285355001 281499782 277375150 272807006
3851B72807006m614054m205799l849415k642990k359796j538611K32847J334286
$$ 272807006 268192952 263987153 260137738 257494748 255134952 253596341 253829188 255163474
3843B55163474K559081L840553L490261M222667N598369O289821O183368P193846
$$ 255163474 257722555 261563108 265053369 269276036 274874405 281164226 287347594 294541440
3835B94541440P846860P894448P561439P573405P749120P709011Q849870P453035
$$ 294541440 302388300 310282748 317844187 325417592 333166712 340875723 349725593 357178628
3827C57178628P511419O871921N948482N541683M736632L686575L666514K483464
$$ 357178628 364690047 371561968 377510450 383052133 387788765 391475340 395141854 397625318
3819C97625318K139966J845007O12098l95896k96718p06483j765648k811449l291136
$$ 397625318 399765284 401610291 402222389 401826493 401529775 400823292 399057644 396246195 392955059
3810C92955059m114375m693021m569383n909044n994359n903869o170794o585374
$$ 392955059 388840684 384147663 379578280 373669236 367674877 361771008 355600214 349014840
3802C49014840n263232n528197o156700n468745n507738m697987m630184m304914
$$ 349014840 343751608 338223411 332066711 326597966 321090228 316392241 311762057 307457143
3794C07457143m455244l861159l619478l100629k402503j913761j239352j379360
$$ 307457143 303001899 299140740 295521262 292420633 290018130 288104369 286865017 285485657
3786B85485657j156830o14223O7720l7224M21302M50988R96416N94786Q43588
$$ 285485657 284328827 283714604 283782324 283745100 284166402 284617390 285613806 286208592 287052180
3777B87052180O61155J196011J046452Q4059l54809J04463j07381l50752j018680
$$ 287052180 287713335 288909346 289955798 290039857 289685048 289789511 289682130 289331378 288312698
3768B88312698j052948j204645k403093k316738k998143l120401l271381l651546
$$ 288312698 287259750 286055105 283652012 281335274 278337131 275216730 271945349 268293803
3760B68293803m443926m495291m430401n397623n615198n747081n891733o293595
$$ 268293803 263849877 259354586 254924185 249526562 243911364 238164283 232272550 225978955
3752B25978955n979925o191993o518670o275217o380756o413437o795431o596396
$$ 225978955 219999030 213807037 207288367 201013150 194632394 188218957 181423526 174827130
3744A74827130o356183n963305n985549o095176n962205n458739n385100n134744
$$ 174827130 168470947 162507642 156522093 150426917 144464712 139005973 133620873 128486129
3736A28486129n228856m823083n063635m452019l869593m156573m526821l854311
$$ 128486129 123257273 118434190 113370555 108918536 105048943 100892370 96365549 92511238
3728I2511238l194584k819708l109829l589453k536659k877498j884534j974080
$$ 92511238 89316654 86496946 83387117 79797664 77261005 74383507 72498973 70524893
3720G0524893k362057k097181k139061r47146j842710k144041j581879q45530
$$ 70524893 68162836 66065655 63926594 62979448 61136738 58992697 57410818 56565288
3712E6565288j187808j428609j214693o36729q51571j546382p22677r15294j085161
$$ 56565288 55377480 53948871 52734178 52097449 51245878 49699496 48976819 48061525 46976364
3703D6976364o83308o66949j228641j519823p70845Q743p92330j039361j075578
$$ 46976364 46293056 45626107 44397466 42877643 42106798 42115541 41323211 40283850 39208272
3694C9208272o97262m82110r31851o35216o86363o29736j232083j097638m23809
$$ 39208272 38511010 38028900 37097049 36461833 35775470 35145734 33913651 32816013 32392204
3685C2392204r47167p7843n20258m17375j112491o34914q86952j302651P268n70100
$$ 32392204 31445037 31367194 30846936 30429561 29317070 28682156 27795204 26492553 26499821 25929721
3675B5929721j155796n11548R8037n58929k51696l83701j090838o2482j62418
$$ 25929721 24773925 24262377 24360414 23801485 23549789 23166088 22075250 22012768 21850350
3666B1850350l17260k51452q9166q35382p49099r3055o20982J76847J99300o11218
$$ 21850350 21533090 21281638 21192472 20357090 19607991 19514936 18893954 19070801 19270101 18658883
3656A8658883m36029n87131k87341K28068n6200j23818m38339k30236o70877N0881
$$ 18658883 18222854 17635723 17348382 17576450 17520250 17396432 16958093 16727857 16056980 16107861
3646A6107861J4383k09068N19266l13022n72426m72491k4418M363K05560J47156
$$ 16107861 16122244 15913176 16432442 16119420 15546994 15074503 15050085 15054448 15260008 15407164
3636A5407164l20532q6685m3096k24226k70529j40546j21700l2864j89899l64670
$$ 15407164 15086632 14999947 14956851 14732625 14462096 14321550 14199850 14166986 13977087 13612417
3626A3612417K48364L13945m51464J41160o12470n12446l2462L14193j4983l29437
$$ 13612417 13860781 14174726 13723262 13864422 13251952 12739506 12707044 13021237 13006254 12676817
3616A2676817l84983J89537J92770n91586l13647K79436L1953j60247j97468l26454
$$ 12676817 12291834 12481371 12674141 12082555 11768908 12048344 12080297 11920050 11722582 11396128
3606A1396128L5733l28599j68258N82060l5236j0184K8439L06991M75745p29752
$$ 11396128 11431861 11103262 10935004 11517064 11481828 11471644 11500083 11807074 12282819 11553067
3596A1553067p4917K30940q95886J45772J72712n7249l66616j94877O1694K76977
$$ 11553067 11478150 11709090 10813204 10958976 11131688 11074439 10707823 10512946 10574640 10851617
3586A0851617L04352l81726k11694Q1833M89324p13873l47249L91007J39131k20498
$$ 10851617 11155969 10774243 10562549 10644382 11133706 10419833 10072584 10463591 10602722 10382224
3576A0382224k38444m04478J95041m7606r1671j61062n4359J50452l030M6354
$$ 10382224 10143780 9739302 9934343 9886737 9795066 9634004 9579645 9730097 9727067 9773421
3566I773421o8306j86354O7406K87321l35353Q0348P2629j66067k34500l57054
$$ 9773421 9705115 9518761 9586167 9873488 9538135 9618483 9691112 9525045 9290545 8933491
3556H933491Q1391L68135l21816M66556m2759j24120L34713q7099k79698K37078
$$ 8933491 9014882 9383017 9061201 9527757 9484998 9360878 9695591 9608492 9328794 9565872
3546I565872P3978m5748L60766k91057k24196L06470K01981L08291R8232r51070
$$ 9565872 9639850 9594102 9954868 9663811 9439615 9746085 9948066 10256357 10354589 9403519
3536I403519L88379L68977k21102k70143O67810M2931j04529M1625J80603K47094
$$ 9403519 9791898 10160875 9939773 9669630 10337440 10380371 10275842 10317467 10498070 10745164
3526A0745164m30130K84770J983k34282j12322N36089N06501k43210k15578K02445
$$ 10745164 10315034 10599804 10601787 10367505 10255183 10791272 11297773 11054563 10838985 11041430
3516A1041430j18167k96514k03301K32122Q0299L06764M17139l45455j56741M3450
$$ 11041430 10923263 10626749 10423448 10655570 10735869 11042633 11459772 11114317 10957576 11001026
3506A1001026K80625m78603m5481N73408J26868m8330J25599M95970O72259l894
$$ 11001026 11281651 10803048 10757567 11330975 11457843 11409513 11535112 12031082 12703341 12699447
3496A2699447J86518K31938J27514m6080M66201N78988K52088K33567j49027L74208
$$ 12699447 12885965 13117903 13245417 13199337 13665538 14244526 14496614 14730181 14581154 14955362
3486A4955362q4331J63377M79108J1068p491M08489j92152K86671R07127k80409
$$ 14955362 14871031 15034408 15513516 15524584 15517093 15925582 15733430 16020101 16927228 16646819
3476A6646819m3831l6060K24294K37195P23874K80776L84073M60575o6693O51170
$$ 16646819 16602988 16566928 16791222 17028417 17752291 18033067 18417140 18877715 18811022 19462192
3466A9462192J003941K66955O87439J172817J319727J481645Q79466J552019K195079
$$ 19462192 20466133 20733088 21420527 22593344 23913071 25394716 26274182 27826201 30021280
3457C0021280J901962K922052L255100K793241K666361N07134j239196j230233
$$ 30021280 31923242 34845294 38100394 40893635 43559996 44067130 42827934 41597701
3449D1597701j598389j347330o76237r40771k45562k92208p56659r1238l13517
$$ 41597701 39999312 38651982 37975745 37034974 36789412 36497204 35740545 35649307 35335790
3440C5335790n55178j22786k089q50459m96035m45310j102411K21217k6661K9104
$$ 35335790 34780612 34657826 34655737 33805278 33309243 32863933 31761522 31982739 31956078 31985182
3430C1985182M69951J5445l39357J022588J754729K309432L324203M349106L730449
$$ 31985182 32455133 32470578 32131221 33153809 34908538 37217970 40542173 44891279 48621728
3421D8621728J836358j409303l368444m488625l981164m198813l623759l800357
$$ 48621728 50458086 49048783 45680339 41191714 37210550 33011737 29387978 25587621
3413B5587621k362838k026507j641292j073186r29883o07176j267770m87785m15317
$$ 25587621 23224783 21198276 19556984 18483798 17553915 16946739 15678969 15191184 14775867
3404A4775867m31791L33202k8236m36237J48035J77826M54143M93178J47217J38696
$$ 14775867 14344076 14677278 14649042 14212805 14360840 14538666 14992809 15485987 15633204 15771900
3394A5771900J075703J628962K055261J821694J904008O60789n59763j503313
$$ 15771900 16847603 18476565 20531826 22353520 24257528 24918317 24358554 22855241
3386B2855241k153863k293512k247480k060154j194675j423312q15712p93675
$$ 22855241 20701378 18407866 16160386 14100232 12905557 11482245 10666533 9872858
3378I872858l94541m29716k61774o16999j19302k79574o31849k34040n03507K24204
$$ 9872858 9478317 9048601 8786827 8169828 8050526 7770952 7139103 6905063 6401556 6625760
3368F625760m17153M1631l3693k4285m38772m44321L63021k21347k05009n00709
$$ 6625760 6208607 6250238 6216545 6192260 5753488 5309167 5672188 5450841 5245832 4745123
3358D745123m23851M2691J05794K01322l97667n10165Q0525l1072J45699J84629
$$ 4745123 4321272 4363963 4469757 4671079 4273412 3763247 3843772 3812700 3958399 4143028
3348D143028m33984j64389Q033K34516R5579O075j15194p6509L53423k65905n65369
$$ 4143028 3709044 3544655 3552688 3787204 3882783 3888858 3773664 3697155 4050578 3784673 3219304
3337C219304L538n1608m4517j73345m222N0641l71586k9764m13882M87392M30602
$$ 3219304 3222842 3171234 3126717 2953372 2949150 2999791 2628205 2598441 2184559 2671951 3102553
3326C102553k03202P8177L38496j88045k10477m74658L05830K9373m51782K46618
$$ 3102553 2899351 2977528 3316024 3127979 2917502 2442844 2748674 2778047 2326265 2572883
3316B572883K74801j32686n46296P2178N84269k7649m39823l2249m4122K44687
$$ 2572883 2847684 2714998 2168702 2240880 2825149 2797500 2357677 2325428 2281306 2525993
3306B525993k61770K78554M03319k58152K90138J40919K06576m27968m02140m30392
$$ 2525993 2264223 2542777 2946096 2687944 2978082 3119001 3325577 2897609 2495469 2065077
3296B065077J40981J77157m46795M14376r5969M16004n6400p93981k8076K16474
$$ 2065077 2206058 2383215 1936420 2350796 2254827 2670831 2614431 1820450 1792374 2008848
3286B008848j00309K48929j81043j81435m8343L241L52K77200N19135n88838k15939
$$ 2008848 1908539 2157468 1976425 1794990 1746647 1749888 1750240 2027440 2546575 1957737 1741798
3275A741798j66982J06532O62283j01262m68664J49174N599j4628j27106J02386
$$ 1741798 1574816 1681348 2343631 2242369 1773705 1922879 1928478 1913850 1786744 1889130
3265A889130j37706q3750L54487k29900l68546k09314L02350j59560n73343N48291
$$ 1889130 1751424 1667674 2022161 1792261 1423715 1214401 1516751 1357191 783848 1332139
3255A332139J21603j14600J31159O7225N87075m93317m46907J62922K61082j93038
$$ 1332139 1453742 1339142 1470301 1537526 2124601 1631284 1184377 1347299 1608381 1415343
3245A415343j32458J44632L7074m37469J78365O5490J11357P75657j68163j85238
$$ 1415343 1282885 1427517 1464591 1027122 1205487 1270977 1382334 2157991 1989828 1804590
3235A804590k60935N8459R2879k63604m65893L15184M44613J06102P0418Q5902
$$ 1804590 1543655 1602114 1694993 1431389 965496 1280680 1725293 1831395 1901813 1987715
3225A987715k00788o00437L30450M508J80104J10575l03916p31759k0567L52746
$$ 1987715 1786927 1186490 1516940 1521448 1701552 1812127 1508211 776452 755885 1108631
3215A108631o8111J49898K04470l65891N44738Q6616k4086R8916l5778J62922
$$ 1108631 1040520 1190418 1394888 1028997 1573735 1660351 1636265 1735181 1699403 1862325
3205A862325l98720K03024j90745j8945P9639n86929K80377K20398m19136Q960
$$ 1862325 1463605 1666629 1475884 1456939 1536578 949649 1230026 1450424 1031288 1040248
3195A040248K77035k1177N8271J80505m7098j91576l3535L6000j91324J17165
$$ 1040248 1317283 1296106 1354377 1534882 1487784 1296208 1262673 1298673 1107349 1224514
3185A224514j26210j76043R7924J68838n1456l89939J79172P5699l968k887K55679
$$ 1224514 1098304 922261 1020185 1189023 1137567 747628 926800 1002499 998531 995644 1251323
3174A251323L95605J45050K84578p5903L7977p4374J45265n91353n1401Q8154
$$ 1251323 1646928 1791978 2076556 2000653 2038630 1964256 2109521 1518168 1466767 1554921
3164A554921K36825l29805l63556K91330J20284K83676j03105j00823j02563J30346
$$ 1554921 1791746 1461941 1098385 1389715 1509999 1793675 1690570 1589747 1487184 1617530
3154A617530K38572j64597n5602M07596K58508L1381K07177M43992m89686J61624
$$ 1617530 1856102 1691505 1635903 2043499 2302007 2333388 2540565 2984557 2494871 2656495
3144B656495L00797k58591J4266J31665L37666k56119P0936J98273m50692K26441
$$ 2656495 2957292 2698701 2712967 2844632 3182298 2926179 2997115 3195388 2744696 2971137
3134B971137j9557M69998O4518m09039j9753j10492J87106N6150L5303o07159
$$ 2971137 2951580 3421578 3486096 3077057 3057304 2946812 3133918 3190068 3225371 2618212
3124B618212l24839K45855J87071L01652p7362J13494K97600l54468K51293J91508
$$ 2618212 2293373 2539228 2726299 3027951 2950589 3064083 3361683 3007215 3258508 3450016
3114C450016J18226m51583K89179N88823p4889j53249J45193N32667K60095m04327
$$ 3450016 3568242 3116659 3405838 3994661 3919772 3766523 3911716 4444383 4704478 4300151
3104D300151j08049K08628M58655o53307n48905J12450m1142r8601o24570M20274
$$ 4300151 4192102 4400730 4859385 4206078 3657173 3769623 3728481 3629880 3005310 3425584
3094C425584k31334n89686j68807k16294l5042j5925q1533L34904O70727R3718
$$ 3425584 3194250 2604564 2435757 2219463 2184421 2168496 2086963 2421867 3092594 3186312
3084C186312l28951j31262R9468n12273K90302J57329q311J26347l2901K1488
$$ 3186312 2857361 2726099 2825567 2313294 2603596 2760925 2752614 2878961 2846060 2867548
3074B867548l32087p05795K59008j0489P7913K13031n22269l3625J00633Q4341
$$ 2867548 2535461 1829666 2088674 2078185 2156098 2369129 1846860 1813235 1913868 1998209
3064A998209O2895J55769m55513m59015L05408K64166q15954L23750l43051O2006
$$ 1998209 2061104 2216873 1761360 1302345 1607753 1871919 1055965 1379715 1036664 1098670
3054A098670Q60433M5637k76474j60573k73824l9218p99372O19069K41887k70230
$$ 1098670 1959103 2004740 1728266 1567693 1293869 1254651 455279 1074348 1316235 1046005
3044A046005j26040K51207M13068l14872j37991j48790O08380k23362k13688j02729
$$ 1046005 919965 1171172 1584240 1269368 1131377 982587 1590967 1367605 1153917 1051188
3034A051188j63420K0498K8011n35178k80648K17103K67434N4194k35268J87854
$$ 1051188 887768 908266 936277 401099 120451 337554 604988 659182 423914 611768
3024F11768K25736K24041j84789n87548J17824J84211K40555j20343n76158J61513
$$ 611768 837504 1061545 876756 289208 407032 591243 831798 711455 135297 296810
3014B96810Q767J2482K1005n60567J89996R92192L64292l24548k55511k72l17714
$$ 296810 305577 318059 339064 -221503 -31507 960685 1324977 1000429 744918 744646 426932
3003D26932P06266J22652o16191j829q4728k917o0977k756k34191N9512R6285
$$ 426932 1133198 1255850 639659 637830 553102 550185 489208 486452 252261 311773 408058
2992D08058j48719j80751Q4159l6872J66513k88851M26706L20324J35514p9680
$$ 408058 259339 78588 162747 125875 292388 3537 430243 750567 886081 806401
2982H06401j45384K8563k94377L12755J5609k64573K76583k30226J19007r6811
$$ 806401 661017 689580 395203 707958 723567 458994 735577 505351 624358 527547
2972E27547M65325l86549L12796n4516j16965k46278o48227M11851K17408P1880
$$ 527547 992872 606323 919119 864603 747638 501360 -146867 264984 482392 554272
2962E54272O397l24117q2147K62303m07033M89330J58975R5931l86410J38135
$$ 554272 560669 236552 154405 416708 9675 499005 657980 753911 367501 505636
2952E05636J70422L9292k69977n76759O04619k41270o84373J019823N62565j84653
$$ 505636 676058 715350 445373 -131386 473233 231963 -452410 567413 1129978 945325
2942I45325l06858n58382L40496L81148m78076k97143J18867l3664o7567K49128
$$ 945325 638467 80085 420581 801729 323653 26510 145377 111713 44146 293274
2932B93274k56660k3387n5129O37542j00666l82022J10342L7180l6429p8891J39444
$$ 293274 36614 13227 -41902 595640 494974 112952 223294 260474 224045 145154 284598
2921B84598j91447j60241O78129l1387m48093k68237k5633k74409J15200j70605
$$ 284598 93151 -67090 611039 579652 131559 -136678 -162311 -436720 -321520 -492125
2911d92125M94155R7845j39382J51470L38473r5688k62423k81624J77447L18129
$$ -492125 2030 99875 -39507 111963 450436 354748 92325 -189299 -11852 306277
2901C06277j61300L23142j43939J86557K2345k06382O4683n5768L6350l11611
$$ 306277 144977 468119 324180 510737 533082 326700 391383 335615 371965 60354
2891F0354L28597Q4420r6520J47606q1355j42805L37758j10476j22089k54056
$$ 60354 388951 473371 376851 524457 443102 300297 638055 527579 405490 151434
2881A51434Q5073o1158l82724N31351N8358k38375m58683N10158n0774j53539
$$ 151434 236507 175349 -207375 323976 382334 143959 -314724 195434 144660 -8879
2871h879m39668P46287J14030k63919J71572j70216J24816L04442p49934l02870
$$ -8879 -448547 297740 411770 147851 319423 149207 274023 578465 -171469 -474339
2861d74339j65198J4874L52784K32923P8234k02958j74936N7092p45143K40206
$$ -474339 -639537 -624663 -271879 -38956 39278 -163680 -338616 -281524 -1026667 -786461
2851g86461P29286j16192K42484M0987j43083N48607n17387m57198J44359N77430
$$ -786461 -57175 -173367 69117 110104 -32979 515628 -1759 -458957 -314598 262832
2841B62832o07762M59551k33033J66785K32907j7468k92770J2058P72676J49363
$$ 262832 -344930 114621 -118412 48373 281280 263812 -28958 -16900 755776 905139
2831I05139k59132m93251L58267J01942L7995L05596n79379l86884L63580K37727
$$ 905139 646007 152756 511023 612965 650960 956556 377177 -9707 353873 591600
2821E91600K01119n68803n95459K81719j58070M48609J31893l10493M79696l58350
$$ 591600 792719 223916 -371543 -89824 -247894 200715 332608 22115 501811 143461
2811A43461j03855j74663J09653K90608o39486M5297L46169l41797N51133J65773
$$ 143461 39606 -135057 -25404 265204 -374282 -328985 17184 -324613 226520 392293
2801C92293m8993l28066N7757L78809j13483j70364K79960q5079K74426m37973
$$ 392293 343300 15234 72991 451800 338317 167953 447913 362834 637260 199287
2791A99287l33775j4249J87779j60608M67182J59756l97761m78216N2056L79793
$$ 199287 -134488 -148737 39042 -121566 345616 505372 107611 -370605 -318549 61244
2781F1244K75992m7076m74347J93777N76262k52652j50221l32660M3957j54577
$$ 61244 337236 290160 -184187 9590 585852 333200 182979 -149681 -105724 -260301
2771b60301L71606j28411J37773l40416K45137J34366o89714J7213N36302L22521
$$ -260301 111305 -17106 120667 -219749 25388 159754 -529960 -512747 23555 346076
2761C46076N8269L04460m3906l08215L69868m88154k29292q5819J68032K8029
$$ 346076 404345 708805 664899 356684 726552 238398 9106 -76713 91319 119348
2751A19348k56837l43385K24448M79273L07330k53856l92995K72710M09827r6861
$$ 119348 -137489 -480874 -256426 222847 530177 276321 -116674 156036 565863 469002
2741D69002o30023K27601k12822l21509L5261L63580L81569R3523k67742l27843
$$ 469002 -161021 66580 -146242 -467751 -432490 -68910 312659 406182 138440 -189403
2731a89403k81137M08245o6457J37141K07847N88896R8099l04852l5912m76648
$$ -189403 -470540 -62295 -128752 8389 216236 805132 903231 598379 562467 85819
2721H5819r776M88307n03327q6165l31370L4665K00504K63672L80908m37741k1460
$$ 85819 76043 564350 61023 -25142 -356512 -321847 -121343 142329 523237 85496 64036
2710F4036j56157j69842M45220m3120K96805K71527o88574m66079M14777l21921
$$ 64036 -92121 -261963 183257 140137 436942 708469 19895 -446184 -31407 -353328
2700c53328k33510L39232Q20918j83062J04617O2516K4824l32650l97001L46597
$$ -353328 -586838 -247606 573312 390250 494867 557383 582207 249557 -147444 199153
2690A99153J088R5854L17399M97884k50332q9972j23770m73059n2142K61029o6390
$$ 199153 200241 296095 613494 1111378 861046 771074 647304 174245 122103 383132 316742
2679C16742k14746j60037m9588M92425l92380L02786j7086K6965J74396J72300
$$ 316742 101996 -58041 -107629 384796 -7584 295202 278116 305081 479477 651777
2669F51777L8936l65908M6437j72581k54090j33499j93283O9777L89347j44045
$$ 651777 690713 324805 371242 198661 -55429 -188928 -382211 -312434 76913 -67132
2659f7132m58952J30359J58971J90584k5476m63616J72023N17190O682R8164m01676
$$ -67132 -526084 -395725 -236754 -46170 -71646 -535262 -363239 153951 160633 258797 -142879
2648a42879j01296K66837N1455k50531N03500K62333k96256K36312k71005J84543
$$ -142879 -244175 22662 74117 -176414 327086 589419 293163 529475 258470 443013
2638D43013j61866m59869j11580m3616j63159L96560J85336K73876R9988m22902
$$ 443013 281147 -178722 -290302 -333918 -497077 -100517 84819 358695 458683 35781
2628C5781M7715m14474N3988j99069p3949J39192J09458J49238l07014K76734
$$ 35781 83496 -330978 -276990 -476059 -550008 -410816 -301358 -152120 -459134 -182400
2618a82400L90300l44860k68313O8424K01344K85870m8119J43598M68993k40281
$$ -182400 207900 -136960 -405273 -336849 -135505 150365 102246 245844 714837 474556
2608D74556l57299j68276j33750M06450o6660q6236j58411J14013J74229l1949
$$ 474556 117257 -51019 -184769 221681 155021 68785 -89626 24387 198616 166667
2598A66667Q8374J32275N0436J28676J15241l59080o16432J47973k25656j14493
$$ 166667 255041 387316 437752 566428 681669 322589 -293843 -145870 -371526 -486019
2588d86019K42582Q09433l72836l73977k8571M93431j08993k08661Q273L56333
$$ -486019 -243437 565996 193160 -180817 -209388 284043 175050 -33611 -25338 330995
2578C30995l07326J0276L44903l40857j58829J73004n2920M01243l88037l60125
$$ 330995 23669 33945 378848 37991 -120838 52166 -754 400489 12452 -347673
2568c47673K56980j05612J2749m96627P6731K49006j63996N69792N25214j78292
$$ -347673 -90693 -196305 -183556 -680183 -603452 -354446 -518442 51350 576564 398272
2558C98272j24555l94864m55985K04803j29307L79541J48991k82308J60856M65354
$$ 398272 273717 -121147 -577132 -372329 -501636 -122095 26896 -255412 -94556 370798
2548C70798l63930k05237l654J8741L37671j52373j51081q8930k6599L61343L54593
$$ 370798 6868 -198369 -202023 -183282 154389 2016 -149065 -237995 -264594 96749 451342
2537D51342Q5214J4139l83580K6068k16064L05860k57136J20533j21200M97884
$$ 451342 536556 550695 167115 193183 -22881 282979 25843 146376 25176 523060
2527E23060k03504q9406K85062q5198m8478j84949q0836K05732M1030M82362k82564
$$ 523060 319556 230150 515212 430014 381536 196587 115751 321483 362513 844875 562311
2516E62311p03159m97225j6634J41601K32153j26474K66708K38123j67286j26174
$$ 562311 -140848 -638073 -654707 -513106 -280953 -407427 -140719 97404 -69882 -196056
2506a96056l21739N47175O2393k21825J2840P2832K61247Q8165l97334L5663K09851
$$ -196056 -517795 29380 91773 -130052 -117212 -44380 216867 305032 -92302 -56639 153212
2495A53212q3101k98759N69729o33061J0090M71091m68220L49249O91988j49658
$$ 153212 70111 -228648 341081 -291980 -281890 189201 -279019 70230 762218 612560
2485F12560l25387o09j01555o2447j51396N61812m09706j98267P6978P2384N32311
$$ 612560 287173 286564 185009 122562 -28834 532978 123272 -74995 1983 74367 606678
2474F06678L32732n06108J02539L48540l58287l2484l09857r7638J82455n3732
$$ 606678 939410 433302 535841 884381 526094 493610 183753 86115 268570 214838
2464B14838P990J50091J02023K35155K82928m01973K57775k57287l82040N0293
$$ 214838 222828 372919 474942 710097 993025 591052 848827 591540 209500 259793
2454B59793K91685j30220J4229O7023n93364O72826k0958m43237M1140O42750
$$ 259793 551478 421258 435487 502510 -90854 581972 561014 117777 158917 801667
2444H01667j6224k72279r4652n7636L51343J51943k59060j70766N41588J8468
$$ 801667 785443 513164 418512 360876 712219 864162 605102 434336 975924 994392
2434I94392m06893k15811J44504j69510j39292L44146j11827K7589j23234k2563
$$ 994392 587499 371688 516192 346682 207390 551536 439709 467298 344064 321501
2424C21501L20188p4305J0090j00594J01648l343J5676L50743n3494j07930k65085
$$ 321501 641689 567384 577474 476880 578528 575185 590861 941604 888110 780180 515095
2413E15095O8490O5903m7081K06665k28711j32887K38782M66575m12726n05162
$$ 515095 583585 649488 602407 809072 580361 447474 686256 1152831 740105 234943
2403B34943k45430j95796N61045L55023k06960O7472L54794j09381K02196r3212
$$ 234943 -10487 -206283 354762 709785 502825 570297 925091 815710 1017906 924694
2393I24694q5116L13337r4708j38251l813J21367l06422j99107L14978j52003
$$ 924694 839578 1152915 1058207 919956 916143 1037510 731088 531981 846959 694956
2383F94956J96609L06422k03963o2672n53791K88066Q31169J46021M44374k69982
$$ 694956 891565 1197987 994024 931352 377561 665627 1496796 1642817 2087191 1817209
2373A817209j12025L37316k41520L7869N11122K20166k35604l33379J28727l36680
$$ 1817209 1705184 2042500 1800980 1838849 2349971 2570137 2334533 2001154 2129881 1793201
2363A793201K40179O62097n78283J82588N61778j87937k21711K18690K60309M64876
$$ 1793201 2033380 2695477 2117194 2299782 2861560 2673623 2451912 2670602 2930911 3395787
2353C395787N84185K686l3688M92729M94201J28621K74077K79635n561l94057
$$ 3395787 3979972 3982658 3948970 4441699 4935900 5064521 5338598 5618233 5612672 5218615
2343E218615K92060m66099K59570j2364j08483J45811M45611K11026M9748J56028
$$ 5218615 5510675 5044576 5304146 5291782 5183299 5329110 5774721 5985747 6035495 6191523
2333F191523j72773J93763M14643K14522O24834O23445L38677L75290K95913P27548
$$ 6191523 6018750 6212513 6627156 6841678 7466512 8089957 8428634 8803924 9099837 9827385
2323I827385Q33530J022810O02438J252258J636287K226797K431042L289103M227546
$$ 9827385 10660915 11683725 12286163 13538421 15174708 17401505 19832547 23121650 27349196
2314B7349196L501724M115018N893974Q026339Q819539R279246O207909P0846
$$ 27349196 30850920 34965938 40859912 48886251 57705790 66985036 73192945 73263791
2306G3263791n828911j0068126j0326261q648251o441208m215399k664641l124789
$$ 73263791 67434880 57366754 47040493 38392242 31951034 27735635 25070994 21946205
2298B1946205k854297j770640j202978r38014j023052j62626r68469r36771j282993
$$ 21946205 19091908 17321268 16118290 15180276 14157224 13994598 13026129 12089358 10806365
2289A0806365j261344n86632j398004m81034l46838n78351l60865k15548n84952
$$ 10806365 9545021 8958389 7560385 7079351 6732513 6154162 5793297 5577749 4992797
2280D992797k24111j40555P247k82551p39560q3171L49383j11070n96017o30459
$$ 4992797 4768686 4628131 4635378 4352827 3613267 3530096 3879479 3768409 3172392 2541933
2270B541933J08134L38976l1538j30286j83975n22832K02867j53892N2277k12803
$$ 2541933 2650067 2989043 2957505 2827219 2643244 2120412 2323279 2169387 2221664 2008861
2260B008861K92169l49050R6180o2373m0271L81153k82607M8942m56905p47642
$$ 2008861 2301030 1951980 2048160 1985787 1945516 2326669 2044062 2093004 1636099 888457
2250H88457K3027Q87372J12263p76616J75815P8189O4541K31192L03654p33204
$$ 888457 911484 1798856 1911119 1134503 1310318 1388507 1453048 1684240 1987894 1254690
2240A254690n69679N65779l0525k71385k28937M8881L48679M4424k34091k03223
$$ 1254690 685011 1250790 1220265 948880 719943 768824 1117503 1161927 927836 724613
2230G24613M55059K01898r94225M68642l41666j88432J51750P9619M54391M234
$$ 724613 1179672 1381570 387345 855987 514321 325889 477639 557258 1011649 1015883
2220A015883j2527l1702j73908k85986k85241K5083L2039n2208O5953j69001L25721
$$ 1015883 1003356 971654 797746 511760 226519 251602 283641 231433 297386 128385 454106
2209D54106R4244k88126J94392L91031L68177q14357r0020J74428K69173k20479
$$ 454106 548350 260224 454616 845647 1213824 399467 309447 483875 753048 532569
2199E32569Q1211K87602l46676J5588k34754l12766o1110j88009L05046L81707
$$ 532569 613780 901382 554706 570294 335540 22774 -38336 -226345 78701 460408
2189D60408k48000J08314K6354k60277k86050J23191M6125J27310N1609j43125
$$ 460408 212408 320722 347076 86799 -199251 -76060 -29935 97375 148984 5859
2179E859j32742j05263M9194R22081K04085j18721L1066k75068j30401l30060
$$ 5859 -126883 -232146 -182952 739129 943214 824493 855559 580491 450090 120030
2169A20030j10177J15058n6417j45554K53165Q2027j67028l31172j17394j0068
$$ 120030 9853 124911 68494 -77060 176105 258132 91104 -240068 -357462 -367530
2159c67530M26889J76098r8440n38310O2214N4299r1827J76950K41013J78248
$$ -367530 59359 235457 137017 -401293 -339079 -284780 -376607 -199657 41356 219604
2149B19604N23042q9716k05080m35131p39020K28039M25780K07050k55247L6679
$$ 219604 742646 652930 447850 12719 -726301 -498262 -72482 134568 -120679 -84000
2139h4000j98579K79547K55022j18734R4459j42754M10023n79133l24176K62780
$$ -84000 -282579 -3032 251990 133256 227715 84961 494984 -84149 -408325 -145545
2129a45545P021R7567j462J99068m4232l81903L20927N6007m39453M53304L11621
$$ -145545 -138524 -40957 -42419 156649 112417 -269486 51441 107448 -332005 121299 432920
2118D32920j53927j74986P2307J2266K52867l83878K67932K3284k11282K6121
$$ 432920 278993 104007 176314 188580 441447 57569 325501 348785 137503 163624
2108A63624j83767k93458k7841L12844K88192J9306J60862m02182l76197M4004
$$ 163624 -20143 -313601 -341442 -28598 259594 278900 439762 37580 -338617 -294613
2098b94613j65752L14722k02805K77259l75871J75181N57764J55166J1605m4818
$$ -294613 -460365 -145643 -348448 -71189 -447060 -271879 285885 441051 452656 407838
2088D07838l74524J45566j33773k20702O13796j00399J39559l64609N6611j8063
$$ 407838 33314 178880 45107 -175595 438201 337802 477361 112752 169363 151300
2078A51300L54550j03685J45176n67935j18507L24799l10298K31441m05656j20710
$$ 151300 505850 402165 547341 -20594 -139101 185698 -124600 106841 -298815 -419525
2068d19525q2913J88477O26318l27807P6716N07621j86635m57429M2161P2682
$$ -419525 -502438 -313961 312357 -15450 61266 568887 382252 -75177 -33016 39666
2058C9666L3143L20804l12978k55962J70840K80634j73448l65444L76234K19135
$$ 39666 72809 393613 80635 -175327 -4487 276147 102699 -262745 113489 332624
2048C32624k16627k92168J68523r4965J47334J44589j56266K16012J35788M32709
$$ 332624 115997 -176171 -7648 -102613 44721 189310 33044 249056 384844 817553
2038H17553M3633j93745m61880m61167m42971R48826j93080K45887L23945m1029
$$ 817553 861186 667441 205561 -255606 -698577 250249 57169 303056 627001 585972
2028E85972l44586j46822k14719j7862M3713k73728J33638j21614N5520n0718
$$ 585972 241386 94564 -120155 -138017 -94304 -368032 -234394 -356008 -300488 -351206
2018c51206j52735O8776N30997j2286K13760j83779K40379p2825m88254K4963
$$ -351206 -503941 -435165 95832 83546 297306 113527 353906 281081 -207173 -182210
2008a82210L00464n46498L42256r4824M72810k20566L83131j36011l85482R7719
$$ -182210 118254 -428244 -85988 -180812 291998 71432 454563 318552 -66930 30789
1998C0789k71388n4912l9049J56325o46274L63322M74520l62640J15698J55608
$$ 30789 -240599 -295511 -334560 -178235 -824509 -461187 13333 -349307 -233609 -78001
1988g8001k33523L08942M32709k83211m24501p645j39653J4914N2307L6492o07131
$$ -78001 -311524 -2582 430127 146916 -277585 -285230 -424883 -409969 -357662 -321170 -928301
1977i28301p9956J30070O01570L35520K17921k70681L1016j39748K48993j67107
$$ -928301 -1008257 -878187 -276617 58903 276824 6143 37159 -102589 146404 -20703
1967b0703l07253M47735R9932l34513j17554N30167n31715j60567K41199K74308
$$ -20703 -327956 119779 219711 -114802 -232356 297811 -233904 -394471 -153272 121036
1957A21036J74561p42223K38495n9972p4667k94012O23991N24435m65871j2667
$$ 121036 295597 -446626 -208131 -268103 -342770 -636782 -12791 511644 45773 33106
1947C3106m81079o9819R27337j06210n50764M31707J79524j70055l43755L8479
$$ 33106 -447973 -517792 409545 303335 -247429 184278 363802 193747 -150008 -111529
1937a11529K50261J2819k91265Q5469j23214k41272j33683M12518K54687j92302
$$ -111529 138732 151551 -139714 -54245 -177459 -418731 -552414 -139896 114791 -77511
1927g7511o32028O7086K75738j14899M18600J20840J73464m3395n70126K173L70569
$$ -77511 -709539 -642453 -366715 -481614 -63014 57826 231290 187895 -382231 -380058 -9489
1916i489m08262M17591j05411o42485M77618k96996k13621N13039j52728j67009
$$ -9489 -417751 -160 -105571 -748056 -270438 -567434 -781055 -268016 -420744 -587753
1906e87753L48274N61477k79041j32823K42772n5270P4254k44978R7331P5175
$$ -587753 -239479 321998 42957 -89866 152906 97636 171890 -73088 24243 99418
1896I9418M39102j48489m70742j20159J03604R9770L44384o07715k42808N96634
$$ 99418 538520 390031 -80711 -200870 -97266 2504 346888 -260827 -503635 92999
1886I2999Q1519j43722j99332N2600q6616q2551N50284k78607J22285J10524j64690
$$ 92999 174518 30796 -168536 -115936 -202552 -285103 265181 -13426 108859 219383 54693
1875E4693k98247M7596J97028m06254k51510J85853O04558k90472j61925k63274
$$ 54693 -243554 -195958 1070 -405184 -656694 -470841 133717 -156755 -318680 -581954
1865e81954M60876L35201k68877J28005P4017q9012l40167r73N86202J22545o63183
$$ -581954 -121078 214123 -54754 73251 147268 58256 -281911 -282884 303318 425863 -237320
1854b37320K02887J96299o3538j25376r2050L98047P7544j36900j90971j07711
$$ -237320 -34433 161866 98328 -27048 -119098 278949 356493 219593 28622 -79089
1844g9089l40506O02322J45348n46661k63455m0700K29480L08487j04866j27180
$$ -79089 -419595 182727 328075 -218586 -482041 -522741 -293261 15226 -89640 -216820
1834b16820l79701J66701K10388N43083K32086m21787j09946J43163m32553R5938
$$ -216820 -596521 -429820 -219432 323651 555737 133950 24004 167167 -265386 -169448
1824a69448J49437j65568m22601L39589N19543k52162k66918m19617m70937K3291
$$ -169448 -20011 -185579 -608180 -268591 250952 -1210 -268128 -687745 -1158682 -1135391
1814a135391L97737M03419k0147m44119K22984N07620L87340l62509l68867k53609
$$ -1135391 -737654 -334235 -354382 -798501 -575517 -67897 319443 -43066 -411933 -665542
1804f65542M02225L65293K43452n3046L0354j40317j79362K95776P9031r4326
$$ -665542 -263317 101976 345428 292382 322736 182419 3057 298833 377864 283538
1794B83538r6127l23683K7131k3353K68301K01892l43972m28034L72830o35962
$$ 283538 187411 -136272 -109141 -132494 135807 337699 -6273 -434307 -61477 -697439
1784f97439k52122K96223J67979K59439K59896K78150k23392k11106M49567l1929
$$ -697439 -949561 -653338 -485359 -225920 33976 312126 88734 -122372 327195 295266
1774B95266j40281K58732r8127Q2975l29155n32479P1637J61229l1405P0477L43816
$$ 295266 154985 413717 315590 398565 69410 -463069 -391432 -230203 -261608 -191131 152685
1763A52685J90169k27012j22215J45820k25534j82992L13812l27914L80740k512
$$ 152685 342854 115842 -6373 139447 -86087 -269079 44733 -283181 97559 95047
1753I5047l30021k1916l93216O39642L5500n32795L04556P8952p1217j56292K14770
$$ 95047 -234974 -256890 -650106 -10464 25036 -507759 -203203 -124251 -195468 -351760 -136990
1742a36990L75029K069j56071k15980j44951K15842k78939j29265k13357M15582
$$ -136990 238039 240108 84037 -131943 -276894 -61052 -339991 -469256 -682613 -267031
1732b67031L20314l19964j15351L46564q7632k09702l4665m9618M30494L48541
$$ -267031 53283 -266681 -382032 -35468 -123100 -332802 -367467 -417085 13409 361950
1722C61950m33078m8566l46075n4190N42609m45364N65144M1434o09543P5269
$$ 361950 -71128 -119694 -465769 -519959 22650 -422714 142430 183864 -425679 -350410
1712c50410J51975l69131l65501N3661L10179P15073J75253l48119m07381M3703
$$ -350410 -198435 -567566 -933067 -879406 -569227 145846 321099 -27020 -434401 -390698
1702c90698K41280l66672J71928k01722J04942J78494m6582R0088j37109K41789
$$ -390698 -149418 -516090 -344162 -545884 -440942 -262448 -309030 -218942 -356051 -114262
1692a14262p878J75691L69591K0447q5170l13174n69541P75J07045L46375m06102
$$ -114262 -122140 53551 423142 443589 358419 45245 -524296 -523521 -416476 -70101 -476203
1681d76203m1025K77069R6464K35774m53051K43854K09982L5681k99683J92852
$$ -476203 -517228 -240159 -143695 92079 -360972 -117118 92864 128545 -171138 21714
1671B1714l01765o9195M39745j66626k80690N10981J15093M1319K19423m66204
$$ 21714 -280051 -349246 90499 -76127 -356817 154164 269257 310576 529999 63795
1661F3795j15464k09239J87629L35129l95203l31805L60770k20450P649O6333
$$ 63795 -51669 -260908 -73279 261850 -133353 -465158 -104388 -324838 -317189 -250856
1651b50856M57586L16287j26377p28768L05293j41071k40147o9357o4398R4466
$$ -250856 206730 523017 396640 -332128 -26835 -167906 -408053 -477410 -541808 -447342
1641d47342k1245K58783L244j90626j62974j80157J471O3241o31345L65920M13939
$$ -447342 -468587 -209804 -206560 -397186 -560160 -740317 -738846 -675605 -1306950 -941030 -527091
1630e27091j55659M1725L57216J10148N0150J75077L8707m42559q3397k02065
$$ -527091 -682750 -641025 -283809 -173661 -123511 51566 90273 -352286 -435683 -637748
1620f37748J35035K7611N73151j77498j81193M36456K1661k66514o8958O9295
$$ -637748 -502713 -475102 98049 -79449 -260642 175814 197475 -69039 -137997 -68702
1610f8702O1632j87894K03785J66742k52488M07190p6422o79226K0456J49193
$$ -68702 -7070 -194964 8821 175563 -76925 330265 253843 -425383 -404927 -255734
1600b55734k89200l37553N98352J94768k61119N1271j8081L81150n87179k86053
$$ -255734 -544934 -882487 -284135 -89367 -350486 -299215 -317296 63854 -523325 -809378
1590h09378K25962L06000o4016L05394k59878j48848r03K62242K47899N7961n67982
$$ -809378 -583416 -277416 -341432 -36038 -295916 -444764 -445667 -183425 64474 122435 -445547
1579d45547M05011P1142j32293j54167j5101N07138r35589k2126Q74467k70936
$$ -445547 -40536 30606 -101687 -255854 -270955 236183 -699406 -721532 152935 -118001
1569a18001j67731M42636Q8324J95171m11930Q1306K69629J85685k9252k38372
$$ -118001 -285732 156904 245228 440399 28469 109775 379404 565089 535837 297465
1559B97465l69822k4220J91923O7180p7152l33383j26200o4683k05526L57603
$$ 297465 -72357 -96577 95346 162526 85374 -248009 -374209 -438892 -644418 -286815
1549b86815N46629m68369k63793P6449J3340j25655J47175L80132n28908m51936
$$ -286815 259814 -208555 -472348 -395899 -382559 -508214 -361039 19093 -509815 -961751
1539i61751N62291l01728J39037M08342n6484L1979L79212k8658m11233L0534
$$ -961751 -399460 -701188 -562151 -153809 -210293 -178314 200898 172240 -238993 -208459
1529b08459j35929K950L6580o1370O8395N07302l84477l2789o9053P8091j03214
$$ -208459 -344388 -341438 -304858 -366228 -297833 209469 -175008 -207797 -276850 -198759 -301973
1518c01973J59020k9535R3964J95997j07150r5394K51949l18885L29927p2912
$$ -301973 -142953 -172488 -78524 117473 10323 -85071 166878 -152007 177920 105008
1508A05008o22245L98659L62585N5997o10777j12512M22054l76882J26419j13164
$$ 105008 -517237 -118578 244007 300004 -310773 -423285 -1231 -378113 -251694 -364858
1498c64858m4528K2498J69356J17898p208q4664m56573O26845k88089j97965J18153
$$ -364858 -409386 -386888 -217532 -99634 -106842 -191506 -648079 -21234 -309323 -507288 -389135
1487c89135o313M75876K32277n19006L4789J56978m20487K14078j68576N1068
$$ -389135 -395448 80428 312705 -206301 -171512 -14534 -435021 -220943 -389519 -338451
1477c38451K5943j5223K44164m04482O1719J72052J49279K08172k19166o3976
$$ -338451 -312508 -327731 -83567 -488049 -426330 -254278 -104999 103173 -115993 -179969
1467a79969J93137m55017J03168L41768R9738l96095K42643K07676K09400o32521
$$ -179969 13168 -441849 -338681 3087 102825 -293270 -50627 157049 366449 -266072
1457b66072j71988R3140J15692k14392j04969J9711K10855K07997M14459J51472
$$ -266072 -438060 -344920 -229228 -443620 -548589 -528878 -318023 -110026 304433 455905
1447D55905K12374J30001o58166k18077J29064J55770N5724l90238n4077J47382
$$ 455905 668279 798280 140114 -77963 51101 206871 262595 -127643 -181720 -34338
1437c4338j54716P9970K903K69440o25111p2960J72880L15557K91339n3299J61900
$$ -34338 -189054 -109084 -106181 163259 -461852 -534812 -361932 -46375 244964 191665 353565
1426C53565k22128q5170j08273n15613o7458K94429n3649J48387p6456j29914
$$ 353565 131437 46267 -62006 -577619 -645077 -350648 -404297 -255910 -332366 -462280
1416d62280K22749m58249l22494O10673N37781j79815m10074M28285K62958m0814
$$ -462280 -239531 -697780 -1020274 -409601 128180 -51635 -461709 -33424 229534 188720
1406A88720J98060n18844K37166L80202O4658m72972J77075K37074o00915m98508
$$ 188720 386780 -132064 105102 485304 549962 76990 254065 491139 -109776 -608284
1396f08284Q29351J22152n4302n89059J3651J40352j63628J98755n81172N35176
$$ -608284 221067 343219 288917 -300142 -286491 -146139 -309767 -111012 -692184 -157008
1386a57008J5514n456q2388n57915K47875P20338j75499L14559m1710m80410L88196
$$ -157008 -141494 -146950 -229338 -787253 -539378 180960 5461 320020 278310 -202100 186096
1375A86096r8175J32879P4831j65210L73930J10898q20137m51611N59212n5016
$$ 186096 87921 220800 295631 130421 504351 615249 -204888 -656499 -97287 -152303
1365a52303K62189j17383k90177O32263M89012k38488j37952k32376K03708J3425
$$ -152303 109886 -7497 -297674 334589 823601 585113 447161 214785 418493 431918
1355D31918p34085j33903M54931L23923j89647k64189j18254N93587L7347m17314
$$ 431918 -302167 -436070 18861 342784 153137 -111052 -229306 364281 401628 -15686
1345a5686k966M47201m24326q7918K54264j00J04977J61186l20372m34789n18038
$$ -15686 -18652 428549 4223 -83695 170569 170469 275446 436632 116260 -318529 -836567
1334h36567K7262P28669j18968K5528k9962n5511K1672K14325L2681q5586L57522
$$ -836567 -809305 -80636 -199604 -174076 -204038 -259549 -237877 -23552 9129 -76457 281065
1323B81065k54178o4186k11034P3381K93270j2866j56418j73701O2526M05522
$$ 281065 26887 -37299 -248333 -174952 118318 105452 -50966 -224667 -162141 243381
1313B43381J07289O4129j01687l02915m59813o1180J35984L5340M13901j50199
$$ 243381 350670 414799 313112 10197 -449616 -510796 -374812 -339472 74429 -75770
1303g5770j27000j30748j49969O43705m55066o2573L14869n4282N2238l82903
$$ -75770 -202770 -333518 -483487 160218 -294848 -357421 -42552 -96834 -44596 -427499
1293d27499P21994n40409m25489N61088L88200l43608J72641Q094m00442l59408
$$ -427499 294495 -245914 -671403 -110315 277885 -65723 106918 115012 -285430 -644838
1283f44838K18749L20452j3272j69685K79081J705j67232M16283k31567k66248
$$ -644838 -426089 -105637 -118909 -288594 -9513 -7808 -175040 241243 9676 -256572
1273b56572L59227P622k65563J760J14298n79334J40177K98186K17428j0000k62879
$$ -256572 102655 110277 -155286 -153526 -39228 -618562 -478385 -180199 37229 27229 -235650
1262b35650L24186j23804M6475M637P6985q6157m9906M30k36749J62685J72128
$$ -235650 88536 -35268 11207 15844 92829 6672 -43234 -42804 -279553 -116868 55260
1251E5260l31109N3427k10279J57672P38431J47682j22435m31544k89406m0438
$$ 55260 -275849 -222422 -432701 -275029 463402 611084 488649 57105 -232301 -272739
1241b72739L57074k68629k11455K89192L85922p2105k78164p0794N68186j4846
$$ -272739 84335 -184294 -395749 -106557 279365 207260 -70904 -141698 426488 411642
1231D11642m79370O2221l18225Q8006j35233J58524p566k66152J40532M92122
$$ 411642 -67728 -5507 -323732 -235726 -370959 -212435 -220001 -486153 -345621 146501
1221A46501k0159m88574K70909j21523l8950O8578n90455L61260O7057K43040
$$ 146501 126342 -362232 -91323 -212846 -251796 -183218 -773673 -412413 -345356 -102316
1211a02316p4588J22647N7655j14874n7290K01927p72037J81575L60775o97027
$$ -102316 -176904 -54257 3398 -111476 -168766 33161 -738876 -557301 -196526 -893553
1201h93553q7225M38392M26675m9163K64257n3829k40430M57426K61252K2699
$$ -893553 -980778 -542386 -115711 -164874 99383 45554 -194876 262550 523802 546501
1191E46501L00165j58220l59166r2012j54022j79910k71920K75281L1285m33320
$$ 546501 846666 688446 329280 237268 83246 -96664 -368584 -93303 -62018 -495338
1181d95338J02658J29777K06346K0463K73459j08433R6758m81820O6138j65854
$$ -495338 -392680 -262903 -56557 -36094 237365 128932 225690 -256130 -189992 -355846
1171c55846P1187K93297N9394J29009O8951N98284l02068k72270O1811m51620
$$ -355846 -284659 8638 68032 197041 265992 864276 562208 289938 351749 -99871
1161i9871J64517l0033j4595L8519L22120j96225m19500J90208J81646M9560j08996
$$ -99871 64646 34613 20018 58537 380657 184432 -235068 -44860 136786 186346 77350
1150G7350J50389l64232r9155N23842L23617n17150k29242j75830M02505j63731
$$ 77350 227739 -136493 -235648 288194 611811 94661 -134581 -310411 92094 -71637
1140g1637m76590L89764K58117k0511P1969M8486n18485P7172N8653q7307k69355
$$ -71637 -548227 -158463 99654 79143 151112 199598 -318887 -241715 -183062 -270369 -539724
1129e39724L23445N9549q343m09849L05511J85794N37003L43504o59903O86368
$$ -539724 -216279 -156730 -165073 -574922 -269411 -83617 453386 796890 136987 823355
1119H23355j42691J33027o00109k750P7326j2130l22792j69976J43854J37106
$$ 823355 680664 813691 213582 210832 288158 276028 -46764 -216740 -72886 64220
1109F4220j32701k93910N97171j39696j23937J51295j67256j03419J05982J24954
$$ 64220 -68481 -362391 234780 95084 -28853 122442 -44814 -148233 -42251 82703
1099H2703k55926J13544Q9663L7212K16890K11417Q0958k29550q5285n40380N44191
$$ 82703 -173223 -59679 29984 67196 284086 495503 576461 346911 261626 -278754 265437
1088B65437M19656l24097m69162j3682M53704n85967K21310K3844K17802J96985
$$ 265437 685093 360996 -108166 -121848 331856 -254111 -32801 -8957 208845 405830
1078D05830j0287j21850L9921o6162k38484J98152q2538J83637K54839j82357
$$ 405830 395543 273693 313614 247452 8968 207120 124582 308219 563058 380701
1068C80701m12726j7753J52120K70682l92471K34081m61658J73068k37039k11358
$$ 380701 -32025 -49778 102342 373024 -19447 214634 -247024 -73956 -310995 -522353
1058e22353M23871j70536j75217N73147m32447p4361K1162m9P89304k46782m19412
$$ -522353 -98482 -269018 -444235 128912 -303535 -377896 -356734 -356783 432521 185739 -233673
1047b33673P5420R1304o8606L86482M18176j22195o98872o9202N57535K70179
$$ -233673 -158253 -66949 -135555 250927 669103 546908 -151964 -221166 336369 606548
1037F06548l17384j64440K13791j55010n09137P01265k94727l44080k2773K6296
$$ 606548 289164 124724 338515 183505 -325632 375633 80906 -263174 -285947 -259651
1027b59651k64411M82597M62700l76155k04631p32704J23659Q10425j60950N53512
$$ -259651 -524062 -41465 421235 45080 -159551 -892255 -768596 41829 -119121 434391
1017D34391j60207R0014K04396m26019J582n25216j51008M84980J83417o66068
$$ 434391 274184 364198 568594 142575 144157 -381059 -532067 -47087 136330 -529738
1007e29738o3336J28738K42412j07690j90863Q0402K81592l44810J86269M96124
$$ -529738 -593074 -464336 -221924 -329614 -520477 -440075 -158483 -503293 -317024 179100
997A79100K04401m03874m12671o124K48659J76340K93233J7995j01541m8066l61890
$$ 179100 383501 -20373 -433044 -439168 -190509 -14169 279064 297059 195518 147452 -214438
986b14438J53541m065k58287L30845N70815k20989K06267l25834l17635m1957
$$ -214438 -60897 -64962 -323249 7596 578411 357422 563689 237855 -79780 -121737
976a21737O62815J18824m78235L06446j018661R9320O88790m83758j8826K65971
$$ -121737 541078 659902 181667 488113 -530548 -431228 257562 -226196 -245022 20949
966B0949j66873k92281k18586M30209L10780l31470N8930R2913J01847k1612K2037
$$ 20949 -145924 -438205 -656791 -226582 84198 -247272 -188342 -95429 6418 -15194 6843
955F843K81211L65628M9517l91402o2955k59159m5131K31917k46861k6503J04330
$$ 6843 288054 653682 703199 311797 248842 -10317 -55448 176469 -70392 -96895 7435
944G435J7264l35373m57040L47663M44018L27500J6534j11654J5304m88158k68634
$$ 7435 24699 -310674 -767714 -420051 23967 351467 368001 256347 271651 -216507 -485141
933d85141L92633L20565n39328J35685J26848L77980l71231j69109j29080J52171
$$ -485141 -92508 228057 -311271 -175586 -48738 329242 -41989 -211098 -340178 -188007
$$ [...]
##END NTUPLES=NMR SPECTRUM
##END=
