##TITLE=1H_TG-2390-2
 200.13MHz, CDCl3,
 8 sc
 
 8.9.2025
##JCAMPDX= 6.0         $$ Bruker NMR JCAMP-DX V2.0
##DATA TYPE= NMR SPECTRUM
##DATA CLASS= NTUPLES
##ORIGIN= UXNMR, Bruker Analytische Messtechnik GmbH
##OWNER= pz
$$ XWIN-NMR		Version 3.5
$$ Mon Sep  8 13:44:19 2025 Russian Standard Time (UT+4h)  she@DPX200
##.OBSERVE FREQUENCY= 200.1313
##.OBSERVE NUCLEUS= ^1H
##.ACQUISITION MODE= SIMULTANEOUS
##.ACQUISITION SCHEME= undefined
##.AVERAGES= 8
##.DIGITISER RES= 18
##SPECTROMETER/DATA SYSTEM= spect
##.PULSE SEQUENCE= zg30
##.SOLVENT NAME= CDCl3
##.SHIFT REFERENCE= (INTERNAL, CDCl3, 0, 15.5166)
##AUDIT TRAIL= $$ (NUMBER, WHEN, WHO, WHERE, WHAT)
$$ ##TITLE= Audit trail, XWIN-NMR		Version 3.5
$$ ##JCAMPDX= 5.01
$$ ##ORIGIN= Bruker BioSpin GmbH
$$ ##OWNER= she
$$ F:/spectra/data/she/nmr/H-C/1/pdata/1/auditp.txt
$$ ##AUDIT TRAIL=  $$ (NUMBER, WHEN, WHO, WHERE, WHAT)
(   1,<2025-09-08 13:42:59.39 +0400>,<she>,<DPX200>,
      <created by zg, POWCHK disabled, PULCHK disabled
       configuration hash MD5:
       00 E9 B6 7A A2 85 ED C7 34 08 36 98 17 FE 4E 26
       data hash MD5: 16K
       C9 96 F8 88 DF 7C 3F E4 8B B7 E7 43 6F B8 B8 E8>)
(   2,<2025-09-08 13:43:01.60 +0400>,<she>,<DPX200>,
      <Start of raw data processing
       efp BC_mod = 2 LB = 0.25 FT_mod = 6 PKNL = 1 PHC0 = -1561.591 PHC1 = 11.79228 SI = 16K 
       data hash MD5: 16K
       AC 02 95 CD A2 2D 16 98 23 02 41 8B 5E DD 39 B0>)
(   3,<2025-09-08 13:43:24.89 +0400>,<she>,<DPX200>,
      <pk PHC0 = 1.769612 PHC1 = 1 
       data hash MD5: 16K
       EE B7 1B F5 D8 10 2B E6 79 E1 DA C0 24 92 05 F8>)
(   4,<2025-09-08 13:43:31.57 +0400>,<she>,<DPX200>,
      <abs ABSG = 5 
       data hash MD5: 16K
       9E BB 78 CA E5 4D 10 4A 2C 16 2F A4 7F 45 8D 7C>)
$$ ##END=
$$ 
$$ hash MD5
$$ 73 74 ED CB 0F 41 32 F2 A7 9D 5A 4C D5 30 8E D9
##$RELAX= 
##$RELAX= 
##$RELAX= 
##$RELAX= 
##$RELAX= 
##$RELAX= 
$$ Bruker specific parameters
$$ --------------------------
##$DU= <F:/spectra>
##$EXPNO= 1
##$NAME= <H-C>
##$PROCNO= 1
##$TYPE= <nmr>
##$USER= <she>
##$AMP= (0..31)
100 100 100 100 100 100 100 100 100 100 100 100 100 100 100 100 100 100 
100 100 100 100 100 100 100 100 100 100 100 100 100 100 
##$AQSEQ= 0
##$AQ_mod= 1
##$AUNM= <au_zg>
##$AUTOPOS= <>
##$BF1= 200.13
##$BF2= 200.13
##$BF3= 200.13
##$BF4= 200.13
##$BF5= 200.13
##$BF6= 200.13
##$BF7= 200.13
##$BF8= 200.13
##$BYTORDA= 1
##$CFDGTYP= 0
##$CFRGTYP= 5
##$CHEMSTR= <none>
##$CNST= (0..31)
1 1 145 1 1 1 1 1 1 1 1 1 1 1 1 1 1 1 1 1 1 1 1 1 1 1 1 1 1 1 1 1 
##$CPDPRG= <>
##$CPDPRG1= <>
##$CPDPRG2= <>
##$CPDPRG3= <>
##$CPDPRG4= <mlev>
##$CPDPRG5= <mlev>
##$CPDPRG6= <mlev>
##$CPDPRG7= <mlev>
##$CPDPRG8= <mlev>
##$CPDPRGB= <>
##$CPDPRGT= <>
##$D= (0..31)
0 0.7 0 0 0 0 0 0 0 0 0 0.03 0 0 0 0 0 0 0 0 0 0 0 0 0 0 0 0 0 0 0 0 
##$DATE= 1757324578
##$DBL= (0..7)
120 120 120 120 120 120 120 120 
##$DBP= (0..7)
150 150 150 150 150 150 150 150 
##$DBP07= 0
##$DBPNAM0= <>
##$DBPNAM1= <>
##$DBPNAM2= <>
##$DBPNAM3= <>
##$DBPNAM4= <>
##$DBPNAM5= <>
$$ [...]
##$SUBNAM3= <"">
##$SUBNAM4= <"">
##$SUBNAM5= <"">
##$SUBNAM6= <"">
##$SUBNAM7= <"">
##$SUBNAM8= <"">
##$SUBNAM9= <"">
##$SW= 18.0517328524113
##$SWIBOX= (0..15)
0 0 2 0 0 0 0 0 0 0 0 0 0 0 0 0 
##$SW_h= 3612.71676300578
##$TD= 16384
##$TD0= 1
##$TE= 0
##$TE2= 300
##$TE3= 300
##$TEG= 300
##$TL= (0..7)
0 120 120 120 120 120 120 120 
##$TP= (0..7)
150 150 150 150 150 150 150 150 
##$TP07= 0
##$TPNAME0= <>
##$TPNAME1= <>
##$TPNAME2= <>
##$TPNAME3= <>
##$TPNAME4= <>
##$TPNAME5= <>
##$TPNAME6= <>
##$TPNAME7= <>
##$TPOAL= (0..7)
0.5 0.5 0.5 0.5 0.5 0.5 0.5 0.5 
##$TPOFFS= (0..7)
0 0 0 0 0 0 0 0 
##$TUNHIN= 0
##$TUNHOUT= 0
##$TUNXOUT= 0
##$USERA1= <user>
##$USERA2= <user>
##$USERA3= <user>
##$USERA4= <user>
##$USERA5= <user>
##$V9= 5
##$VALIST= <valist>
##$VCLIST= <CCCCCCCCCCCCCCC>
##$VD= 0
##$VDLIST= <DDDDDDDDDDDDDDD>
##$VPLIST= <PPPPPPPPPPPPPPP>
##$VTLIST= <TTTTTTTTTTTTTTT>
##$WBST= 1024
##$WBSW= 4
##$XGAIN= (0..3)
0 0 0 0 
##$XL= 0
##$YL= 0
##$YMAX_a= 449331
##$YMIN_a= -752658
##$ZGOPTNS= <>
##$ZL1= 120
##$ZL2= 120
##$ZL3= 120
##$ZL4= 120
##$ABSF1= 15.53865
##$ABSF2= -2.513202
##$ABSG= 5
##$ABSL= 3
##$ALPHA= 0
##$AQORDER= 0
##$ASSFAC= 0
##$ASSFACI= 0
##$ASSFACX= 0
##$ASSWID= 0
##$AUNMP= <proc_1d>
##$AZFE= 0.1
##$AZFW= 0.1
##$BCFW= 0
##$BC_mod= 2
##$BYTORDP= 0
##$COROFFS= 0
##$CY= -3
##$DATMOD= 1
##$DC= 0
##$DFILT= <>
##$DTYPP= 0
##$F1P= 0
##$F2P= 0
##$FCOR= 1
##$FTSIZE= 16384
##$FT_mod= 6
##$GAMMA= 0
##$GB= 0
##$INTBC= 1
##$INTSCL= 3.241238e-09
##$ISEN= 128
##$LB= 0.25
##$LEV0= 0
##$LPBIN= 0
##$MAXI= 10000
##$MC2= 0
##$MEAN= 0
##$ME_mod= 0
##$MI= 1.114404
##$NCOEF= 0
##$NC_proc= -7
##$NLEV= 6
##$NOISF1= 3.799351
##$NOISF2= 2.8
##$NSP= 0
##$NTH_PI= 0
##$NZP= 0
##$OFFSET= 15.51661
##$PC= 1
##$PHC0= -1559.821
##$PHC1= 12.79228
##$PH_mod= 1
##$PKNL= yes
##$PPARMOD= 0
##$PSCAL= 0
##$PSIGN= 0
##$REVERSE= no
##$SF= 200.130001018946
##$SI= 16384
##$SIGF1= 3
##$SIGF2= 2
##$SINO= 0.751879
##$SIOLD= 32768
##$SREGLST= <19F.Aceton>
##$SSB= 0
##$STSI= 16384
##$STSR= 0
##$SW_p= 3612.71676300578
##$SYMM= 0
##$S_DEV= 0
##$TDeff= 16384
##$TDoff= 0
##$TI= <>
##$TILT= no
##$TM1= 0
##$TM2= 0
##$TOPLEV= 0
##$USERP1= <user>
##$USERP2= <user>
##$USERP3= <user>
##$USERP4= <user>
##$USERP5= <user>
##$WDW= 1
##$XDIM= 16384
##$YMAX_p= 367325964
##$YMIN_p= -720571
$$ End of Bruker specific parameters
$$ ---------------------------------
##NTUPLES= NMR SPECTRUM
##VAR_NAME=  FREQUENCY,     SPECTRUM/REAL,   SPECTRUM/IMAG
##SYMBOL=    X,             R,               I
##VAR_TYPE=  INDEPENDENT,   DEPENDENT,       DEPENDENT
##VAR_FORM=  AFFN,          ASDF,            ASDF
##VAR_DIM=   16384,         16384,           16384
##UNITS=     HZ,            ARBITRARY UNITS, ARBITRARY UNITS
##FACTOR=    0.220516191357247, 1,           1
##FIRST=     3105.33920424328, 0,            0
##LAST=      -507.377558762499, 0,           0
##MIN=       -507.377558762499, -720571,     0
##MAX=       3105.33920424328, 367325964,    0
$$ Real data points
##PAGE= N=1
##DATA TABLE= (X++(R..R)), XYDATA
$$ [...]
6447B1408020J67606M36368O00180O34679K96207M32276O80317Q26856R23465
6438B6405974P55703J098181Q96787R34646J151851J319610J002234J369564J415825
6429C6350375J432881J703700J737069J843571J896527K093236K107582K160027
6421E1324968J743728J518747Q27157L25377M6228n51359n37266j9829M69007
6412E5146758Q08370J439205J679395J866738L080851K827660K337963L465699
6404G2652639L509994M191136M800766M361432M090784L316314J706316L08566
6396I8937947j124317k148408l080525l525900l574837l184077k350206j785642
6388G8164035j411623k34867N24298J208355J882328K432846K941714L202949
$$ plain form
6447 21408020 21575626 22011994 22612174 23246853 23543060 23975336 24655653 25482509 26405974
6438 26405974 27161677 28259858 29156645 30091291 31243142 32562752 33564986 34934550 36350375
6429 36350375 37783256 39486956 41224025 43067596 44964123 47057359 49164941 51324968
6421 51324968 53068696 54587443 55414600 55739977 55786205 55234846 54697580 54677751 55146758
6412 55146758 55955128 57394333 59073728 60940466 64021317 66848977 69186940 72652639
6404 72652639 76162633 80353769 85154535 89515967 93606751 96923065 98629381 98937947
6396 98937947 97813630 95665222 92584697 89058797 85483960 82299883 79949677 78164035
6388 78164035 76752412 76517545 77041843 78250198 80132526 82565372 85507086 88710035
6380H8710035L629034L945329M097923L742682K365870O23823q97486k718431
6372A03498779m277884m960478n690470n663731n366065m373243l519032l114480
6364F6533396k165452j446119j171966p79668k41099o4072K82730P04822J126956
6355F2779528R60458N69983K75193j03482j132660j727767k244801k512774k661503
6346E4202175k614728k450265j970107j586245j578587j019093j200157j016823
6338D0766170o09034o45143n82497o90508r16712q51297m41505k85844m85415
6329C5258215l87583r7443k25360j31504J66342Q4864j2057M77533M59267P0288
6319C5662562K66622J93814N33429L55695R2142L76782K10877M37205L35189N54164
$$ plain form
6380 88710035 92339069 96284398 100382321 104125003 106490873 107114696 106217210 103498779
6372 103498779 99220895 94260417 88569947 82906216 77540151 73166908 69647876 66533396
6364 66533396 64367944 62921825 61749859 60970191 60729092 60665020 60947750 61652572 62779528
6355 62779528 63739986 64309969 64585162 64481680 63349020 61621253 59376452 56863678 54202175
6346 54202175 51587447 49137182 47167075 45580830 44002243 42983150 41782993 40766170
6338 40766170 40157136 39511993 38929496 38238988 37322276 36470979 36029474 35743630 35258215
6329 35258215 34870632 34773189 34547829 34416325 34582667 34667531 34655474 35133007 35592274 35662562
6319 35662562 35929184 36122998 36656427 37012122 37104264 37481046 37691923 38129128 38464317 39018481
6309C9018481M18549N54535L83240N49985Q22815Q70141Q59734Q91899Q19023
6300D5188402J242676R17868O15393J031360J174357Q70724J104623J374835J498694
6291E5018932J617356J131081J548697J549324J930524J916389K176490K330327
6283F9219120K372730L071804L175132L303298L711819L876411M072209L870818
6275I6673341L922048M134291M190663M269336M588512M558451L698814L180442
6267A29215898K459076J203020J49422K32613j5714o38960p0909M61917J202971
6258A34199334J856966J812345K434315L138522L460754L887845M068237M343547
6250A59201865L878297L637785K960347J723497M11103n90411j481885k511380
$$ plain form
6309 39018481 39437030 39991565 40374805 40924790 41747605 42617746 43477480 44369379 45188402
6300 45188402 46431078 47348946 47964339 48995699 50170056 51040780 52145403 53520238 55018932
6291 55018932 56636288 57767369 59316066 60865390 62795914 64712303 66888793 69219120
6283 69219120 71591850 74663654 77838786 81142084 84853903 88730314 92802523 96673341
6275 96673341 100595389 104729680 108920343 113189679 117778191 122336642 126035456 129215898
6267 129215898 131674974 132877994 133027416 133260029 133244315 132605355 132534446 132996363 134199334
6258 134199334 136056300 137868645 140302960 143441482 146902236 150790081 154858318 159201865
6250 159201865 163080162 166717947 169678294 171401791 171812894 171222483 169740598 167229218
6242A67229218l543915m112137m389449m524247m573040m457387m161876m083403
6234A33383764l210172k622420k644829j810565j089495o71308l45189p4733K4301
6225A20939354o82712j072327j912493k879915m174097m596942m996819n290998
6217I5333051m885970m791549m135532l753904l930095l768851l552213l407259
6209F3107678l426578l344568k924889k562691j991411j856796j627293j538348
6201D3835104j431867j439344r54331r22384r86427q15022o61574n39017o72226
6192C5412912m21658l80114o72516n69119m85447o87832k90869j97576j51928
6183C1555853k70664j76780m26572o4201J76295M4250k6374J04438M01211O8718
$$ plain form
6242 167229218 163685303 159573166 155183717 150659470 146086430 141629043 137467167 133383764
6234 133383764 130173592 127551172 124906343 123095778 122006283 121334975 120989786 120915053 120939354
6225 120939354 120256642 119184315 117271822 114391907 110217810 105620868 100624049 95333051
6217 95333051 90447081 85655532 81520000 77766096 73836001 70067150 66514937 63107678
6209 63107678 59681100 56336532 53411643 50848952 48857541 47000745 45373452 43835104
6201 43835104 42403237 40963893 40009562 39087178 38100751 37285729 36624155 36085138 35412912
6192 35412912 34991254 34611140 33938624 33369505 32884058 32196226 31905357 31707781 31555853
6183 31555853 31285189 31108409 30681837 30617636 30793931 30838181 30811807 30916245 31317456 31386174
6173C1386174K49386R8944q2299J00161j25955K1410l88822j09491k58517k58971
6163C0632020j36804k92186o0774k65743j20586J95488J89738K92430K05294N57153
6153C1196030O05051J59485N74902N06097L93297N22936M61618j6584k18818m52016
6143C3731998o74169m62937l73690n62102l87434m50610l46993k83066R1752J84067
6133C0466816M0810J62199L51701K04220M85636O32575N80903L85680N11571N27576
6123C4349687M21471M66396K0732J94871J34707K54909L12291N70185M20684L0885
6113C7176818K0295J01149l42110n55728n08686l12856m83493m38714l8908J14140
6103C4731907p9597J13409M66158Q74729J057770Q68355Q84365P90780J202525
$$ plain form
6173 31386174 31635560 31734504 31652205 31752366 31626411 31647821 31258999 31149508 30890991 30632020
6163 30632020 30495216 30203030 30142256 29876513 29755927 29951415 30141153 30433583 30638877 31196030
6153 31196030 31801081 31960566 32535468 33041565 33434862 33957798 34419416 34402832 34184014 33731998
6143 33731998 33057829 32594892 32221202 31659100 31271666 30821056 30474063 30190997 30282749 30466816
6133 30466816 30507626 30669825 31021526 31225746 31711382 32343957 32924860 33310540 33822111 34349687
6123 34349687 34771158 35237554 35258286 35453157 35587864 35842773 36155064 36725249 37145933 37176818
6113 37176818 37197113 37298262 36956152 36400424 35891738 35578882 35095389 34656675 34617767 34731907
6103 34731907 34652310 34765719 35231877 36106606 37164376 38032731 38917096 39707876 40910401
6094D0910401J299595Q87691R21615R17171J35543k85815q05014j023655j292721
6085D1664811j333761j661220j296873j358545j436548j002745r03364o76053
6077C1995702p4481k62614O4085L72539P5940j4248J39030N86920K23311j81101
6067C2925083n998m66355p79796p12836j106887j170785r22925j058084j210773
6058B5490644r09811p90397o57170q67194p53003o81422n29549n30825k88223
6049A9483050j54522k92009m90174j17062j57604k17631m2812r9087l77789J1252
6039A7545612K71054q2442j23484k40585l22116K00595l1734p0991L8552M1756
6029A7226217J5322k24199o904k3692o6111J29953R7115J4951M9917J62452J06726
$$ plain form
6094 40910401 42209996 43097687 44019302 44936473 45072016 44786201 43981187 42957532 41664811
6085 41664811 40331050 38669830 37372957 36014412 34577864 33575119 32671755 31995702
6077 31995702 31921221 31658607 31722692 32095231 32171171 32156923 32295953 32882873 33106184 32925083
6067 32925083 32919085 32452730 31672934 30960098 29853211 28682426 27759501 26701417 25490644
6058 25490644 24580833 23790436 23133266 22266072 21513069 20831647 20302098 19771273 19483050
6049 19483050 19328528 19036519 18546345 18429283 18271679 18054048 18011236 17912149 17534360 17545612
6039 17545612 17816666 17734224 17610740 17370155 17048039 17248634 17216900 17145909 17184461 17226217
6029 17226217 17241539 17017340 17010436 16986744 16920633 17050586 17147701 17162652 17212569 17375021 17481747
6018A7481747J43649J79146J97953j44285p9292K00602p4198J97014J34093R1702
6008A8328131J39987K29877K07637M50877L3893J87946M25051P5621N00949N62412
5998B1142381K70213J98422L27569N94403M31959O35264L47101L50699M33959
5989B4731970L97909M99239L91083L86557J37017L40006J97706J20736L07996
5980B7510219K75468K10066L92623M19040M79325N47515O57070P61434P35576
5971C1988336P06895Q26151Q50914P84581Q35757P54597O74967J67192L05373
5962C7894763N854J25254N20697q6699k04078K6335N0005l5680J79963J31682
5952C8608096K57611K32883O29983O45222P20465P04100P33095Q61529P66361
$$ plain form
6018 17481747 17625396 17804542 18002495 17858210 17778918 17979520 17905322 18102336 18236429 18328131
6008 18328131 18468118 18697995 18905632 19356509 19390402 19578348 20003399 20079020 20579969 21142381
5998 21142381 21412594 21611016 21938585 22532988 22964947 23600211 23947312 24298011 24731970
5989 24731970 25129879 25629118 26020201 26406758 26543775 26883781 27081487 27202223 27510219
5980 27510219 27785687 27995753 28388376 28807416 29286741 29834256 30491326 31252760 31988336
5971 31988336 32695231 33521382 34372296 35156877 35992634 36747231 37422198 37589390 37894763
5962 37894763 37900617 38025871 38546568 38459869 38255791 38282126 38332131 38296451 38476414 38608096
5952 38608096 38865707 39098590 39728573 40373795 41094260 41798360 42531455 43392984 44159345
5943D4159345O37977O68568J045525Q83198R31210R03639P78699J029590J015523
5934E2053274Q83899J408855J465115J642996J693347J308528J382839J576828
5926F3415681J533670J360667J173122J527532J302851J411306J332511J652401
5918G4709741J902219K005651K397727K470866K564161K849120L605057L614753
5910I6119295M214206M652607N310181N737493O245635P116554P831748Q961330
5902A46189049R704403R847621J1074722J2468768J3529167J4537338J4596306
5895B31947374J3221172J0203419N811048O77734m789562r934184j3063711j4685853
5887B19387437j4499013j3006489j0795758p954776n420236l255574j206484K31038
$$ plain form
5943 44159345 44797322 45465890 46511415 47394613 48325823 49229462 50008161 51037751 52053274
5934 52053274 52937173 54346028 55811143 57454139 59147486 60456014 61838853 63415681
5926 63415681 64949351 66310018 67483140 69010672 70313523 71724829 73057340 74709741
5918 74709741 76611960 78617611 81015338 83486204 86050365 88899485 92504542 96119295
5910 96119295 100333501 104986108 110296289 116033782 122279417 129395971 137227719 146189049
5902 146189049 155893452 165741073 176815795 189284563 202813730 217351068 231947374
5895 231947374 245168546 255371965 261183013 261860747 257071185 247137001 234073290 219387437
5887 219387437 204888424 191881935 181086177 173131401 167711165 164455591 163249107 163480145
5879A63480145J507225K740302L109350L869334L815099K789137J678720n30101
5871A82459211k724292m717980o424363p181341p569048p574586o897215n842642
5863A33527744n256314m353947l646963l488445k730904k436081k052070j628395
5855A07934625j325236j316999j089465q19011o33814j1862L38508L06745J82860
5846A03566351J093801J242649J194312K163655K554850K895442L449392L963984
5838A22124436M748791N584177O375340O645653P328131P561965O833428N515703
5830A72717624L734717J353665j033091k645269l847326l865748l240190k319823
5822A60854559j434057o04422J6781R617m42359k76036p86250n17656j64344M54798
$$ plain form
5879 163480145 164987370 167727672 170837022 174706356 178521455 181310592 182989312 182459211
5871 182459211 179734919 175016939 168592576 161411235 153842187 146267601 139370386 133527744
5863 133527744 128271430 123917483 120270520 116782075 114051171 111615090 109563020 107934625
5855 107934625 106609389 105292390 104202925 103383914 102750100 102738238 103076746 103383491 103566351
5846 103566351 104660152 105902801 107097113 109260768 111815618 114711060 118160452 122124436
5838 122124436 126873227 132457404 138832744 145478397 152806528 160368493 167201921 172717624
5830 172717624 176452341 177806006 176772915 174127646 170280320 166414572 163174382 160854559
5822 160854559 159420502 158816080 158832861 158842478 158400119 158124083 157337833 156820177 156655833 157110631
5812A57110631Q65335J086988J127211K83540m77022j378705k181938l024743
5804A53411297k850808k847153j929341q54752O183J265377K217400K930940L678725
5795A55027868M108536M694472M835958N015034M730295L860093L131644J838740
5787A87242640N31502j120895l235675n074599o728486p991164q638704q980516
5779A46004103q764814p880990o556894n541848m644300l800946k762648k014692
5771A04036971j536510q25934m74631M0659P03467R01569J101485N49938j31821
5762A04365193j143439k093290k650942l638583l783739l803196l720615l202530
5754H0328859k632149k161197j536795j332708r75325p72396q58851q05034p97031
$$ plain form
5812 157110631 157975966 159062954 160190165 160473705 159996683 158617978 156436040 153411297
5804 153411297 150560489 147713336 145783995 144929243 144935426 146200803 148418203 151349143 155027868
5795 155027868 159136404 163830876 168666834 173681868 178412163 182272256 185403900 187242640
5787 187242640 187774142 186653247 183417572 178342973 171614487 163623323 154984619 146004103
5779 146004103 137239289 129358299 122801405 117259557 112615257 108814311 106051663 104036971
5771 104036971 102500461 101674527 101199896 101240555 101944022 102845591 103947076 104497014 104365193
5762 104365193 103221754 101128464 98477522 94838939 91055200 87252004 83531389 80328859
5754 80328859 77696710 75535513 73998718 72666010 71690685 70918289 70059438 69254404 68457373
5745F8457373j032848j111136j191745j541671j347746j765005j444710j558146
5737E7464366j270424j086712j124627q83073r27134r10802q52894n39379n92400
5728D9276921p7131j40599m75921n56188k36194L0405l16627l87200j04531K84633
5718D7297568K36874J96804K75559N01858M31824K58453N86169O94464N45783
5709E1025356P72362Q87188Q90350Q39205M98902J010657J018453J044354J218173
5700E9205000J173427J300918J518729J279962J050786Q41786K88310K19143J0796
5691F6888857l15161n36680m00484j37701L33638O99800R18191J033071J281664
5682F9765195J339343J371050K016912K194926K419403K335719K527025K364561
$$ plain form
5745 68457373 67424525 66313389 65121644 63579973 62232227 60467222 59022512 57464366
5737 57464366 56193942 55107230 53982603 53099530 52172396 51261594 50408700 49869321 49276921
5728 49276921 49199790 49059191 48583270 48027082 47790888 47821293 47504666 47117466 47012935 47297568
5718 47297568 47534442 47731246 48006805 48508663 48940487 49198940 49785109 50479573 51025356
5709 51025356 51797718 52684906 53575256 54414461 54913363 55924020 56942473 57986827 59205000
5700 59205000 60378427 61679345 63198074 64478036 65528822 66370608 66658918 66878061 66888857
5691 66888857 66573696 66037016 65636532 65498831 65832469 66532269 67450460 68483531 69765195
5682 69765195 71104538 72475588 74492500 76687426 79106829 81442548 83969573 86334134
5674H6334134K061742J778019J484726J004083L90996j94026m85622m46250m27926
5665I1499876p1749L25826Q01347J311448K134789K082620K522855L214540L101238
5656A06922790L719511M404646M860185M943568N072429M556945M293350K720409
5648A41493833R98038n166j186274j872430k194333j870841j902624p32752P9640
5639A32807091O08741J414394K031706K969012L589430M125271M567875M507255
5631A56620775M278227L647719L000314K100358P61035m13324k022567l097855
5623A64874682l845002m356117m456055m570879m170068l261638k044859j473172
5615A36696892l52712K65602J284210K018809J960416K411759K973549K519519
$$ plain form
5674 86334134 88395876 90173895 91658621 92662704 93053700 92859674 92374052 91927802 91499876
5665 91499876 91428127 91753953 92555300 93866748 96001537 98084157 100607012 103821552 106922790
5656 106922790 110642301 115046947 119907132 124850700 129923129 134480074 138773424 141493833
5648 141493833 142491871 142486705 141300431 139428001 137233668 135362827 133460203 132727451 132807091
5639 132807091 133415832 134830226 136861932 139830944 143420374 147545645 152113520 156620775
5631 156620775 160899002 164546721 167547035 169647393 170408428 169995104 167972537 164874682
5623 164874682 161029680 156673563 152217508 147646629 143476561 140214923 138170064 136696892
5615 136696892 136344180 136609782 137893992 139912801 141873217 144284976 147258525 149778044
5607A49778044J605188P96332j7019j276297k445271l179538l428690l637772
5599A38194977l001304k307342j729715q84816k66052m6008P2290J74279j20665
5590A30085644J47902M35887M61283J284558J782841K050965K350422K250989
5582A40850491K138530J446272P68974P9737l04721n26060n63229m59951n48338
5573A42881705o77136m64636p63354j122181r22241o07066q1055N52395J418421
5564A40214852J937338K816271L291551K340792J874532J140328l15412j458521
5556A51841731k778613l579439l350999l364772l329441l450486m061325m396325
5548A23530331m212457m169483l792575l493351k636641j446176p24493L71568
$$ plain form
5607 149778044 151383232 152179564 152162545 150886248 148440977 145261439 141832749 138194977
5599 138194977 135193673 132886331 131156616 130271800 130005748 129959740 130032030 130206309 130085644
5590 130085644 130233546 130669433 131130716 132415274 134198115 136249080 138599502 140850491
5582 140850491 142989021 144435293 145204267 145284004 144979283 144453223 143889994 143430043 142881705
5573 142881705 142204569 141739933 140976579 139854398 138932157 138325091 138244036 138796431 140214852
5564 140214852 142152190 144968461 148260012 150600804 152475336 153615664 153300252 151841731
5556 151841731 149063118 145483679 142132680 138767908 135438467 131987981 127926656 123530331
5548 123530331 119317874 115148391 111355816 107862465 105225824 103779648 103055155 103426723
5540A03426723R54648J050023J020407N13301o99047k102552l272721m564880
5532I6325902n386374n319657m614638m277775l396236l141625k658687k171848
5524F5359062j557413j283247j254449j207272p77958p97974p66965m63743k35644
5515E7014397r2267j57136n9843M48279P10329N66464O4946N7160o6624p6644
5505E8409061n45674q98190k91268k28704m52892k13424J08466j1622l26653p3649
5495E5475451M18390L60463N56188P04383R70119R68473J163085K68663k37136
5486F0648079m83176j011791j378196j276089j848050j521126j262040j316836
5478E0550775j140285o48445n41782n20797l84771J4701K16401M23464O61359
$$ plain form
5540 103426723 104381371 105431394 106451801 106965102 106266055 104163503 100890782 96325902
5532 96325902 90939528 85619871 81005233 76727458 73331222 70189597 67530910 65359062
5524 65359062 63801649 62518402 61263953 60056681 59278723 58480749 57713784 57250041 57014397
5515 57014397 56922130 56764994 56705151 57153430 57863759 58430223 58495169 58552329 58485705 58409061
5505 58409061 57863387 56965197 56673929 56445225 55992333 55778909 55887375 55875753 55549100 55475451
5495 55475451 55893841 56254304 56810492 57514875 58484994 59453467 60616552 60885215 60648079
5486 60648079 60164903 59153112 57774916 56498827 54650777 53129651 51867611 50550775
5478 50550775 49410490 48762045 48220263 47699466 47314695 47329396 47545797 47969261 48630620
5469D8630620O54478R72748O83580R64035P47798M5885r18898j726595j948285
5460D8105366k227892k130597k148228j652259j340466j350603r60666o47373
5452C5647282p35557o22618m91488k86892l05949M6515L9057k75722M38244L53230
5442C3806102J78463K64641K20246R6279P8479k41668k91451l28578m76210m91699
5432C2814604l66100m28263k77296o2412m0154M0023L12569J1510J31549M77427
5422C2613457M40260M93301M51100K39315q657J95274K44677M22567J17904N7957
5412C5267155q918J50982R3376J49720J08798J42375J71770M17760M51493P48236
5402C7692747P58382O12597Q5549M03634O29044L17202M87349M25021L77797M67556
$$ plain form
5469 48630620 49285098 50257846 50941426 51905461 52653259 52699144 51780246 50053651 48105366
5460 48105366 45877474 43746877 41598649 39946390 38605924 37255321 36294655 35647282
5452 35647282 34911725 34289107 33797619 33510727 33204778 33251293 33290350 33014628 33452872 33806102
5442 33806102 33984565 34249206 34469452 34565731 34644210 34402542 34111091 33782513 33306303 32814604
5432 32814604 32448504 32020241 31742945 31680533 31640379 31680402 31992971 32004481 32136030 32613457
5422 32613457 33053717 33547018 33998118 34237433 34228776 34424050 34668727 35091294 35209198 35267155
5412 35267155 35258237 35409219 35502595 35652315 35761113 35903488 36075258 36493018 36944511 37692747
5402 37692747 38451129 39063726 39149275 39552909 40181953 40499155 40986504 41411525 41789322 42256878
5392D2256878R31549Q66575P19311P68657J084504Q31546J027641J107789R86585
5383E0581035J132707J526597J669373J515435J899030J833688K657707K699865
5375F5515437K675576L007491K990908L740372L830290M433322M727436M616731
5367I5537563L858342L114861J884749J06840j430468k328858l211435l129861
5359I4401733l186101k478570j742949j028771L0278R91255J563623K086614K741084
5350I3378196L294088L536292L278242L323591K805889K492993J339694N22761
5342A13971746p21998k415098l488039m158956n444228n521447n320318m854906
5334H2046756l410755k864022k032886j400880q35709j67532M35092O16812R72700
$$ plain form
5392 42256878 43188427 44055002 44774313 45542970 46627474 47459020 48486661 49594450 50581035
5383 50581035 51713742 53240339 54909712 56425147 58324177 60157865 62815572 65515437
5375 65515437 68191013 71198504 74189412 77929784 81760074 86193396 90920832 95537563
5367 95537563 99395905 102510766 104395515 104502355 103071887 100743029 97531594 94401733
5359 94401733 91215632 88737062 86994113 85965342 85995620 86986875 88550498 90637112 93378196
5350 93378196 96672284 100208576 103486818 106810409 109616298 112109291 113448985 113971746
5342 113971746 113249748 110834650 107346611 103187655 97743427 92221980 86901662 82046756
5334 82046756 78636001 75771979 73739093 72338213 71502504 71334972 71770064 72386876 73359576
5325G3359576J087444J159746P31347J81366n25950j098898j990454k583767k787582
5316F7532828l205714k837292k535400j844646j417395j172394n15172o39783
5308E3365032n06005n88696q87263j364734j844213k002264j643551j771343j442566
5299D1314397j007241q83674q98853l18870j85364J93869L39301L13151Q05958
5290C9672674O69881L10802K66923L78014J31402R0214l71100q13103j419655
5281C8916052j409639j736250k072014j815327j509857j383322j310455r84936
5273B6694252o71379p41735k17003r7705q8501k28496J78821O4661p9910R605
5263B4822610l41014p01108o19076r52415j091757j397580j320937j374122r08549
$$ plain form
5325 73359576 74447020 75606766 76338113 76519479 75993529 74894631 72904177 70320410 67532828
5316 67532828 64327114 61489822 58954422 57109776 55692381 54519987 54004815 53365032
5308 53365032 52859027 52270331 51383068 50018334 48174121 46171857 44528306 42756963 41314397
5299 41314397 40307156 39423482 38524629 38205759 38020395 38214264 38553565 38866716 39672674
5290 39672674 40342555 40653357 40920280 41298294 41429696 41519910 41148810 40335707 38916052
5281 38916052 37506413 35770163 33698149 31882822 30372965 28989643 27679188 26694252
5273 26694252 26022873 25281138 25064135 24966430 24877929 24649433 24828254 24892915 24813005 24822610
5263 24822610 24481596 23780488 23161412 22208997 21117240 19719660 18398723 17024601 16116052
5254A6116052o15096p66793r02505p07257o83429k88655K0948m33144n36045k68337
5244A0935739l80726l74669k49169j92461j59995l27879k1578j4718l02016l46026
5234H566502j59930j97161l52758j24054M2414j08327j82419l00878K80855j14054
5224G350190m57984k6978j30547R133p7546k3998k81283j34235j41023m07937
5214E677792J62570k2595l6838M3007q8959j45866K15430r8548l3221p7885l62951
5203E231936N7116j69745l72131j3991K36149K03122j53951j07923k8330P4760
5193D957012n8898j88751m75296O5856J50032l35827M9023N1159j1290N3494L35480
5182D591994J3127j90689M3034n9764j76271J58800r5853j70799K28851Q163J991
$$ plain form
5254 16116052 15500956 14734163 13831658 13124401 12440972 12152317 12173265 11740121 11204076 10935739
5244 10935739 10555013 10180344 9931175 9738714 9578719 9250840 9229262 9214544 8912528 8566502
5234 8566502 8406572 8209411 7856653 7732599 7775013 7666686 7484267 7183389 7464244 7350190
5224 7350190 6892206 6865228 6734681 6743814 6666268 6642270 6360987 6226752 6085729 5677792
5214 5677792 5840362 5817767 5780929 5823936 5734977 5589111 5804541 5705993 5672772 5594887 5231936
5203 5231936 5289052 5119307 4747176 4733185 4969334 5172456 5018505 4910582 4882252 4957012
5193 4957012 4898114 4709363 4234067 4299923 4449955 4114128 4163151 4214310 4203020 4256514 4591994
5182 4591994 4605121 4414432 4457466 4397702 4221431 4380231 4284378 4113579 4342430 4350593 4352584
5171D352584M476j48186L1440p7915j95807J32246o1863J67354M3157o2845k54770
5160C929871j9382M9349J65945R9519k98184J07769N7494K2071j14955J17787
5150D117284Q2179J5938L0954J0417M7259k20366j03780k7913L24437K4932J22961
5139D424302j92336O0936K96327n1321J2342K20899p9492K6857m2195J41472K89444
5128E107235q4939k12815K79495M39131k1140L35111K13188l3551K5441k0620
5118F026536j21187J6048p4508k96299j18877p5255J43978K6197q7521L95048
5108E834160r6368l76108K73531L54770L02646K36026K42652n9338q426m6674
5098F656871k00039Q8364k65489k41954j55125j14894l41702j45734k62002J1921
$$ plain form
5171 4352584 4357060 4208874 4240314 4162399 3966592 4098838 4036975 4204329 4247486 4184641 3929871
5160 3929871 3910489 3959838 4125783 4225302 3927118 4034887 4092381 4114452 3999497 4117284
5150 4117284 4199463 4215401 4246355 4256772 4304031 4083665 3979885 3951972 4276409 4301341 4424302
5139 4424302 4231966 4292902 4589229 4537908 4550250 4771149 4691657 4718514 4676319 4817791 5107235
5128 5107235 5022296 4809481 5088976 5528107 5506967 5842078 6055266 6021715 6047156 6026536
5118 6026536 5905349 5921397 5846889 5550590 5431713 5356458 5500436 5526633 5439112 5834160
5108 5834160 5737792 5361684 5635215 5989985 6292631 6528657 6771309 6711971 6703545 6656871
5098 6656871 6456832 6545196 6279707 6037753 5882628 5767734 5426032 5280298 5018296 5030217
5088E030217k39649J39827l1593m7656J16494k11477J4108K03706j18189m2477
5078D813311j30951p8459K9270j25164k03033j15956j78367k00445N5435j96555
5068C669086k70600p5766K20640k96230j09391J80773j28621N1573l39484p7604
5058B824376J42247K2447j39679J0877o0734j15736j4092J13468r3152P459J29990
5047B827471j02769O0334n6254Q3615J92101N3729n8764j30888j31191k5996J64785
5036B876173Q8634Q7423k0917J38734j5902m54336k65519J39199J75855J48470
5026B897814n3376m4987J47218J44613o7205k35574O8315n466Q8854J8641m8005
5015B910842K08000l10971j04050M1903J09795l7474q0996J79974R4252L1526
$$ plain form
5088 5030217 4790568 4930395 4898802 4851146 4967640 4756163 4770271 4973977 4855788 4813311
5078 4813311 4682360 4603901 4633171 4508007 4304974 4189018 4010651 3810206 3865641 3669086
5068 3669086 3398486 3322720 3543360 3247130 3137739 3318512 3189891 3241464 2901980 2824376
5058 2824376 2966623 2989070 2849391 2860268 2799534 2683798 2669706 2783174 2690022 2697481 2827471
5047 2827471 2724702 2785036 2728782 2812397 3004498 3058227 2999463 2868575 2737384 2711388 2876173
5036 2876173 2964807 3052230 3031313 3170047 3154145 2699809 2434290 2573489 2749344 2897814
5026 2897814 2844438 2799451 2946669 3091282 3024077 2788503 2856818 2851352 2940206 2958847 2910842
5015 2910842 3118842 2807871 2703821 2745724 2855519 2818045 2737049 2917023 3011275 3042801
5005C042801k02905k60052K03531K67262k77272J85148Q261N6145k1117j62687
4995B839115k25775L5331j04718O0391k4357J31898j47230k0301J33377M9873
4985B727604k09012L6438N9774K32236K36610O5502j0097j74529p3187p7066j6604
4974B797669K07618r5134k70914j0092j30174k10440K08711r5846j06671P8313
4964B373040L8793j37446j84192J13078K02277q0931Q8533N2856l4186l25921
4954B105901O6958k8959j57918K43770R7823J59419k23997o6885J08841K4673
4944B329626k15193k2709o908J52116J33468L5860j95846o7757L01458Q6040k96860
4933B233295J0754N3820j33537l22833J13873M3653L18559J75143j3421J77466
$$ plain form
5005 3042801 2839896 2579844 2783375 3050637 2773365 2958513 2966774 3022919 3001802 2839115
4995 2839115 2613340 2648671 2543953 2604344 2579987 2711885 2564655 2544354 2677731 2727604
4985 2727604 2518592 2555030 2614804 2847040 3083650 3149152 3139055 2964526 2891339 2814273 2797669
4974 2797669 3005287 2910153 2639239 2629147 2498973 2288533 2497244 2401398 2294727 2373040
4964 2373040 2411833 2274387 2090195 2203273 2405550 2324619 2413152 2466008 2431822 2105901
4954 2105901 2172859 2143900 1985982 2229752 2327575 2486994 2262997 2196112 2304953 2329626
4944 2329626 2114433 2091724 2084816 2236932 2370400 2406260 2210414 2142657 2444115 2530155 2233295
4933 2233295 2244049 2297869 2164332 1841499 1955372 1999025 2317584 2492727 2479306 2656772
4923B656772k73858q7905J45714m4281J36213J05873j06389p172K02780j30121
4913B597626q3051J97140L1290j7436K49232j18887k771L9031l8958k29Q0905
4902B933892k78425k71265J23478R2037j78830K281k15293J71588P1294j40769
4892B309988j7421M3531l8266N4748k08674j15735O5297J19634K1697j93009K94707
4881B336497J46579K15358k85296m2098J07853k01325k9196r8149M3599N5065
4871B248887k5615O7423K11894j00397k95741J47449J69621M8822o7187Q8307
4861B493463K54441o4861k01432P6934l03121j54690K72326J90999p7029o3031
4851B423999j28904n6544J98847k8699R9326j31932j40813j06452O1366J10717
$$ plain form
4923 2656772 2382914 2295009 2440723 2396442 2532655 2638528 2532139 2524967 2727747 2597626
4913 2597626 2514575 2711715 2743005 2725569 2974801 2855914 2853143 2892174 2853216 2852987 2933892
4902 2933892 2655467 2384202 2507680 2599717 2420887 2423168 2207875 2379463 2450757 2309988
4892 2309988 2292567 2336098 2297832 2352580 2143906 2028171 2093468 2213102 2234799 2041790 2336497
4881 2336497 2483076 2698434 2413138 2371040 2478893 2277568 2248372 2150223 2193822 2248887
4871 2248887 2223272 2290695 2502589 2402192 2106451 2253900 2423521 2472343 2405156 2493463
4861 2493463 2747904 2683043 2481611 2558545 2255424 2100734 2373060 2564059 2487030 2423999
4851 2423999 2295095 2238551 2437398 2408699 2508025 2376093 2235280 2128828 2190194 2300911
4841B300911j98658j15624N2554J45284L4069p2666k09038M9316K044m4573K62764
4830B206383K63804m13173j65149m8124K70891l29847m8089L11953l9595m4688
4820A964366o387J10406K98567j41410j14603N0112K8670j79756J0985K46154
4810B267104j17574j65725j2957J38780K52285j1140J70604r6045j63471r6481
4800B165380o4601K41087l7259m8596o7015N7171n9895Q9244R6778j47845j58922
4789B065527K36027J803Q5336l1494J55950K02948k55185L8775l1671M5817j23300
4778B390533M6105q8773j2676N3836j58461K59927r1996K02014j1429k94668K4236
4767B318648l790L4263K20403J61006j87559r33K03282K13720Q8743k92781m6981
$$ plain form
4841 2300911 2102253 1986629 2039183 2184467 2218536 2145870 1936832 1986148 1988192 1943619 2206383
4830 2206383 2470187 2057014 1891865 1843741 2114632 1784785 1736696 2048649 2009054 1964366
4820 1964366 1957979 2068385 2366952 2225542 2110939 2161051 2189721 2009965 2020950 2267104
4810 2267104 2149530 1983805 1970848 2109628 2361913 2350773 2521377 2425332 2261861 2165380
4800 2165380 2100779 2341866 2304607 2256011 2188996 2246167 2186272 2275516 2372294 2224449 2065527
4789 2065527 2301554 2303357 2388693 2357199 2513149 2716097 2460912 2499687 2468016 2513833 2390533
4778 2390533 2436638 2347865 2335189 2389025 2230564 2490491 2398495 2600509 2589080 2294412 2318648
4767 2318648 2314858 2349121 2569524 2730530 2542971 2542038 2745320 2959040 3047783 2755002 2708021
4756B708021K32737p1163j46577o221P9634N5036j36001K36961J77033k54013
4746B875447k37053J18363j5934K91338J14486Q9023j16084j74748M0542n3553
4736B931827J608J35149r8598K39515n8789l2246n4538J73264N3716r7427J49155
4725C342636O6778O7465q4999j09975O8750J63152l02481J16707J81824j63291
4715C346566l07430j29218J03323K63550Q7628j42004j11804L01859J91286M739
4705C608495j58341O5946Q9426J71089J36769J36466R2458j80016J87753J96280
4695D346325j72242l1695J54884j23601q5394j40451j6149Q3316p9499J39403
4685D074897p3358l078k9515j32035l26905J43680K85727J25093K42247j90030
$$ plain form
4756 2708021 2940758 2869595 2723018 2716797 2796431 2851467 2715466 2952427 3129460 2875447
4746 2875447 2638394 2756757 2740823 3032161 3146647 3235670 3119586 2944838 2985380 2931827
4736 2931827 2933435 3068584 2969986 3209501 3150712 3118466 3063928 3237192 3290908 3193481 3342636
4725 3342636 3409414 3476879 3391880 3281905 3350655 3513807 3211326 3328033 3509857 3346566
4715 3346566 3039136 2909918 3013241 3276791 3364419 3222415 3110611 3412470 3603756 3608495
4705 3608495 3450154 3516100 3605526 3776615 3913384 4049850 4142308 3962292 4150045 4346325
4695 4346325 4174083 4142388 4297272 4173671 4088277 3947826 3931677 4014993 3935494 4074897
4685 4074897 4001539 3998461 3968946 3836911 3510006 3653686 3939413 4064506 4306753 4116723
4675D116723P5914O9620Q3163R4467L0453J89282K2747J61780l0025j084M11411
4664E224451N65669K66781k14048J58520K00087m94345j48989k55993j45305m29588
4654D727240k14940J70919l94962j51242k17884j18263K18349J98726j96497M5976
4644D067422M1022m7052r4581J2801K57717j64301k2158j42989O3443J13157j4729
4633D069752k50339J94379K26119m3067L5497k78938K6137L49391K60698k25085
4623D364544n0313K657N6244l22805O4053j18830k11672L07254J01210J89210
4613D381552J55552k39687k5047P0085J49044J67795q0568k39159q7935K50157
4603D501789J82161P8666l73860P5227K64084m0845K15084j58097r6903J2998
$$ plain form
4675 4116723 4192637 4262257 4345420 4439887 4470340 4659622 4682369 4844149 4814124 4813040 5224451
4664 5224451 5790120 6056901 5842853 6001373 6201460 5707115 5558126 5302133 5156828 4727240
4654 4727240 4512300 4683219 4288257 4137015 3919131 3800868 4019217 4217943 4021446 4067422
4644 4067422 4108444 4061392 3966811 3979612 4237329 4073028 4050870 3907881 3971324 4084481 4069752
4633 4069752 3819413 4013792 4239911 4196844 4232341 3953403 3979540 4328931 4589629 4364544
4623 4364544 4314231 4316888 4373132 4050327 4114380 3995550 3783878 4091132 4192342 4381552
4613 4381552 4537104 4297417 4272370 4342455 4491499 4659294 4578726 4339567 4251632 4501789
4603 4501789 4683950 4762616 4388756 4463983 4728067 4687222 4902306 4744209 4647306 4660304
4593D660304J53271K45402j18894m2561j3459K32711J70897k23624j26198J40274
4583E078123K50149O3468J31618j22711k94938j9319n8857M1174K42419L17734
4573E628860l43371Q6718M44377l3002j18136K61046R1603r1191J09123q6373
4563E949654j71953K4959Q6194N324j07834N6214K79708J86373J1837j47856k42253
4552E930367j2246K26147K41288J68360l7811J61374K3444l939l4458j03732m5450
4541F513344p6858l970O875k05979J57515j93503M14656J86174j45042J74148
4531F827360m1023M7078O0690K83485M7093N0036j07155o7907J38335l79961J46115
4520G004146K16253r4874K4876l1321J64177R2979L28200n1503j26304q2940J78121
$$ plain form
4593 4660304 4813575 5058977 4940083 4897522 4884063 5116774 5287671 5064047 4937849 5078123
4583 5078123 5328272 5391740 5523358 5400647 5105709 5086390 5027533 5068707 5311126 5628860
4573 5628860 5285489 5372207 5816584 5783582 5665446 5926492 6018095 5926904 6036027 5949654
4563 5949654 5777701 5802660 5888854 5894178 5786344 5842558 6122266 6308639 6320476 6172620 5930367
4552 5930367 5918121 6144268 6385556 6553916 6516105 6677479 6700923 6696984 6662526 6558794 6513344
4541 6513344 6436486 6432516 6439391 6233412 6390927 6197424 6612080 6798254 6653212 6827360
4531 6827360 6786337 6833415 6894105 7177590 7224683 7274719 7167564 7099657 7237992 6858031 7004146
4520 7004146 7220399 7125525 7150401 7119080 7283257 7376236 7704436 7652933 7526629 7443689 7621810
4509G621810K26073K9978k16461J64644R595m7391R4834K34696R9050q6269l4681
4498H095878R142L20723J90063j9933q1859k4592l4558N392J57601J38551N5050
4487H811458j90057k5801K03413J89994K57800O5439R701Q9853n165j46689M6658
4476I306604o3321J44696K73310M0626P9478j32638l1610j07985J87265J72832
4466I869257J13737m5004O0247J15080r9935K26348J7759J00888j02776J29193
4456A0384794J24460M75204m2069k37498Q940J39073J6830m3989R0633L07101
4446A1223479J62605J72802Q170M266j76493k4083L88961n267K85681K79545R113
4435A2328779o9771l7839K49301k5479K9505K97346J15944K410p1967M7879L4491
$$ plain form
4509 7621810 7847883 7877861 7661400 7826044 7835639 7788248 7883082 8117778 8216828 8130559 8095878
4498 8095878 8105020 8425743 8615806 8595873 8514014 8489422 8454864 8460256 8617857 8756408 8811458
4487 8811458 8621401 8595600 8799013 8989007 9246807 9312246 9321947 9411800 9406635 9259946 9306604
4476 9306604 9243283 9387979 9661289 9701915 9781393 9648755 9617145 9509160 9696425 9869257
4466 9869257 9982994 9937990 9998237 10113317 10013382 10239730 10257489 10358377 10255601 10384794
4456 10384794 10509254 10984458 10942389 10704891 10713831 10852904 10869734 10825745 10916378 11223479
4446 11223479 11386084 11558886 11567056 11571322 11394829 11370746 11759707 11754440 12040121 12319666 12328779
4435 12328779 12259008 12221169 12470470 12444991 12474496 12771842 12887786 12890196 12818229 12866108 12900599
4424A2900599r3771j18862J80642J00281J76081K78374R4023J4951J30159J49735
4414A3812212L79317J27674P2821l1290K25811K37795K87408J56257N1240J77167
4404A5496412Q4261J61919j06500J27819K43710o254J33029K11438L64116J47364
4394A6857314J22313L3391l2005K30238M94579R2980K71723K53169J65261J66919
4384A8655882k8271L24158J01176J54294L7143Q444K65706K30251J88304J61326
4374B0098413L07100j59048k96K15496J29889K47631J2799P4710K13989M14227
4364B1554910J69770L84091K05310K30806N76061J92104M88630M67991N67850
4355B4837523M71966N5612O29201R18915N15664O51388N70306k33587k56823k30134
$$ plain form
4424 12900599 12806828 12687966 12868608 12968889 13144970 13423344 13517367 13532318 13662477 13812212
4414 13812212 14191529 14319203 14392024 14360734 14586545 14824340 15111748 15268005 15319245 15496412
4404 15496412 15580673 15742592 15636092 15763911 16007621 16001367 16134396 16345834 16709950 16857314
4394 16857314 16979627 17013018 16981013 17211251 17705830 17798810 18070533 18323702 18488963 18655882
4384 18655882 18627611 18951769 19052945 19207239 19244382 19252826 19518532 19748783 19937087 20098413
4374 20098413 20405513 20246465 20246169 20461665 20591554 20839185 20851984 20926694 21140683 21554910
4364 21554910 21724680 22108771 22314081 22544887 23120948 23313052 23801682 24269673 24837523
4355 24837523 25309489 25365101 25994302 26913217 27428881 28080269 28650575 28416988 28160165 27930031
4345B7930031n51563m54109p6306N6564L3467j860J18774n3949K48806M86186
4335B7736041R8860K8431J51559K87282N08258J86955O1903O13651N66096M54166
4325C0693202J90063K10326N24500K87217K1383M36402M44448L59955M52590N60208
4315C4180294N58559L91834M51307O55428P61148J58504O51092M95281O95540
4306C8998987O08522O76770N93801P12976P58080Q30618N75405Q97661J142073
4297D5794893Q45342P86207J064724J099358J018117J208950J221211R36118Q74781
4288E4849701J362337J227137J302994J338121J653387J551205J331328J360497
4280F5976707J841292J711877J506978J522700J864948J783793J917554K126529
$$ plain form
4345 27930031 27378468 26924359 26848053 26904617 26938084 26936224 27054998 27001049 27249855 27736041
4335 27736041 27834901 27863332 28014891 28302173 28810431 28997386 29059289 29672940 30239036 30693202
4325 30693202 30883265 31093591 31618091 31905308 31926691 32363093 32807541 33167496 33620086 34180294
4315 34180294 34738853 35130687 35581994 36237422 36998570 37157074 37808166 38303447 38998987
4306 38998987 39607509 40284279 40878080 41591056 42349136 43179754 43755159 44652820 45794893
4297 45794893 46640235 47426442 48491166 49590524 50608641 51817591 53038802 53974920 54849701
4288 54849701 56212038 57439175 58742169 60080290 61733677 63284882 64616210 65976707
4280 65976707 67817999 69529876 71036854 72559554 74424502 76208295 78125849 80252378
4272H0252378J835450J740660J904245J885482K197566K117512K065388J986989
4264I5985670J990238K137945J788684J685121J955183J777302J259705J508060
4256A10087908J936734J502271J378722J193022J286600J019267R86959J098959
4248A20490442P93919O99736N57767J73684N11544J39549j18059J67852j38294
4239A23278140O1987k4458k35454k87340j64280l98479j50202l0037n07438l61626
4229A21180813l00500l61543k80958m47530k5669p6686N7552L77218O85K10165
4219A20333547L36974N59917M24676N54014P22691N87278Q73689N58434P96139
4210A25747359R49010J097339J194550J020753J132115J446347J410441J427753
$$ plain form
4272 80252378 82087828 83828488 85732733 87618215 89815781 91933293 93998681 95985670
4264 95985670 97975908 100113853 101902537 103587658 105542841 107320143 108579848 110087908
4256 110087908 112024642 113526913 114905635 116098657 117385257 118404524 119391483 120490442
4248 120490442 121284361 121984097 122541864 122715548 123227092 123366641 123248582 123416434 123278140
4239 123278140 123340127 123315669 123080215 122792875 122628595 122230116 122079914 122049877 121542439 121180813
4229 121180813 120880313 120518770 120237812 119790282 119764613 119687927 119745479 120122697 120123382 120333547
4219 120333547 120670521 121230438 121655114 122209128 122931819 123519097 124392786 124951220 125747359
4210 125747359 126696369 127793708 128988258 130009011 131141126 132587473 133997914 135425667
4202A35425667J423996J319479J580199J356310J528122J304251J348275J259940
4194A46546239J079798J167437J352231J346861P00418R70733J265448J292765
4186A55721930P69260Q63169R59816O91612P68531N23230K5995J21524K62641
4177A60707708j110j13711l84959k47770l71123p21065q37595o19863p15983j305014
4167A55389515j527482j297838j606451j850917j630077k322418k424905k277490
4159A40451937k280318k488394k611121k645461k478625k752241k890275k622210
4151A19683292k772656k883611k937391k843766k768695l071376k826692k676148
4143I6902957k764103k551351k423477k389308k312253k287522k089139k069381
$$ plain form
4202 135425667 136849663 138169142 139749341 141105651 142633773 143938024 145286299 146546239
4194 146546239 147626037 148793474 150145705 151492566 152192984 153163717 154429165 155721930
4186 155721930 156491190 157354359 158314175 159005787 159774318 160297548 160323543 160445067 160707708
4177 160707708 160706598 160592887 160207928 159960158 159589035 158867970 158030375 157410512 156694529 155389515
4167 155389515 153862033 152564195 150957744 149106827 147476750 145154332 142729427 140451937
4159 140451937 138171619 135683225 133072104 130426643 127948018 125195777 122305502 119683292
4151 119683292 116910636 114027025 111089634 108245868 105477173 102405797 99579105 96902957
4143 96902957 94138854 91587503 89164026 86774718 84462465 82174943 80085804 78016423
4135G8016423j901526j857477j982110j832581j871098k036217j859898j653041
4127F3022475j640389j562696j315879j049940j371307j435294j136927j037708
4119E2472335j012895r76945r58893q96754p78359o97378n38742p76795q20292
4110D5015282p00923o46998m71855j90655m59546k72735l03604j89661R5025k47118
4100D1627212k30845k77212m1938k41514L8224J77175L08308L40946J64623P2419
4090D1937398J82279l0389K83807M21621K56760M88958N95400K17963M54008K24140
4080D5031945J67999N04807O96862N28633P62579P11107M51463N70277M95239
4071D9920911M00899N12470M48685O51781N81952N52863L60332O78025P83951
$$ plain form
4135 78016423 76114897 74257420 72275310 70442729 68571631 66535414 64675516 63022475
4127 63022475 61382086 59819390 58503511 57453571 56082264 54646970 53510043 52472335
4119 52472335 51459440 50482495 49523602 48626848 47848489 47151111 46612369 45835574 45015282
4110 45015282 44314359 43667361 43195506 43004851 42545305 42272570 41968966 41779305 41874330 41627212
4100 41627212 41396367 41119155 41077217 40835703 40873927 41051102 41359410 41700356 41864979 41937398
4090 41937398 42119677 42089288 42373095 42794716 43051476 43540434 44135834 44353797 44807805 45031945
4080 45031945 45199944 45704751 46401613 46930246 47692825 48403932 48855395 49425672 49920911
4071 49920911 50321810 50834280 51282965 51934746 52516698 53069561 53429893 54107918 54891869
4062E4891869M02396N72602P29232R34224R76308J005959P97844J095313R16026
4053F2321773J039835R02892R55774J347735J453529J273991J278356J242235
4045G1816120J295357J364927J199688J330892J406337J378827J857462J642988
4037H3292598J774928J862410J836575K109094K419575K466906K583482K863520
4029A01209088L395510L692695L817525M369220N087384N542643O131299O652244
4021A39897608P099529P809548Q414256R025098R331949R085659Q776208Q113811
4013B07553666P114014O013068L921215K624814R30920r2990o71922j456451j900658
4004B24035676j910959j723294j846656k419310k655521l106300m284199n221180
$$ plain form
4062 54891869 55294265 55866867 56596099 57530323 58506631 59512590 60310434 61405747 62321773
4053 62321773 63361608 64264500 65220274 66568009 68021538 69295529 70573885 71816120
4045 71816120 73111477 74476404 75676092 77006984 78413321 79792148 81649610 83292598
4037 83292598 85067526 86929936 88766511 90875605 93295180 95762086 98345568 101209088
4029 101209088 104604598 108297293 112114818 116484038 121571422 127114065 133245364 139897608
4021 139897608 146997137 154806685 163220941 172246039 181577988 190663647 199439855 207553666
4013 207553666 214667680 220680748 224601963 227226777 228157697 228064707 227392785 225936334 224035676
4004 224035676 222124717 220401423 218554767 216135457 213479936 210373636 206089437 200868257
3996B00868257o691284p512899q649633r431735r552141r396116q979910q100574
3988A32553965p635147o610484n836575m884580m117551l831103l423479k895080
3980I3319966k350894j975086j415895j338429j162169r07903m69612m07689m50271
3971H2842018q4447m5262K12194K99488K43216K33370l6842K28627M27905Q12527
3961H5132794P00607M51491O78940Q86827R11399J338706J126222R17322J033186
3952I3177494R90032Q94141J137491J166699J256987J476377J666651J530916
3944A03296788J558455K163061K104056K257974K589358K583647K725080K613398
3936A21891817L258050L566674L579534L689261M012711M502597M855150M956356
$$ plain form
3996 200868257 194176973 186664074 178014441 168582706 159030565 149634449 140654539 132553965
3988 132553965 124918818 118308334 112471759 107587179 103469628 99638525 96215046 93319966
3980 93319966 90969072 88993986 87578091 86239662 85077493 84169590 83699978 83292289 82842018
3971 82842018 82757571 82712309 82924503 83223991 83467207 83700577 83663735 83892362 84320267 85132794
3961 85132794 85833401 86284892 86963832 87850659 88762058 90100764 91226986 92144308 93177494
3952 93177494 94167526 95061667 96199158 97365857 98622844 100099221 101765872 103296788
3944 103296788 104855243 107018304 109122360 111380334 113969692 116553339 119278419 121891817
3936 121891817 125149867 128716541 132296075 135985336 139998047 144500644 149355794 154312150
3928A54312150N474309N821166N995024O774055O870867P091252P336629P500548
3920B07176000P645564P289930P005237O458210N981719N520057N141722N074494
3912B57292933M673087M659306M497785M271318M158932L729947L154084K583673
3904B89021065J617722P98963l80721j221679k473175k937661l314379l827793
3896B77282342l846962l741629l417062l680564l816104l856662l771279m204504
3888B46947576m041788m206344m431905m610130m429077m082442m027959l352219
3880B13765712k835510k187804k217380j545161j092272p04843l26136J24018
3872B02980624R13514J135814J921102K517416L083338L880189M816502N136961
$$ plain form
3928 154312150 159786459 165607625 171602649 178376704 185247571 192338823 199675452 207176000
3920 207176000 214821564 222111494 229116731 235574941 241556660 247076717 252218439 257292933
3912 257292933 261966020 266625326 271123111 275394429 279553361 283283308 286437392 289021065
3904 289021065 290638787 291437750 291057029 289835350 287362175 284424514 281110135 277282342
3896 277282342 273435380 269693751 266276689 262596125 258780021 254923359 251152080 246947576
3888 246947576 242905788 238699444 234267539 229657409 225228332 221145890 217117931 213765712
3880 213765712 210930202 208742398 206525018 204979857 203887585 203182742 202856606 202980624
3872 202980624 203894138 205029952 206951054 209468470 212551808 216431997 221248499 226385460
3864B26385460O066494O629117P282781P822941P489317P528412O973938N808737
3856B81987197M921722L750364K473371J767815J075696R82148N51683L18055
3848B97828051M52460J022353J153964R66268O21187M34403o18344j500700j826950
3839B98532692k687491k993255l213244k780886k272534j299154n32748L83733
3831B83137113J338975K185253L016482L620760M489666M791850N204358N344581
3823C13129038N074276N416314N522795N104162M872275M478172M566169M205512
3815C52368713L696558L278681K612398K244648J763550R93230K41810J26376
3807C67325964o50613j500050j793511k330232l114946l708752m112910m441653
$$ plain form
3864 226385460 232451954 239081071 246363852 254186793 261676110 269204522 276178460 281987197
3856 281987197 286908919 290659283 293132654 294900469 295976165 296958313 297509996 297828051
3848 297828051 298280511 299302864 300456828 301423096 302044283 302478686 301860342 300359642 298532692
3839 298532692 295845201 292851946 289638702 286857816 284585282 283286128 282753380 283137113
3831 283137113 284476088 286661341 289677823 293298583 297788249 302580099 307784457 313129038
3823 313129038 318203314 323619628 329142423 334246585 339118860 343597032 348163201 352368713
3815 352368713 356065271 359343952 361956350 364200998 365964548 366957778 367199588 367325964
3807 367325964 366675351 365175301 363381790 361051558 357936612 354227860 350114950 345673297
3799C45673297m671736n076167n380146n245635m877432n059847m988459m765074
3791C05608801m642342m435272m279406l763100l574050l391367k845309k360527
3783B76317428j626448j004162q48398j95Q18873Q59315J266781J520734J330169
3774B78634097J435076J656292J601726J286409J521522J315400J428569J352077
3766B90231168J230044Q29909K45296k92517n17900j233048j692693k126106l174329
3757B83499824l907705m249643m692533m888243n567965n915130n788182o285150
3749B42205273o629325p130958p296183p394807p438189p357903p091924p642247
3741A84223737p429443p104292o735982o833186o810589o314361n957796n979238
$$ plain form
3799 345673297 341001561 335925394 330545248 325299613 320422181 315362334 310373875 305608801
3791 305608801 300966459 296531187 292251781 288488681 284914631 281523264 278677955 276317428
3783 276317428 274690980 273686818 272838420 272838225 273657098 274516413 275783194 277303928 278634097
3774 278634097 280069173 281725465 283327191 284613600 286135122 287450522 288879091 290231168
3766 290231168 291461212 292291121 292536417 292243900 291726000 290492952 288800259 286674153 283499824
3757 283499824 279592119 275342476 270649943 265761700 260193735 254278605 248490423 242205273
3749 242205273 235575948 228444990 221148807 213754000 206315811 198957908 191865984 184223737
3741 184223737 176794294 169690002 162954020 156120834 149310245 142995884 137038088 131058850
3733A31058850n518959n236148n043109m834379m877559m281565l797708l618369
3725I3851054l365116l252448l011812k781859k821130k443301k006912k183560
3717G1984916k065568k176175k135534j776098j562531j253908j492005j382318
3709E8140779j148222j343613j127496j204977j026409r34297j106242o96288
3701D9553235p93089r09243j045882r31419q54849o19151r81496r74468r53170
3692D1490468o16687o82047p81556n11389q37705p03815n00674o75551j068490
3683C5112554o65217n75315p10358p42699o76547p18452o51304m54176n20262
3674B9398224k26383q13184q14017j83362p02301n85636l51047m54864l49265
$$ plain form
3733 131058850 125539891 120303743 115260634 110426255 105548696 101267131 97469423 93851054
3725 93851054 90485938 87233490 84221678 81439819 78618689 76175388 74168476 71984916
3717 71984916 69919348 67743173 65607639 63831541 62269010 61015102 59523097 58140779
3709 58140779 56992557 55648944 54521448 53316471 52290062 51355765 50249523 49553235
3701 49553235 48760146 47850903 46805021 45873602 45018753 44399602 43418106 42443638 41490468
3692 41490468 40873781 40191734 39410178 38898789 38061084 37357269 36856595 36181044 35112554
3683 35112554 34447337 33872022 33161664 32418965 31742418 31023966 30372662 29918486 29398224
3674 29398224 29171841 28358657 27544640 27361278 26658977 26073341 25722294 25267430 24918165
3665B4918165m65661m62697k40382p32863m98145l4672n01377l33697j87805k15264
3655B1245602m57012l35675m06482q5172j70298l15835l40552k00992k91178j51092
3645A8491314j79601j85111n834l75473n4158l63123k02495j29661j79259k73895
3635A6542704j30409n1196k20212j12773j96459l31865J39711k63783k20902j07074
3625A5047742j8423P5291k40246r4101l14307j32223K0256m31992k2693M0144
3615A3929448j17192o9962j9168k7460j35608K0287k19848K1033k4412k29902
3605A3127216k42728j02319j01627l5691j73845k81772J2891J31284j10406l21044
3595A1901959P7135R206m80165L8605K4111K7666j95875j78470n1777J21718j59572
$$ plain form
3665 24918165 24452504 23989807 23749425 23016562 22518417 22483745 21982368 21648671 21460866 21245602
3655 21245602 20788590 20452915 20046433 19961261 19790963 19475128 19134576 18933584 18642406 18491314
3645 18491314 18311713 18126602 18120768 17745295 17691137 17328014 17125519 16995858 16816599 16542704
3635 16542704 16412295 16361099 16140887 16028114 15831655 15499790 15639501 15375718 15154816 15047742
3625 15047742 15029319 15104610 14864364 14770263 14455956 14323733 14343989 13911997 13889304 13929448
3615 13929448 13812256 13742294 13723126 13695666 13560058 13580345 13360497 13381530 13357118 13127216
3605 13127216 12884488 12782169 12680542 12644851 12471006 12189234 12202125 12333409 12223003 11901959
3595 11901959 11979094 11988300 11508135 11546740 11570851 11598517 11402642 11224172 11172395 11294113 11134541
3584A1134541L86J77995k65626Q5633r108N7775l55730k0387l5759J54988j36311
3573A0788397j14802K14424R3138j19950q7940r9660m3670n0375j60424J55940
3563A0575078N6012j35076r3653J89556p5835J68675M1574P0702j03929J640j47251
3552A0547493j92232q5153J6953k34432M5795K51655j33067J10412m5371L8679
3542A0320732j76983O0661R6195k49531k2328K61758r7833j24202j03614K27021
3532A0191876K65015J87915J60142j20434J00745J17112p1241Q034R0092J09472
3522A1038728j75747j5575K07753Q3100j5325J04281J41401j90721J84397n7654
3512A1304638j36494R0452j29365P5037L93524j1168J83331o8393k545j15588
$$ plain form
3584 11134541 11134927 11312922 11047296 11132929 11123821 11181596 10825866 10805479 10769720 10924708 10788397
3573 10788397 10673595 10888019 10981157 10861207 10773267 10673607 10629937 10579562 10419138 10575078
3563 10575078 10631090 10496014 10402361 10591917 10516082 10684757 10726331 10797033 10693104 10694744 10547493
3552 10547493 10355261 10270108 10287061 10052629 10098424 10350079 10217012 10327424 10282053 10320732
3542 10320732 10143749 10204410 10300605 10051074 10028746 10290504 10192671 10068469 9964855 10191876
3532 10191876 10456891 10644806 10804948 10684514 10785259 10902371 10831130 10839164 10929256 11038728
3522 11038728 10862981 10847406 11055159 11138259 11122934 11227215 11368616 11177895 11362292 11304638
3512 11304638 11168144 11258596 11129231 11204268 11597792 11586624 11769955 11701562 11699017 11583429
3502A1583429P997M2021n2988J85577J68028j09501J51072M2866O7637M15146
3492A2501284J91905J83977J21921J93083P0257M07388J67803k79454J12712J02995
3482A3773871m028L58227J51415K32407J49212J18136N5906L21157L36574J04354
3472A5597231R4002L86385J41605j51523L46518p8796J46624M85176K32275J60361
3462A7359858J16882M95542O43463K74408L69891L71231N42053P99523O40130
3453B1612981P41290Q08334O77383L17444O25675N53657O50873P38169K90695
3444B7016501J7509J97642j18190j25611m29483p54695m19898p08273p94662o87811
3434B3193029j056352q39588j028112j146307r07378o78673o32741n63184l03493
$$ plain form
3502 11583429 11591426 11633447 11580459 11766036 11934064 11824563 11975635 12018501 12086138 12501284
3492 12501284 12693189 12877166 12999087 13192170 13262427 13669815 13837618 13558164 13670876 13773871
3482 13773871 13769843 14128070 14279485 14511892 14661104 14779240 14835146 15156303 15492877 15597231
3472 15597231 15691233 16077618 16219223 16067700 16414218 16335422 16482046 16967222 17199497 17359858
3462 17359858 17476740 17972282 18615745 18890153 19260044 19631275 20173328 20972851 21612981
3453 21612981 22354271 23162605 23839988 24157432 24783107 25336764 25987637 26725806 27016501
3444 27016501 27034010 27231652 27113462 26987851 26558368 25803673 25383775 24675502 23880840 23193029
3434 23193029 22136677 21297089 20268977 19122670 18215292 17536619 16903878 16340694 16037201
3425A6037201n14940n05275l50795k15732m99344m09065l4394n1041M8461K20364
3415A3725440J31794K61076l57297m84286j02947k69206n15209o95561m26993
3406A1266811m54594l40514q4657m75955k27861k58400k24626k31162k96254J78007
3396H850795l29217k74954k6733k49818m8843j56941J74038j33764j35716k287
3386G666560k96980J86699j2813N9341P2077k33787L2078o5171p4384o4951l65453
3375F903216m66846j70435n7197p6697k41195l83951K65511j38283k0938j00990
3365E512195k4511J01418j42811j01305k20164q7816o9603J02603j65396K6981
3355D931591m0053k3163j61155J57334j75064j00546k1139M6086m9062j26068
$$ plain form
3425 16037201 15522261 15016986 14666191 14450459 13951115 13542050 13507656 13456615 13505076 13725440
3415 13725440 13857234 14118310 13761013 13276727 13173780 12904574 12389365 11693804 11266811
3406 11266811 10812217 10471703 10387046 9911091 9683230 9424830 9200204 8969042 8672788 8850795
3396 8850795 8521578 8246624 8219891 7970073 7921230 7764289 7938327 7804563 7668847 7666560
3386 7666560 7369580 7556279 7543466 7602807 7674884 7441097 7473175 7408004 7333620 7268669 6903216
3375 6903216 6436370 6265935 6208738 6132041 5890846 5506895 5772406 5634123 5613185 5512195
3365 5512195 5487684 5589102 5446291 5344986 5124822 5037006 4967403 5070006 4904610 4931591
3355 4931591 4891538 4868375 4707220 4864554 4689490 4588944 4567805 4613891 4564829 4438761
3345D438761J5250p6425J85456j54376l5819M4678j12131p8895p4511p1776J75875
3334D256087j5617j89197O0797m8955j43559J23091N9736j66447k9790j96155
3324C709991j1925N8848l5814K99713k19375j8473l06146K670L40465l10839J25713
3313C634828K1530j48842k49980J34976J37458j39595J40970R5430j66579k9313
3303C430883j25295r1460N6994j61270J25562n0411R4744O5203k65114l896P8238
3292C154178k18570j16063R2117K14286n0017K277j16782k23478J8876L01949
3282C058773J2976J79427k30356o7721K91187l24636k31545P0812J1531o0880
3272B709568J24160l55164r2817j42125k4901P3869J00904K93430o4878K2279
$$ plain form
3345 4438761 4454011 4377586 4563042 4408666 4372847 4417525 4305394 4226499 4151988 4080212 4256087
3334 4256087 4240470 4051273 4112070 4063115 3919556 4042647 4102383 3935936 3906146 3709991
3324 3709991 3698066 3756914 3721100 4020813 3801438 3782965 3476819 3479489 3819954 3509115 3634828
3313 3634828 3656358 3507516 3257536 3392512 3529970 3390375 3531345 3626775 3460196 3430883
3303 3430883 3305588 3214128 3271122 3109852 3235414 3185003 3279747 3344950 3079836 3075940 3154178
3292 3154178 2935608 2819545 2911662 3125948 3075931 3078208 2961426 2737948 2756824 3058773
3282 3058773 3071749 3251176 3020820 2953099 3244286 2919650 2688105 2758917 2770448 2709568
3272 2709568 2833728 2478564 2385747 2243622 2218721 2292590 2393494 2686924 2622046 2644325
3262B644325l7062o0749J7171J20647J3660p7042K6164k41515J12058j16436J83056
3251B584277J07314q4090R975J90714r1436o6673J37432j01599q1511j21829R2595
3240B575169M1798R7342l11617j28434J55235K3892o6643K51426O1977m7546q1366
3229B571233j82751J10947j07231N3058N1658R4958J31906j95311k25321J76401
3219B479547J47768p8427m1251K0734k45858P6206J04216j62505j3855J32533
3209B419108M40371j05606l72392R2848N9880k43717Q224J3210J67271l46152
3199B133045k07982M54783K12293J49796P8382p248J50265j5747Q6908J8090N5705
3188C108290p8624j43034J6527l3058l2326j39242J93724J18085n4671J74061
$$ plain form
3262 2644325 2607263 2546514 2563685 2684332 2697992 2620950 2647114 2405599 2517657 2401221 2584277
3251 2584277 2691591 2607501 2617476 2808190 2716754 2650081 2787513 2685914 2604403 2482574 2575169
3240 2575169 2616967 2714309 2402692 2274258 2429493 2453385 2386742 2638168 2700145 2652599 2571233
3229 2571233 2388482 2499429 2392198 2445256 2496914 2591872 2723778 2528467 2303146 2479547
3219 2479547 2627315 2548888 2507637 2528371 2282513 2358719 2462935 2300430 2286575 2419108
3209 2419108 2859479 2753873 2381481 2474329 2534209 2290492 2298716 2311926 2479197 2133045
3199 2133045 1925063 2379846 2592139 2741935 2820317 2813069 2963334 2947587 3034495 3052585 3108290
3188 3108290 3029666 2886632 2903159 2870101 2837775 2698533 2892257 3010342 2955671 3129732
3178C129732j40251j8370J52642J17100J23159p7135L16664j4876r9801P4950
3168C563814j12012j1158n9993J06442k73806j5092K27469J26821J38396K40324
3158C931205N6336j16398K533J19843P6253K82574J89191j87189J46860J1399
3148D512607J46077K9330R7979L63533J71811J09590K67902J90065O00775k22840
3138F266829m00990K02596K51844L49306p4426N3820J01359Q0938K16963L57537
3128G405776k1161k4519J20071j55823O7844O4616r6276J618K11136j0302K2541
3117G585521N9640J9867L35699R9093J03051K13367N7773L06765J74009K08269
3107I163054L3604L76250M42444p9801K9964N68032L84209J10602j6254j12078
$$ plain form
3178 3129732 2989481 2971111 3123753 3240853 3364012 3286877 3603541 3588665 3488864 3563814
3168 3563814 3451802 3440644 3380651 3487093 3213287 3198195 3425664 3552485 3690881 3931205
3158 3931205 3987541 3871143 3873676 3993519 4069772 4352346 4541537 4354348 4501208 4512607
3148 4512607 4658684 4688014 4785993 5149526 5321337 5430927 5698829 5888894 6489669 6266829
3138 6266829 5865839 6068435 6320279 6669585 6595159 6648979 6750338 6831276 7048239 7405776
3128 7405776 7384615 7360096 7480167 7324344 7392188 7456804 7360528 7362146 7573282 7562980 7585521
3117 7585521 7645161 7665028 8000727 8099820 8202871 8416238 8474011 8780776 8954785 9163054
3107 9163054 9196658 9572908 10015352 9935551 9965515 10533547 10917756 11028358 11012104 10900026
3097A0900026o55483o15145l24776n05473j25117k55627n66862n66021k71201
3088G014321k60782J26964J608n7914k5655K12030M3680l05852p1796Q9408j51004
3077F615008M7286R2857L0625N9304j10459j7530M2617o575m1137j55696m01905
3066F154395j16857k04558o0303q8111k00619l5912l8133m05413J15m83836l37350
3055D183418K11495k11019J00756K17337j44458m03493q1611L1494O6490l17130
3045C653279l77769l08182j79329L91361J6043j61487J66260l0268o9589j75279
3035B925040J56625m5383k02776k63893n6205K2848l13654j1137J61550O0800
3025B433815k71986K0320J21189j44180j39435n7309k25545N1973R5417J15557
$$ plain form
3097 10900026 10244543 9629398 9304622 8799149 8674032 8418405 7851543 7285522 7014321
3088 7014321 6753539 6880503 6882111 6824197 6798542 7010572 7054252 6748400 6676604 6766012 6615008
3077 6615008 6662294 6755151 6785776 6845080 6734621 6717091 6759708 6753133 6711996 6556300 6154395
3066 6154395 6037538 5832980 5772677 5684566 5483947 5448035 5409902 5004489 5004604 4520768 4183418
3055 4183418 4394913 4183894 4284650 4501987 4357529 3954036 3872425 3903919 3970409 3653279
3045 3653279 3275510 2967328 2787999 3179360 3195403 3033916 3200176 3169908 3100319 2925040
3035 2925040 3081665 3036282 2833506 2569613 2513408 2536256 2222602 2211465 2373015 2433815
3025 2433815 2161829 2182149 2303338 2159158 2019723 1962414 1736869 1788842 1884259 1999816
3015A999816J60083j2065j84002j84982Q6777K13029J84n0491k2238j87520L0536
3004A849127m01847R666J66394l8296k6521P7922j22927q5610k708O3079j13186
2993A375093J21304l991l48421j8656l2548N0623R9883K14986P5158q1148k8122
2982A424161j78959j4110K28626r7043k92630O7253J82321n0415j68355k9813
2972A071036k10714K0313K19698J96754N5030j95973j72260O0581P0874J67141
2962A282480M6438l73980L4930j45964j10122J15881J48376o3904j27677j07325
2952F99133J70310K74140o390o0661o5346n31K1720k0013p6079j06181J09362
2941I39464N1014K86470k54206j11367J53174j13284j52900p734J2771M1965Q8468
$$ plain form
3015 1999816 2159899 2147834 1963832 1778850 1865627 2078656 2078840 2028349 2006111 1818591 1849127
3004 1849127 1447280 1456946 1623340 1585044 1558523 1636445 1513518 1427908 1425200 1488279 1375093
2993 1375093 1496397 1492406 1143985 1125329 1092781 1143404 1243287 1458273 1533431 1452283 1424161
2982 1424161 1245202 1231092 1459718 1362675 1070045 1137298 1319619 1269204 1100849 1071036
2972 1071036 860322 880635 1100333 1297087 1352117 1156144 983884 1044465 1115339 1282480
2962 1282480 1328918 954938 989868 843904 733782 849663 998039 934135 806458 699133
2952 699133 869443 1143583 1137193 1076532 1011186 1010655 1032375 1012362 936283 830102 939464
2941 939464 990478 1276948 1022742 911375 1064549 951265 798365 790631 803402 845367 933835
2930I33835J1278K04645M1019l34982J06006J21108k8049O6218m263n04733Q3291
2919F95373J33532P480j620k04567P4360p5263Q1358J54016k1284l33120J42338
2908F52603P1743k1915k9719K07892j12618j46101r5833j4971j91767P9651O0559
2897D59524R6881o4133L2992n3357K29135K2859j14620K59869J0099k5599n9752
2886G93898j22453o354l9817j00308l1158k85718J88547K38111N5351J44139k9179
2875H05059L2249r6717n8499j07191j36522K82371n8890j39516j04417K13861
2865F31788j28387K45313j0430j11476o1457j0440n7731k8564p4750p1029J94834
2854E17671J11471l4346j18694J56064J26445k48465J31247K62904l45684O1927
$$ plain form
2930 933835 945113 1149758 1190777 855795 961801 1082909 1054860 1121078 1116815 612082 695373
2919 695373 828905 836385 834765 630198 704558 629295 710653 864669 843385 510265 652603
2908 652603 724346 702431 672712 880604 767986 621885 526052 511081 319314 398965 459524
2897 459524 556405 492272 525264 471907 701042 723901 609281 869150 879249 853650 793898
2886 793898 671445 665091 625274 524966 493808 208090 396637 634748 690099 834238 805059
2875 805059 837308 740591 682092 574901 438379 720750 661860 522344 417927 631788
2865 631788 503401 748714 738284 626808 565351 554911 497180 468616 393866 322837 517671
2854 517671 629142 594796 476102 632166 758611 510146 641393 904297 558613 620540
2844F20540O950p2957m8967K4441l3688J42922J13425j23525J44910M6593j09507
2833G11137q6122k40156j35841N4610j81638O7641K34850l775j53768L5125M8642
2822C50705l6379K10941o0058j56044q8871O0424L37524R8568n7606K10402k02609
2811F66997j75576J0260j58905N3610J58049J7790l6390J53597l2697j31574M562
2800E29723N2059q6194p6296N9284J35571r807j12504m6210J05593P2593p0628
2789E53184m6430J7009P9528J4346r5345j31563J72204L9958R833o8301k78379
2778B66044J8616k06499n8256J49724K82487O0987j80248J30283J28819L0674
2768F22631q9599J42221n4957q9386N4486q2852L3293K3259O8632k73825r5758
$$ plain form
2844 620540 627490 554533 505566 530007 496319 639241 752666 629141 774051 820644 711137
2833 711137 625015 384859 249018 303628 121990 189631 424481 420706 266938 302063 350705
2822 350705 314326 525267 465209 309165 220294 280718 618242 716810 659204 869606 666997
2811 666997 491421 501681 342776 396386 554435 572225 535835 689432 656735 525161 529723
2800 529723 581782 495588 419292 478576 614147 604340 491836 445626 551219 623812 553184
2789 553184 506754 523763 603291 617637 522292 390729 562933 602891 612724 544423 266044
2778 266044 284660 78161 19905 169629 452116 513103 332855 463138 591957 622631
2768 622631 533032 675253 620296 530910 585396 502544 535837 559096 627728 353903 258145
2757B58145J95259Q7471j30452q2622J66026j91545J6975J8226l6902J07446o0670
2746C47357j93054L64670J36108L9558j52229j07227Q1538j02840J0277j16874
2736C07284Q596J41702J26643j1812k85029k44154J57976L5879N309q9659j16024
2725C6711J06430J17667K15585J40428j88541p5295j70528r2663J77772L46706
2715F14272J4823j85086k56696o8216L70702p8717j8405k12338M4175K8011K87665
2704E40190k19755R4846o6801l9353R1665j18504L2064j42726R9466q1770l21
2693A89001m405J53901m9927j25717J56716J33160k34379j19806P6940J98140
2683C73624O7489m0682K6952O4106j28657J1154j39008r5481J52924J17969k23966
$$ plain form
2757 258145 453404 540875 410423 327801 493827 302282 319257 337483 300581 408027 347357
2746 347357 154303 518973 655081 694639 542410 435183 516721 413881 424158 307284
2736 307284 315880 457582 584225 572413 287384 43230 201206 237085 242394 152735 36711
2725 36711 143141 260808 476393 616821 428280 352985 182457 89794 267566 614272
2715 614272 629095 444009 187313 119097 489799 411082 392677 180339 224514 252525 540190
2704 540190 320435 415281 348480 309127 400792 282288 314352 171626 271092 189322 189001
2693 189001 184596 338497 288570 162853 319569 452729 218350 98544 175484 373624
2683 373624 441113 400431 427383 491489 362832 373986 234978 139497 292421 410390 186424
2672A86424m3396K4226j12312K25861J1667k86106M13320N5334j92763l72531
2662i0276o4184N07116K47956k22041j45365r240r5301L09018k3073j62845q3954
2651A67811J81380N36753j17572n22451L3497K95652J49750k67578j86995J78820
2641D49067P4884j35464j30449L0393j874L0544Q074J19642J16546j89986j0827
2630C60550Q3118k45165O5767J38353L0653Q1538J6489J01794k81657q7204J01128
2619C65364j35229K46205j56358k35812l2170P4276n5291K23926o151O1073K27367
2608E77200P8779k16549k0963k68301j19058Q3385R0936J80538n3231j63065p1943
2597I7728K46223k24614J28496K51680K9881l5896J97537k03315n7370R6602m7220
$$ plain form
2672 186424 143028 167254 54942 280803 292470 6364 419684 475018 282255 -90276
2662 -90276 -154460 352656 600612 378571 233206 223966 128665 437683 414610 251765 167811
2651 167811 349191 885944 768372 245921 279418 575070 724820 457242 270247 449067
2641 449067 523951 388487 258038 288431 286557 317101 325175 444817 561363 371377 360550
2630 360550 443668 198503 264270 402623 433276 514814 531303 633097 351440 264236 365364
2619 365364 230135 476340 319982 84170 52000 126276 70985 294911 288760 349833 577200
2608 577200 655979 439430 418467 150166 31108 114493 205429 385967 332736 169671 97728
2597 97728 343951 119337 247833 499513 529394 493498 691035 487720 430350 526952 479732
2586D79732l57551M9424J29789j3981J13621r4073Q5912J67642O6834j69912j39253
2575C18184J08116p7167j27518K89785n4548O5793K87373l35082l8857J03684
2565E39763j87904J49402O4368k41200R604M3879K11259O661l12067Q2765J7998
2554C84528j22395o757o4553K14674n2629M6374k29801K66715m5068J4030K52059
2543F57177l8610o2354l01945k34474J31438K36325M26J1490J16803M2903j49645
2532D09534P9379L2178P7904j37988p5183J76393q6660R322n3714m9650j38386
2521B43129J4767J9270n4988M6425J59701L5009J81563n7867k1074j57299j65789
2510B42847J09673K48384K16663j98519J54974N0158k77842k64346O8930j29601
$$ plain form
2586 479732 122181 171605 301394 287413 401034 306961 392873 560515 627349 457437 318184
2575 318184 426300 349133 221615 511400 456852 522645 810018 474936 436079 539763
2565 539763 351859 501261 565629 324429 334033 377912 589171 595832 283765 366530 384528
2554 384528 262133 255376 190823 405497 352868 399242 169441 436156 391088 405118 657177
2543 657177 618567 556213 254268 19794 151232 387557 387983 399473 516276 559179 409534
2532 409534 488913 521091 598995 461007 385824 562217 475557 484879 431165 381515 243129
2521 243129 257896 277166 222178 268603 428304 463313 644876 587009 565935 408636 242847
2510 242847 352520 600904 817567 619048 774022 824180 546338 281992 350922 221321
2500B21321K13312J67890O7941j21658J4832K12898o6102N310N2867J5825k5981
2489G58455p6989k88513q8983K45516j98180Q9888N8356l6785N5017k5548j9541
2478D72693o9584m4941K22777J40249L465j46994j82927J41625Q3701n9645Q9120
2467F49539L9271j64308J34700j9153l2725n730j33058j25362L6114r9903r3135
2456A86250N21182J31884j18930Q3324k632q0449n7106j84898J29681N6318j12078
2445E52546r3218Q6185R0618n1468K21900O4164k65811j03463M075L6260q2906
2434D58882j7508n1810K39167j7859J2798q0415j74607k4283J72503K44078Q1550
2423H42496k9186q5635m2287R2512O4578K01008R0013j83685j72115j45200J91787
$$ plain form
2500 221321 434633 602523 670464 548806 563638 776536 710434 715744 768611 784436 758455
2489 758455 681466 392953 303970 549486 351306 441194 499550 462765 517782 492234 472693
2478 472693 403109 358168 580945 721194 724659 577665 394738 536363 620064 560419 649539
2467 649539 688810 524502 659202 640049 607324 601594 468536 343174 379288 279385 186250
2456 186250 707432 839316 720386 803710 801078 720629 663523 478625 608306 664624 552546
2445 552546 459328 545513 636131 584663 806563 870727 604916 501453 505528 541788 458882
2434 458882 441374 389564 628731 610872 623670 543255 368648 344365 516868 760946 842496
2423 842496 813310 727675 685388 777900 842478 1043486 1133499 949814 777699 632499 824286
2412H24286L3853O6586m3040l1297j7875N932J16087p8668k14151N8473K45441
2401I65627P5176k61724l17628O1126K44459J62589L1954L03067r9425k60282
2391I04939n0017J00663J65950Q2967J25157J03032m9766j93175K49867P7707
2381A517324J44649k6689p5810K15196L9094p9769K62049J7459j82866L4894Q9263
2370A954794J0344n8509k501K17275m3563k170p6673O9986p6008j42775q1248
2359A768952R8202K18139J33103J30349J47572J32576L6924n05J27632k6588J85058
2348B951414J01664M1229K51318k845K16358N03700L46123P2837K54124K40787
2338D976709J95354M31174J12081P2857J81894k063j9941K25811K59686k6867
$$ plain form
2412 824286 858139 924725 881685 850388 832513 838445 954532 875864 661713 720186 965627
2401 965627 1040803 779079 461451 522577 767036 929625 961579 1264646 1165221 904939
2391 904939 854922 955585 1121535 1204502 1329659 1432691 1382925 1189750 1439617 1517324
2381 1517324 1661973 1635284 1559474 1774670 1813764 1733995 1996044 2013503 1830637 1865531 1954794
2370 1954794 1965138 1906629 1904128 2121403 2077840 2075670 1998997 2068983 1992975 1850200 1768952
2359 1768952 1867154 2085293 2218396 2348745 2496317 2628893 2665817 2665312 2792944 2766356 2951414
2348 2951414 3053078 3094307 3345625 3342780 3559138 4062838 4408961 4481798 4735922 4976709
2338 4976709 5172063 5603237 5715318 5788175 5970069 5968006 5948065 6173876 6433562 6406695
2328F406695R0709K66733J15519K65097K00112M13062L37104L52956J90631M83739
2318I122357N74104N43809P52996R66644P18565Q61655R61407J099911J767508
2309A7368956K200435K963673L134428L037620L308594L916475M120444L926046
2301D3976671K476005J090321j741408n011254p166929o380521m812311l582716
2293A8847858k271751j626550j413104j368345j021666r28439p45288q19225n49818
2284H103672n05938o02107l02408o02196m13110m10488l51953o7326m16814l17890
2274D113442k68271k83685J10337k27145q7914J91772k02829k84833l70895K30087
2264B920066m0103l86990j45400j11609p4161k7130m5019M7970J26547k10029
$$ plain form
2328 6406695 6497404 6764137 6879656 7144753 7344865 7757927 8095031 8447987 8638618 9122357
2318 9122357 9696461 10240270 10993266 11959910 12678475 13540130 14501537 15601448 17368956
2309 17368956 19569391 22533064 25667492 28705112 32013706 35930181 40050625 43976671
2301 43976671 46452676 47542997 45801589 40790335 33623406 27242885 22430574 18847858
2293 18847858 16576107 14949557 13536453 12168108 11146442 10218003 9472715 8653490 8103672
2284 8103672 7597734 6995627 6693219 6091023 5677913 5267425 4915472 4848146 4431332 4113442
2274 4113442 3845171 3561486 3671823 3444678 3356764 3548536 3345707 3060874 2689979 2920066
2264 2920066 2879963 2492973 2347573 2235964 2161803 2134673 2089654 2137624 2264171 2054142
2254B054142r1787k27483p2683j06606l9784J91172J47662j43026k14106l04066
2244A193435r1011J7211j2080J70171J14236J08957k23252k29021L78887p5874
2234A351659k01147L1641j54694o0833K74192l3760j0386p6566N4504j3224j00330
2223A061056j21959m2526N0812J8305k1252j3035m6811q0661J13227P8364o8527
2212I26993q7480l2110l5205n8496P4060j8110o9517J58118J81445l32628k32222
2201D74848K26756j85127J88187J68782M4470k7486K1955j15915K14290J4369
2191A025129m30720p2118P2175n9151J19774p1554o0944n6155k0625K06813m5886
2180F06738M0359L4650M802Q0534r260L10122j67443l09386J48930j51481k42780
$$ plain form
2254 2054142 1962355 1734872 1662189 1555583 1515799 1706971 1854633 1711607 1497501 1193435
2244 1193435 1102424 1119635 1107555 1277726 1391962 1500919 1277667 1048646 1427533 1351659
2234 1351659 1150512 1182153 1027459 966626 1240818 1207058 1196672 1120106 1174610 1161386 1061056
2223 1061056 939097 896571 947383 965688 944436 931401 884590 803929 917156 995520 926993
2212 926993 839513 807403 772198 713702 787762 769652 700135 858253 1039698 707070 474848
2201 474848 701604 516477 704664 873446 917916 890430 912385 796470 1010760 1025129
2191 1025129 594409 522291 594466 535315 655089 583535 522591 466436 445811 652624 606738
2180 606738 647097 681747 686549 767083 757823 1067945 900502 591116 740046 588565 345785
2169C45785L9336k09432K15288L76437j38431L59271l04975j14619J11931o0545
2159F20046J68717N8100j28986l02904K19312k92259l5598j33689O4802L53135
2149E90676m7710j12321r3027j22036j20747j23456P4687R1237K4805P5385k3351
2138B14142K2452R8451n1647J60303K6936k47157k70849L93744J96649j75932
2128C67092J8150Q7042J67804k86112l62625j5060k03985K11305K71044L7431
2118B92086k82055J073J84656J48653k1851o3466J49421K07492j4936j94575O7442
2107D73940P9441k05968j05827J348q7449R6438o6688o0159m9841K6300j08440
2096f905L45697j03170J73268k18279J27209j12574j29780K8644l6556R9756J4734
$$ plain form
2169 345785 385121 175689 390977 767414 628983 988254 683279 568660 680591 620046
2159 620046 788763 846863 717877 414973 634285 342026 306428 172739 237541 590676
2149 590676 542966 430645 337618 215582 94835 -28621 46066 137303 162108 237493 214142
2138 214142 236594 335045 283398 443701 470637 223480 -47369 346375 543024 367092
2128 367092 385242 472284 640088 353976 -8649 -23709 -227694 -16389 254655 292086
2118 292086 10031 11104 195760 344413 322562 259096 408517 616009 601073 406498 473940
2107 473940 553381 347413 241586 242934 155485 251923 185235 125076 75235 101535 -6905
2096 -6905 338792 235622 408890 190611 317820 205246 75466 104110 67554 167310 182044
2085A82044j0638K22177n1756k87479j92195M1694O4375J22280j2566J23233J77059
2074C78228j70264j42134P0696J82590l7736l1148j98274R0971N9340K67157j10450
2063C58976J29490n4501k4200j59482l4710J34344N3258j66278m5967K70106k08256
2052B52780j52655m1820l0018N4430L06763q9236J0959N5314J39183j60484j57838
2041A87378P8465J23809k53920r1222M01241K78199j39752k4557P215L2000k15269
2030C83587k1423Q1294j7673o8465M1696K03802k67103P8681Q2751j42319j24503
2019B30325O7349r46k1231k26892J53704J76252q3763k60665J6084M2213J1503
2008A03933K48144L0966k50327k00993K63772P8013J28743M1800k58938j21211
$$ plain form
2085 182044 171406 393583 341827 54348 -137847 -96153 -31778 90502 77936 201169 378228
2074 378228 207964 65830 136526 319116 281380 250232 51958 142929 202269 469426 358976
2063 358976 488466 433965 409765 250283 215573 349917 403175 236897 190930 461036 252780
2052 252780 100125 58305 28287 82717 389480 300244 311203 366517 505700 345216 187378
2041 187378 265843 389652 135732 44510 445751 723950 584198 559641 566856 598856 383587
2030 383587 362164 443458 425785 357320 399016 602818 335715 414396 497147 354828 230325
2019 230325 297674 296728 275497 48605 202309 378561 294798 34133 50217 92430 103933
2008 103933 352077 383043 132716 -68277 195495 273508 402251 444051 185113 63902
1998F3902L8470J89039M7716j945J67224j51137k04137k1500j05634j28978J45984
1987C9004N5231m7207Q0888L5622N5957k43151K18174r2625j03898K20247m0625
1976A77617k87305R0104J57217O0281M3322Q874P3791q1209l58597R4025J44150
1965A22270K50193j8042k75180L6712K6395R2099l730k01972Q6976L14038j75710
1954B54049q3901Q2403Q9520q7444j00178l790J00151k42010m613N3666j2506
1943D5347j8439J1192q479K7997J37247o7046J02967K3073j52185m494j21482
1932b4302p9343J684N6055P8770Q9263m2874J1217K24912M1526j30240n2995k03984
1920c0311J9123o4718J8561M7895j69194J04500R3705p426J87482Q3054k70743
$$ plain form
1998 63902 102372 291411 339127 337182 504406 353269 149132 127632 21998 -106980 39004
1987 39004 94235 47028 127916 163538 219495 -23656 194518 101893 -2005 218242 177617
1976 177617 -109688 -19584 137633 197914 241236 250110 323901 242692 -115905 -21880 122270
1965 122270 372463 354421 79241 115953 142348 234447 230717 28745 115721 429759 254049
1954 254049 170148 252551 342071 254627 154449 150659 250810 8800 4187 57853 45347
1943 45347 26908 38100 29621 57618 194865 127819 230786 253859 101674 97180 -24302
1932 -24302 -103645 -101961 -45906 32864 122127 79253 90470 315382 356908 226668 173673 -30311
1920 -30311 -11188 -75906 -57345 -9450 -178644 -74144 19561 12135 199617 282671 11928
1909A1928O3505l85125j7316M24429J23298o8221j89694L2382M0987P1222k6318
1898H1077N6012J12011k18285q5486L7354R9070l781L0497J38189o7935k71515
1887i2792M3320J76748q7234R7915k5957k83007P2173J80625l0880Q6702k45526
1876a07913j22088J56197Q9269J68797m5360j06330K906K27166q544m9004j49271
1865E5825j20562q423M0798K78738p4416Q3613k76243L8374j17080J974l2712
1854a30114j61668K65240k2785j02125K25746J79326m9929P7751k4038j16046
1844A41358k32949J97532K84762j5534k15838j21273j79116R724N1079j59931
1834b40186j898J44059P0951N1669J660p7783J1894R8460J29219o2723r640j87673
$$ plain form
1909 11928 75433 -309692 -327008 97421 220719 152498 -37196 -4814 36173 107395 81077
1898 81077 137089 249100 30815 -54671 -17317 81753 77972 108469 246658 178723 -92792
1887 -92792 -49472 127276 40042 137957 112000 -171007 -98834 81791 50911 137613 -107913
1876 -107913 -230001 -73804 15465 184262 138902 32572 35478 262644 254100 205096 55825
1865 55825 -64737 -73160 -32362 246376 171960 255573 -20670 17704 -99376 -97402 -130114
1854 -130114 -291782 -26542 -49327 -151452 74294 253620 203691 281442 257404 141358
1844 141358 -91591 105941 390703 375169 159331 38058 -141058 -131334 -80255 -240186
1834 -240186 -242084 -98025 -27074 24595 26255 -51528 -39634 58826 188045 125322 115682 -71991
1822g1991Q226j7198J38489J79390L5824l19738l53207L80247J5414p1328O2558
1811a3314K06444j20175l0308m0488k89791J27817K49790j50220m715j37595j2760
1800b15315N8690q4307P9127J58214p6839j47606K01578L69688J33083k49480
1790B26833j81319j26613J93898k44994j6706L567P8391L6631j50574j32505J65983
1779a47408L62052j46003q7674N5693j2688K27507R1005k43838o6143J11025P9514
1768B23042j57700N7129j97956l1914K48580P2853k14202o3345j2468j07159J4934
1757a68206m0800K21413J95391j27657j26976P4808K24767K0688k63616k73874
1747b64062J43035J10060n4989j72609o2141K28158K60069K73641k20351l65365
$$ plain form
1822 -71991 -63765 -80963 57526 236916 272740 -46998 -400205 -19958 -4544 -75872 -13314
1811 -13314 193130 72955 42647 2159 -287632 -159815 89975 -60245 -64960 -202555 -215315
1800 -215315 -156625 -240932 -161805 -3591 -80430 -228036 -26458 343230 476313 226833
1790 226833 45514 -81099 112799 -132195 -148901 -145334 -66943 -30312 -180886 -313391 -147408
1779 -147408 214644 68641 -19033 36660 23972 251479 342484 98646 32503 143528 223042
1768 223042 65342 122471 -75485 -107399 141181 214034 -168 -63513 -75981 -183140 -168206
1757 -168206 -209006 12407 207798 80141 -46835 27973 252740 273428 9812 -264062
1747 -264062 -121027 -10967 -65956 -238565 -300706 -72548 187521 461162 240811 -124554
1737a24554J08740J70747j43640J74671P2801k46575j65064j66738K41672R6327
1727A8387j04809K43922k28629m0498k54319J4508J64496n0438N3524j73908J23989
1716b33775J00069J31602J23216m696n9479J56408q2488r6759j50209J19252K9599
1705C2740j39306J64505L6893Q3867j09821n0959r2026K1257J86862J9044j02523
1694E0533n7532n4037J3519N605J33640O5921M3296o5467l3993j53617j45277
1683a97409j03278J00737J7616q4217K33099O4570q5657m9929N1651j99711J61025
1672i1503M7551l275K99113j23958k04203J05956K15959k92527Q4487J65688k01166
1661B122N9604j67668K9679j37843J004J25722j08019J63770K02851j47888Q5391
$$ plain form
1737 -124554 -15814 154933 11293 185964 258765 12190 -152874 -319612 -77940 18387
1727 18387 -86422 157500 -71129 -111627 -365946 -351438 -186942 -237380 -183856 -357764 -233775
1716 -233775 -133706 -2104 121112 116416 56937 213345 130857 34098 -116111 3141 32740
1705 32740 -106566 57939 94832 178699 68878 17919 -74107 -52850 134012 153056 50533
1694 50533 -6999 -61036 -47517 -41912 91728 157649 200945 135478 101485 -52132 -197409
1683 -197409 -300687 -199950 -182334 -266551 -33452 31118 -54539 -104468 -52817 -252528 -91503
1672 -91503 -43952 -47227 251886 127928 -76275 29681 245640 -46887 37600 203288 2122
1661 2122 61726 -105942 -76263 -214106 -213102 -87380 -195399 -31629 171222 23334 108725
1650A08725m0910j22839j04420k358k6751n9038K01964K48316J34272j68000k51309
1639h2348J21790k81377J77386L47271j35325k8086q3579k24037j01230J30826
1629a58709O3546J27978k9741Q8147o1921p0454m5601J46822O2370j32294j34297
1618a44154o6714j27256L39093M0665J0656J75862m4720k14946M0964j05404j07811
1607b03765N8798J00550J33225n9831J26280j64781k4172j37966j77961O4738
1597b84885j25529J08235K27072J33948J90449N0836P9321k5996K662N0706m2079
1586C64740k14897n5160j7553p2356N2920K04379j64861K9741l27758l5193J17937
1575a18061J5863p8197Q3863P1648K2974j03408k02252J52824K56742N4753k30994
$$ plain form
1650 108725 67815 -55024 -159444 -161802 -188553 -247591 -45627 202689 336961 168961 -82348
1639 -82348 39442 -241935 -64549 282722 147397 119311 35732 -188305 -289535 -158709
1629 -158709 -95163 32815 3074 91221 29300 -41154 -86755 60067 122437 -9857 -144154
1618 -144154 -210868 -338124 969 41634 52290 228152 183432 -31514 9450 -95954 -203765
1607 -203765 -144967 -44417 88808 28977 155257 -9524 -33696 -171662 -349623 -284885
1597 -284885 -410414 -302179 -75107 58841 249290 300126 379447 353451 356113 406819 364740
1586 364740 149843 94683 77130 4774 57694 262073 97212 126953 -200805 -235998 -118061
1575 -118061 -102198 -180395 -96532 -24884 -1910 -105318 -307570 -154746 101996 156749 -74245
1564g4245M9543k3001P4986J9029J85135J9374P2466j556m2869k52789n9720j57699
1552a91346L9435J9887k84878M61862J61328j61864J82664o1951k24574J0888
1542d8549P4105L3858L5912j53845q8217J75796J24946L51n5071O5922l0826k32905
1530i8523K73391n6433k46605R2098J17169M2673q991j19306j25390N868k390
1519a26439n7712j41652K63369J76573m8460q8050r5623J09077p6339J82156l3659
1508F3241j68570J32359j4501k4577k75247J34167J35585K2210N9383j03568J25879
1497H6361p6593j99163j46449J78383R1690k93038K69143J3456K20305p323k00804
1486f4032l4119n4595P3567l39561o1544K02476N71521j04535j47827p8685j09494
$$ plain form
1564 -74245 -24702 -47703 27283 46312 231447 250821 323287 321731 278862 26073 -33647 -191346
1552 -191346 -151911 -132024 -416902 44960 206288 44424 227088 165137 -59437 -48549
1542 -48549 25556 59414 95326 -58519 -146736 29060 154006 154357 99286 165208 134382 -98523
1530 -98523 174868 118435 -128170 -36072 81097 123770 114779 -4527 -129917 -124049 -126439
1519 -126439 -184151 -325803 -62434 114139 65679 -22371 -117994 -8917 -85256 96900 63241
1508 63241 -105329 27030 12529 -12048 -287295 -153128 -17543 4667 64050 -39518 86361
1497 86361 9768 -189395 -335844 -157461 -65771 -358809 -89666 -76210 144095 136772 -64032
1486 -64032 -98151 -152746 -79179 -418740 -480284 -277808 293713 189178 41351 -37334 -146828
1475a46828L3097O4748k7380j63884R7758N0777P0320K7014n7671K24388K4532
1464A96871o2777o4241m4325j15178R9312O9720m4826q9635j81695K7996J2831
1453a95947P9016o3804q0071L50666J56872j63749j751K81413K62916l29867j87426
1442A08268j38714j40304j25646j04663J54304L30685M9229k25397k98516M50394
1432E9640K78057R414m09906J08275j03680J40279M6260j10373L1399k33326q1281
1421b65242J8313J36481K26571l8524m4531J44901j35279j98458j78939J11809
1411b22898P7198K29738j19324k8510R872J44864m3394J12845Q9920j68140n6253
1400B5918j91045n6935N2527N2340m0073p2883R2779L4986M6765K2181J34415
$$ plain form
1475 -146828 -113731 -48983 -76363 -240247 -142489 -91712 -21392 5622 -52049 172339 196871
1464 196871 134094 69853 25528 -89650 9662 79382 34556 -55079 -236774 -208778 -195947
1453 -195947 -116931 -180735 -260806 89860 246732 82983 81232 362645 625561 295694 108268
1442 108268 -30446 -170750 -296396 -401059 -246755 83930 133159 -92238 -390754 59640
1432 59640 337697 347111 -62795 45480 -58200 82079 128339 17966 49365 -183961 -265242
1421 -265242 -246929 -110448 116123 77599 33068 177969 42690 -155768 -334707 -222898
1411 -222898 -145700 84038 -35286 -63796 -53924 90940 47546 160391 250311 82171 25918
1400 25918 -165127 -222062 -169535 -117195 -157268 -230151 -137372 -102386 -55621 -33440 100975
1389A00975k59145J9040J25330n6252j76961J33860J1422k07706J59526l5925
1379a85836J36294J56885j57972J42053j12182k7987j13341o7227J63379J5768
1369e0166K84810j36348o5658p349P7167j90968j82433R9611J89740K200p8839
1358e8233J74999K10866k27880m03166n7184K9532L1777K84493r965q2550J62675
1347E5364j77888j86286J59873L08604K20018r9956L6286M8329m17693L4504J63711
1336A44866j03482j41854p2538K44469j110M0183o6058j1506m9728j29286K8529
1325a17515K63484k4348j37351j68811J91441j26630j30102L65548j04283J23243
1315A34676j95354L4232j2065j22203K98552j09987k51552J78883p0311J28766
$$ plain form
1389 100975 -158170 -139130 -13800 -70052 -247013 -113153 -101731 -309437 -149911 -185836
1379 -185836 -49542 107343 -50629 91424 -20758 -48745 -162086 -229313 -65934 -50166
1369 -50166 234644 98296 32638 25289 102456 -88512 -270945 -171334 18406 20606 -58233
1358 -58233 116766 327632 99752 -303414 -360598 -331066 -299289 -14796 -24761 -107311 55364
1347 55364 -122524 -308810 -148937 159667 379685 279729 316015 364344 -53349 -18845 144866
1336 144866 41384 -100470 -173008 71461 70351 110534 44476 32970 -16758 -146044 -117515
1325 -117515 145969 121621 -15730 -184541 6900 -119730 -249832 115716 11433 134676
1315 134676 -60678 -26446 -38511 -160714 137838 27851 -223701 -44818 -115129 13637
1305A3637J44931j97345j01662m4842n1755J63013Q7212k27553K2952L4628J37005
1294a9779q1345l2535Q6045m7882N6211k08333O9952R7071j04447K9110K41155
1283H5223J45848j2708k54561J27380k32577m7144J91902r9566o9306J61026o6981
1272g1464j12583J57495k52276P7283P7561K7503L1115k06267J42263k18121j45194
1261d92685L61667J62368j61144r8359J88778J58237n4141l1535j16205O5341
1251a7678J08706k05733k24940N8668L40657R1664j43561k86156P0627L23283
1241A15537l12377J9841J72192P577M8596m7123J49658j13576j20215j41079l7950
1230b58919J36516j7479o0999K36236K92348P1033j00016j18380k71847J01044
$$ plain form
1305 13637 158568 -38777 -140439 -185281 -237036 -74023 13189 -214364 -191412 -156784 -19779
1294 -19779 -101124 -133659 -47614 -95496 -39285 -247618 -177666 -80595 -185042 -155932 85223
1283 85223 231071 218363 -36198 91182 -141395 -188539 3363 -96203 -165509 -4483 -71464
1272 -71464 -184047 -26552 -278828 -201545 -123984 -96481 -65366 -271633 -129370 -347491 -492685
1261 -492685 -131018 31350 -129794 -228153 -39375 118862 64721 33186 -83019 -17678
1251 -17678 91028 -114705 -339645 -280977 59680 151344 7783 -278373 -207746 115537
1241 115537 -196840 -176999 -4807 2770 51366 4243 153901 40325 -79890 -220969 -258919
1230 -258919 -122403 -139882 -200881 35355 327703 398736 298720 180340 -91507 9537
1220I537m5815q6726n9087J47134L0741k2386Kk21492j2113J8727J99528j36586
1208a78536l3089K07230q9526N4050r6588k28547P6168L02197J7144N1532k69375
1197a87340J78710q1063n3335m2366K79693J93120k78307j19899m5219N181J9518
1186a31307J85023l073o0385j83952Q1784o9116K6149K8803P8071J92107j63047
1175a8943j78619O5396J24096L6087M8091j36690J49968k4977k14480P4071J552
1164g4448k9671J48036l1001K061N0333m12602J57863K3394K06805J42030Q1602
1153B64402k6723o7177K9266k29442m8837J5305p6978P0963J87863J65013n8967
1142B24688j69923k5033k8751j45127j00053O5781J33040l19325m5341L43620
$$ plain form
1220 9537 -36278 -123004 -182091 -34957 -4216 -26602 -26600 -248092 -260205 -241478 -41950 -178536
1208 -178536 -211625 -4395 -93921 -39871 -136459 -365006 -288838 13359 30503 82035 -187340
1197 -187340 -8630 -89693 -143028 -185394 94299 287419 9112 -110787 -156006 -150825 -131307
1186 -131307 53716 50643 -9742 -193694 -111910 -181026 -154877 -126074 -48003 144104 -18943
1175 -18943 -197562 -132166 -8070 28017 76108 -60582 89386 64409 -150071 -76000 -74448
1164 -74448 -104119 43917 12916 14977 65310 -347292 -189429 -166035 40770 182800 264402
1153 264402 237679 170502 199768 -29674 -78511 -63206 -140184 -69221 118642 283655 224688
1142 224688 54765 29732 981 -144146 -244199 -178418 -45378 -364703 -410044 -66424
1132f6424J49837l0681k8855O3336j43409j13063J94650R4199J62617r4431k39326
1121e1550j66414N0961J1119P2464K84303k32865j62353M9935K08457k5729j16574
1110g8246J47086J51077l0037j33851N6427j58941J41313k48325k7350R1009j63853
1099b53691J89489k17134j9010r0878O5758J60246Q0826m6084K0999p644K66J27429
1087A0572j09377p5540l1835K85378K04458j71484k29611L1437J3278j08085k9451
1076b10260J86291J35047j72098N1307l25661K75499n133k3212j7600J04245q665
1065a0240j62595J61363J72908l49930J8106L56666m19946k01253P598J20088
1055c07235K53517K32318L3438j31769K7404K075k46705J03618j12306K44066
$$ plain form
1132 -66424 83413 52732 23877 87213 -56196 -169259 25391 119590 282207 187776 -51550
1121 -51550 -217964 -167003 -155884 -83420 200883 -31982 -194335 -144400 64057 38328 -78246
1110 -78246 68840 219917 189880 56029 112456 -46485 94828 -153497 -180847 -89838 -253691
1099 -253691 -64202 -281336 -300346 -391224 -325466 -165220 -84394 -130478 -109479 -117123 -116857 10572
1087 10572 -98805 -174345 -206180 79198 283656 112172 -117439 -86002 -72724 -180809 -210260
1076 -210260 -23969 111078 -61020 -9713 -335374 -59875 -65008 -88220 -105820 -1575 -10240
1065 -10240 -172835 -11472 161436 -188494 -170388 186278 -233668 -434921 -427323 -307235
1055 -307235 -53718 178600 212038 80269 107673 109748 -136957 -33339 -145645 98421
1045I8421l275J26556o0647j59061O8106j44305r6472k3643l0050M800P7186L01315
1033A58931K7801j58446r2494R696J67993j3509k9032j07188k18628J19993k6327
1022a61210J4790M9603j24772k57609j8654L83476q6742J49732K75845n0972j89450
1011a5963j21638K30238J20806P8326j80970r3425J0204k8617N4124J5301Q3199
1000A51585j20331j62174n6599P4382j39287R4308K4110K50079l3940l97188J48378
989a66677J19917j5310l0594j71854J53372K08534k46591j07238n9938K7539K28222
978f0618R0310q8409P4198J46363o5501Q5466O5427j05777N00k0788r7111J4364
966C8424q1958j56996Q3889J88973k19693K8664j55359L28773O9000Q170J67838
$$ plain form
1045 98421 95146 221702 161055 1994 70100 -74205 -170677 -194320 -224370 -219570 -142384 158931
1033 158931 186732 28286 -64208 -54512 113481 99972 70940 -36248 -254876 -134883 -161210
1022 -161210 -146420 -96817 -221589 -479198 -497852 -114376 -201118 -51386 224459 173487 -15963
1011 -15963 -137601 92637 213443 291769 110799 17374 27578 -1039 53085 68386 151585
1000 151585 31254 -130920 -187519 -113137 -252424 -158116 -134006 116073 82133 -315055 -166677
989 -166677 -46760 -62070 -92664 -264518 -111146 97388 -149203 -256441 -316379 -288840 -60618
978 -60618 29692 -58717 15481 161844 96343 181809 247236 141459 141959 121171 24060 38424
966 38424 -43534 -200530 -116641 72332 -147361 -118697 -274056 54717 123717 131887 299725
955B99725j74511j2823k04328j265L7888j53196K09015O9426k41350O7671J8831
944h4917J4881J85410O0043j9595j44714j25921L5489L6490L0908n9329J36257
933F5002q6840P0232M9957j54213q7352R2067K160j7174P6426j78677p1045p4406
921c13863K20156K54473j26123N476M2537l336j58902j22451N2502O6976K13062
910A30507P484l20339j34322J51143n265l9468j7810J29263J34350J46515l1075
899A50983k01290K11038M2294k74796o4436J9036j90581L8714K80968j20974l7537
888a46581p0696R8139J1333k7130n1757p6563J83190P047J46289q1204p6664K30375
876A45778k24989l6925O9624n998p0934n9393l1430R5262J45657j50289J26802
$$ plain form
955 299725 125214 112391 -91937 -93202 -55314 -208510 505 69931 -171419 -103748 -84917
944 -84917 -70036 115374 175417 155822 11108 -114813 -79324 -42834 -11926 -71255 65002
933 65002 -21838 48394 98351 -55862 -143214 -51147 -48987 -66161 10265 -168412 -239457 -313863
921 -313863 -93707 160766 34643 40119 82656 79320 -79582 -202033 -149531 -82555 130507
910 130507 137991 -182348 -316670 -165527 -170792 -210260 -228070 -98807 35543 182058 150983
899 150983 -50307 160731 203025 -71771 -136207 -117171 -307752 -269038 11930 -109044 -146581
888 -146581 -217277 -119138 -107805 -134935 -186692 -263255 -80065 -73018 73271 -7933 -84597 145778
876 145778 -79211 -116136 -46512 -52510 -123444 -182837 -214267 -119005 26652 -123637 3165
865C165n9241j95010M3951K29308q3762J21080j71306j22331J54541J27466L0242
854G8103R3036j62838J80623P7465j24114J95305l64389n2825L73883K1355M2488
843C58092n2354O0223k53932j22712M895M4068j39476N4880J9168k023R0409J61776
831B23014m6327k90295p7452j3623J43299l04821q6642K79988K48532K39685k88160
820B7198j46578J70839P5366q9726O1537J78178j55131j64063P1499N9642r3009
809d248M9575j68689l0808k05737K05848K38547m1838K87575j15567k38843O1743
798C7558J93107l3568j05649M6822j20573j9369o7202J74498m2164Q7206m346
787A46320j30976K9862j33043q2778k00138J77305j30903o7912K35454j6384N4190
$$ plain form
865 3165 -56076 -251086 -207135 22173 -61589 59491 -111815 -234146 -79605 47861 78103
854 78103 171139 8301 188924 266389 142275 337580 -26809 -79634 294249 315604 358092
843 358092 305738 365961 112029 -10683 -5788 38280 -101196 -46316 -27148 -29171 61238 223014
831 223014 176687 -113608 -191060 -204683 -61384 -366205 -452847 -172859 75673 315358 27198
820 27198 -119380 51459 126825 37099 98636 276814 121683 -42380 29119 88761 -4248
809 -4248 45327 -123362 -154170 -359907 -154059 84488 42650 330225 214658 -24185 37558
798 37558 230665 197097 91448 138270 17697 -1672 -68874 105624 63460 150666 146320
787 146320 15344 45206 -87837 -170615 -370753 -193448 -324351 -392263 -156809 -173193 -119003
$$ [...]
##END NTUPLES=NMR SPECTRUM
##END=
