##TITLE=1H_TG-2390-1
 200.13MHz, CDCl3,
 8 sc
 
 5.9.2025
##JCAMPDX= 6.0         $$ Bruker NMR JCAMP-DX V2.0
##DATA TYPE= NMR SPECTRUM
##DATA CLASS= NTUPLES
##ORIGIN= UXNMR, Bruker Analytische Messtechnik GmbH
##OWNER= pz
$$ XWIN-NMR		Version 3.5
$$ Fri Sep  5 13:49:32 2025 Russian Standard Time (UT+4h)  she@DPX200
##.OBSERVE FREQUENCY= 200.1313
##.OBSERVE NUCLEUS= ^1H
##.ACQUISITION MODE= SIMULTANEOUS
##.ACQUISITION SCHEME= undefined
##.AVERAGES= 8
##.DIGITISER RES= 18
##SPECTROMETER/DATA SYSTEM= spect
##.PULSE SEQUENCE= zg30
##.SOLVENT NAME= CDCl3
##.SHIFT REFERENCE= (INTERNAL, CDCl3, 0, 15.5342)
##AUDIT TRAIL= $$ (NUMBER, WHEN, WHO, WHERE, WHAT)
$$ ##TITLE= Audit trail, XWIN-NMR		Version 3.5
$$ ##JCAMPDX= 5.01
$$ ##ORIGIN= Bruker BioSpin GmbH
$$ ##OWNER= she
$$ F:/spectra/data/she/nmr/H-C/1/pdata/1/auditp.txt
$$ ##AUDIT TRAIL=  $$ (NUMBER, WHEN, WHO, WHERE, WHAT)
(   1,<2025-09-05 13:47:26.28 +0400>,<she>,<DPX200>,
      <created by zg, POWCHK disabled, PULCHK disabled
       configuration hash MD5:
       00 E9 B6 7A A2 85 ED C7 34 08 36 98 17 FE 4E 26
       data hash MD5: 16K
       F4 FF 82 95 AC 92 F5 E0 C2 59 EB C8 52 65 D8 FD>)
(   2,<2025-09-05 13:47:57.82 +0400>,<she>,<DPX200>,
      <Start of raw data processing
       efp BC_mod = 2 LB = 0.25 FT_mod = 6 PKNL = 1 PHC0 = -1565.67 PHC1 = 19.39228 SI = 16K 
       data hash MD5: 16K
       6E C7 E4 1C 5D 7E 9E 1B 31 C2 B8 1A 66 B9 4C 92>)
(   3,<2025-09-05 13:48:39.37 +0400>,<she>,<DPX200>,
      <pk PHC0 = 6.375945 PHC1 = -8.399999 
       data hash MD5: 16K
       DD 3F 01 E5 38 D3 3C 40 F5 E1 A1 36 4E B2 E6 BB>)
(   4,<2025-09-05 13:48:43.53 +0400>,<she>,<DPX200>,
      <abs ABSG = 5 
       data hash MD5: 16K
       E4 77 85 2A AD 6C F2 63 0F 36 97 51 65 DC B5 8F>)
$$ ##END=
$$ 
$$ hash MD5
$$ E6 82 DF 4E AA 99 25 A6 D8 3F 21 B4 F6 78 64 52
##$RELAX= 
##$RELAX= 
##$RELAX= 
##$RELAX= 
##$RELAX= 
##$RELAX= 
$$ Bruker specific parameters
$$ --------------------------
##$DU= <F:/spectra>
##$EXPNO= 1
##$NAME= <H-C>
##$PROCNO= 1
##$TYPE= <nmr>
##$USER= <she>
##$AMP= (0..31)
100 100 100 100 100 100 100 100 100 100 100 100 100 100 100 100 100 100 
100 100 100 100 100 100 100 100 100 100 100 100 100 100 
##$AQSEQ= 0
##$AQ_mod= 1
##$AUNM= <au_zg>
##$AUTOPOS= <>
##$BF1= 200.13
##$BF2= 200.13
##$BF3= 200.13
##$BF4= 200.13
##$BF5= 200.13
##$BF6= 200.13
##$BF7= 200.13
##$BF8= 200.13
##$BYTORDA= 1
##$CFDGTYP= 0
##$CFRGTYP= 5
##$CHEMSTR= <none>
##$CNST= (0..31)
1 1 145 1 1 1 1 1 1 1 1 1 1 1 1 1 1 1 1 1 1 1 1 1 1 1 1 1 1 1 1 1 
##$CPDPRG= <>
##$CPDPRG1= <>
##$CPDPRG2= <>
##$CPDPRG3= <>
##$CPDPRG4= <mlev>
##$CPDPRG5= <mlev>
##$CPDPRG6= <mlev>
##$CPDPRG7= <mlev>
##$CPDPRG8= <mlev>
##$CPDPRGB= <>
##$CPDPRGT= <>
##$D= (0..31)
0 0.7 0 0 0 0 0 0 0 0 0 0.03 0 0 0 0 0 0 0 0 0 0 0 0 0 0 0 0 0 0 0 0 
##$DATE= 1757065645
##$DBL= (0..7)
120 120 120 120 120 120 120 120 
##$DBP= (0..7)
150 150 150 150 150 150 150 150 
##$DBP07= 0
##$DBPNAM0= <>
##$DBPNAM1= <>
##$DBPNAM2= <>
##$DBPNAM3= <>
##$DBPNAM4= <>
$$ [...]
##$SUBNAM3= <"">
##$SUBNAM4= <"">
##$SUBNAM5= <"">
##$SUBNAM6= <"">
##$SUBNAM7= <"">
##$SUBNAM8= <"">
##$SUBNAM9= <"">
##$SW= 18.0517328524113
##$SWIBOX= (0..15)
0 0 2 0 0 0 0 0 0 0 0 0 0 0 0 0 
##$SW_h= 3612.71676300578
##$TD= 16384
##$TD0= 1
##$TE= 0
##$TE2= 300
##$TE3= 300
##$TEG= 300
##$TL= (0..7)
0 120 120 120 120 120 120 120 
##$TP= (0..7)
150 150 150 150 150 150 150 150 
##$TP07= 0
##$TPNAME0= <>
##$TPNAME1= <>
##$TPNAME2= <>
##$TPNAME3= <>
##$TPNAME4= <>
##$TPNAME5= <>
##$TPNAME6= <>
##$TPNAME7= <>
##$TPOAL= (0..7)
0.5 0.5 0.5 0.5 0.5 0.5 0.5 0.5 
##$TPOFFS= (0..7)
0 0 0 0 0 0 0 0 
##$TUNHIN= 0
##$TUNHOUT= 0
##$TUNXOUT= 0
##$USERA1= <user>
##$USERA2= <user>
##$USERA3= <user>
##$USERA4= <user>
##$USERA5= <user>
##$V9= 5
##$VALIST= <valist>
##$VCLIST= <CCCCCCCCCCCCCCC>
##$VD= 0
##$VDLIST= <DDDDDDDDDDDDDDD>
##$VPLIST= <PPPPPPPPPPPPPPP>
##$VTLIST= <TTTTTTTTTTTTTTT>
##$WBST= 1024
##$WBSW= 4
##$XGAIN= (0..3)
0 0 0 0 
##$XL= 0
##$YL= 0
##$YMAX_a= 720461
##$YMIN_a= -1105201
##$ZGOPTNS= <>
##$ZL1= 120
##$ZL2= 120
##$ZL3= 120
##$ZL4= 120
##$ABSF1= 15.48907
##$ABSF2= -2.562779
##$ABSG= 5
##$ABSL= 3
##$ALPHA= 0
##$AQORDER= 0
##$ASSFAC= 0
##$ASSFACI= 0
##$ASSFACX= 0
##$ASSWID= 0
##$AUNMP= <proc_1d>
##$AZFE= 0.1
##$AZFW= 0.1
##$BCFW= 0
##$BC_mod= 2
##$BYTORDP= 0
##$COROFFS= 0
##$CY= -3
##$DATMOD= 1
##$DC= 0
##$DFILT= <>
##$DTYPP= 0
##$F1P= 0
##$F2P= 0
##$FCOR= 1
##$FTSIZE= 16384
##$FT_mod= 6
##$GAMMA= 0
##$GB= 0
##$INTBC= 1
##$INTSCL= 3.241238e-09
##$ISEN= 128
##$LB= 0.25
##$LEV0= 0
##$LPBIN= 0
##$MAXI= 10000
##$MC2= 0
##$MEAN= 0
##$ME_mod= 0
##$MI= 1.114404
##$NCOEF= 0
##$NC_proc= -6
##$NLEV= 6
##$NOISF1= 3.799351
##$NOISF2= 2.8
##$NSP= 0
##$NTH_PI= 0
##$NZP= 0
##$OFFSET= 15.53424
##$PC= 1
##$PHC0= -1559.294
##$PHC1= 10.99228
##$PH_mod= 1
##$PKNL= yes
##$PPARMOD= 0
##$PSCAL= 0
##$PSIGN= 0
##$REVERSE= no
##$SF= 200.129997489904
##$SI= 16384
##$SIGF1= 3
##$SIGF2= 2
##$SINO= 0.751879
##$SIOLD= 32768
##$SREGLST= <19F.Aceton>
##$SSB= 0
##$STSI= 16384
##$STSR= 0
##$SW_p= 3612.71676300578
##$SYMM= 0
##$S_DEV= 0
##$TDeff= 16384
##$TDoff= 0
##$TI= <>
##$TILT= no
##$TM1= 0
##$TM2= 0
##$TOPLEV= 0
##$USERP1= <user>
##$USERP2= <user>
##$USERP3= <user>
##$USERP4= <user>
##$USERP5= <user>
##$WDW= 1
##$XDIM= 16384
##$YMAX_p= 324177554
##$YMIN_p= -1041655
$$ End of Bruker specific parameters
$$ ---------------------------------
##NTUPLES= NMR SPECTRUM
##VAR_NAME=  FREQUENCY,     SPECTRUM/REAL,   SPECTRUM/IMAG
##SYMBOL=    X,             R,               I
##VAR_TYPE=  INDEPENDENT,   DEPENDENT,       DEPENDENT
##VAR_FORM=  AFFN,          ASDF,            ASDF
##VAR_DIM=   16384,         16384,           16384
##UNITS=     HZ,            ARBITRARY UNITS, ARBITRARY UNITS
##FACTOR=    0.220516191357247, 1,           1
##FIRST=     3108.86736597392, 0,            0
##LAST=      -503.849397031859, 0,           0
##MIN=       -503.849397031859, -1041655,    0
##MAX=       3108.86736597392, 324177554,    0
$$ Real data points
##PAGE= N=1
##DATA TABLE= (X++(R..R)), XYDATA
$$ [...]
8743 11282726 10689226 10293190 9954029 9544497 9106255 8786234 8542878 8208675 7848461
8734 7848461 7592314 7538635 7403387 7320836 7112407 6787725 6605386 6460520 6381110 6244738
8724 6244738 6017798 5754151 5608871 5466393 5353223 5278685 5096703 4909172 4750518 4594289
8714 4594289 4459806 4401506 4387733 4262146 4139863 4106942 4041566 3959018 3728826 3672488 3656354
8703 3656354 3601136 3457729 3514034 3410682 3449231 3530079 3491821 3393794 3398105 3369393 3317152
8692 3317152 3081610 3104135 3048533 3062584 2891281 2881578 2813387 2804293 2756834 2858647 2903564
8681 2903564 2777678 2604812 2567836 2726206 2599237 2559193 2522089 2547525 2493085 2409990 2396334
8670 2396334 2310405 2247670 2231525 2230859 2279220 2329260 2203010 2189567 2210285 2165718 2269964
8659 2269964 2299674 2341812 2319680 2256092 2195244 2247720 2325355 2276139 2247137 2161729 2082594
8648 2082594 2086591 2075672 2076006 2076805 2048443 2091962 2227024 2215187 2257404 2226615 2213371 2195604
8636 2195604 2185454 2199632 2233644 2162528 2148687 2196093 2343561 2163467 2182803 2140292 2075679
8625 2075679 2150533 2301575 2307927 2280389 2197266 2135813 2148303 2253910 2368562 2448139 2422162
8614 2422162 2323079 2385019 2330948 2370730 2380834 2497946 2459998 2386319 2531386 2623562 2831916
8603 2831916 2793258 2740415 2785922 2842837 2903018 3025991 3207077 3187752 3349151 3639693 3637751
8592 3637751 3677818 3792646 4088574 4174638 4150387 4167133 4486387 4786696 4875144 5109435
8582 5109435 5353885 5715030 5991776 6353030 6830794 7335537 7881251 8413934 9035338 9637126
8572 9637126 10184697 11048558 11803352 12726253 13754339 14922681 16217737 17720865 19593119
8563 19593119 21671223 24208006 27129598 30279041 33742680 37674386 42287332 47754953
8555 47754953 54190618 61625031 69451569 77105695 83813231 89020228 91647246 90755588
8547 90755588 86912273 81124272 74758481 68281024 62191217 56846403 52356142 48458080
8539 48458080 45146360 42048678 39283997 36522610 33693722 31122147 28462518 25979149
8531 25979149 23722389 21452765 19579376 18017974 16571764 15191995 14133960 13302131
8523 13302131 12414429 11677591 10878697 10309973 10034546 9593800 9191364 8736849 8239952
8514 8239952 7913303 7538179 7203851 6806468 6385541 6074015 5807947 5535362 5362672 5183248
8504 5183248 4954673 4752945 4626337 4480640 4323834 4142163 4093021 3845445 3580465 3671974
8494 3671974 3627825 3468639 3292077 3203801 3175956 3024956 2981620 2892400 2894227 2914432 2811849
8483 2811849 2678371 2749005 2590764 2624565 2503794 2391955 2494072 2577968 2528061 2528772 2626017
8472 2626017 2649148 2735912 2727169 2726747 2791726 2876726 2784358 2791362 2963503 3138481 3434332 3739824
8460 3739824 3965567 4207823 4326469 4522405 4617749 4677102 4546613 4473289 4413833 4378512
8450 4378512 4336022 4325859 4243950 4128732 3942960 3769868 3538141 3113503 2798084 2663812
8440 2663812 2502690 2360246 2172462 2159771 2062965 1956088 1832557 1867979 1680052 1588667
8430 1588667 1450742 1320691 1335458 1381681 1355802 1193872 1186394 1053907 1041643 1031157 1023957
8419 1023957 1005732 988514 1044468 1061481 1015476 831983 790371 788488 656353 786857 835680
8408 835680 796239 679464 514201 374688 575881 650255 645290 504334 557713 525535 563886
8397 563886 557736 503166 460496 460296 381894 469176 339885 392705 508205 429948 485040 538553
8385 538553 530374 240643 250885 321763 168395 129310 189614 176401 242674 208870 140373
8374 140373 52447 57815 40924 68986 39022 56890 20602 3732 127425 123853 3525 85783
8362 85783 68727 29974 -7738 -33679 -37185 -3998 -11579 2327 24261 70054 -147783 -259220
8350 -259220 -67067 -55710 -108892 -147358 -118609 -6706 133074 73917 28313 -45059 -82145
8339 -82145 -62774 23251 61179 -72055 -18373 47385 88351 -43520 -45013 158052 -20635
8328 -20635 -88165 68647 80784 22743 25974 8488 -19033 -61916 -56990 -108208 -132852 -89582
8316 -89582 -129764 -225499 -93329 -95179 -132369 -158566 -118208 -89160 -153356 -225890 -395984 -364732
8304 -364732 -265381 -220686 -236560 -328370 -380579 -407017 -303064 -196045 -298601 -277610 -305460
8293 -305460 -327751 -193078 -161123 -353899 -296944 -352110 -347613 -304880 -446049 -414804 -371064
8282 -371064 -345965 -379927 -346420 -290238 -291179 -210035 -157798 -266851 -319115 -392655 -315229 -261385
8270 -261385 -301253 -330239 -316696 -252927 -348445 -368870 -349763 -405601 -401513 -387015 -285791 -278585
8258 -278585 -323085 -406992 -444020 -430571 -366740 -305670 -402388 -375289 -240338 -212413 -290636
8247 -290636 -496873 -551762 -417664 -293789 -257417 -303690 -320500 -330311 -313705 -328313 -325136
8236 -325136 -401988 -586937 -435457 -319840 -471895 -542421 -464952 -468225 -452883 -314227 -426872
8225 -426872 -303028 -410788 -502423 -522694 -474945 -419638 -411699 -442766 -421453 -366961 -341415
8214 -341415 -378287 -387772 -300785 -254290 -325170 -436984 -584776 -609817 -492778 -470902 -469843
8203 -469843 -369231 -329170 -544438 -438138 -451650 -458912 -543880 -471088 -437434 -409760 -655540
8192 -655540 -1041655 -533727 -395001 -492105 -393894 -450794 -485920 -469828 -482244 -527627 -270584
8181 -270584 -284941 -447926 -514929 -496767 -466231 -509574 -389324 -415651 -452232 -476933 -465068
8170 -465068 -489487 -492967 -547407 -520925 -467143 -537612 -456643 -467626 -523987 -420821 -316125
8159 -316125 -372730 -406328 -506656 -423809 -365347 -334832 -481573 -612702 -625153 -637197 -555648
8148 -555648 -535082 -522819 -467444 -497908 -441544 -431952 -605749 -547906 -597718 -559440 -533090 -574730
8136 -574730 -518579 -474727 -380787 -381189 -399169 -523765 -443431 -405004 -424358 -447933 -472236 -288472
8124 -288472 -306335 -361423 -347359 -437381 -392655 -339264 -237214 -111454 -154719 -201450 -143705
8113 -143705 -30002 14235 -37595 -58348 48327 -45522 -80275 -13220 -45996 -39160 -47455 -165731
8101 -165731 -137461 -113682 -65853 -161789 -242454 -267335 -257637 -301562 -352051 -332858 -166351 -222795
8089 -222795 -348019 -328055 -403549 -357040 -357179 -418446 -385246 -389645 -394191 -338583 -315405 -344127
8077 -344127 -463292 -495112 -421718 -427725 -514267 -538633 -538407 -471593 -411974 -491417 -636437 -608794
8065 -608794 -453724 -439603 -424933 -414593 -436445 -521965 -381492 -399850 -541999 -426503 -370652
8054 -370652 -467083 -520966 -465152 -540635 -521199 -589033 -614171 -548403 -551742 -461679 -589625 -651877
8042 -651877 -583862 -595561 -546729 -550621 -568631 -607514 -456296 -457983 -481342 -539276 -584699 -555438
8030 -555438 -534759 -495870 -605601 -531352 -549144 -657851 -541588 -526751 -442525 -417947 -446455
8019 -446455 -377187 -438499 -552596 -562899 -584866 -428518 -435244 -440915 -559497 -572708 -440935
8008 -440935 -432270 -461440 -684499 -688118 -665092 -624888 -651520 -621618 -566658 -567963 -525023 -527158
7996 -527158 -511940 -626566 -700652 -677946 -646888 -511928 -532904 -580430 -494750 -447669 -445399
7985 -445399 -462707 -527478 -521936 -406472 -420441 -514390 -572847 -590125 -571185 -446093 -542336
7974 -542336 -565406 -524495 -495824 -450133 -639421 -605346 -522253 -521309 -545177 -440846 -398726 -444415
7962 -444415 -378957 -477811 -638490 -597007 -593229 -628355 -491823 -463295 -554055 -634657 -571188
7951 -571188 -481745 -373949 -442839 -439645 -493694 -467615 -478519 -503790 -445623 -434973 -417273 -412792
7939 -412792 -263062 -324301 -356741 -390465 -397468 -391207 -457018 -496326 -424583 -375909 -387241 -422845
7927 -422845 -387459 -369014 -226874 -275736 -271222 -304198 -245255 -294940 -267218 -275561 -331359 -187066
7915 -187066 -87966 -248219 -212040 -96639 -117293 -163376 -261682 -352923 -395142 -358496 -455851
7904 -455851 -433146 -358094 -426790 -495805 -439980 -346737 -510643 -445594 -364922 -377351 -414131
7893 -414131 -598636 -652652 -462614 -521743 -532649 -337684 -412800 -413308 -430191 -496205 -541664
7882 -541664 -526408 -493301 -623988 -633099 -406902 -414750 -450348 -584091 -677940 -470372 -399022
7871 -399022 -490266 -588506 -541890 -412985 -594213 -499130 -580282 -630101 -578679 -500170 -646739
7860 -646739 -710807 -556087 -623951 -629639 -627798 -528912 -449081 -590704 -545361 -609062 -502162
7849 -502162 -539836 -463632 -514224 -507040 -445756 -562313 -520800 -449972 -577713 -550562 -621474
7838 -621474 -634493 -627063 -577339 -590787 -682466 -586621 -516378 -533007 -538481 -571732 -534783 -492766
7826 -492766 -527687 -515043 -571536 -383126 -350264 -447872 -592783 -621630 -586072 -546026 -655374
7815 -655374 -548702 -497351 -472025 -534023 -636934 -518190 -506084 -473181 -608941 -567249 -412195
7804 -412195 -383201 -437498 -523234 -489842 -619416 -498706 -550926 -437999 -487871 -597410 -618895
7793 -618895 -528065 -544423 -510155 -536282 -616986 -584854 -537630 -513049 -393479 -497027 -422074
7782 -422074 -495266 -547390 -499045 -498951 -432137 -550060 -454264 -511692 -423606 -432858 -525196 -461067
7770 -461067 -360819 -481023 -518101 -338063 -306281 -447573 -558551 -463665 -329059 -390130
7760 -390130 -447852 -487292 -481520 -398809 -408752 -545044 -553099 -486787 -482521 -426125 -377401 -398137
7748 -398137 -336318 -339614 -359022 -338154 -326580 -451852 -634708 -435260 -303775 -397637 -419329
7737 -419329 -443271 -430069 -403863 -396848 -391534 -326211 -346506 -395496 -450727 -415400 -414578 -578485
7725 -578485 -521709 -568562 -613251 -456800 -448641 -367115 -433286 -298591 -391440 -396344 -476589 -449814
7713 -449814 -333117 -303594 -175552 -229212 -205156 -334062 -416073 -466636 -300617 -288247 -321296
7702 -321296 -304183 -323372 -214476 -213531 -292237 -277376 -226818 -106555 -71427 -178662 -216465
7691 -216465 -188493 -121092 -192849 -160864 -80135 -22027 109837 76276 16667 47147 58875
7680 58875 27136 67657 25081 -7430 3891 32794 64978 75781 105878 125054 180914 119594
7668 119594 47938 28891 125756 83491 48923 109388 190474 251622 71233 -19897 72897
7657 72897 168058 93939 118920 192710 115482 131136 9591 -104386 34199 -104398 -60486
7646 -60486 -70166 -102929 -143208 -40765 -97512 -202138 -120824 -109433 -89233 -232218 -132853
7635 -132853 -238420 -219641 -212425 -315468 -306912 -266503 -187090 -254125 -190171 -74762 -123453
7624 -123453 -215351 -252164 -248249 -284233 -309877 -295725 -297613 -395991 -297419 -318259 -278045 -195481
7612 -195481 -74205 25051 -3301 -135343 -123769 -57707 -65546 -141153 -273563 -263851 -220522
7601 -220522 -203425 -41259 -40012 -244733 -209898 -66774 74632 -71366 -75523 -20661 -111960
7590 -111960 -170704 -116772 -102902 570 -31269 -65118 -67245 -27250 -96019 -103449 -62559 -58647
7578 -58647 -33404 99143 53776 -7252 111857 29178 -58484 -186849 -110429 -112831 -145380
7567 -145380 -11599 69037 59867 25793 -55788 -77051 -13707 62701 -13494 4333 23215 11523
7555 11523 70644 63271 -22841 1016 83050 -103386 -33486 -88700 -168742 -99888 -22475 20441
7543 20441 -15780 -99434 -284707 -294285 -147225 -153705 -196095 -189567 -185907 -127037 -85123 -63150
7531 -63150 -23679 -113253 -131178 -27613 12006 26764 -61016 -14014 -85828 -107337 -46327 -41711
7519 -41711 -70219 17758 -23530 4263 -5612 89078 116410 3674 49508 51364 244272 286633
7507 286633 216722 87795 177096 98433 83953 181967 287318 298622 217435 162562 70425
7496 70425 209616 195882 77066 92810 143061 -7071 117771 295305 262593 166677 150085
7485 150085 174144 190257 225132 226040 285045 335612 379060 472158 353494 300958 221441 397902
7473 397902 454833 431940 449732 315163 472553 539216 537714 626338 634987 648216 804919
7462 804919 860432 845081 870181 840839 915859 948885 866091 833368 928592 989899 980855 1058548
7450 1058548 1179240 1279885 1224350 1275773 1361546 1405370 1567945 1645346 1699503 1773999 1815794
7439 1815794 1970764 1999709 2105664 2123762 2198251 2285472 2442478 2540781 2730548 2939380
7429 2939380 3126616 3393708 3624498 3747296 4045736 4399436 4678828 4997764 5247716 5548225
7419 5548225 6004906 6500367 7073030 7654284 8118514 8730921 9423915 10152024 10762911 11482008
7409 11482008 12309921 13149328 14230928 15390072 16649003 18128477 19578478 21057477
7401 21057477 22737188 24322149 25527813 26547881 27297137 27917660 28418460 28606594 28744009
7392 28744009 29163250 29755610 30497656 31635650 32839618 34377741 36219279 38213595 40410455
7383 40410455 42679841 44920437 46889801 48416720 49384735 49975003 49880229 49388113 48508376
7374 48508376 47424388 46055584 44503545 42960369 41315916 39620311 37982667 36568117
7366 36568117 35053540 33511112 32088007 30943735 29814680 28742775 27620079 26637774
7358 26637774 25723950 24804430 24136988 23508823 23063325 22839639 22680145 22757211 23038630 23171446
7348 23171446 23532414 23799642 24241177 24384064 24305304 24188587 23713975 22971438 22227232 21565686
7338 21565686 20787171 20017765 19186386 18309102 17441654 16612401 15817586 15186877 14559473
7329 14559473 14052697 13429992 12752238 12222667 11867181 11442630 11017625 10951154 10813328 10727989
7319 10727989 10631626 10634001 10637541 10759080 10690651 10552292 10291301 9925117 9636930 9283900
7309 9283900 8874314 8479220 8223841 7671147 7241802 6900413 6634343 6316414 6049704 5730664
7299 5730664 5567680 5260441 5026627 4844068 4620141 4340923 4073797 3768314 3638369 3639350
7289 3639350 3530732 3414577 3235568 3006750 2996801 3086427 2993906 2854658 2729726 2558817
7279 2558817 2431043 2438988 2287863 2146180 2068316 2092431 1991243 1975935 2021949 1891029 2017815
7268 2017815 2010244 1813833 1861852 1889615 1686557 1615957 1600086 1613595 1663540 1575184 1458710
7257 1458710 1411962 1529169 1413580 1316913 1261851 1297973 1304091 1330576 1202176 1201983 1104718
7246 1104718 1116751 1141513 1205182 1106885 920755 1067789 1029273 918679 856737 917592 847247
7235 847247 801814 744222 763192 740009 652557 636858 737748 809909 743888 740016 634129
7224 634129 511401 613659 656972 622267 507038 428790 427395 412277 367835 350396 220530
7213 220530 219007 378022 338684 287785 345316 279081 321251 345220 373212 432001 448555 380442
7201 380442 275588 232719 270655 300375 219025 126112 94594 160490 143906 274105 286192
7190 286192 303685 294954 202346 277562 254973 276297 323624 315847 324330 279060 313550 291847
7178 291847 398381 381235 245898 213632 362660 509562 510596 453857 460975 480724 475053
7167 475053 459749 498958 521796 421877 286617 308287 305429 322945 388258 291460 298631 343405
7155 343405 430792 274088 196070 166993 41229 59278 51949 130759 -3168 54309 68493
7144 68493 -18066 -111687 -157461 -12108 -88552 -43683 -44724 -87859 -112273 -7423 38714 -53482
7132 -53482 -166586 -208880 -178053 -89946 -175621 -232166 -264659 -303032 -259161 -254768 -302997 -341550
7120 -341550 -434185 -332928 -302676 -167471 -114043 -264597 -338113 -320066 -225884 -113323 -79628
7109 -79628 -89409 -50890 -192657 -207811 -174734 -262768 -259128 -223919 -205971 -263620 -220761 -44594
7097 -44594 -78992 -81919 -58314 9180 -108419 -54692 -45622 -141904 -252809 -422755 -285663
7086 -285663 -62056 -7720 62573 24150 -62385 -11300 -126294 -104622 -40549 -118787 28856
7075 28856 89931 -22694 39874 173831 157520 106134 80146 137444 66342 159140 160006 220636
7063 220636 330004 119913 106461 75448 65469 -227 -65874 -95634 -51188 -43119 -56127 -76539
7051 -76539 -96283 -143194 -129446 -143338 -129460 19499 -21849 43774 -97973 -170281 -278853
7040 -278853 -247105 -219472 -189964 -244648 -278444 -167173 -229215 -331696 -385423 -208295 -248686
7029 -248686 -239116 -210697 -222446 -122534 -153527 -151766 -195963 -238818 -123490 -186355 -274648 -187682
7017 -187682 -103573 -145442 -149652 -203500 -284139 -245851 -163359 -150115 -200805 -205480 -239724 -208042
7005 -208042 -187483 -354489 -257070 -308277 -435649 -425837 -427476 -416202 -382238 -227252 -152317
6994 -152317 -248351 -337018 -263335 -267922 -411496 -290424 -153552 -185383 -234262 -251897 -370607
6983 -370607 -309461 -242701 -143817 -118357 -220013 -295852 -277240 -284965 -306564 -164588 -48899
6972 -48899 -15833 -76051 -155274 -184444 -4147 55894 -159 -89599 -76562 -227111 -274654
6961 -274654 -378402 -489603 -370372 -312889 -353791 -369067 -289614 -245109 -203735 -171057 -241350
6950 -241350 -303950 -257738 -362572 -418125 -373803 -370867 -380016 -352175 -337114 -291526 -366746 -374058
6938 -374058 -442198 -401488 -332296 -367267 -168183 -296616 -349512 -375610 -452162 -478008 -396927
6927 -396927 -370420 -290328 -325999 -447412 -497555 -384867 -291722 -340560 -253442 -469511 -452878
6916 -452878 -350909 -403233 -523899 -461138 -417073 -375374 -277238 -330108 -406098 -418946 -368622
6905 -368622 -476132 -424303 -419824 -460809 -518288 -523700 -521087 -535404 -506902 -519947 -502024 -433001
6893 -433001 -359234 -436143 -417693 -395466 -443574 -484177 -407067 -451299 -437515 -411320 -498027 -578374
6881 -578374 -539721 -674680 -569968 -433273 -407246 -408083 -397364 -479352 -562127 -467890 -482231
6870 -482231 -438655 -586571 -482183 -395645 -295187 -252759 -258797 -422986 -424619 -482745 -476632
6859 -476632 -429006 -519897 -579219 -628177 -501101 -396985 -514004 -544194 -411837 -396925 -331623
6848 -331623 -306414 -358716 -329377 -353318 -382538 -364870 -330588 -159791 -135502 -255433 -323742
6837 -323742 -340120 -340726 -411111 -487616 -355986 -237823 -360143 -454227 -541133 -499799 -385759
6826 -385759 -369480 -442473 -486319 -411068 -481274 -512321 -382991 -265885 -258105 -301887 -337947
6815 -337947 -436650 -468649 -315898 -267680 -308260 -354041 -444080 -567941 -430394 -445583 -444161
6804 -444161 -382911 -355460 -422473 -389373 -470944 -640622 -581720 -441184 -375837 -444066 -222463
6793 -222463 -179898 -371487 -434579 -336955 -317146 -311581 -317151 -318703 -382087 -355018 -288665 -244603
6781 -244603 -228821 -314959 -394368 -357284 -329275 -510614 -443555 -392867 -375277 -304821 -352302
6770 -352302 -362015 -385867 -454729 -425592 -426616 -350089 -227969 -288157 -334692 -367541 -400046 -381081
6758 -381081 -319343 -274075 -331027 -317119 -227435 -193767 -203591 -212396 -278683 -301040 -232555 -168845
6746 -168845 -259104 -294568 -236398 -238183 -268686 -183380 -240961 -391045 -316865 -345514 -267905 -196437
6734 -196437 -102351 -134841 -226164 -198081 -265277 -217313 -263926 -200425 -101044 -138607 -143833 -212637
6722 -212637 -251428 -182070 -33735 -22167 -92902 -72410 3570 28978 -45412 -7688 110792
6711 110792 -83412 -137997 -51699 -47396 -58857 -55831 -61622 -56934 -76555 -21565 82334 85478
6699 85478 82971 106072 78277 34036 -32688 62469 125585 91833 75260 77193 195431 75300
6687 75300 38644 131305 178567 179738 166628 149113 239294 71210 130568 135140 134402 228155
6675 228155 198893 160467 181435 283079 194987 212149 108386 229477 322299 361493 323996
6664 323996 303879 262491 229376 244696 312497 329220 237479 181790 204743 287484 350321 402182
6652 402182 464297 403311 403031 442664 365782 419510 382675 488704 460860 289406 340169 247881
6640 247881 243525 430268 470357 337284 314258 278694 310748 277509 358289 396707 348534
6629 348534 414675 309936 305822 340792 388069 444155 435361 298116 228842 240862 215097 126502
6617 126502 163956 236312 206136 143124 173655 240686 239700 223570 362191 363013 223881 367776
6605 367776 420698 367306 314748 369818 578112 454428 389419 537377 535132 605562 730234
6594 730234 655164 651959 555801 515934 534553 731919 784846 692064 550350 584159 677914
6583 677914 639061 709093 716694 787546 806053 868139 797187 731962 851437 855726 801585 866715
6571 866715 985207 1046222 1013446 969295 916318 951538 1102572 1210410 1117404 1039438 1117901
6560 1117901 1297989 1334120 1267404 1203102 1297737 1387630 1386567 1350498 1347942 1450743 1487973
6549 1487973 1453409 1535892 1622278 1704857 1667360 1664370 1681011 1565748 1655099 1717651 1753351
6538 1753351 1823188 1997049 2048634 2002628 1947531 2005182 1888756 1786612 1994762 1984012 1853000
6527 1853000 1818021 1976309 2078175 2099820 2081817 2134876 2135418 1973963 1951666 1954817 1973553
6516 1973553 2050709 2066523 1990714 1867221 1808698 2051097 2059107 2069231 2224075 2260796 2200134
6505 2200134 2332691 2388482 2265384 2403546 2513461 2557134 2581951 2598957 2583216 2579861 2516523
6494 2516523 2547436 2713421 2894904 2886028 2750012 2779311 2867404 3027364 3124124 3102422 3271728
6483 3271728 3376156 3417247 3586728 3704552 3807189 3857962 3920224 4011738 4128745 4385366
6473 4385366 4484497 4448869 4434458 4675558 4640520 4739758 4694819 4693431 4833476 4864787 4931467
6462 4931467 4816120 4731114 4732165 4774433 4808970 4848929 5031961 4989130 4957982 4938023 4963136
6451 4963136 5115101 5217895 5397466 5390559 5367558 5493522 5475504 5512042 5583620 5663485 5640511
6440 5640511 5899350 6059373 6048229 6197537 6211848 6327144 6399235 6431861 6439776 6628989 6735493
6429 6735493 6874849 6943065 7104397 7262293 7336123 7468801 7604424 7802933 8067500 8278780
6419 8278780 8420837 8529536 8747426 9004118 9421749 9851173 10266180 10569949 11034247 11419727
6409 11419727 11964850 12502514 13048179 13605939 14500930 15403169 16319574 17421107 18474056
6400 18474056 19568545 20683690 21870512 22846105 23630977 24319507 24690203 25009692 25200544
6391 25200544 25390430 25837498 26507911 27329552 28291777 29348343 30762367 32432645 34224082
6382 34224082 36338660 38621512 40914230 43364835 45675847 47689370 49546545 50831925
6374 50831925 51872129 52353755 52581987 52573536 52203164 51938333 51679795 51405976 51396986 51524436
6364 51524436 51925922 52608069 53572735 54755599 56234456 57938223 59886504 61900347 63875723
6355 63875723 65676143 67009438 67854866 68495926 68580634 68227785 67399977 66128006 64943170
6346 64943170 63736387 62600451 61586165 60643406 59809450 59007796 58468905 57901423 57476091
6337 57476091 57313080 57346338 57437228 57552169 57667698 57758468 57652435 57194943 56531462 55730076
6327 55730076 54832637 53852576 52995645 52123772 51346883 50517587 49666157 48815518 48142936
6318 48142936 47547383 46642187 45854751 45084410 44470632 43717630 43110561 42676414 42009138
6309 42009138 41442229 41035599 40546506 40193362 39707520 39198965 38800298 38325608 37848504
6300 37848504 37369497 36881852 36612026 36403120 36103444 35830182 35420706 35075335 34863482
6291 34863482 34630374 34475396 34272735 33979515 33777491 33536324 33466923 33376660 33267217 33304117
6281 33304117 33211917 33281492 33307497 33290842 33378920 33372649 33629127 33707501 33900441 34143249 34462798
6270 34462798 34803050 35060850 35338508 35734293 36213129 36673246 37384245 38120855 38732725
6261 38732725 39579597 40643053 41878185 43388340 44910955 46684558 48722375 50900051
6253 50900051 53271772 55704451 58561135 61409248 64497321 67911698 71449823 75103952
6245 75103952 78927914 82410597 85636817 88277938 90239184 91547406 92231671 92500239
6237 92500239 92595500 92725097 93305354 94188109 95518853 97237754 99299412 101932597 104895611
6228 104895611 108026113 111519527 115420864 119388396 123424707 127110553 130526183 133153352
6220 133153352 134634916 135083681 134618599 133315983 131507213 129233570 126401987 123236941
6212 123236941 120202643 117394864 115018620 113159234 111562411 110235747 109522201 109069498
6204 109069498 108835983 108675285 108905639 109108573 109271140 109163363 108599720 107302305 105104613
6195 105104613 102297999 98855835 95072313 91244699 87609582 84236474 80994322 77781611
6187 77781611 75012810 72346584 69939862 67587877 65183559 63060491 60970551 58892879
6179 58892879 56859850 54866200 52955082 50881648 49061197 47407247 46001725 44571801
6171 44571801 43103243 41956265 40989836 39952989 39095070 38434139 37655026 37025863 36513514
6162 36513514 35953844 35373953 34805752 34338159 33888924 33506217 32978554 32468453 31966968
6153 31966968 31289533 30685252 30128031 29604323 29028448 28571296 28098276 27622808 27153583
6144 27153583 26704112 26285289 25916979 25444003 25131063 24780335 24570142 24248004 24052042
6135 24052042 23931965 23677137 23522537 23527237 23380878 23404359 23529468 23523552 23376391 23330761
6125 23330761 23242039 23159044 23069069 22972936 22958155 22697448 22455719 22206224 22075828 21915563
6115 21915563 21855771 21817255 21841676 21889964 21948917 22024227 22044212 22250565 22502320 23128878 23615857
6104 23615857 23780648 24194443 24670503 25053537 25369988 25620730 25752385 26041429 26079000 25977144
6094 25977144 25885173 25673044 25361095 25361905 25335556 25410590 25552764 25600945 25810617 26192503 26665531
6083 26665531 26998340 27470541 28249051 28987067 29547403 30216488 30997361 31406131 31798165
6074 31798165 32081049 32149074 32097463 31914135 31681326 31235253 31002754 30747502 30436695 30212399
6064 30212399 30036241 29956139 29856820 29752401 29847106 29827289 29711629 29677199 29567078 29598945
6054 29598945 29525359 29454825 29299320 28997885 28797454 28552015 28156681 27791856 27312191 26947986
6044 26947986 26582493 26250035 25910723 25721396 25563847 25336790 25104865 24800358 24318145
6035 24318145 23829452 23374777 22660084 21968332 21265526 20759157 20187486 19499206 18890261
6026 18890261 18292387 18000233 17787908 17566893 17296132 17031131 16831857 16627225 16537201 16502825
6016 16502825 16373896 16174596 16104680 15893066 15547275 14938164 14624541 14306811 13827382 13395528
6006 13395528 13133323 12818634 12555720 12412253 12325720 12109172 11813286 11604960 11275372 10998656
5996 10998656 10860133 10769273 10630063 10388275 10295177 10243951 10059951 10008404 10060231 9991979
5986 9991979 9980261 10113928 10100946 10211220 10404475 10554385 10737012 10889739 11118693 11332499
5976 11332499 11511016 11529707 11572100 11712353 11773725 11910778 11948656 11952727 11951776 12129629 12220430
5965 12220430 12279640 12389218 12603188 12766605 12854844 13104712 13395950 13657737 13984997 14253709
5955 14253709 14466247 14629651 15051029 15269749 15260225 15413452 15505458 15594240 15683577 15623635
5945 15623635 15575325 15494801 15392694 15329614 15211771 15265503 15340388 15337976 15427279 15597547 15686895
5934 15686895 15844689 15890193 16017908 16137434 16187543 16445474 16670890 16939999 17063917 17076204
5924 17076204 17057584 17262127 17399240 17420613 17483381 17605644 17739522 17922333 17985202 18120094
5914 18120094 18445830 18721971 18974439 19251955 19613149 20113872 20408596 20809134 21457494
5905 21457494 22064427 22883964 23626394 24417070 25285751 26514056 27498626 28665426 29902055
5896 29902055 31278076 32818520 34366085 36137282 38191985 40321829 42571662 45162215
5888 45162215 48063567 51358371 55316573 59564804 64197770 69553904 75530024 82153643
5880 82153643 89843019 98453105 108001734 118578888 130174347 142250801 154474590 166064623
5872 166064623 176327394 184392337 189232300 190509887 188543724 184350035 179143467 173916011
5864 173916011 169242685 165249592 162019011 159596386 157991639 156745415 155699643 154550274
5856 154550274 152853144 150601299 147483169 143796213 139352130 134629826 129983256 125620196
5848 125620196 121568014 117946621 114600736 111706386 109217950 106953126 104935080 103228810
5840 103228810 101836787 100625778 99543034 98741675 98046108 97590681 97262452 97067921 96969397
5831 96969397 97228163 97519165 97866280 98415412 99200285 100041907 101124492 102529570 104117085
5822 104117085 105959800 107956889 110072152 112429697 115088041 117696168 120192114 122496601
5814 122496601 123891950 124126595 123508962 122244347 120055230 117621034 115253612 113074520
5806 113074520 111101785 109168697 107293311 105460227 103651762 101801791 100038718 98569065
5798 98569065 97476198 96525347 95880055 95682362 95869043 96450728 97510963 99060881 100729203
5789 100729203 102475922 104237233 106070817 107642816 108562425 109098389 109417482 109837882 110386650
5780 110386650 111070320 111914032 112872114 113818866 114677558 115268690 115588204 115762599 116002295
5771 116002295 116495346 116871174 117578096 118468247 119484476 120674862 121478532 121873001 121684819
5762 121684819 121215870 120310965 118931828 117018987 114902666 112869997 111149737 109384246
5754 109384246 107460966 105409698 103165813 100812902 98463388 96380010 94445258 92739330
5746 92739330 91344756 90224668 89606842 89073226 88495745 87827732 87059867 85843717 84270157
5737 84270157 82357114 80464244 78595956 76800285 75020299 73219182 71482460 69864235
5729 69864235 68261979 66579683 64777034 63168003 61687183 60224175 58948121 57671950
5721 57671950 56379723 55374742 54515886 53614152 53046242 52323734 51551773 50877468 50262235
5712 50262235 49869289 49474885 49053756 48522668 48047327 47646539 47372738 47075237 47046358 46830699
5702 46830699 46780452 46826978 46859060 47020151 47189815 47461826 47751929 47948871 48200849 48664058
5692 48664058 48915425 49130134 49412181 49453419 49282536 49361459 49519534 49681558 49640670 49879112
5682 49879112 50196655 50523663 50776884 51322773 51619760 51980930 52400430 52567953 52602033 52660597
5672 52660597 52523398 52221980 51841050 51550763 51094829 50738414 50387141 50145132 50159627 50038602
5662 50038602 50147349 50191300 50343981 50750517 51280329 51715709 52163633 52826052 53537835 54129735
5652 54129735 54629652 55104978 55546233 55691317 55689556 55530896 55441301 55410239 55339748 54945699
5642 54945699 54365233 54026382 54037617 54266686 54718460 55173236 55878478 56875207 57957991
5633 57957991 59437436 61095195 62963866 64968180 67220695 69737820 72474513 75354277
5625 75354277 78450396 81617224 84772881 87691180 90528080 92956470 94819798 96050563
5617 96050563 96818345 97224749 97754794 98411210 99340880 100510968 101506987 102554651 103979294
5608 103979294 106098154 108460591 111246723 113982981 116901317 120077336 123408476 126442538
5600 126442538 128856396 130775144 132095390 132796784 133170150 133158922 132461127 131124145 129437691
5591 129437691 127927720 126724989 125771159 125072232 124653709 124485203 124475707 124484919 124804913 125328942
5581 125328942 125875258 126487103 127033819 127369483 127867879 128346747 128423547 128001016 127153884
5572 127153884 126082139 124877905 123784171 122743122 121857320 121206992 120782414 120651724 120654768
5563 120654768 120595613 120597670 120357609 119853799 119059212 117961567 116604919 115296972 114366464
5554 114366464 113578603 113009856 112841100 112498954 112046392 111676327 111479461 111565073 112094609
5545 112094609 113100387 114417647 115586372 116665012 117801272 118824989 119512022 119223126
5537 119223126 118108598 116656936 114725523 112861122 110947364 108957342 106704005 104468923
5529 104468923 102449841 100565198 98696773 96657084 94293159 92005128 90432661 89342893
5521 89342893 88451786 87920689 87669878 87289036 86924089 86300537 85198372 83149662 80357136
5512 80357136 77079792 73815944 70642614 67750502 65019192 62381263 59934021 57866875
5504 57866875 55918123 54096825 52494748 50850806 49307343 47838808 46533094 45205150
5496 45205150 44039125 42968255 41981470 41318580 40868001 40379029 40023262 39795474 39563173
5487 39563173 38937914 38459648 38147181 37571792 37111541 36594307 36211827 35829970 35633775
5478 35633775 35395461 35223572 35071619 35095367 35068467 35260199 35481767 35586314 35827914 36138412
5468 36138412 36440018 36422847 36489152 36256875 35730519 35238483 34762889 34115283 33397135 32887990
5458 32887990 32211152 31540991 31137586 30792092 30349899 30095107 29986688 29927484 29914822 29983038
5448 29983038 30197088 30468561 30824254 31084441 31206186 31019359 30548594 29852751 28951383
5439 28951383 27995054 27103072 26253016 25494788 24787545 24107775 23538723 23040004 22597522
5430 22597522 22206497 21715020 21556241 21338347 20969468 20795888 20518134 20363960 20102737
5421 20102737 19845218 19626361 19366793 19099939 18840066 18547628 18215427 18016040 17769630
5412 17769630 17520250 17293190 17148551 17040671 16933746 16884486 16885164 16873396 16686182 16716015
5402 16716015 16787664 16868744 16978968 16825057 16818935 16845169 16921602 16980044 16880540 16821663 16799429
5391 16799429 16781028 16728894 16529852 16272920 16245393 16193516 16079057 16065784 16101105 16125801 16074870
5380 16074870 16131152 16076906 16129924 16242536 16294626 16337485 16436017 16563790 16856558 17009106
5370 17009106 17304652 17553867 17755706 18004276 18309539 18609026 18961886 19407405 19951159
5361 19951159 20589267 21243820 22072256 22887228 23949276 25106550 26338122 27800127 29573479
5352 29573479 31307562 33375797 35792412 38324122 41103677 43819962 46442621 48718925
5344 48718925 50491708 51717148 52131142 51971471 51604725 50889928 50017936 49341973 48924045
5335 48924045 48663473 48783008 49302142 50299337 51444556 52820302 54517423 56159618 58034266
5326 58034266 59856024 61657006 63072174 64295972 65330812 65846927 65665506 64781407 63449763
5317 63449763 61667536 59736922 57681834 55749940 53953758 52472622 51194102 50171042
5309 50171042 49450852 48924267 48585183 48417841 48404097 48468837 48562924 48539655 48387440 47914641
5299 47914641 47384474 46461769 45306839 43809679 42252043 40844732 39597183 38488266
5291 38488266 37497891 36663453 35995103 35489981 35017601 34453063 33795429 33067124 32061549
5282 32061549 30729876 29432608 28212487 27276461 26449240 25563561 24975697 24645728 24139117
5273 24139117 23914182 23789141 23776834 23841565 23840181 23973438 24104851 24029184 24011543 24206640
5263 24206640 24163825 23892633 23502975 22907826 22088861 21395574 20640113 19787351 18962457 18497918
5253 18497918 18069100 17564244 17057524 16678605 16493379 16359471 16237471 16002486 15792320
5244 15792320 15824837 15516892 15211022 14930428 14621129 14144905 13483535 12906528 12238224 11778427
5234 11778427 11267736 10880618 10472399 9999763 9642900 9161502 8841293 8549158 8226563
5225 8226563 7955996 7616629 7389066 7059566 6711623 6506858 6282592 6157378 5958266 5811039
5215 5811039 5557962 5433454 5249396 5218027 5092906 4855054 4817614 4658751 4588978 4565226
5205 4565226 4520394 4408135 4436778 4338741 4111982 4084152 3969703 3825720 3769975 3634861
5195 3634861 3489315 3514556 3596686 3577416 3382477 3319054 3255694 3297693 3204600 3093058 3040453
5184 3040453 2931734 2945206 2915720 2902852 2842999 2828178 2814429 2689429 2668171 2556520 2498127
5173 2498127 2490217 2471196 2358817 2313331 2455223 2423039 2449441 2440559 2375231 2426589 2514774
5162 2514774 2329159 2281848 2240069 2141854 2013155 1913391 2005667 2170551 2112669 2052944 2001688
5151 2001688 2000922 1971407 1873198 1838891 1817227 1865042 1823014 1757959 1729967 1728984 1740164 1744962
5139 1744962 1769326 1781805 1673051 1588540 1652284 1619880 1683840 1728199 1644270 1721292 1608044
5128 1608044 1678287 1710327 1654691 1598130 1662758 1669985 1606295 1660146 1667262 1743737 1773250 1874289
5116 1874289 1853924 1958042 2139867 2191736 2047469 2067153 2154997 2279100 2360226 2355598 2639391
5105 2639391 2779740 2612185 2712132 2680638 2781368 2761974 2728972 2649909 2566206 2490098 2484268
5094 2484268 2566757 2438984 2425388 2525644 2595262 2568124 2670375 2793150 2951484 3068497
5084 3068497 3305266 3228722 3102887 3055701 3157782 3090837 2888512 2840974 2838981 2779955 2660468
5073 2660468 2546878 2487193 2525057 2390530 2516124 2491081 2397559 2424401 2372509 2360599 2284946
5062 2284946 2311447 2506196 2545914 2245045 2183963 2135955 2025099 2050491 1986623 1855704 1778390
5051 1778390 1675552 1663018 1704665 1547515 1484321 1463538 1399448 1407566 1440884 1390582 1406068
5040 1406068 1426081 1324212 1379513 1225612 1236474 1316292 1162556 1071484 1147715 1269665 1240152
5029 1240152 1170058 1162537 1138439 1159855 1238062 1186969 1116876 1145761 1102919 1084313 1086428 977090
5017 977090 1097407 1195574 1155587 1076706 1071708 1097911 979241 976712 1034465 1190333 1220660
5006 1220660 1109681 1222798 1243424 1106998 1233030 1254476 1263645 1260760 1203045 1277440 1255290
4995 1255290 1346567 1294579 1205054 1218462 1124182 1141339 1230488 1149312 1224168 1236925 1190214
4984 1190214 1171642 1235972 1158917 1261027 1200162 1104321 1117392 1253058 1355307 1352969 1313047
4973 1313047 1316126 1358152 1253567 1283510 1269858 1368645 1352411 1371867 1220473 1236123 1232395
4962 1232395 1174876 1235822 1184441 1273162 1374358 1352126 1424625 1547390 1635334 1603211 1479372
4951 1479372 1466001 1523241 1422581 1412229 1366233 1372978 1249335 1163049 1256990 1271939 1228518
4940 1228518 1258306 1195161 1161019 1232061 1177174 1165310 1116640 1088581 1105556 1041774 1072498
4929 1072498 1061598 996458 986628 1082300 1171047 1280384 1300171 1148818 1067025 1097983 970910
4918 970910 915711 986654 1071911 1071907 911145 922491 972102 1009185 1129127 1156007 1084167 982383
4906 982383 1007271 1107656 1049622 983408 1090581 1136366 1212535 1298939 1240029 1115960 1114786
4895 1114786 1252584 1215718 1260971 1201271 1434076 1455057 1480899 1459325 1400536 1505751 1611541
4884 1611541 1643712 1628150 1620296 1594210 1676665 1718039 1537557 1624836 1584402 1430057 1418614
4873 1418614 1468262 1567022 1469322 1493448 1327099 1284497 1386923 1299232 1319655 1208808 1344906
4862 1344906 1286408 1223932 1348226 1294676 1239151 1218620 1323367 1282755 1348577 1357295 1174996
4851 1174996 1114827 1184454 1210047 1247389 1304912 1190900 1273916 1355274 1329975 1421754 1479157
4840 1479157 1546905 1411789 1445684 1477842 1483174 1440145 1480943 1601158 1528289 1503184 1492818
4829 1492818 1456345 1615020 1623769 1539548 1675616 1618304 1515060 1580100 1528771 1660643 1507323
4818 1507323 1381792 1442576 1392377 1472660 1376122 1349971 1297831 1252719 1304701 1329488 1450893
4807 1450893 1433189 1455214 1447327 1543582 1650849 1595773 1751567 1686932 1651056 1706120 1641840
4796 1641840 1673602 1801468 1762495 1830560 1792042 1701095 1690948 1672714 1706295 1679934 1686906
4785 1686906 1773563 1736767 1843951 1982404 1944498 1881143 1890945 1941850 1946525 1916209 1914065 1941842
4773 1941842 1863567 1930411 1987474 2010985 1908070 1885480 1971884 1971540 2086723 2172763 2149906
4762 2149906 2138463 2083844 2267132 2281897 2243967 2296504 2249073 2274649 2311468 2326479 2340938
4751 2340938 2228011 2288228 2317779 2319942 2392672 2431079 2350499 2325904 2438418 2511738 2580909
4740 2580909 2522064 2504039 2506201 2789373 2777992 2701049 2676727 2689115 2746430 2837314 2962956
4729 2962956 2865932 3045240 2925449 2952711 2922874 2919864 3002760 3016050 3089066 3123021 3071887
4718 3071887 3116733 3197864 3201738 3302050 3206542 3199610 3377957 3357103 3436771 3447604 3476549
4707 3476549 3521503 3402866 3372799 3481386 3574757 3551818 3689296 3614150 3688909 3785527 3830897
4696 3830897 3885526 3943205 4029323 4004478 4033739 4075483 4097526 4093317 4184522 4159215 4291449
4685 4291449 4406202 4357037 4431229 4484673 4525571 4529768 4575167 4758060 4745938 4757079 4742106
4674 4742106 4912825 5011354 4986740 5119151 5191488 5199121 5107457 5116929 5096988 5185217 5254329
4663 5254329 5262593 5219589 5317439 5305494 5348746 5275550 5338843 5418245 5438623 5477316 5474578 5644766
4651 5644766 5799695 5711915 5644307 5834263 6093560 6173471 6268806 6261644 6438479 6596711 6851798
4640 6851798 7055213 7086800 7255131 7406016 7502864 7667649 7650245 7507063 7286543 7297760
4630 7297760 7310134 7253615 7203542 7195230 7243642 7104675 7116390 7211530 7327731 7408557 7320939
4619 7320939 7226626 7357036 7308167 7241887 7177523 7147498 7141088 7083459 7208706 7344841 7429641
4608 7429641 7478171 7361006 7344035 7563105 7694031 7754283 7690583 7615422 7656939 7670714 7732829
4597 7732829 7830440 7910560 7857815 7801031 7864049 7956484 8015349 8120775 8089965 8135394 8144141
4586 8144141 8218052 8336734 8356418 8320750 8225143 8246005 8314151 8254123 8307013 8489097 8581314
4575 8581314 8532402 8528114 8514650 8524272 8553835 8552754 8542573 8605899 8612348 8487405 8464038 8534309
4563 8534309 8469737 8516069 8476413 8395683 8434795 8457821 8492301 8593088 8639116 8664178 8618312
4552 8618312 8608238 8617207 8570806 8610708 8646661 8622208 8499783 8523362 8561636 8593145 8510673
4541 8510673 8565838 8636109 8597528 8635621 8734226 8796342 8616043 8561681 8508815 8502814 8528442
4530 8528442 8482189 8419490 8537177 8465035 8384714 8291472 8318649 8306994 8201534 8248586 8177359
4519 8177359 8058329 8059798 8091628 8021056 8065885 8092636 7953657 7953883 7962475 7882120 7847871 7723095
4507 7723095 7657240 7743839 7778199 7673353 7632488 7686339 7650557 7537480 7519250 7574243 7462849
4496 7462849 7503894 7509804 7323667 7240317 7332269 7302554 7201037 7212024 7185642 7226442 7201071
4485 7201071 7161428 7043880 7099111 7124845 7109248 7022270 6853789 6945033 7128211 7146861 7051293
4474 7051293 7009322 6960590 6951422 7000530 6885611 6814767 6934982 6905407 6927828 7001659 7078937
4463 7078937 7179784 7089507 6943441 6784377 6786385 6728113 6681697 6688796 6738518 6652184 6682751
4452 6682751 6626958 6596782 6537398 6452556 6384649 6372975 6248468 6320466 6379203 6393479 6292564
4441 6292564 6191868 6391001 6286700 6198550 6213267 6081414 6176635 6284141 6204386 6044118
4431 6044118 6098532 6268505 6170778 6101550 6128261 6120014 6066637 6156461 6093868 6078434 6103390
4420 6103390 6149295 6146737 6054238 6066145 6014768 5963735 6106489 6191858 6130492 6051799 6063395
4409 6063395 6180461 6162421 6070596 6074934 6081229 6044644 6037401 5943322 5900309 5778637 5920596
4398 5920596 5941818 5702400 5737922 5921272 5878738 5883201 5875403 5814037 5775669 5792482 5925743
4387 5925743 5958495 5915755 5892947 6065003 6070593 6143028 5990258 6037114 6014497 6049774 6098837
4376 6098837 6057394 6139546 6183006 6243181 6304974 6415466 6415355 6367956 6396298 6458692 6562966
4365 6562966 6648713 6629815 6693220 6702471 6842525 6853843 6792119 6778258 6926646 7018965 7091347
4354 7091347 7130665 7204596 7274492 7390841 7530340 7690068 7672464 7582752 7714536 7740085 7835547
4343 7835547 7927388 8008247 7996975 8023859 8036639 8261426 8485180 8616259 8926434 9122242
4333 9122242 9247077 9385943 9572423 9799716 9873447 9787742 9635651 9648602 9488778 9466785
4323 9466785 9433167 9264994 9070386 9056495 9239578 9344863 9510645 9433043 9263208 9216726
4313 9216726 9318235 9502097 9460576 9589386 9689592 9882953 9768614 9769852 9839843 9817964
4303 9817964 10013214 10291541 10377994 10409418 10456026 10704862 10741730 10837095 11016355 11147815
4293 11147815 11360349 11509068 11796551 12073655 12269301 12470639 12704100 12997235 13261883
4284 13261883 13546351 13922434 14144913 14513769 14973675 15499123 15939515 16291843 16877586
4275 16877586 17454144 17957695 18498307 19112214 19846154 20490788 21252423 21943599 22726319
4266 22726319 23672281 24578145 25584435 26745544 27958071 29098307 30051459 31321600 32610738
4257 32610738 33926705 35339661 36754467 38221294 39914122 41475082 43105959 44766764
4249 44766764 46548077 48369903 50154850 51926644 53717030 55519756 57473029 59268724
4241 59268724 60825860 62481103 64133386 65882984 67478028 69080335 70608244 72072546
4233 72072546 73539516 74907725 76271604 77475011 78722170 79761383 80628087 81468857
4225 81468857 82280973 83033949 83610152 84020454 84520537 84910551 85322302 85648101 85875332
4216 85875332 86209363 86448345 86581409 86713826 86957824 87172104 87223754 87185412 87258308 87376741
4206 87376741 87506098 87626452 87947808 88349604 88720121 89202830 89587627 90182723 90852537
4197 90852537 91637956 92237428 92961327 93817552 94554958 95513421 96318864 97292471 98392330
4188 98392330 99423576 100477365 101706257 102926766 104154886 105427111 106748440 108000053
4180 108000053 109240807 110553402 111840022 113117788 114341940 115638238 116857416 117978394
4172 117978394 119037187 120072691 121327129 122478571 123543094 124560283 125449018 126449064
4164 126449064 127184200 127843681 128450355 129063811 129511622 129848856 130234760 130493872 130816656
4155 130816656 130836343 130639446 130351105 129992652 129614017 128949240 128220484 127402033 126510925
4146 126510925 125467717 124197656 122827169 121496715 119964414 118098548 116426000 114611433
4138 114611433 112584803 110560463 108605531 106372297 104091747 101771047 99418525 97027019
4130 97027019 94510094 92018961 89638678 87120159 84710052 82313950 79913857 77647401
4122 77647401 75302338 72797586 70653269 68360517 66315273 64354715 62212941 60109467
4114 60109467 58233742 56507730 54805087 53082839 51409032 49715659 48243808 46911990
4106 46911990 45456799 44084485 42660279 41459890 40380424 39228310 38210803 37246322
4098 37246322 36198925 35279742 34364799 33528433 32632410 31872393 31174891 30488528 29740175
4089 29740175 29093206 28468757 28022296 27625973 27233139 26774989 26351006 25972202 25601245
4080 25601245 25327553 25015776 24774763 24520118 24280965 23925399 23754057 23638958 23611446 23573273
4070 23573273 23469224 23410870 23335120 23305790 23282617 23298863 23399628 23430242 23538471 23629685 23704660
4059 23704660 23689539 23882719 24031802 24174432 24444123 24601924 24598438 24820642 25002128 25178689
4049 25178689 25386218 25411181 25602837 25850552 26043025 26256983 26404861 26514436 26800572 26946875
4039 26946875 27027734 27092736 27249158 27371703 27558751 27793652 28019422 28227335 28499608 28647447
4029 28647447 28995108 29196082 29553855 29937585 30353607 30808880 31189618 31916170 32616651
4020 32616651 33274822 34101910 34873549 35881568 36906329 38137864 39583765 41062894 42599470
4011 42599470 44443628 46434426 48418220 50829151 53787445 56860646 60377371 64225010
4003 64225010 68531229 73368088 78580799 84434471 90842999 97699252 104913122 112585287
3995 112585287 120647502 128579567 136316784 143578660 150264438 156227780 161153432 165140216
3987 165140216 168361037 170821647 172762234 174427956 175655154 176712160 177453785 177836543
3979 177836543 177765899 176952024 175536311 173187811 169813162 165450666 160237978 154302437
3971 154302437 147840479 141240441 134681007 128059028 121604591 115503930 109936343 104529916
3963 104529916 99463919 94807931 90481632 86600735 82746845 79239456 76013342 73006378
3955 73006378 70302747 67935346 65857453 64060380 62388415 60967567 59648561 58578020
3947 58578020 57708600 56815438 56122092 55676299 55019245 54637812 54504758 54316164 54304932 54450613
3937 54450613 54488321 54616458 55040779 55409587 55818095 56316210 56885936 57720338 58597938 59554793
3927 59554793 60687362 61823093 63314597 65079935 66785978 68974213 71189417 73693952
3919 73693952 76392315 79412348 82791127 86419001 90164054 94399386 98834785 103547395
3911 103547395 108704427 114001575 119488283 125313520 131339242 137544178 143902218 150203919
3903 150203919 156609593 163035857 169218075 175490871 181376662 186925258 192138602 197201224
3895 197201224 202081599 206571573 210790523 214652738 218176857 221308749 223791267 225822664
3887 225822664 227326678 228232070 228545473 228305458 227459984 226019335 224422272 222448838 220230355
3878 220230355 217864924 215448455 212893053 210339842 207629058 204811154 201897839 199052832
3870 199052832 196079637 192949799 189703578 186747691 183753761 181102497 178512828 176103124
3862 176103124 174126755 172366163 170958634 169901542 169087195 168589578 168573252 168945936 169579356
3853 169579356 170493685 171950454 173700180 175984972 178710259 181843088 185472904 189451971
3845 189451971 193569348 197989763 202389690 206368061 209886856 213007672 215508137 217427489
3837 217427489 218835217 219586009 220286864 220995830 221498109 222018460 222480515 222956849 223163313
3828 223163313 222994001 222483080 221373363 219769716 217776068 215423115 212874797 210304706
3820 210304706 207881799 206051184 204486586 203803421 203676101 204164654 205191565 207030947
3812 207030947 209353925 212014476 215165923 218805414 222883191 227109029 231726960 236667971
3804 236667971 241899596 247234538 252480719 257761822 263057718 268340247 273074286 277504043
3796 277504043 281631911 285523122 288955493 291836652 294367874 296502004 298186172 299377801
3788 299377801 300208999 300592279 300377615 299626219 298353015 296679908 294592291 292102444 289291371
3779 289291371 285978979 282716370 279297422 275851135 272342035 268902997 265456763 262205932
3771 262205932 259082698 255969219 253014411 250152643 247916840 245797785 243980978 242487995
3763 242487995 241403597 240760955 240475762 240388288 240410575 240917086 241522523 242306765 243256781
3754 243256781 244225150 245247534 246423221 247532092 248629609 249749711 250780293 251735285
3746 251735285 252422660 252879222 252937016 252526812 251962342 250883697 249613534 247825058 245634864
3737 245634864 243162843 240271856 237015242 233542936 229823640 225801273 221427927 216784237
3729 216784237 211902979 206727217 201298142 195844420 190192959 184519085 178662535 172820329
3721 172820329 167131171 161577916 156156444 150637712 145069464 139730212 134472958 129525036
3713 129525036 124719375 119857498 115201782 110808476 106589918 102615302 98792554 95026129
3705 95026129 91674629 88361345 85282510 82381034 79547811 76778151 74281582 72060527
3697 72060527 69737171 67637584 65612408 63658979 61899741 60379060 58824528 57283173
3689 57283173 55871079 54486384 53051433 51727165 50664056 49609421 48415562 47253307
3681 47253307 46366487 45500851 44517655 43526266 42551998 41709494 40854673 40043577 39243582
3672 39243582 38345709 37645803 36867106 36182793 35354624 34470136 33750318 33097188 32382095
3663 32382095 31750621 31172982 30393402 29669719 29034279 28388540 27869970 27271567 26781634
3654 26781634 26129970 25570509 25206629 24584326 24098179 23628850 23033343 22628446 22329248
3645 22329248 21871871 21325387 20995700 20722576 20378815 19949707 19599775 19327079 19019699
3636 19019699 18603501 18444199 18157599 17825842 17582728 17247345 16922287 16723789 16545449
3627 16545449 16226705 15936849 15679982 15452273 15352073 15192818 15001766 14772706 14529922
3618 14529922 14437133 14254089 14130635 13852179 13632349 13464525 13548707 13466120 13271575 13119080
3608 13119080 12949312 12640356 12403784 12351633 12248081 12185588 11982815 11921157 11884928 11780330
3598 11780330 11677466 11665090 11548128 11321013 11049813 10915907 10936603 10915909 10687203 10482426
3588 10482426 10349975 10394976 10251578 10118147 10024193 9917245 9723752 9586934 9571054 9283960
3578 9283960 9266523 9141307 8988202 8983117 8938502 8863646 8750076 8566773 8539099 8483958 8443890
3567 8443890 8414514 8307596 8254324 8243710 8021830 8067000 8124485 7895722 7622678 7668297 7676206
3556 7676206 7669829 7697614 7615525 7541425 7502881 7556299 7545706 7554173 7524352 7505646 7285212 7253230
3544 7253230 7193407 7219058 7176428 7154397 6997715 7004339 6937685 6848473 6810187 6834012 6753517
3533 6753517 6765414 6719998 6639171 6554888 6680608 6628942 6507832 6547757 6514867 6490524 6413462
3522 6413462 6445611 6426829 6431700 6336464 6358169 6442707 6478661 6548602 6776818 6733098 6682933
3511 6682933 6563095 6721594 6971451 6997986 6919075 6864770 6802004 6679616 6631766 6723497 6731832
3500 6731832 6801400 6800022 6824136 6800715 6771857 6769696 6806550 6768191 6807374 6789751 6695206 6708790
3488 6708790 6771114 6662282 6796401 6747951 6688312 6876787 6932697 6892775 6806847 6899329 6853366
3477 6853366 6896529 6966443 7044373 7111755 7094851 7143888 7171471 7296897 7417036 7510647 7475845
3466 7475845 7568788 7647335 7742329 7788475 7837703 7917278 8008740 8285592 8334944 8403766 8637136
3455 8637136 8764776 8761016 8816589 8863481 8956293 9154066 9343713 9594773 9849480 9962460
3445 9962460 10041029 10262181 10466842 10709888 11059892 11440807 11879661 12264196 12612648 13101346
3435 13101346 13718257 14125479 14662216 15141045 15503976 16072589 16721207 17090583 17610541
3426 17610541 18137567 18715443 19278914 19826050 20346222 20682593 20923796 21082535 21182952
3417 21182952 20613592 19788384 19082186 18245111 17630999 16842649 16182802 15553606 14937161
3408 14937161 14365753 13733121 13147926 12596642 12231846 11978651 11650158 11381056 11065793
3399 11065793 10708638 10704311 10739792 10787179 11030272 11257036 11583998 12167020 12823488 13375199
3389 13375199 13817761 14438664 15040242 15029686 14058555 13170359 12426490 11620191 11073244 10441611
3379 10441611 9962133 9452583 9120252 8852045 8551545 8245570 7878676 7594008 7423721
3370 7423721 7144568 6785608 6734629 6534368 6355777 6372663 6289337 6370429 6508551 6700987
3360 6700987 6841370 7114212 7392659 7713428 8122032 8299074 8211531 7665840 6945964 6546622
3350 6546622 6359357 6064255 5793332 5497933 5255135 5053475 4864165 4718731 4589832 4495090
3340 4495090 4373323 4285799 4064794 3901740 3754582 3362479 3330856 3305236 2996927 2886013
3330 2886013 2863189 2905742 2743862 2739079 2736687 2706572 2623157 2463533 2483346 2337708 2433572
3319 2433572 2397225 2311779 2163401 2100847 2132046 2206948 2202923 2164269 2124377 2063132 2031422
3308 2031422 2026351 1962400 1933121 1939038 1829562 1817956 1933106 1943444 1868667 1875249 1800724 1803985
3296 1803985 1741004 1706646 1728965 1680103 1758488 1662249 1517394 1530826 1569539 1521358 1467065
3285 1467065 1525736 1585817 1481735 1402229 1505966 1583224 1511504 1334040 1265271 1414868 1404062
3274 1404062 1370182 1360090 1286041 1274383 1365241 1235503 1193609 1259773 1236253 1278297 1247909
3263 1247909 1184397 1185938 1165943 1198976 1108046 1066438 1006021 1088918 999842 993654 1121170 1098653
3251 1098653 1116556 1094293 1060037 1108114 943095 853917 925970 931174 934769 925590 845476 852763
3239 852763 812372 895982 875328 958803 1036498 896629 1064987 1144241 1094840 959667 915622
3228 915622 820229 946413 876047 927286 871440 820074 958679 1009219 788896 813229 749646
3217 749646 716725 716616 815324 794747 780064 644506 679664 706125 713053 832902 903363 814947
3205 814947 778162 753745 678611 631827 512899 586254 565018 657623 695420 624714 679303
3194 679303 689832 591083 673687 743926 668768 696171 767882 655094 653967 826714 883752
3183 883752 813799 655015 629470 649220 652656 671150 781581 707873 810394 840508 738194
3172 738194 710298 673360 677186 689739 706261 795735 874861 717981 787639 799776 830389 833542
3160 833542 835716 785167 759436 845324 689104 635011 613296 628624 790776 783233 839995 871974
3148 871974 848200 962857 983089 869172 966850 1026819 979842 946558 1018196 1081689 1176171
3137 1176171 1111729 1085233 1201488 1144458 1071006 1233378 1267815 1338456 1309764 1310513 1345460
3126 1345460 1478438 1480640 1619120 1745701 1842030 1725986 1814202 1920145 2078644 2041867
3116 2041867 2061094 2287043 2274119 2342429 2591940 2818631 2787964 2808988 2770461 2951008 2871114
3105 2871114 2764559 2886300 2932843 2954102 3022449 3108744 3106529 3104657 3197182 3262281 3254996 3216259
3093 3216259 3304438 3549268 3596081 3712572 3914551 4021918 4127843 4140987 4455412 4666658
3083 4666658 4703748 4755505 4751403 4739224 4602170 4408852 4293855 4165494 4017693 3854468
3073 3854468 3845466 3662491 3561923 3548716 3529501 3481992 3392248 3293393 3179129 3084627 3153908
3062 3153908 3247716 3101028 3110577 3148507 3154462 3060525 2943042 2962803 3103340 3015348 2985979
3051 2985979 3053009 3000020 2973342 2802097 2711091 2638015 2557970 2451689 2225245 2225501 2323092
3040 2323092 2196549 2132210 2048424 1991096 1817382 1602723 1796367 1728373 1662092 1682147 1521050
3029 1521050 1457680 1392590 1465739 1453212 1338485 1251853 1154005 994505 959030 938463 901886
3018 901886 935373 1014477 815319 893237 860249 874697 950603 828863 755757 790008 858001
3007 858001 873068 749540 613736 615126 667412 628930 581330 495166 520268 560480 487471
2996 487471 543106 520225 421254 354826 332384 432438 404021 464869 487260 432372 340589
2985 340589 321135 302146 286349 289912 234143 304617 367212 337735 252284 280886 197615 193773
2973 193773 155853 218931 157515 140042 143913 164918 203801 141759 60215 142690 223708 132184
2961 132184 169231 209856 162503 242214 313795 294644 320874 248976 147023 140324 182994 152925
2949 152925 43969 106013 166551 230681 171387 136613 112170 226275 221725 146906 143935 101934
2937 101934 32690 53041 -1123 35195 -28360 69282 -34987 108193 121463 -9071 82211
2926 82211 58842 -13507 -110150 -40555 -31562 -108187 -146320 -53578 13136 9524 -74521 -108189
2914 -108189 -94305 47271 18303 12694 70942 53999 59774 96627 -38492 -121331 -46080 -114629
2902 -114629 -186132 -178158 -156726 -79677 -43965 -48006 -98061 -80313 -20286 -172030 -53001 164574
2890 164574 43797 -44485 -5214 -25629 -111998 -139156 -101468 -32191 -43401 -145422 -209613
2879 -209613 -97040 -24469 80346 -75916 -126305 1310 38747 -18278 -184706 -89495 -26427
2868 -26427 -168277 -149232 -113556 -11475 -32707 -72280 -87986 -45988 -164269 -164149 -65681 -145885
2856 -145885 -150445 -83533 -193780 -147630 -204016 -73859 -17777 -58453 -98715 -261281 -151637
2845 -151637 -151043 -181702 -125527 -24754 -58138 20676 30661 -90239 -101856 -76565 -145707 -225495
2833 -225495 -170698 -191815 -183563 -200931 -224257 -146009 -141894 -115041 -134881 -121456 -175225 -50066
2821 -50066 -38929 -8639 -68699 -92769 -98313 -129337 -87274 -82956 -174348 -205509 -102147 -67415
2809 -67415 -93572 -85028 -31128 11967 -75248 -110331 -132715 -220566 -200218 -40989 -15789 -11572
2797 -11572 -62812 1309 72666 -64024 -24535 -197055 -130678 -32906 31337 -43563 -170745
2786 -170745 -156077 -158016 -119273 -85563 -152685 -169228 -162964 -148421 -135004 -123133 -213950 -162450
2774 -162450 -43862 -134712 -50330 -72888 -320717 -247990 -155419 -107251 -241021 -196363 -71587
2763 -71587 -163743 -170924 -179646 -76772 -16140 5229 37584 -164763 -234129 -198156 -148112 -103603
2751 -103603 -66620 31510 -64017 -92156 -122696 -100963 30885 -30109 -63467 -63107 -120355 -155844
2739 -155844 -130244 -92457 -249647 -114532 -45631 -45004 -84278 -262337 -240997 -78275 -144288
2728 -144288 -145982 -161099 -103716 -125522 -126546 -115095 -148383 -142258 -256671 -298426 -199415 -209220
2716 -209220 -83661 10290 -74926 -96211 -165232 -127843 -107678 -139810 -148292 -135385 -221555 -293316
2704 -293316 -138961 -99149 -147149 -190914 -214934 -186669 -107020 -80660 -145178 -132194 -125358 -168777
2692 -168777 -288930 -290361 -272724 -219516 -195994 -260799 -243667 -231088 -120393 -180922 -208961
2681 -208961 -139134 -234748 -274567 -315671 -249464 -142767 -144409 -103873 -58566 -163169 -134588
2670 -134588 -200591 -224761 -220795 -251392 -210270 -226906 -226872 -270646 -264179 -278125 -359036 -296405 -234228
2657 -234228 -301274 -189825 -174195 -311591 -337548 -243991 -189098 -270361 -258194 -271128 -310342
2646 -310342 -364531 -165327 -95605 -166951 -166768 -121553 -236601 -211988 -34078 -90437 -189985
2635 -189985 -229785 -137204 -199940 -151130 -237516 -194837 -157511 -205408 -151432 -156985 -202213 -206522
2623 -206522 -124258 -206087 -269861 -244531 -251535 -175414 -143229 -197899 -132136 -210982 -317364 -306622
2611 -306622 -286736 -349194 -379142 -411057 -332589 -128448 -216406 -141553 -142757 -159410 -185750 -279817
2599 -279817 -315372 -221418 -105002 -164701 -142139 -131735 -137018 -19180 -29734 -88536 -85117 -109170
2587 -109170 15923 -187851 -254169 -277774 -195577 -113942 -211131 -205716 -227082 -234059 -156992 -234942
2575 -234942 -232716 -125976 -106856 -133915 -50371 -133298 -210415 -123144 -96492 -17684 -30761 -50331
2563 -50331 -122215 -230747 -178749 -306444 -179803 -181704 -277781 -331623 -320589 -162437 -194219
2552 -194219 -70628 -108035 -192146 -258042 -226345 -139403 -150048 -233417 -276774 -205670 -126727
2541 -126727 -80788 -105797 -64853 -223500 -299233 -261180 -244861 -109143 -186401 -170384 -135284
2530 -135284 -242450 -224149 -137859 -141548 -60536 -160434 -237483 -189479 -117205 -172309 -194578 -75834
2518 -75834 61296 40066 -118066 -260375 -292488 -267902 -111234 -40968 -109386 -88530 -126848
2507 -126848 -57010 -90345 -131116 -76873 -107944 -143674 -95107 -90367 -223856 -167605 -65338
2496 -65338 -78214 -42080 -104490 -178848 -185196 -196340 -262982 -211661 -178907 -83730 -118927 -217325
2484 -217325 -174653 -139416 -46338 -53719 -97489 -4179 -41677 -109205 -48321 -97257 27566 405
2472 405 -68647 -157991 -94240 -59904 -99669 -197184 -43816 82300 33380 13490 -78533 -75486
2460 -75486 -52197 -77494 -125595 -166703 -97979 -71066 -56090 -48321 3343 -72794 -82055 39470
2448 39470 3589 -123091 -161095 -134010 -32802 -138279 -181867 -139660 -188080 -208949 -136669
2437 -136669 -132721 -165988 -65041 -69373 -109874 -62821 -103979 -94526 -66101 -41500 38706 -57068
2425 -57068 -148297 -196088 -125177 -240494 -144373 -100340 -139975 -197950 -158177 -146066 -104614 -51916
2413 -51916 -61963 -46113 -1581 151013 86931 783 15295 -28652 78803 -106731 -137661
2402 -137661 -99072 -20466 -27310 -122914 -56185 89477 36435 -107360 -19345 95575 26676
2391 26676 -34562 -15605 -36302 -123093 -65125 41946 -79128 -79748 -54168 38205 44453 12327
2379 12327 62537 79089 26140 -103019 20407 -10586 -59686 -18212 7553 23155 -17553
2368 -17553 -49786 24212 110234 135948 75093 111956 188795 192087 250232 239939 6649 -70091
2356 -70091 53209 19928 59339 73045 20935 18163 69146 103849 114788 59923 30066 83368
2344 83368 80386 83295 62527 110505 220218 243777 241029 98207 214934 405555 362201 300865
2332 300865 238541 319121 401659 399960 425924 431718 415373 442337 509062 519272 639360 767582
2320 767582 665762 720838 843267 956930 1016084 869390 891645 1158814 1309146 1463650
2310 1463650 1629642 1774534 1982958 1960447 2216021 2488037 2720161 3095190 3358632 3646067
2300 3646067 4055757 4446499 4898032 5499943 6016803 6730638 7481625 8217481 9205003 10632983
2290 10632983 12700259 15057132 17375304 19076685 20984730 22601448 23209920 21329721
2282 21329721 18751486 17119857 15655228 13894222 12350974 11494311 10744951 10073704 9523664
2273 9523664 8988093 8498113 7940927 7329823 6846231 6105357 5413284 4962960 4561095 4167465
2263 4167465 3775468 3333195 3000822 2839719 2720884 2493114 2469363 2400554 2177213 2123910
2253 2123910 2020179 1863007 1855990 1754964 1705540 1554241 1458944 1538217 1476512 1326923 1234444
2242 1234444 1154944 1029187 969012 1026571 1104822 1073299 986402 955367 915652 776511 578490
2231 578490 724221 685198 645068 614660 542784 650815 617037 519261 461974 471693 478266 459059
2219 459059 406945 308688 268406 260595 244720 159012 117920 108222 205809 183957 223665 134385
2207 134385 165446 298610 108668 100119 143844 211013 216287 262535 177341 164282 250123 207474
2195 207474 252268 113480 79901 153858 293119 172422 120757 153806 157834 203758 120834
2184 120834 171043 140011 130307 114511 84740 68012 48246 48799 134608 165796 9123 28150
2172 28150 115369 117404 165180 214335 196037 154324 100769 140139 132084 78348 54384 75249
2160 75249 -42904 -18842 11374 58726 95243 37921 -37424 -67661 27968 57189 156858 177297
2148 177297 211068 227903 200552 102953 116426 78571 24609 100422 -21268 -23911 95078
2137 95078 46676 45093 138324 120187 104544 64020 108266 18568 -4403 87443 168444 -22919
2125 -22919 -85778 4421 119705 140938 59927 87732 -5023 -69356 -124067 21610 26474 -50367
2113 -50367 -86626 -111539 -129727 -140319 -39524 -26863 -5659 21952 48224 26229 -83952
2102 -83952 -66372 -69072 38396 -118518 -77347 -44309 -138247 -135142 -128289 -190661 -216334 -126112
2090 -126112 11648 32170 98240 50402 65600 -115620 -246418 -168898 -65276 -81434 -201643
2079 -201643 -183854 -137515 -88588 -71861 -143108 -83827 -66348 -84511 -137573 -89046 -62025 -39146
2067 -39146 -21498 -72043 -100034 -62529 -73960 2817 58393 31951 90718 26909 74025 37642
2055 37642 -43854 -88662 -51943 25505 48098 -52799 262 -21764 -14339 -20840 -144106 -9881
2043 -9881 1624 71994 89413 15283 27223 98656 99363 3975 -45643 -58192 -28547 -34830 -37565
2030 -37565 -15850 1195 -8741 -14148 -212005 -132722 -87685 31254 29041 -2886 -44863 46352
2018 46352 121726 101198 12976 63992 44287 63576 -21882 -21077 109945 74284 91422 134302
2006 134302 111811 74012 21898 28093 -20810 -42151 -142801 -81504 121030 115517 135686 119734
1994 119734 124326 -20072 -36661 -12501 -113971 -69714 -129740 -96394 -22702 -41806 -17117
1983 -17117 4171 -28951 -108725 -92166 -97499 -89858 -195676 -210621 -163787 -98617 -113978 -86733
1971 -86733 -114497 -95975 -87431 -110687 -23524 -7259 -88473 -29789 -104277 -134293 -104221 -151679
1959 -151679 -104737 -26097 -49826 -140584 -130829 -17035 89450 40023 -62140 -103562 -127156
1948 -127156 -63035 -123169 -165927 -123694 -25085 60970 121741 -78120 -189482 -111165 -107122
1937 -107122 20915 45818 91024 137618 118966 99449 29885 -25157 4158 50285 -60382
1926 -60382 -44799 81336 -12066 -19496 20068 55299 39525 -142276 -188192 -172237 -155152 -76295
1914 -76295 -76459 -106142 -59644 24595 75800 143079 -18688 -105258 -74935 -120415 -20063 -205028
1902 -205028 -261225 -181956 -229723 -80425 -152080 -221942 -143658 -164536 -242403 -128380 -111139
1891 -111139 -80910 -208319 -249268 -134535 -71909 -38680 -70368 -49780 74905 60855 -30824
1880 -30824 17309 3558 10364 -12884 -115728 -146304 -39414 93938 -18564 -77262 -202496
1869 -202496 -172169 -190779 -240470 -174898 -159367 -176119 -141812 -142801 -247334 -131214 -114228 -172429
1857 -172429 -131345 -58902 30364 23446 -39290 2902 -25839 42833 39255 -57795 -120426 -134473
1845 -134473 -158499 -112191 -111882 -84809 -144342 -175439 -294681 -284607 -157322 35108 -44355
1834 -44355 -65156 11912 41545 136704 227534 83940 7437 41467 -41176 -167214 -214937
1823 -214937 -203165 -93843 -77797 35715 59088 13748 -4033 -164949 -85493 -17985 5884
1812 5884 65910 -94191 -105410 -19182 -37235 37223 61178 2034 -95833 -87272 -41479 -66979
1800 -66979 -185574 -111533 -110999 -137358 -111326 -84864 -13690 -129439 -112903 -95867 -96253 -204234
1788 -204234 -260050 -164224 -190974 -105731 -60007 91475 -143814 -60320 -54691 -102589 -196581
1777 -196581 -214148 -153440 -147373 -26379 -84492 -116712 -55719 52938 98954 40363 21527
1766 21527 -14992 -67380 -109545 -27423 -158396 -249108 -152236 -48757 81845 177417 97521
1755 97521 -108049 -72144 -34635 -1692 -28457 -141500 -108162 34442 70753 -6489 57385
1744 57385 15621 -109756 -152939 -50537 -61147 -87804 -140700 -136246 -24058 -2291 87216
1733 87216 78125 -32954 -134023 -255805 -216879 -189828 -321541 -213820 -135570 -157061 -203878
1722 -203878 -154278 -98559 16190 -33323 5644 -21265 -71363 31390 29053 -91548 -83582
1711 -83582 -127001 -70548 -13365 -74942 -37778 74568 32962 3623 36375 9310 -6957 -88540
1699 -88540 -7919 -28404 -142489 -74303 -161674 -130309 -9723 -61889 -94182 -117430 -186335
1688 -186335 -157121 -64942 -77418 -94851 35634 32023 -99763 70133 142968 -47706 -206389
1677 -206389 -70500 -42096 40518 12708 59455 53045 91287 29840 8702 -34065 -16172 52350
1665 52350 -88692 -81253 -12356 24844 59438 13386 -155015 -108762 -88014 -74772 -176969
1654 -176969 -177554 -134152 -80925 -70181 23499 3364 -116393 -81558 -30972 -64126 -115774 -104503
1642 -104503 -116504 -147242 -36264 -33187 -57142 -45044 86700 18844 -8185 49342 71405
1631 71405 4535 -115591 -201874 -204121 -138092 -148749 -120473 84926 -46172 -141523 -157232
1620 -157232 -211521 -155130 -22164 -48785 -85845 -7062 13676 -43281 -13946 39052 -23224
1609 -23224 -36999 -68756 17029 74503 136032 -17886 -20585 -83875 -129488 -74343 -15436 -6413
1597 -6413 -7893 3716 -60919 -96581 -96841 -52664 4530 -121153 -80847 -25215 -1470 -2683 52363
1584 52363 -50893 -21240 -10872 18057 -50529 -65854 -60079 -237240 -114099 -190702 -204117
1573 -204117 -15766 15711 89327 101457 27672 -74188 -7748 21120 105936 87944 38253
1562 38253 50072 -72358 -140063 -229554 -141711 -128830 -112259 -55862 -688 -17945 32202 105668
1550 105668 40122 -79940 5193 101360 23386 288 12407 -52239 -108142 83249 103791
1539 103791 125284 135630 157075 164623 173180 99754 14864 -6914 -40449 -959 -17958 2774
1527 2774 77636 -26734 -101743 30742 -19461 1418 100554 28242 12039 63052 -26372 93857
1515 93857 111780 60314 -97887 -64617 86152 31606 920 -2306 -22483 83368 47797
1504 47797 65052 110837 67635 48255 22709 -22304 -26408 18282 115364 90752 -45736 -93383
1492 -93383 -80029 -115051 -83194 -31443 83124 6559 -88132 -6792 -43393 -15689 41697 110750
1480 110750 19093 72182 31872 -23100 34217 41454 -53867 -126948 -136386 -19378 -16261 25502
1468 25502 36895 -48931 39250 22839 -19814 26486 29193 77168 60942 33815 30942 8571
1456 8571 169525 219059 4804 -28901 50272 186347 147486 139999 189815 129749 36911 10072
1444 10072 -16169 -65189 19306 68839 -20627 -103108 -17645 33455 63565 60545 7429 2343
1432 2343 109897 92309 154781 72558 -2329 -118024 -154830 -13186 165495 172457 74593
1421 74593 -31332 2876 163871 112963 -45753 -33703 37717 9024 104800 105312 -10631
1410 -10631 25089 44342 63409 -46872 108885 193706 99057 132382 55264 147822 180577
1399 180577 133462 55385 75053 79038 48574 -9251 47555 157262 226519 169472 160947 126296
1387 126296 76135 60302 116258 174943 121298 197122 270038 324301 256761 97526 -52557
1376 -52557 13658 -6421 -38910 -128636 -93315 -4766 33138 35816 65273 174032 14531 -65798
1364 -65798 -24661 42157 -9531 -45505 -24840 -21222 -30031 -6019 22121 4006 71960 180768
1352 180768 165240 42991 -13409 -87723 16358 62110 85272 109036 -5386 -54988 -205383
1341 -205383 -64342 73119 84214 31063 13187 45532 71671 -109741 -29491 44907 -12831
1330 -12831 48945 -36577 -120801 -24287 48268 14166 -20098 22053 15974 20601 16657 -35053
1318 -35053 -66496 37923 154018 220442 253986 143264 144470 165378 169189 138971 154214 183494
1306 183494 7564 -16061 -12005 -9337 -3859 -73949 45338 156061 116035 43763 100214 65090
1294 65090 108636 110945 108524 138354 67239 4242 28704 -52591 -91140 -234328 -127356 -23057
1282 -23057 -31420 91850 158718 192087 147720 91672 -9495 -32621 -42015 -74453 -83456 -62255
1270 -62255 -64503 -27804 116710 119330 69749 -43215 32136 24869 -55307 -58881 -78833 62550
1258 62550 179576 153770 49966 3360 -118284 -68153 -4218 -10287 -119662 -113277 70270
1247 70270 52663 21059 -41466 -29697 131810 91635 69601 13852 -22823 -45563 -34438 10888
1235 10888 -38677 21430 9485 -100092 -14969 -34599 89279 128644 -47 82666 63371
1224 63371 37742 88023 80917 -8172 43029 62242 123504 30993 108833 114633 113167 91662
1212 91662 -132445 -58676 -77756 -19438 91836 -26397 -96833 -79069 -33648 76008 127255
1201 127255 145901 46276 132657 117858 88916 65288 74741 83343 43369 60926 -4606 1503
1189 1503 -56096 109973 12576 78022 180476 44773 7586 -13644 12122 16667 57322 94469
1177 94469 -4180 -10657 38717 -54041 -44034 -140 -27504 20911 25563 112597 19465 -183014
1165 -183014 -74317 75961 45411 -73723 -10088 7250 60624 84020 1767 13381 76158
1154 76158 85808 40821 86371 65071 2959 -47427 -104209 -85265 -22061 14547 8868 13589
1142 13589 97297 18150 -32310 50838 -54196 -135450 -93863 -134916 -123110 -113204 -110059 25629
1130 25629 57569 76242 56831 54661 56487 -66305 -61100 55195 -45214 -41979 -94669 -76280
1118 -76280 -114563 -24116 56397 37640 57394 -49275 12342 35401 159932 133577 207739
1107 207739 154778 -88318 -11403 221385 214047 155111 76883 50300 92801 -49478 -38182
1096 -38182 45312 48725 -7221 120152 7588 -36438 46466 51887 186387 64881 -51254
1085 -51254 -47699 -139677 -89861 -113089 -5869 -8838 64881 154979 175293 57325 -31333 29801
1073 29801 108821 25329 -4282 35521 86085 82250 -49832 31162 28692 181545 81887 6384
1061 6384 14135 25245 96987 35565 103959 23483 -32462 -32729 43917 51244 98459 89355 10880
1048 10880 18097 93108 55223 98385 113819 111026 -24037 28441 126648 144922 19230 8214
1036 8214 2627 -143450 -83745 -195215 -119459 -87617 -37017 -161304 -87505 21995 138294
1025 138294 118785 140895 115274 -19472 83137 115587 101604 155993 65823 121773 48374
1014 48374 113850 156016 127260 60751 32045 -47997 -89649 -99125 -48842 3572 36253 66833
1002 66833 53068 -50692 -47204 -78926 145999 50862 16426 90646 39948 -46537 -78880 -18489
990 -18489 22309 100446 169981 190706 118457 174410 78455 53264 45640 125003 61295 -15059
978 -15059 62619 91103 112222 149676 31568 -13043 -14732 -9618 -11151 -21512 127258 150595
966 150595 20848 18742 -96809 -112738 -35673 52815 27653 30943 30109 53193 42702 -26439
954 -26439 97673 98768 -22975 128523 47252 172165 68038 -87343 -67743 40472 81657
943 81657 -54592 -36818 22276 129800 99942 58915 30883 73708 17659 27886 113527 129198
931 129198 -119942 -83705 141560 102538 109607 151833 104929 -2031 -57967 2460 -68756
920 -68756 -97643 -36776 18817 151579 141157 107013 -81558 62911 56063 68986 3302 8721
908 8721 -2557 -1701 33612 41189 118736 135384 88641 120224 99342 87731 63162 -22508 -72097
895 -72097 -63372 -6107 -20056 -60193 47248 21295 -10091 68735 101644 20953 -65991 -18322
883 -18322 -2114 -10201 -47612 62899 145361 233921 57309 9852 -15445 -51197 -5501 4380
871 4380 35949 108171 172714 128859 61655 76145 -45799 -7664 60561 -8809 -70050 31720
859 31720 130382 43877 -70054 5165 105483 150027 23886 -216690 -84124 -50723 -48630
848 -48630 15637 13257 94602 -3813 -28287 116088 70539 -2782 -72487 -56937 -5387 -5724
836 -5724 80109 153165 108880 14946 98746 50913 -55544 -34758 -44983 -8966 95675 -64909
824 -64909 -125488 76366 120974 32210 57217 236541 148255 80003 27933 -126260 38085
813 38085 11559 137158 236516 150184 76939 30497 55153 37586 1901 -48742 -9383 189019
801 189019 143679 133177 17546 8203 74476 -55488 -38174 65558 96248 159437 33357
790 33357 22352 -27330 27063 75366 -44611 -109436 -107236 189 -31952 17903 134707 215343
778 215343 144585 5737 28266 45925 78747 134965 143918 210962 177726 42558 -47232 -3701
766 -3701 -71024 -44510 113867 174082 285754 175721 -19079 -14096 7378 30851 -101699
755 -101699 10995 95045 57900 72159 24936 -20066 56790 -31570 -21030 137846 61902
744 61902 72389 146661 107653 104120 81542 136667 136403 117724 111112 92624 11146 13783 134670
731 134670 33598 -79011 -48182 49742 122154 79029 43524 -75531 -4164 18222 -7531
720 -7531 -14793 37002 2628 -115418 -76302 46257 -53503 -111001 -121835 -84776 -55566 -12920
708 -12920 -10279 -72138 -174119 -80477 -62659 -18869 -70906 -159272 -132301 -30241 23964 29262
696 29262 -106008 -107601 13096 28557 54243 21311 121675 111222 221021 242489 186312
685 186312 154413 47247 92047 54078 77909 93907 86103 112740 90502 54604 -73738 -40324
673 -40324 39743 85870 151775 200782 98513 145119 61836 51499 -13600 -10939 60887 104167
661 104167 19791 -24904 -51764 35680 124737 78458 72564 90099 -98904 8187 -31687 437
649 437 36859 -4322 82637 52641 57343 46062 123117 122708 72006 -61622 -5986 36173 7276
636 7276 76483 99795 21847 140183 130799 63265 91277 71650 -31367 -45816 -25240 3038
624 3038 -58198 -34425 -16707 24968 21245 -41814 -15996 -40733 -28347 -4056 -117924 -5984
612 -5984 68058 -3539 13832 -70792 -25963 -29837 66103 53379 56442 5584 -31163 65205 77393
599 77393 56406 51978 21379 -9897 -97393 -200039 -81225 61455 -19758 -51480 -118731 -111997
587 -111997 -60690 -113887 -154131 -126041 -27144 19957 -25467 68541 -17914 37961 -8044 -5032
575 -5032 119132 57562 12543 47105 59807 -58055 24389 -56428 -78401 16660 36471 26292
563 26292 1482 62812 87541 -50999 -123265 -19555 54376 48736 -3906 -12204 -71962 -4461
551 -4461 36876 50112 35673 -8624 74434 41769 -7720 -34517 -38159 -93683 -51471 894
539 894 -3892 40624 39827 -18881 50820 62244 60091 49043 31637 -4033 -53742 24184 61349
526 61349 17435 -39976 5488 26471 21440 84791 52585 61988 90811 96319 42600 49662 28642
513 28642 -84373 11324 74870 123065 -22404 -112241 33194 92220 118733 125989 104714 -25947
501 -25947 -154305 21850 -41903 -253929 -201676 -103795 93652 92310 74320 95113 105229
490 105229 154058 199278 31238 -208557 -81749 40233 8405 -104055 -222233 -193490 -117360
479 -117360 56610 1824 44292 96680 89670 -40334 60700 98203 127652 60942 14768
468 14768 -113628 -39863 -36152 -95573 -39888 -121800 -142847 -84737 16854 -30991 -72594 -114028
456 -114028 -121240 35508 53652 -110244 -106342 6828 19390 16595 -26116 -110697 -172915 -63534
444 -63534 -55328 -95660 -161814 -99996 -35720 -65761 -62954 -37272 -114715 -193122 -204960 -296109
432 -296109 -181229 -133096 -123034 -86452 -21790 53962 -7191 -27918 39372 -54724 -50672 -63817
420 -63817 36613 -1572 -12536 -21348 -18294 13751 -9411 13991 -74599 -122569 -43037 -27592
408 -27592 55328 30133 72567 -8646 46495 77865 88098 -6986 105376 -68966 24519 -24007
396 -24007 81041 146259 83559 134797 82928 117633 89961 -26948 -139912 -84006 -24719
385 -24719 18462 75842 16714 13267 66633 24916 25951 64927 205964 126665 3812 -146871
373 -146871 -75122 60649 68837 4141 -44347 21909 -67729 -109510 95854 133514 95085 18061
361 18061 130028 126467 88921 39079 -59524 -58153 31826 -22132 -79204 -98579 -84214 -70986
349 -70986 -116623 -84930 -102816 26014 95050 -24794 -100920 -160714 -91601 -26686 -31332 -72088
337 -72088 -83103 -5458 5723 123354 126390 130541 84791 72304 52661 69537 116221 -38586
325 -38586 -112693 -12467 60015 -28296 -27127 14007 97989 115518 56530 -34307 -11398 37524
313 37524 110838 60950 41722 2194 76527 96516 -2760 110486 221556 205925 147391 159211
301 159211 81685 82899 -12164 -62379 23555 5988 -56986 -59001 -59973 -77346 19799 -72051 -37307
288 -37307 46925 177612 32596 108268 161827 67043 66969 133476 15294 -53986 11413 -100257
276 -100257 -70076 28422 86306 36090 -125168 -72324 33508 1380 11672 -11907 -119483
265 -119483 -114680 46692 43984 -88188 -57979 -45246 1537 66131 328 -95325 23849 121805
253 121805 77975 22378 -111374 -88674 -31626 -35307 157858 76639 140840 110548 2000
242 2000 -6058 -148610 -117462 10810 60185 90307 84983 -102224 -131677 -89441 -83250 -145602
230 -145602 -18370 -80764 -59192 -52748 -2945 61762 104809 107129 158038 38996 -19283 14686
218 14686 -26134 33502 -35020 95472 196000 -10462 -189414 -143264 7772 30465 -56393
207 -56393 -156142 -165905 -119568 -44258 -50889 -123777 -136145 -36260 4742 9162 -44388 -66283 -40280
194 -40280 28290 58735 115691 147015 40734 -36845 -5049 -112574 -159127 -144451 -62788 -56302
182 -56302 -93146 -59638 -49856 -81685 -65296 1917 -29935 18517 92086 24113 54045 41863
170 41863 -30929 -39589 76050 74975 -16772 -115562 30219 56654 22822 -34615 -49016 -91632
158 -91632 -77014 -13756 -64430 -12873 -99232 -47850 -34623 -44431 22426 5530 -10077 -27042
146 -27042 -61364 -39769 -39063 16440 -59788 -87893 -40647 -36356 -47165 -26882 18441 -33189 -44240
133 -44240 -33435 -16462 62978 11328 32645 52306 -56096 -85393 9618 106580 49350 -16233
121 -16233 -30592 -156463 -70832 38194 92623 45864 -56101 67548 115459 108046 162999
110 162999 57639 -6327 -49060 6141 -61328 -120248 -123290 -81144 4884 1430 -4361 62887
98 62887 -57383 -205591 -116532 -23965 -87815 -95607 -85659 -56092 -5785 -17649 -74324 39214
86 39214 32067 -120761 -35905 -13945 5126 -15848 -32026 -50481 -94074 -84164 -53578 18150
74 18150 -55764 -80333 -83644 -72438 -27449 -69474 -27440 -49549 13923 39997 -106275 -87999
62 -87999 46619 115516 21025 -85014 -129802 -77919 -122603 -94974 -75344 -42324 -119949 -244843
50 -244843 -169065 -84495 -8075 7606 -4087 12402 -16332 -7926 -15027 37690 -32367 -42538
38 -42538 -48988 -129061 -50425 -29428 -68555 -57989 -58510 -79452 -140422 -85019 -65691 -139304 -144359
25 -144359 15411 34999 -6343 -56651 -78428 3244 5526 11963 -61975 -89591 -69018 1385
13 1385 -100417 -131384 -91077 -29215 -82657 -116802 -36649 -10510 -88928 30857 44533 -39134
1 -39134 -50092
0 -50092
$$ Imaginary data points
##PAGE= N=2
##DATA TABLE= (X++(I..I)), XYDATA
16383 -2002750 -1896917 -1957688 -1959462 -1780919 -1694815 -1709252 -1660341 -1496147 -1517609 -1519301 -1434872
16372 -1434872 -1363126 -1242549 -1215368 -1089769 -1097227 -1073271 -1025079 -963492 -932884 -952159 -898023
16361 -898023 -729197 -602464 -658689 -592317 -662869 -669851 -616441 -508620 -382577 -339453 -297213
16350 -297213 -194238 -256510 -255566 -161771 -87204 -62518 -47003 21128 201165 201416 238040 208110
16338 208110 231981 268429 339772 451799 542407 537984 596956 634351 654253 750388 720019
16327 720019 764309 788704 870840 876260 1106468 1079285 1109855 1178087 1269131 1380716 1354124
16316 1354124 1436908 1443347 1468468 1476287 1551165 1521853 1584449 1656803 1639108 1654621 1823782
16305 1823782 1849051 1847305 1824604 1881866 1906380 1982334 2063066 2119680 2179966 2323831 2356782
16294 2356782 2336797 2352659 2401286 2487617 2487960 2569941 2554578 2561061 2653338 2812384 2881492 2866226
16282 2866226 2844592 2888819 2931022 2972419 3019631 2938767 2889282 2977603 3010834 3068711 3226333
16271 3226333 3183828 3156240 3255145 3345750 3329182 3337037 3461525 3486545 3489908 3549169 3551086 3596265
16259 3596265 3641315 3711199 3726504 3791653 3737983 3649348 3692461 3803677 3868875 3887989 3868156
16248 3868156 3870688 3983951 4082104 4147221 4082595 4116954 4106538 4117713 4165739 4136885 4134203
16237 4134203 4236068 4261909 4190373 4235494 4277608 4236687 4311982 4425428 4448703 4476860 4432031
16226 4432031 4425088 4487467 4458040 4456924 4572708 4647086 4597876 4632860 4583575 4651184 4731217
16215 4731217 4840569 4822000 4834997 4871717 4953761 4903367 4909229 4896175 4927229 5033624 5068406
16204 5068406 4988662 5014321 5107260 5003021 5009097 4918538 4899582 4981337 5159180 5194768 5205501
16193 5205501 5287289 5354529 5263542 5275854 5241928 5317700 5375764 5406448 5419304 5440976 5480477
16182 5480477 5410371 5468004 5430531 5386447 5261428 5271661 5283015 5361403 5355382 5420038 5577422
16171 5577422 5530182 5569410 5579852 5520886 5586862 5633846 5746092 5772774 5639922 5579582 5580363
16160 5580363 5545052 5591921 5573583 5577661 5592427 5688328 5793066 5847954 5883837 5820071 5881809
16149 5881809 5862113 5766622 5843330 5850753 5944690 6079713 6058493 6020966 5895347 5945431 5911465
16138 5911465 5859342 5874510 5898305 5821185 5834450 5960608 5842029 5847231 5889782 5890761 5994220
16127 5994220 6019097 5973422 5889782 5978555 6093119 6057228 6026011 6040432 6043745 6081097 6072142
16116 6072142 6062314 6123607 6147719 5949794 5921637 6065513 6059278 6071246 6053277 5982578 5988561
16105 5988561 6056568 6063304 6058057 6091588 6076793 6074419 6072896 5995938 6105152 6151446 6064730 6140554
16093 6140554 6204465 6099846 6074654 6069350 6055572 6040201 6099002 6180505 6230431 6097071 6013115
16082 6013115 6149501 6164118 6178419 6194946 6248514 6296407 6145358 6035981 6168829 6204723
16072 6204723 6189677 6207404 6275882 6180495 6145162 6264764 6258879 6242443 6399898 6397759 6297933
16061 6297933 6227614 6246270 6295368 6234108 6192523 6308284 6375835 6303117 6166744 6189948 6170037
16050 6170037 6116148 6228328 6290611 6281021 6224455 6183665 6095728 6131470 6047502 6046927 6214993
16039 6214993 6122379 6073649 6198587 6370374 6291142 6208710 6169074 6276028 6367040 6390013 6295663
16028 6295663 6283217 6349182 6306998 6358215 6258094 6301043 6282593 6245854 6182807 6169971 6247903
16017 6247903 6291461 6239588 6317110 6407883 6359522 6350231 6263210 6317958 6344600 6486813 6481998
16006 6481998 6369281 6269023 6317426 6363932 6306706 6285362 6191731 6250196 6288976 6240130 6229423
15995 6229423 6277220 6204793 6217433 6255164 6298289 6407903 6418463 6275959 6240092 6282499 6235513
15984 6235513 6167827 6330068 6464927 6504203 6416202 6246735 6174025 6317741 6292015 6283483 6267968
15973 6267968 6196527 6167939 6139157 6157266 6258244 6342373 6374193 6375694 6241000 6203794 6195070
15962 6195070 6341983 6277935 6238749 6240392 6256911 6307662 6181977 6205961 6229978 6239386 6313085
15951 6313085 6452749 6371982 6295509 6316034 6344299 6270160 6291719 6400789 6412524 6445662 6385369
15940 6385369 6318110 6385976 6411363 6384510 6435924 6325664 6348927 6395152 6376935 6393045 6436368
15929 6436368 6478776 6360008 6324268 6201762 6214481 6265469 6349975 6443274 6413782 6351338 6409412
15918 6409412 6502261 6366280 6430962 6375500 6311488 6292482 6319237 6487535 6493610 6559875 6450573
15907 6450573 6308404 6289990 6295892 6275110 6210725 6182979 6286956 6445152 6400933 6338567 6406224
15896 6406224 6299419 6382089 6303353 6282631 6437655 6483594 6466543 6395687 6493922 6296803 6375879
15885 6375879 6266073 6121408 6104069 6189487 6278493 6338526 6355275 6271348 6345542 6330123 6305858
15874 6305858 6281400 6232204 6268971 6333738 6439449 6442437 6350308 6351891 6333177 6337558 6310840 6212552
15862 6212552 6230962 6361072 6288093 6279612 6409008 6437833 6400830 6300171 6293597 6417283 6324819
15851 6324819 6244317 6283731 6369137 6364584 6204516 6250125 6313015 6327545 6182124 6190896 6361197
15840 6361197 6479583 6331546 6295158 6264240 6198263 6210184 6263591 6319830 6474546 6334505
15830 6334505 6364118 6526443 6494909 6441095 6385631 6293793 6301713 6275845 6322861 6490806 6513149
15819 6513149 6434176 6446032 6426585 6320205 6380682 6310492 6356947 6455966 6537877 6385616 6269466
15808 6269466 6363948 6444975 6471847 6554884 6361524 6377582 6236352 6302083 6418325 6438328 6391696
15797 6391696 6382097 6458556 6463460 6532286 6549536 6410447 6356348 6398859 6404097 6401613 6354561 6320623
15785 6320623 6465577 6602397 6444512 6598038 6654134 6530751 6425078 6416788 6375669 6346421
15775 6346421 6500246 6475682 6305772 6343838 6304780 6336202 6338565 6394721 6402657 6391455 6417526
15764 6417526 6411032 6549389 6579670 6584913 6691736 6648830 6575057 6482222 6464028 6504332 6376808
15753 6376808 6354569 6406913 6403982 6429698 6523690 6364038 6286935 6279379 6373014 6298458 6311890
15742 6311890 6252679 6177284 6283962 6412893 6485464 6410844 6343012 6287902 6303771 6273304 6279232
15731 6279232 6338331 6318003 6546542 6584374 6538230 6534755 6384940 6295373 6468802 6507428 6475849
15720 6475849 6538272 6632166 6576364 6509099 6548058 6483548 6398899 6402902 6574270 6505444 6431540
15709 6431540 6455136 6586154 6495363 6520161 6484384 6479451 6476528 6506820 6534664 6559911 6640827
15698 6640827 6690883 6546757 6559277 6525943 6537807 6566236 6530972 6506492 6441008 6483424 6418307
15687 6418307 6460521 6379849 6391720 6397015 6433675 6361066 6320341 6502751 6527411 6484825 6488858
15676 6488858 6485322 6415180 6432351 6409997 6532174 6532264 6429202 6386651 6385340 6446489 6413551 6438022
15664 6438022 6394998 6611083 6511722 6437333 6525049 6526012 6577447 6561839 6494241 6587466 6577557 6548513
15652 6548513 6503393 6491656 6547374 6493496 6566727 6460635 6463563 6347175 6433672 6386775 6465423
15641 6465423 6446424 6363629 6523711 6422003 6345661 6438786 6543428 6559417 6534602 6507902 6461142
15630 6461142 6524758 6536406 6578477 6537244 6431359 6419163 6538943 6440979 6360426 6494133 6578527
15619 6578527 6527613 6579633 6549743 6452309 6514009 6468855 6456974 6447784 6630286 6675370 6598859
15608 6598859 6605885 6591741 6568611 6486774 6388170 6542803 6587124 6508201 6498743 6557811 6468543
15597 6468543 6454606 6452540 6355054 6343244 6521030 6560393 6483395 6458411 6560418 6592470 6571655
15586 6571655 6518949 6593704 6711784 6655435 6538753 6694688 6578944 6588976 6641069 6643302 6645457
15575 6645457 6585578 6545556 6443883 6410731 6420103 6401144 6548031 6631978 6577981 6605804 6366806
15564 6366806 6363603 6490173 6547895 6601805 6586970 6620431 6620814 6542504 6481438 6445366 6583558
15553 6583558 6531549 6565503 6615643 6620106 6472054 6446037 6518271 6491227 6447168 6500617 6556223
15542 6556223 6513543 6529546 6460701 6490766 6587334 6522196 6569859 6503652 6419646 6430504 6552029
15531 6552029 6568507 6450707 6573941 6539734 6473528 6515956 6524698 6643431 6680631 6608832 6433828
15520 6433828 6500478 6510112 6603305 6540243 6468352 6554659 6490179 6459510 6512675 6488239 6440553
15509 6440553 6552442 6571913 6582617 6527889 6461606 6524083 6776058 6754341 6639114 6570318 6515663
15498 6515663 6564411 6565044 6654510 6661282 6515198 6518844 6489909 6409506 6503732 6707234 6636074 6543639
15486 6543639 6547290 6557469 6532601 6506317 6490207 6567586 6620397 6581865 6513269 6504534 6634796
15475 6634796 6741017 6767868 6639102 6598637 6583120 6579677 6661765 6664414 6715720 6649750 6693538
15464 6693538 6790809 6671990 6621263 6616353 6565382 6563978 6462785 6492132 6544150 6541786 6587766
15453 6587766 6547102 6398645 6338073 6375080 6468418 6604115 6645857 6629947 6537203 6567138 6527454
15442 6527454 6492076 6585661 6608135 6565266 6540402 6561633 6602325 6582600 6653169 6599483 6662743
15431 6662743 6542283 6526663 6640548 6599935 6657384 6610999 6548968 6633194 6691331 6630907 6520850
15420 6520850 6480495 6456249 6499418 6545401 6624445 6765335 6618070 6632953 6650402 6591613 6611851
15409 6611851 6575045 6579625 6744027 6789031 6761458 6663228 6630011 6624548 6525161 6525763 6508648 6611814
15397 6611814 6517559 6526498 6563806 6563610 6685120 6738902 6743552 6729687 6775540 6552662 6521829 6496579
15385 6496579 6457390 6435812 6621640 6537243 6520078 6538391 6571672 6500354 6631342 6719591 6628261
15374 6628261 6771497 6767387 6701901 6550820 6680125 6611475 6595312 6628912 6586402 6469014 6608205
15363 6608205 6609802 6533163 6512343 6603992 6709328 6732077 6842959 6733546 6684829 6708873 6710491
15352 6710491 6772191 6770971 6749069 6602452 6520440 6467590 6527366 6607465 6569916 6556682 6588025
15341 6588025 6635793 6725835 6709431 6714112 6653093 6660738 6766366 6805267 6777516 6713796 6759984
15330 6759984 6890449 6925310 6681583 6659123 6658854 6753018 6682850 6642916 6530256 6584311 6632328
15319 6632328 6641490 6757077 6853780 6843199 6802789 6774033 6716208 6723321 6668113 6686457 6744196
15308 6744196 6750509 6702603 6690012 6666240 6624804 6648688 6680370 6707968 6691190 6694694 6627874 6625952
15296 6625952 6728480 6658010 6761758 6558938 6621224 6621260 6661600 6662603 6684870 6721189 6655580
15285 6655580 6724421 6777468 6752347 6767361 6781453 6568892 6508284 6612156 6735189 6838815
15275 6838815 6703258 6695442 6692784 6813143 6913743 6773784 6709941 6710510 6623419 6617542 6712832
15264 6712832 6736564 6661730 6752036 6836549 6773098 6653536 6679092 6718201 6580347 6568803 6525926
15253 6525926 6574955 6655011 6783126 6785015 6818080 6802150 6663783 6602992 6633909 6613387 6656091
15242 6656091 6809397 6875700 6817720 6862890 6845767 6748108 6725809 6736051 6689788 6763575 6605593
15231 6605593 6645487 6571178 6638043 6670236 6707651 6872737 6878960 6864334 6756460 6803436 6696456
15220 6696456 6682047 6643845 6685055 6802147 6674776 6671542 6701031 6703304 6560046 6643537 6708380
15209 6708380 6751128 6575398 6528483 6545660 6619994 6744956 6872512 6768469 6590464 6572770
15199 6572770 6601800 6759488 6732926 6662083 6655188 6638549 6545689 6693160 6687556 6614520 6583601
15188 6583601 6615056 6686629 6676520 6674834 6743315 6649548 6718763 6718170 6591161 6701187 6626659
15177 6626659 6718128 6960796 6859824 6762653 6658014 6734835 6752276 6676513 6734601 6753337 6742626
15166 6742626 6800092 6819431 6855004 6791673 6888679 6806001 6832222 6791892 6736396 6730744 6820345
15155 6820345 6909388 6735056 6666852 6674522 6730315 6709604 6713228 6785041 6879840 6772484 6735316
15144 6735316 6722902 6636130 6673038 6712303 6761114 6778594 6759659 6879924 6922701 6909563 6954047
15133 6954047 6893365 6863374 6771048 6717602 6789953 6869390 6785557 6786585 6914607 6950625 6710508
15122 6710508 6634867 6601481 6660094 6618332 6662923 6763912 6793009 6924847 6829262 6782342 6827899
15111 6827899 6906380 6911429 6925055 6888508 6814773 6745761 6803026 6859770 6736281 6778777 6892200
15100 6892200 6746950 6774123 6778304 6774125 6774439 6799497 6839602 6931414 6949954 6933590 6901876 6874594
15088 6874594 6884231 6891940 6835869 6899246 7028545 6977115 6855731 6787142 6806339 6737401 6704157
15077 6704157 6804863 6860442 6868481 6851590 6944950 6902646 6735301 6863851 6775266 6817777 6843890
15066 6843890 6780610 6812855 6811153 6767534 6774914 6851778 6777171 6688855 6803289 6855500 6815532
15055 6815532 6898019 6979097 6995623 6985515 6956969 6822435 6810238 6838316 6834070 6826424 6898131
15044 6898131 6890537 6920233 6760800 6844320 7017929 6953866 6972804 7049152 7000523 6945019 6924429
15033 6924429 6805799 6722802 6830678 6874556 6872865 6921757 6889903 6754972 6844772 6757546 6780071
15022 6780071 6781317 6700167 6757401 6722606 6773440 6785274 6857041 6851540 6869539 6858496 6880929 6874273
15010 6874273 6953861 6891791 6838766 6894168 6786193 6798225 6896057 6809783 6724144 6853315 6863874
14999 6863874 6869533 6892780 6896002 6915282 6840512 6777994 6799368 6882002 6996152 6984534 6873108
14988 6873108 6876469 6885993 6905605 6832637 6844088 6818915 6791431 6856241 6783229 6702866 6817997
14977 6817997 6879792 6802290 6810865 6865236 6880555 6833819 6816551 6822979 6833000 6876616 6887098 6862743
14965 6862743 6927981 6978382 6845694 6917546 6979265 6958951 6982910 6946507 6996837 6981354 6937803
14954 6937803 6921545 6770899 6822541 6915067 6901647 6848729 6807244 6804779 6908702 7038280 6995593
14943 6995593 6960316 6962524 6930823 6920160 6869194 6957497 6983936 6877099 6881310 6851363 6736556
14932 6736556 6822314 6834443 6867144 6838039 6778112 6784644 6705484 6778754 6884550 6843574 6961518
14921 6961518 7036617 6984776 7016607 7037079 7102401 7119945 7091403 7072921 6922473 6904186 6942272
14910 6942272 6867172 6866943 6970861 6987572 6929940 6995244 7128915 7056975 7018434 6899618 6949009
14899 6949009 7048084 7065424 7075446 7075670 7148031 7053332 6868698 6857773 6926597 6868612 6904685
14888 6904685 6875589 6926355 6919683 7002402 6948590 6969187 7064649 6999585 7117711 7264088 7066659
14877 7066659 7057167 7097647 7145335 7096135 7094914 7006332 7125079 7079441 7062399 7035208 7009971
14866 7009971 6957643 6952805 7021968 6926003 7022550 7053738 7017010 6942006 6929448 6973825 6972199 7042350
14854 7042350 7135486 7011340 6979628 7073306 7075633 7152753 7060128 6999591 7166697 7136715 7032563
14843 7032563 7021947 7022925 6930360 6975117 6999419 6919360 6870268 6935377 6969755 7055703 7041134 6935890
14831 6935890 6789501 6974047 7067402 6963601 6953760 6946004 6863372 6898009 6967021 6916894 6919980
14820 6919980 6913983 6976336 6945296 6993748 6883886 6874430 6964391 7065113 7035924 7099865 7096054
14809 7096054 7007582 7002101 6967847 7062412 7002452 7032397 7075988 6998932 6884542 6844598 6838290
14798 6838290 6797437 6823246 6845561 6849393 6995221 7136610 7155951 7095132 7002413 6885536 7029159
14787 7029159 7037021 6987022 7051975 6992912 6827992 6809417 6848575 7008347 7029291 6964703 7033609
14776 7033609 7027129 7157309 7062274 6863107 6981194 6956602 6867035 6945949 6932629 7019571 7021994
14765 7021994 7044519 7022055 7042833 7033242 6964610 6968210 7063821 7179723 7046054 6896352 7072050
$$ [...]
##END NTUPLES=NMR SPECTRUM
##END=
