##TITLE=1H_TG-2389
 200.13MHz,CDCl3 ,
 8 sc
 
 14.8.2025
##JCAMPDX= 6.0         $$ Bruker NMR JCAMP-DX V2.0
##DATA TYPE= NMR SPECTRUM
##DATA CLASS= NTUPLES
##ORIGIN= UXNMR, Bruker Analytische Messtechnik GmbH
##OWNER= pz
$$ XWIN-NMR		Version 3.5
$$ Thu Aug 14 13:40:59 2025 Russian Standard Time (UT+4h)  she@DPX200
##.OBSERVE FREQUENCY= 200.1313
##.OBSERVE NUCLEUS= ^1H
##.ACQUISITION MODE= SIMULTANEOUS
##.ACQUISITION SCHEME= undefined
##.AVERAGES= 8
##.DIGITISER RES= 18
##SPECTROMETER/DATA SYSTEM= spect
##.PULSE SEQUENCE= zg30
##.SOLVENT NAME= CDCl3
##.SHIFT REFERENCE= (INTERNAL, CDCl3, 0, 15.4659)
##AUDIT TRAIL= $$ (NUMBER, WHEN, WHO, WHERE, WHAT)
$$ ##TITLE= Audit trail, XWIN-NMR		Version 3.5
$$ ##JCAMPDX= 5.01
$$ ##ORIGIN= Bruker BioSpin GmbH
$$ ##OWNER= she
$$ F:/spectra/data/she/nmr/H-C/1/pdata/1/auditp.txt
$$ ##AUDIT TRAIL=  $$ (NUMBER, WHEN, WHO, WHERE, WHAT)
(   1,<2025-08-14 13:39:45.92 +0400>,<she>,<DPX200>,
      <created by zg, POWCHK disabled, PULCHK disabled
       configuration hash MD5:
       00 E9 B6 7A A2 85 ED C7 34 08 36 98 17 FE 4E 26
       data hash MD5: 16K
       F6 F2 10 38 1C 96 6B 74 DC D3 D8 6B B1 CD D0 A7>)
(   2,<2025-08-14 13:39:48.21 +0400>,<she>,<DPX200>,
      <Start of raw data processing
       efp BC_mod = 2 LB = 0.25 FT_mod = 6 PKNL = 1 PHC0 = -1560.403 PHC1 = 11.19228 SI = 16K 
       data hash MD5: 16K
       DD EE D2 01 EE E9 EA 5A AB EE FF 19 BF 6E 79 44>)
(   3,<2025-08-14 13:40:12.01 +0400>,<she>,<DPX200>,
      <pk PHC0 = 3.830508 PHC1 = -6.2 
       data hash MD5: 16K
       D2 1A D7 5C B8 00 73 5A A4 3C EC 05 65 B0 E9 67>)
(   4,<2025-08-14 13:40:18.12 +0400>,<she>,<DPX200>,
      <abs ABSG = 5 
       data hash MD5: 16K
       4A B1 77 9F 49 83 60 07 00 73 A8 AF C5 DE 04 5F>)
$$ ##END=
$$ 
$$ hash MD5
$$ 97 23 76 97 B0 3D 98 CC E0 42 A3 03 B7 9B 75 1D
##$RELAX= 
##$RELAX= 
##$RELAX= 
##$RELAX= 
##$RELAX= 
##$RELAX= 
$$ Bruker specific parameters
$$ --------------------------
##$DU= <F:/spectra>
##$EXPNO= 1
##$NAME= <H-C>
##$PROCNO= 1
##$TYPE= <nmr>
##$USER= <she>
##$AMP= (0..31)
100 100 100 100 100 100 100 100 100 100 100 100 100 100 100 100 100 100 
100 100 100 100 100 100 100 100 100 100 100 100 100 100 
##$AQSEQ= 0
##$AQ_mod= 1
##$AUNM= <au_zg>
##$AUTOPOS= <>
##$BF1= 200.13
##$BF2= 200.13
##$BF3= 200.13
##$BF4= 200.13
##$BF5= 200.13
##$BF6= 200.13
##$BF7= 200.13
##$BF8= 200.13
##$BYTORDA= 1
##$CFDGTYP= 0
##$CFRGTYP= 5
##$CHEMSTR= <none>
##$CNST= (0..31)
1 1 145 1 1 1 1 1 1 1 1 1 1 1 1 1 1 1 1 1 1 1 1 1 1 1 1 1 1 1 1 1 
##$CPDPRG= <>
##$CPDPRG1= <>
##$CPDPRG2= <>
##$CPDPRG3= <>
##$CPDPRG4= <mlev>
##$CPDPRG5= <mlev>
##$CPDPRG6= <mlev>
##$CPDPRG7= <mlev>
##$CPDPRG8= <mlev>
##$CPDPRGB= <>
##$CPDPRGT= <>
##$D= (0..31)
0 0.7 0 0 0 0 0 0 0 0 0 0.03 0 0 0 0 0 0 0 0 0 0 0 0 0 0 0 0 0 0 0 0 
##$DATE= 1755164385
##$DBL= (0..7)
120 120 120 120 120 120 120 120 
##$DBP= (0..7)
150 150 150 150 150 150 150 150 
##$DBP07= 0
##$DBPNAM0= <>
##$DBPNAM1= <>
##$DBPNAM2= <>
##$DBPNAM3= <>
##$DBPNAM4= <>
$$ [...]
##$SUBNAM3= <"">
##$SUBNAM4= <"">
##$SUBNAM5= <"">
##$SUBNAM6= <"">
##$SUBNAM7= <"">
##$SUBNAM8= <"">
##$SUBNAM9= <"">
##$SW= 18.0517328524113
##$SWIBOX= (0..15)
0 0 2 0 0 0 0 0 0 0 0 0 0 0 0 0 
##$SW_h= 3612.71676300578
##$TD= 16384
##$TD0= 1
##$TE= 0
##$TE2= 300
##$TE3= 300
##$TEG= 300
##$TL= (0..7)
0 120 120 120 120 120 120 120 
##$TP= (0..7)
150 150 150 150 150 150 150 150 
##$TP07= 0
##$TPNAME0= <>
##$TPNAME1= <>
##$TPNAME2= <>
##$TPNAME3= <>
##$TPNAME4= <>
##$TPNAME5= <>
##$TPNAME6= <>
##$TPNAME7= <>
##$TPOAL= (0..7)
0.5 0.5 0.5 0.5 0.5 0.5 0.5 0.5 
##$TPOFFS= (0..7)
0 0 0 0 0 0 0 0 
##$TUNHIN= 0
##$TUNHOUT= 0
##$TUNXOUT= 0
##$USERA1= <user>
##$USERA2= <user>
##$USERA3= <user>
##$USERA4= <user>
##$USERA5= <user>
##$V9= 5
##$VALIST= <valist>
##$VCLIST= <CCCCCCCCCCCCCCC>
##$VD= 0
##$VDLIST= <DDDDDDDDDDDDDDD>
##$VPLIST= <PPPPPPPPPPPPPPP>
##$VTLIST= <TTTTTTTTTTTTTTT>
##$WBST= 1024
##$WBSW= 4
##$XGAIN= (0..3)
0 0 0 0 
##$XL= 0
##$YL= 0
##$YMAX_a= 621139
##$YMIN_a= -683698
##$ZGOPTNS= <>
##$ZL1= 120
##$ZL2= 120
##$ZL3= 120
##$ZL4= 120
##$ABSF1= 15.48136
##$ABSF2= -2.570489
##$ABSG= 5
##$ABSL= 3
##$ALPHA= 0
##$AQORDER= 0
##$ASSFAC= 0
##$ASSFACI= 0
##$ASSFACX= 0
##$ASSWID= 0
##$AUNMP= <proc_1d>
##$AZFE= 0.1
##$AZFW= 0.1
##$BCFW= 0
##$BC_mod= 2
##$BYTORDP= 0
##$COROFFS= 0
##$CY= -3
##$DATMOD= 1
##$DC= 0
##$DFILT= <>
##$DTYPP= 0
##$F1P= 0
##$F2P= 0
##$FCOR= 1
##$FTSIZE= 16384
##$FT_mod= 6
##$GAMMA= 0
##$GB= 0
##$INTBC= 1
##$INTSCL= 3.241238e-09
##$ISEN= 128
##$LB= 0.25
##$LEV0= 0
##$LPBIN= 0
##$MAXI= 10000
##$MC2= 0
##$MEAN= 0
##$ME_mod= 0
##$MI= 1.114404
##$NCOEF= 0
##$NC_proc= -6
##$NLEV= 6
##$NOISF1= 3.799351
##$NOISF2= 2.8
##$NSP= 0
##$NTH_PI= 0
##$NZP= 0
##$OFFSET= 15.46593
##$PC= 1
##$PHC0= -1556.572
##$PHC1= 4.99228
##$PH_mod= 1
##$PKNL= yes
##$PPARMOD= 0
##$PSCAL= 0
##$PSIGN= 0
##$REVERSE= no
##$SF= 200.130011162494
##$SI= 16384
##$SIGF1= 3
##$SIGF2= 2
##$SINO= 0.751879
##$SIOLD= 32768
##$SREGLST= <19F.Aceton>
##$SSB= 0
##$STSI= 16384
##$STSR= 0
##$SW_p= 3612.71676300578
##$SYMM= 0
##$S_DEV= 0
##$TDeff= 16384
##$TDoff= 0
##$TI= <>
##$TILT= no
##$TM1= 0
##$TM2= 0
##$TOPLEV= 0
##$USERP1= <user>
##$USERP2= <user>
##$USERP3= <user>
##$USERP4= <user>
##$USERP5= <user>
##$WDW= 1
##$XDIM= 16384
##$YMAX_p= 441799411
##$YMIN_p= -427283
$$ End of Bruker specific parameters
$$ ---------------------------------
##NTUPLES= NMR SPECTRUM
##VAR_NAME=  FREQUENCY,     SPECTRUM/REAL,   SPECTRUM/IMAG
##SYMBOL=    X,             R,               I
##VAR_TYPE=  INDEPENDENT,   DEPENDENT,       DEPENDENT
##VAR_FORM=  AFFN,          ASDF,            ASDF
##VAR_DIM=   16384,         16384,           16384
##UNITS=     HZ,            ARBITRARY UNITS, ARBITRARY UNITS
##FACTOR=    0.220516191357247, 1,           1
##FIRST=     3095.19674054568, 0,            0
##LAST=      -517.520022460096, 0,           0
##MIN=       -517.520022460096, -427283,     0
##MAX=       3095.19674054568, 441799411,    0
$$ Real data points
##PAGE= N=1
##DATA TABLE= (X++(R..R)), XYDATA
$$ [...]
8638B910388r141o0044q1628J4283q7619K3755J00033n9712k84703Q4297N6466
8627B606375j24299k0200J501J5676q8505M9528J9424k54507O4391J79423j80846
8616B267961O321K6016J23320n5937n6792J14092o2709j6577q8778n8218J9296
8605B217995O232O2334K0553j03947K307q1586N1737N7559p2702R9685L5994j42521
8593B153640n7430n1622Q8375r5126O6463K56389R949o30620k4059J10550K9946
8582A856455K20958j44068j832J11061l0151L751j8305J02520O140r6746k5455
8571A984328J14954J34723J4033L8128J28123Q8587P3585j43072j46104J34920
8561B422205k3063k02806j3794K11454M7593O0510N5823J18026K02903N8706K08160
$$ plain form
8638 2910388 2901247 2841203 2759575 2773858 2686239 2709994 2810027 2750315 2465612 2549909 2606375
8627 2606375 2482076 2461876 2463377 2479053 2390548 2440076 2459500 2204993 2269384 2448807 2267961
8616 2267961 2274282 2300298 2423618 2367681 2310889 2424981 2362272 2345695 2256917 2198699 2217995
8605 2217995 2224227 2286561 2307114 2203167 2205474 2123888 2175625 2233184 2160482 2260167 2296161 2153640
8593 2153640 2096210 2044588 2132963 2037837 2104300 2360689 2370638 1740018 1715959 1826509 1856455
8582 1856455 2077413 1933345 1931513 2042574 2012423 2016174 1997869 2100389 2106529 2009783 1984328
8571 1984328 2099282 2234005 2248038 2286166 2414289 2502876 2576461 2433389 2287285 2422205
8561 2422205 2399142 2196336 2182542 2393996 2441589 2502099 2557922 2675948 2878851 2937557 3145717
8550C145717J04703N4359J83923J20549K96610L31618J85685L26317K58077P5745
8540E083303L3662l5825K23299O2884k31211j05836r6624k04737k22049j72213
8530D334653p3924j58487r6739j17738j23118J40437R234n887l5578k53388p31
8519C618734K1132p174J50897Q7800Q725J84471R3678K76380J06195P616J77368
8508D725822K39967J16718L15178K25343l9439K24158l1693k8257R6054J85463
8498F029314J26698j08590L4382J11492O1982J08732K39411P1383J34900R5546
8488F905250J29987J8364J11799L88246K49524K48679Q1237K08237M00264M56962
8478I198549L53151N87671N22391N41999O42159J019781Q55448J035202J349816
$$ plain form
8550 3145717 3250420 3304779 3488702 3609251 3905861 4237479 4423164 4749481 5007558 5083303
8540 5083303 5116965 5081140 5304439 5367323 5136112 5030276 4933652 4728915 4506866 4334653
8530 4334653 4260729 4102242 4005503 3887765 3764647 3905084 3914318 3908431 3872853 3619465 3618734
8519 3618734 3639866 3632692 3783589 3871389 3880114 4064585 4158263 4434643 4540838 4548454 4725822
8508 4725822 4965789 5082507 5397685 5623028 5583589 5807747 5776054 5747797 5843851 6029314
8498 6029314 6156012 6047422 6081804 6193296 6255278 6364010 6603421 6674804 6809704 6905250
8488 6905250 7035237 7053601 7165400 7553646 7803170 8051849 8133086 8341323 8741587 9198549
8478 9198549 9551700 10139371 10661762 11203761 11845920 12865701 13721149 14756351 16106167
8469A6106167J310161J691520J707141J886106K264486K405265K351719K474677
8461C2197242K334304K020010J700499R43365J51163m78263j273445j780155j978398
8452C3836322k435001k181583j886876j995142j603261j529100j752468j378708
8444A9074183j272986j309019j233134r11074p08834p57814p09227o31591l98048
8435A1142456m76523l49014k05721j53502l50361k67614k50402k33280l01959
8426H554080l97536k56208k93546l12051k79170l43488m31892n98557j96059k30983
8416E214590n9262l06096j80398q8123l37134p3810k46385j19169o0289n3634
8406C690290p9038n9805q9844j78770L619O8267P6228j9211J18138K0967j72764
$$ plain form
8469 16106167 17416328 19107848 20814989 22701095 24965581 27370846 29722565 32197242
8461 32197242 34531546 36551556 38252055 39195420 39346583 38868320 37594875 35814720 33836322
8452 33836322 31401321 29219738 27332862 25337720 23734459 22205359 20452891 19074183
8444 19074183 17801197 16492178 15259044 14347970 13639136 12881322 12172095 11540504 11142456
8435 11142456 10665933 10316919 10111198 9957696 9607335 9339721 9089319 8856039 8554080
8426 8554080 8156544 7900336 7606790 7294739 7015569 6672081 6240189 5641632 5445573 5214590
8416 5214590 5155328 4849232 4668834 4580711 4243577 4169767 3923382 3804213 3743924 3690290
8406 3690290 3611252 3551447 3461603 3282833 3286452 3354719 3430947 3411736 3529874 3550841 3378077
8395C378077J10430j06670j10192J3869J07185j2547l58386j51278j16503j02614
8385B651371r0282j9884J70926l07114n5688R8168p8056j9992o741j13949L4655
8374B263414L4878n3157J90348k8270k05602n8760m012L1846J95764J78344K51889
8363B796682M9324k0238K30678L40184J24804R7461K23346l0126Q3069N3677j42725
8352C806136l18333o4775J57649j08614l19642j73354J2088j31406l50226j91471
8342B318052j02368k47071k5686K9991j40734k7308m8017m181j32330j21372r9721
8331A399255L7154O1178k25151p9765P0571q154J20291L2869l04084j19294O2978
8320A047848Q7960j23719j5846P6868o7091M2554r0731j995k44989j57664L1074
$$ plain form
8395 3378077 3488507 3381837 3271645 3285514 3392699 3380152 3021766 2870488 2753985 2651371
8385 2651371 2561089 2541205 2712131 2405017 2349329 2447497 2369441 2349449 2342708 2228759 2263414
8374 2263414 2298292 2245135 2435483 2407213 2201611 2142851 2138839 2170685 2366449 2544793 2796682
8363 2796682 2846006 2825768 3056446 3396630 3521434 3618895 3842241 3812115 3895184 3948861 3806136
8352 3806136 3487803 3423028 3580677 3472063 3152421 2979067 2991155 2859749 2509523 2318052
8342 2318052 2215684 1968613 1942927 1972918 1832184 1804876 1756859 1752678 1620348 1498976 1399255
8331 1399255 1436409 1497587 1272436 1192671 1263242 1255088 1375379 1408248 1104164 984870 1047848
8320 1047848 1135808 1012089 996243 1073111 1006020 1048574 957843 955848 710859 553195 584269
8309E84269l7048J12520l7446l6292p5941J11582n7631N9882K18025M0791j75075
8298G07636n2031j2556R441k2898o3688r6112j40071j9612J4793K06600j14551
8287D16951r2576N1839K9981k595J09148M6113j22542N9620p8580R3358l7784
8276D72933j38060J37599j09936j58341R3806J85507O9685j48774j58348Q1332
8266C27403N7716j8158n2333j3965L8890R9245o2309K5202j07441o7911k0609
8255B05730M2129L131n834p9107P3800j03921k3040J47196K6206J56469j15014
8244C27745L0982m7046l0847r6070r1449R6228K4149p6534J2514R6602q9615n6378
8232A00281j8949j2256K08117l6115K6586j06325p1427k1309j09463J28439J12752
$$ plain form
8309 584269 547221 659741 622295 586003 510062 621644 564013 623895 841920 882711 707636
8298 707636 655605 643049 652490 629592 565904 469792 329721 310109 324902 531502 416951
8287 416951 324375 376214 406195 403600 512748 558861 436319 495939 417359 510717 472933
8276 472933 334873 472472 362536 204195 298001 483508 553193 404419 246071 327403
8266 327403 385119 366961 314628 300663 339553 438798 376489 401691 294250 226339 205730
8255 205730 247859 250990 245156 166049 239849 135928 112888 260084 286290 442759 327745
8244 327745 358727 311681 280834 184764 93315 189543 213692 137158 149672 246274 156659 100281
8232 100281 81332 69076 277193 241078 267664 161339 89912 68603 -40860 87579 200331
8221B00331j39912n1608j2579O2575J06228J54810q974K1663l2922o0224j29790
8210A09598L7770L6253J04100n2940q5753n7672r90Q5038P2256J18957r1886q8620
8198A86111j59427m570O6870R3277j6751K8192j31288N0477q1851J48870p3708
8187A06202m0963Q3706l25L2978j18952R5728O7639o7025j70271J32428R4147
8176B15292n0016P2070j69448o6479N4741K4818M0428L5581k5634j5732j37339
8165b1718o8591J40151M37j3493J51169p9809R0165J9093j66732J100l0838R4218
8153A15152k28757n340Q9456K0428K9557K3211J99707J558j6230k4540J0501r4675
8141A20028k5024M3612P4598N1914p6814j76566j50547l3265k164J68598L4074
$$ plain form
8221 200331 60419 8811 -3768 58807 165035 319845 310871 332534 299612 239388 109598
8210 109598 147368 183621 287721 234781 149028 91356 90366 175404 247660 366617 274731 186111
8198 186111 26684 22114 88984 182261 165510 193702 62414 112891 31040 179910 106202
8187 106202 65239 148945 148620 181598 62646 158374 226013 158988 -11283 121145 215292
8176 215292 165276 237346 67898 1419 56160 80978 121406 156987 131353 115621 -21718
8165 -21718 -90309 49842 50279 36786 187955 108146 198311 217404 50672 51772 20934 115152
8153 115152 -113605 -118945 -29489 -9061 20496 43707 243414 244972 228742 204202 214703 120028
8141 120028 95004 138616 213214 265128 188314 11748 -138799 -172064 -174228 -5630 28444
8130B8444J10207Q574j33928N9066q1623k13833K46823M9353J04976m9081J57028
8119B86006k5603k04378j56105N7769K3522m227R3231n1632k996l4374P6176r8860
8107d1471J59250P9843k5581o115R8146m3776p4209O9737Q4143j0814J79615j54247
8095C14521l04210N0587J46093k1497p4948l0642J41371m3838j32872p6168R683
8084b1920J28638M1702j15320r7381K54604j0402j32067J02756j40146J21593
8074A32057L48614j80618j07329O1471p5819M4117J93891n015j62106Q732K7116
8063B85111J38067Q4619j37599j47168L6458q6995J30691R0784o6180l7236M6676
8052C37228K2484j97225q5890N3368K75859n7178n4366j84875j40680R2957J44817
$$ plain form
8130 28444 138651 147225 13297 72363 -9260 -223093 23730 73083 178059 128978 286006
8119 286006 260403 56025 -100080 -42311 -18789 -23016 70215 18583 15587 -18787 57389 -41471
8107 -41471 117779 197622 172041 165926 264072 220296 146087 215824 299967 289153 468768 314521
8095 314521 10311 60898 206991 185494 110546 79904 221275 177437 44565 -31603 -21920
8084 -21920 106718 148420 33100 -64281 190323 179921 47854 150610 10464 132057
8074 132057 480671 300053 192724 254195 178376 222493 416384 411369 249263 257995 285111
8063 285111 423178 507797 370198 223030 259488 172493 303184 393968 327788 290552 337228
8052 337228 359712 162487 76597 129965 405824 348646 294280 109405 -31275 61682 206499
8041B06499J25472l5922j24673k4787o0740J14472R5221o5406l7941L9193K4008
8030B55396K855j27913m5610p8252J78559J76374L6104k582k869j0568q3107q8565
8018B09822M1451K3587n4577J47841P130o070j04186j1281R5269K8112r9951J01853
8006C79000R9612K4384j91297K12935j4440o9346j83308r9271J53385L3870N0676
7995C96200n4603r8231l2040J60965N6036j87147J69634j68982m8062J31116j63959
7984A60927j71589o5804K34286j27439J21148O9781Q4273L0282n806P871j28506
7973B09424n0500o7092m980L6425k806N1658j4627q3720p2240P1219K7012m4786
7961E4987L5266M1754q9744Q2073J05711J02158l19279N4495K00104p0471q4793
$$ plain form
8041 206499 331971 296049 171376 146589 85849 200321 295542 230136 192195 231388 255396
8030 255396 258251 130338 84728 6476 185035 361409 397513 394931 392062 381494 298387 209822
8018 209822 251273 274860 220283 368124 375254 369184 264998 253717 348986 377098 277147 379000
8006 379000 478612 502996 311699 524634 510194 440848 257540 158269 311654 345524 396200
7995 396200 341597 243366 211326 372291 428327 241180 410814 241832 193770 324886 160927
7984 160927 -10662 -76466 157820 30381 151529 221310 305583 335865 330059 337930 209424
7973 209424 158924 91832 86852 123277 120471 172129 157502 73782 1542 72761 99773 54987
7961 54987 90253 132007 42263 124336 230047 332205 12926 67421 267525 197054 112261
7950A12261K1680L0309j91018N0159L4943M2513J10596N9244r8681j790m6495
7939A23721L1719k01878J33706j8298L308J16814N3282r7534k11834K8539n759
7928d4214q6248j04688J13354J36801j4682j17641K18779l5814m9324K7024j0966
7917C2381Q3213M710o049r5366R2751O0988N3663M0374m6499n9086j26182k48274
7905b13376R4058J08012k4932L5908j6320J65555R358n0473k9719M5716j53460
7894b9673J54973n868J29889L9657p1721j82098M3710J5634M0728q034l3330m1490
7882E2377R2414J04361O2232j8294j93069k6487j82306N9995Q898N0174Q8402
7871I8697k6266m675Q8629M9070m7530L5950m9838P0895R3765j19350J00120j00364
$$ plain form
7950 112261 133941 164250 -26768 23391 58334 100847 211443 270687 172006 170216 123721
7939 123721 155440 -46438 87268 68970 72278 189092 242374 144840 -66994 -38455 -44214
7928 -44214 -130462 -235150 -121796 15005 323 -117318 101461 65647 16323 43347 32381
7917 32381 115594 120304 114255 18889 111640 172628 226291 266665 220166 161080 34898 -213376
7905 -213376 -119318 -11306 -36238 -330 -16650 148905 158263 107790 78071 123787 -29673
7894 -29673 125300 119432 249321 288978 217257 35159 78869 94503 135231 127197 93867 52377
7882 52377 144791 249152 311384 293090 100021 73534 -108772 -48777 -39879 10295 98697
7871 98697 72431 67756 156385 205455 157925 193875 144037 214932 308697 189347 289467 189103
7859A89103J88424j45894j61105P0514Q2104N803k01556k5416J01647J12194L7526
7848B53344n4809l9312K6704L5251q0929J16585j0473m4226l7721q2736L9042
7837A20720J79722o3556r021K16848j82384j44872O6981r6579k145K68150m3716
7826C10148p7649k1795k6268J03401j77533K053J22794K168n9316J25230r8691
7815B04542J3388j60084j7573M5069J47831L2382j58742K0444n0899o1454j4007
7804H97j3227L7415J09341J00349J50039j84219j9292J59456l4726M5595j37267
7793B14361R3427k7253J3662Q9900j92700R4295j30251r990K2321P6524J38866
7782C83162J02653p006k3593r4833O0870n3330r4860j38952j0929J10939n813
$$ plain form
7859 189103 377527 231633 70528 141042 223146 228949 27393 1977 103624 215818 253344
7848 253344 198535 159223 185927 221178 140249 256834 246361 202135 164414 81678 120720
7837 120720 300442 236886 227865 444713 262329 117457 184438 87859 85714 353864 310148
7826 310148 232499 210704 184436 287837 110304 112357 235151 237319 178003 303233 204542
7815 204542 217930 57846 40273 85342 233173 265555 106813 127257 76358 14904 897
7804 897 -12330 25085 134426 234775 384814 200595 181303 340759 306033 351628 214361
7793 214361 307788 280535 294197 384097 191397 285692 155441 145451 167772 244296 383162
7782 383162 485815 478809 455216 360383 421253 367923 273063 134111 123182 234121 228308
7771B28308p6913K250J07788J71784j74455k610J46874R0402k6674K3812m3102
7760D47464j87048J9557m589J15090Q2972n6459m309j47960j11546L9653R6404
7749B89229J18170K20988q2068p3569J70376p1927j9690p1709r0635K14062j1379
7738E91848j1202l1546J8988j2419Q6864O9290J25924q0797P1522K16137r3207
7727I51402J85102J26364M489j09765o5406j10343r362k1020o2823M5533n7989
7716H76182J14261Q018p6825m8838n6805l8125q6113P969k6519j17634k9832Q8481
7704F14220q0825l6983j34885o9081K41563O0305o0618N6719j87761l7391j3254
7693C52009O9795Q0156N8984r5442L4873p836J12815n4501K2066O5951o0265j7811
$$ plain form
7771 228308 151395 153645 261433 433217 258762 256152 403026 493428 466754 490566 447464
7760 447464 260416 279973 275384 390474 473446 416987 412678 264718 153172 192825 289229
7749 289229 407399 628387 546319 472750 643126 571199 551509 479800 389165 603227 591848
7738 591848 580646 549100 568088 555669 642533 711823 837747 756950 828472 1044609 951402
7727 951402 1136504 1262868 1267357 1157592 1092186 981843 972481 951461 888638 934171 876182
7716 876182 990443 998461 921636 872798 815993 777868 691755 699724 673205 555571 525739 614220
7704 614220 533395 496412 361527 292446 534009 594314 533696 590415 402654 365263 352009
7693 352009 421804 501960 560944 465502 500375 492539 605354 550853 572919 638870 578605 560794
7681E60794j16639r7696J02407P2843J75725J57836J2905n010p5843M0152o1394
7670G66080Q5530k8660O5237n8534l5272J02073j15116l9457k1199m870L0562
7659G46374m3563l0324P1919j8885N9007O4849n1618l2353J1161O4231k58967
7648E81831J12199P3834N1779k09511o4385K82900J7673R88k7819J61156j47971
7637H32674j01600P6812N7239K0550O9799p9285K032q8765J09252j06938O5205
7626H56975P0660j05675L1188k9002m704N1691l0964K0098Q4558q7576L9350J11806
7614A008405o8452p3504P2377m5210l4466P8654J3113o8927Q0815N5212J70718
7603A188735k29047n2230J28609j6751Q0058o5791L1771O7689j58095o746j16964
$$ plain form
7681 560794 444155 346459 448866 521709 697434 855270 868175 863165 787322 827474 766080
7670 766080 851610 822950 888187 829653 794381 896454 781338 741881 720682 715812 746374
7659 746374 702811 672487 744406 725521 784528 849377 797759 765406 776567 840798 581831
7648 581831 694030 767864 819643 610132 545747 828647 846320 847308 819489 980645 832674
7637 832674 731074 807886 865125 885675 955474 876189 878221 789456 898708 791770 856975
7626 856975 927635 821960 853148 824146 819442 871133 840169 860267 944825 857249 896599 1008405
7614 1008405 939953 866449 938826 893616 859150 937804 950917 881990 962805 1018017 1188735
7603 1188735 959688 907458 1036067 1019316 1099374 1033583 1065354 1133043 974948 968202 851238
7592H51238l5644J88019J10650K4712n9190O2309J5860K6050R412J15496L1656
7581A340568r1676L2093L3730N7089r2245O0521j21354P7450n3270n2636j32287
7570A057983R9767P9821K8796J18999p2568L0075Q6292j3967p5715j04317J16182
7559A351348P2968J618R0726n9877J27884r6340m3504J41553j7081J58620J4122
7548A742037n18K15370j23945o2192j3448L3463J9749o6646p775O3198K01378
7537B000671P0948j15337N724J97722Q5224j25005J1282n0761R5496p5941K33344
7526B333367J58809K9550J03154j15669J1169P1708R7413R7804J86185R0372j22557
7515B941305Q0321n6232o2005q1472P4694J26755P7308R1562j3247J8711j18704
$$ plain form
7592 851238 815594 1003613 1114263 1138975 1079785 1142094 1157954 1184004 1193416 1308912 1340568
7581 1340568 1248892 1280985 1314715 1371804 1279559 1340080 1218726 1296176 1242906 1190270 1057983
7570 1057983 1157750 1237571 1266367 1385366 1312798 1342873 1429165 1415198 1339483 1235166 1351348
7559 1351348 1424316 1425934 1516660 1456783 1584667 1488327 1444823 1586376 1569295 1727915 1742037
7548 1742037 1741519 1956889 1832944 1770752 1757304 1790767 1810516 1743870 1736095 1799293 2000671
7537 2000671 2071619 1956282 1962006 2159728 2244952 2119947 2131229 2080468 2175964 2100023 2333367
7526 2333367 2492176 2521726 2624880 2509211 2520380 2592088 2689501 2787305 2973490 3063862 2941305
7515 2941305 3021626 2965394 2903389 2821917 2896611 3023366 3100674 3192236 3178989 3197700 3078996
7504C078996o6374K62767K09468j31447M5168J2121r357K4836J66181J47645J10600
7493C850604J11035R3465K07269J5139J08824J04042M3190N571J44315J17143
7483D800597K5272m8414K05154K23475m7061K8979J15086J61821J23842J30189
7473E718940J41183K38126J85249K43685M02951K30273N1327K33321J94341L33434
7463G972830L51015K81781K55547K87900L03593K71372M03414O34429M10252M01725
7453A1573858M60027N03786O73480N45202O82472O70703N64732O88414Q31615
7444A7194289R58819J005952J080669J176022J149082J121534J270955J405741
7436B6363063J430089J368317J390716J588509J875330J998835K275926K585335
$$ plain form
7504 3078996 3012622 3275389 3484857 3353410 3398578 3410699 3401342 3426178 3592359 3740004 3850604
7493 3850604 3961639 4055104 4262373 4277512 4386336 4490378 4533568 4539139 4683454 4800597
7483 4800597 4825869 4777455 4982609 5206084 5159023 5188002 5303088 5464909 5588751 5718940
7473 5718940 5860123 6098249 6283498 6527183 6930134 7160407 7211734 7445055 7639396 7972830
7463 7972830 8323845 8605626 8861173 9149073 9452666 9724038 10127452 10761881 11172133 11573858
7453 11573858 12033885 12537671 13211151 13756353 14438825 15109528 15674260 16362674 17194289
7444 17194289 18153108 19159060 20239729 21415751 22564833 23686367 24957322 26363063
7436 26363063 27793152 29161469 30552185 32140694 34016024 36014859 38290785 40876120
7428D0876120K998662L105004L591529L865286M328377M996144N531369O096201
7420G5388692O832565P530320Q122836Q334836Q457603P955488P051274N609567
7412A35283181L343648J072823j408424l588933n247718o391014o901662o937848
7404A09224053o626433o056220n520317n323033n124100m412405m352672m282740
7396F7526133m196260l805998l674181l206635l140128l013036k493756j996104
7388D2000035j917153j837542j589037j187341j082335j005170p65232o27003
7380C1989222n15528l43986l01524q2610r7114l1645J33153Q2518K32370M42970
7370C1507826O68687P69406J227181J320628J345142J706008J922208K085312
$$ plain form
7428 40876120 43874782 46979786 50571315 54436601 58764978 63761122 69292491 75388692
7420 75388692 82221257 89751577 97874413 106209249 114666852 122622340 129673614 135283181
7412 135283181 138626829 139699652 138291228 134702295 129454577 123063563 116161901 109224053
7404 109224053 102597620 96541400 91021083 85698050 80573950 76161545 71808873 67526133
7396 67526133 63329873 59523875 55849694 52643059 49502931 46489895 43996139 42000035
7388 42000035 40082882 38245340 36656303 35468962 34386627 33381457 32616225 31989222
7380 31989222 31473694 31129708 30828184 30745574 30648460 30616815 30749968 30832486 31064856 31507826
7370 31507826 32176513 32945919 34173100 35493728 36838870 38544878 40467086 42552398
7362D2552398K564854K812173L068166L513675L615126L512966L444363L094140
7354F8177861K462372J605821P09736m46303j413887k394627k971952l218890
7346F2510131l325120l312854l122623k831884k903904k698612k398198k373393
7338C9543543k346066k238959k261871j975898j816557j808039j836281j511920
7330B3747952j455961j102869j215978j158434q02974r78297r59567p85032o13546
7321A4675294p85736m47457o33865l31182n59550m27523l10936m79092m46554
7312A0253399l44208k64043j82231l51580m29646j97560l56279l58853k19020
7303G549979k45551k38091j50135l03505j41649n8376k16490r7671j17217j39718
$$ plain form
7362 42552398 45117252 47929425 50997591 54511266 58126392 61639358 65083721 68177861
7354 68177861 70640233 72246054 72955790 72509487 71095600 68700973 65729021 62510131
7346 62510131 59185011 55872157 52749534 49917650 47013746 44315134 41916936 39543543
7338 39543543 37197477 34958518 32696647 30720749 28904192 27096153 25259872 23747952
7330 23747952 22291991 21189122 19973144 18814710 18011736 17033439 16073872 15288840 14675294
7321 14675294 13889558 13442101 12808236 12477054 11917504 11489981 11179045 10699953 10253399
7312 10253399 9909191 9645148 9462917 9111337 8681691 8484131 8127852 7768999 7549979
7303 7549979 7304428 7066337 6916202 6612697 6471048 6412672 6196182 6098511 5981294 5841576
7293E841576p5294k64165r4567o7594j89312p2305j51873n4746k27016j31581
7283D513123N8524r8463o7778j16156r6334j31028j0830j9032p4649j73486m4244
7272C739647p2913j06977j50904k6676q7052J07262j44108j41132p7600j04847
7262B934700M45l7827o5953J26885N1728j33365n4700o4469r9508j81522l6400
7251B440014J5466L4527j84862r1308M8580P7455K7026n0836n9035p2347o7182
7240B117498K7548j15772j47338j3279L5862j56944J0559J28837k4894l2571m0626
7229A788880o6139R6648J33956r7530k73869r5092K7786J20134n3306O6897o6722
7218A581643j19561j23851n8351J3479N601J8087j96890Q6951J42507n6841k1763
$$ plain form
7293 5841576 5766282 5502117 5407550 5339956 5150644 5078339 4926466 4871720 4644704 4513123
7283 4513123 4571647 4473184 4405406 4289250 4192916 4061888 4051058 4032026 3957377 3783891 3739647
7272 3739647 3666734 3559757 3408853 3382177 3295125 3402387 3258279 3117147 3039547 2934700
7262 2934700 2935145 2897318 2831365 2958250 3009978 2876613 2821913 2757444 2657936 2476414 2440014
7251 2440014 2455480 2490007 2305145 2213837 2262417 2339872 2366898 2316062 2257027 2184680 2117498
7240 2117498 2145046 2029274 1881936 1868657 1904519 1747575 1758134 1886971 1862077 1829506 1788880
7229 1788880 1722741 1819389 1953345 1855815 1581946 1486854 1514640 1634774 1581468 1648365 1581643
7218 1581643 1462082 1338231 1279880 1293359 1298960 1317047 1120157 1207108 1349615 1292774 1271011
7207A271011J88913l2415m1501n5600r1490r9781J2306K9788J73250j17576j91464
7196A045441O6915o313Q5934j52910M4323M4706l8085j74581O2942K14240q1970
7185A110642N5269m3032M6936q0768N7430j01629n3527J20008p5598J6278o7521
7174I84488K0153k1473J07846L8898m2299p0119R8006M3437p0695j62753j33765
7163G91724M1855q8797K01816J01780l5609K4130j171n9655j0165J05838r5341
7152I76405K188J90524j45905p1020J43038m4014J03308M7341j41989K34831j3848
7141A280859k767Q1559j26007J24551K04483J66617J69531k4519R5294L06282
7131B275883K35026M75919N06426M14522L74789J92543M76481P2768k57529k42132
$$ plain form
7207 1271011 1459924 1427509 1386008 1330408 1238918 1139137 1151443 1181231 1354481 1236905 1045441
7196 1045441 1112356 1106043 1191977 1039067 1083390 1128096 1090011 915430 978372 1192612 1110642
7185 1110642 1165911 1122879 1169815 1089047 1146477 1044848 991321 1111329 1035731 1052009 984488
7174 984488 1004641 983168 1091014 1129912 1087613 1017494 1115500 1158937 1088242 925489 791724
7163 791724 833579 744782 946598 1048378 1012769 1036899 1035728 976073 965908 1071746 976405
7152 976405 978593 1169117 1023212 952192 1095230 1051216 1154524 1201865 1059876 1294707 1280859
7141 1280859 1278092 1359651 1233644 1358195 1562678 1729295 1898826 1874307 1969601 2275883
7131 2275883 2510909 2986828 3493254 3907776 4282565 4475108 4951589 5024357 4766828 4524696
7121D524696m84039m00378k63419l22474k28878j32058j51603p6895p8788o1748
7111B324416q1926r1943J37981q3933j23767m5228J10350J00580j1983Q219j39914
7100B102852O2755j29791j5147l6481p1545J40114N2248k01657j16773K6773p6210
7089A737138l0043j91932n2720L2352K1232o942q5697K5024j88152j59502m4218
7078A056540j00445n6159m6765p7125P5066j12184K2183j6370j35124J07152K9070
7067G45839J9534R8831j44770j34776n2328m7233J04537J70232j28500R171j5419
7056F25118q0625J24804k338L4348J01284j53617j3451j17416k2796N8953Q0385
7045F34649Q5062j7136N2636m671j08487Q8609J43017n1573K1408K2579j03032
$$ plain form
7121 4524696 4040657 3640279 3376860 3054386 2825508 2693450 2541847 2464952 2386164 2324416
7111 2324416 2242490 2150547 2288528 2204595 2080828 2035600 2145950 2246530 2234547 2242766 2102852
7100 2102852 2165607 2035816 2020669 1984188 1912643 2052757 2105005 1903348 1786575 1813348 1737138
7089 1737138 1707095 1515163 1462443 1494795 1516027 1509085 1423388 1448412 1260260 1100758 1056540
7078 1056540 956095 899936 853171 776046 851112 738928 761111 744741 609617 716769 745839
7067 745839 765373 864204 719434 584658 532330 485097 589634 759866 631366 640537 625118
7056 625118 544493 669297 666959 701307 802591 648974 635523 518107 495311 554264 634649
7045 634649 719711 702575 755211 750540 642053 730662 873679 822106 843514 866093 763061
7034G63061o0318J56381N9644j63525m4152m0074N7950K106m3643P921j80838
7023E14513K6396N2318L387j81978J70132L2560m046r3853N9203j8286k5014m0958
7011D94374M675j99501j6031Q8975R2737o0295r3680j4726k5132k7402l4793N7571
6999B66772K01455M2226j77480r2521k90794K64375Q0863j22851O0699J69656
6989D02400j18601m4067m6616j1670q4188Q1959R3430l7112m4232k8761L2538
6978A95080M2008l3522N2671P0497O3298l1895r8872l0569N3678j0918r9276N6959
6966B29139J11911j8647P1292O3847r0733Q8307N6259j20810j27219N2190j448
6955C14088M0836o1669n2849p3236N3338R4964l8475L0159j26427q9551n3518
$$ plain form
7034 763061 702743 859124 918768 755243 711091 671017 728967 731073 687430 695351 514513
7023 514513 540909 593227 596614 414636 584768 617328 613282 519429 578632 560346 535332 494374
7011 494374 499049 299548 283517 372492 465229 404934 311254 296528 271396 243994 209201 266772
6999 266772 468227 510453 332973 240452 -50342 214033 294896 172045 232744 402400
6989 402400 283799 239732 193116 181446 97258 179217 272647 235535 191303 162542 195080
6978 195080 237088 203566 256237 326734 390032 358137 259265 228696 282374 271456 172180 229139
6966 229139 341050 322403 393695 457542 366809 455116 511375 390565 263346 315536 314088
6955 314088 354924 293255 240406 167170 220508 315472 276997 307156 180729 91178 37660
6944C7660O2919J53552l9755R0035O0300j48307j52922K9054J46396M6750L3922
6933C19604n0823O853n2337j89188j7051N553K15599l8967j18639J35406P9104
6922B95114r0199k5080k0653K1251O3737n8856J08601p716k61786o6414l4227
6911g6228J959P1050J18848J22720k5053J7552M3506J11628J03445q0878r3032
6900C15517J3625j17305l0180J35091n0347N2022L4883l8261O9377m8069k21341
6889A15012N873n34J11094J43457k895j74052j9786M5306j0429K747q0432P5041
6877B10402K16662o9059K9013J45306M425J26120p3530m2341J8701q0557n5908
6866D29234j8850Q3688R1235k5354R1066p6630j18356r6277L568J41800R4921
$$ plain form
6944 37660 100579 254131 214376 304411 364711 216404 63482 92536 238932 285682 319604
6933 319604 268781 275634 223297 34109 17058 22611 238210 199243 80604 216010 295114
6922 295114 204915 179835 159182 180433 244170 185314 293915 286199 24413 -42001 -76228
6911 -76228 -74269 -3219 115629 238349 213296 230848 274354 385982 489427 408549 315517
6900 315517 329142 211837 181657 316748 266401 318423 353306 315045 384422 336353 115012
6889 115012 120885 120351 231445 374902 372007 197955 178169 223475 213046 215793 135361 210402
6877 210402 427064 358005 387018 532324 536749 662869 589339 546998 565699 485142 429234
6866 429234 410384 494072 585307 559953 651019 574389 456033 359756 363324 505124 600045
6855F00045k21111J43252P7116r8619l6459P6575o0586n6986L292j17535J45368
6844D54352J4401J12908j82097k9434J11751k27205k0043J26666Q2151p2459L5978
6833D06969n9211j8004k68238J03771k2913n7184j3419L1414P3881n5749N8621
6822A79938K6063K1320R5507k230j39363O0918m6582O7895K5278j10373O1454
6811B39825Q2248J37357P352K5379j17237j28m0787j27804L3294n848K24676j08709
6799C49618K9246K1095k5802N2902J9426k01255K1155R0548o7595m0400K495N9482
6787C10915L3657l5345J1989p35l6446j30897O7673k6771p3419K4906J19133l8742
6775B25918m1799J46716R3833l3953P3594l7717j31193J1541p1198R4428Q2385
$$ plain form
6855 600045 378934 522186 599302 500683 464224 540799 480213 423227 426519 308984 454352
6844 454352 468753 581661 399564 370130 481881 254676 234633 361299 443450 370991 406969
6833 406969 347758 329754 61516 165287 142374 85190 71771 103185 177066 121317 179938
6822 179938 206001 227321 322828 320598 181235 242153 195571 263466 288744 178371 239825
6811 239825 322073 459430 466782 492161 374924 374796 334009 206205 239499 233651 458327 349618
6799 349618 378864 399959 374157 427059 446485 245230 266385 356933 289338 248938 251433 310915
6787 310915 344572 309227 321216 320481 284035 153138 220811 194040 120621 145527 264660 225918
6775 225918 184119 330835 424668 390715 464309 426592 295399 306940 235742 330170 412555
6764D12555j34646r9121J3287K2172O6719p5290j08562O8522N7173k4318N7825
6753B56316J27271j2188p6395p8703J10539J5616r9485L6887j79802j61720k6208
6742h7872n855K56305N0745k1962M4046j20244J06382j5648n1431l3978J61317
6731B81805K8957m2286j03218M5524J94473N7048l9626j11652N1280R2360j91171
6720B63494l5791n0091J48844P7472r6078O2270N3264j14522j98729J96492K9009
6709C35634M8314J32403R4967j02541j41704l7585l182j75572q2693j5322J02296
6698A55015n7855o704J28607J31634R3932j9701r5384j19172n62J3625P9134J6518
6686C19087M6821P1265K714n9284j03683l3679j5608j9188K02504O307K3080r9274
$$ plain form
6764 412555 277909 178788 192075 214247 280966 205676 97114 165636 222809 198491 256316
6753 256316 383587 371399 295004 216301 326840 342456 242971 279858 100056 -61664 -87872
6742 -87872 -93727 162578 213323 191361 235407 115163 221545 205897 154466 120488 281805
6731 281805 310762 268476 165258 210782 405255 462303 422677 311025 362305 454665 263494
6720 263494 227703 177612 326456 403928 307850 370120 423384 308862 110133 306625 335634
6709 335634 383948 516351 611318 508777 367073 329488 326306 150734 68041 52719 155015
6698 155015 97160 90456 219063 350697 444629 424928 329544 210372 209810 223435 302569 319087
6686 319087 365908 437173 439887 380603 276920 243241 227633 208445 410949 417256 440336 341062
6674C41062l5227J65476K3496p3364p0733M3710J62903j12829j01250J758L5402
6663C80404O7299l2177j4622j01544K1211O9324R9079n8009M5243Q2248j16063
6652D42393O3222k3236K9697M2632L673J37890O2862j19093j61320j58737J75760
6641D95743M7487n3878R7713J93844o8829j40914j19275l5261J16140j35094M1777
6630D39453J62379l455j16417r8337J03819L5606r2177r4282K13816R0990n604
6619F35791J3936k3322J28323q9604q6515p4751J37018R6572K0088j18502l3437
6608F05597o3559K17334q4730r8635J30674N3267L8430L2596r3736p7930j7932
6597F41376l9000J05857O9869K459O2152o1602R5327r191q3318K6237q0591R7879
$$ plain form
6674 341062 305835 471311 494807 421443 350710 394420 557323 444494 343244 345002 380404
6663 380404 447703 415526 400904 299360 320571 389895 488974 430965 476208 558456 442393
6652 442393 505615 482379 512076 554708 558381 696271 759133 640040 478720 319983 495743
6641 495743 543230 489352 587065 780909 712080 571166 451891 416630 532770 397676 439453
6630 439453 601832 598377 481960 383623 487442 523048 430871 336589 550405 641395 635791
6619 635791 649727 626405 754728 665124 578609 503858 640876 737448 757536 639034 605597
6608 605597 542038 759372 674642 576007 706681 759948 798378 830974 737238 659308 641376
6597 641376 602376 708233 778102 780561 842713 781111 876438 867247 783929 810166 729575 827454
6585H27454j2217J9354P4498j91637J21858M4416m2621Q1840J87699L096k03742
6574I09998P9744o3621J3485j03745J6217P6135K8742j20133P0306j39281M176
6563G72023O0346j51323P3518O0076q0062O9213K22741n7470j75221J99325m0938
6552I52228p3351N9275P5936M5114p2894j6032j66561J01844M4890j07446L6359
6541H79362m155j36683n5848P3128l2909J48540J32909q830l8933m2991l0249
6530H83341M4240Q3821j54185l13615K61301J64561j12564P6466R2146L5121m5829
6519A014804j52758j62908k6010J19251J61622j01810J1621j11484O6004Q9261
6509I07593K1498j0435o1674r4030m5330j28239Q4734J63568J16172J80169m2380
$$ plain form
6585 827454 815237 834591 909089 717452 839310 883726 841105 922945 1110644 1113740 909998
6574 909998 989742 926121 939606 835861 852078 928213 956955 836822 907128 767847 772023
6563 772023 832369 681046 754564 814640 734578 803791 1026532 969062 793841 993166 952228
6552 952228 878877 938152 1014088 1059202 986308 970276 803715 905559 950449 843003 879362
6541 879362 875207 738524 682676 755804 722895 871435 1004344 995514 956581 913590 883341
6530 883341 927581 1011402 857217 543602 804903 969464 856900 933366 1025512 1060633 1014804
6519 1014804 862046 699138 673128 792379 954001 852191 863812 752328 818332 907593
6509 907593 929091 918656 856982 762952 717622 589383 674117 837685 953857 1134026 1091646
6498A091646j14513r6640J7269J44566R8743m6467j67747n2866J9J50999n3009
6487I72000m8806j60755J0858J33415j917k40266M3791K48498p0358o8335O1849
6476H79974R3121j45370l1695k0636J10540K20805P8831r4884o8362j19229J00411
6465A003506J47251q6167R081m5306r341J82522J179n4766k1133o5972J46731
6454A207585J19928k00077j27109M2313M9087j6835K21871j59067j67006J02023
6444A072713J1597M0801O1512K0887M4234M5891n2882J39859Q3509j16022M5806
6433A397905J24635q2012j32641J02551j3076R0479j06585j02804J05501k9065
6423A354888j9360L1336r5425K8293R8599L2018P0113k3357M90q178L9243P3303
$$ plain form
6498 1091646 977133 880493 897762 1042328 1141071 1094604 926857 873991 874010 1025009 972000
6487 972000 923194 762439 773297 906712 904795 664529 708320 956818 886460 818125 879974
6476 879974 973095 827725 796030 775394 885934 1106739 1185570 1090686 1022324 903095 1003506
6465 1003506 1150757 1064590 1073671 1028365 1019024 1201546 1202725 1147959 1126826 1060854 1207585
6454 1207585 1327513 1127436 1000327 1042640 1091727 1074892 1296763 1137696 970690 1072713
6444 1072713 1084310 1125111 1186623 1207510 1251744 1297635 1244753 1384612 1468121 1352099 1397905
6433 1397905 1522540 1440528 1307887 1410438 1397362 1487841 1381256 1278452 1383953 1354888
6423 1354888 1335528 1366864 1271439 1299732 1398331 1430349 1500462 1477105 1477595 1469417 1508660 1581963
6411A581963j150J0936j22503P2114Q186P6857j5074L4359J62294j35628O4784
6400A737138J12235p9095L450J2237k6259Q4885N3625J11320L8301n4767j82060
6389A811010K5753J46104k6837O6953J38366j00644j2859R86J16078n4430j31771
6378A978709J40015K22918j52717J245k8652J99793J58936m9748O0287j45K9400
6367B560041q823k9303j4858n7114Q0002J55550K029J32401J02004J00389K11
6356C022529Q4486m4318j43671J16423J35477K68408j09379J9835J03334Q6896
6346C540020J30091Q6283J02813N6535N9996J14651J50896J5511J13118J51074
6336D520988J39072J19370J09591j28936N6016J11149K40754J41847J26553O3399
$$ plain form
6411 1581963 1580813 1591749 1469246 1541360 1549546 1626403 1611329 1645688 1807982 1672354 1737138
6400 1737138 1849373 1770278 1773728 1785965 1759706 1844591 1898216 2009536 2047837 1993070 1811010
6389 1811010 1836763 1982867 1956030 2022983 2161349 2060705 2047846 2048832 2164910 2110480 1978709
6378 1978709 2118724 2341642 2188925 2190170 2161518 2361311 2520247 2470499 2530786 2530641 2560041
6367 2560041 2551218 2521915 2507057 2449943 2529945 2685495 2687524 2819925 2921929 3022318 3022529
6356 3022529 3107015 3062697 2919026 3035449 3170926 3439334 3329955 3349790 3453124 3540020
6346 3540020 3670111 3756394 3859207 3915742 3975738 4090389 4241285 4256796 4369914 4520988
6336 4520988 4660060 4779430 4889021 4760085 4816101 4927250 5168004 5309851 5436404 5499803
6326E499803P1026N9947J08440J36407J08269K47457K57505K14046J79088Q0846
6316F962834K84423L20773L05345K50075L54297L25715L55232K30664M13755N75915
6306A0379028N05075O57172M27505M91183N33894N14852M07378P01383O78504
6297A5295974Q14951J021448Q13664R79214J253341J484214J651093J707638J916661
6288B6938198K098804K559563K664235K945233L207857L250016L140556K717818
6280D9522280K265689J723556P73710J84361m13962q45439r64096m51922k07379
6271E1586798r096N78440J011860J303160J785669K443067K510604K914236L467022
6262F7591760L781188L842833L771914L112205K528137J481260K95631r07655
$$ plain form
6326 5499803 5570829 5630776 5739216 5875623 5983892 6231349 6488854 6702900 6881988 6962834
6316 6962834 7247257 7568030 7873375 8123450 8477747 8803462 9158694 9389358 9803113 10379028
6306 10379028 10884103 11541275 11968780 12459963 12993857 13508709 13916087 14617470 15295974
6297 15295974 16110925 17132373 17946037 18925251 20178592 21662806 23313899 25021537 26938198
6288 26938198 29037002 31596565 34260800 37206033 40413890 43663906 46804462 49522280
6280 49522280 51787969 53511525 54285235 54469596 54055634 53210195 52246099 51794177 51586798
6271 51586798 51577702 52156142 53168002 54471162 56256831 58699898 61210502 64124738 67591760
6262 67591760 71372948 75215781 78987695 82099900 84628037 86109297 86404928 85497273
6254H5497273j835763k767487l110615l191650l215321k964016k500000k244332
6246F3668089j685205j394054r17878o46642k11793K54253N07060N97492P91930
6237F0963252Q21170N32106J91770m77628j026968k055563k780362l390082l463527
6228D9314168l472713l106832k722224k359412k231313j930163j772998j920150
6220B9798363j852784j727662j621663j432862j473028j348913j276996j357194
6212A7707261r78073q31833q59743q29707n75449m85317o65911m80497m47608
6203A1553123n08370n53220l65893l66769l63624k92885k65352j48118k80755
6194H408137k27808k85502j11136j38368k51565k77512l04361k10784j07240Q1968
$$ plain form
6254 85497273 83661510 80894023 77783408 74591758 71376437 68412421 65912421 63668089
6246 63668089 61982884 60588830 59670952 59024310 58812517 59066770 59573830 60171322 60963252
6237 60963252 61784422 62316528 62508298 62030670 61003702 58948139 56167777 52777695 49314168
6228 49314168 45841455 42734623 40012399 37652987 35421674 33491511 31718513 29798363
6220 29798363 27945579 26217917 24596254 23163392 21690364 20341451 19064455 17707261
6212 17707261 16729188 15897355 15037612 14207905 13632456 13147139 12481228 12000731 11553123
6203 11553123 11044753 10491533 10125640 9758871 9395247 9102362 8837010 8688892 8408137
6194 8408137 8180329 7894827 7783691 7645323 7393758 7116246 6811885 6601101 6493861 6575829
6184F575829k41785q5987j08997j52999j5006j63588m7961j38066o924j4280k94819
6173E305417m0147r0674j76247j19768l7616P771j30582q4661m8414p9705o7296
6162D438078J9135J18742j62743j49603j704J5762j75035n6137q3804j45574r077
6151C808040O4859k1117j16317P8064J09021j02710j26084o7666o0158K6943L5596
6140C628471m7499k03834k4368K3895j35936q0444J55478r8873l3666j14870L1949
6129C100303N6846k19208k6341J50216N6708k07166p5298O7656o4630O666j11353
6118B734399N7574j9047k182M9632l2408J25701j26845n4622l5073N3992N4964
6107B806085q3051J2362M8822K8156q482j56512j18436J82658p4591R3508m1395
$$ plain form
6184 6575829 6334044 6248057 6139060 5986061 5971055 5807467 5759506 5621440 5614516 5600236 5305417
6173 5305417 5265270 5174596 4998349 4878581 4840965 4848736 4718154 4633493 4585079 4505374 4438078
6162 4438078 4457213 4575955 4413212 4263609 4261905 4277667 4102632 4046495 3962691 3817117 3808040
6151 3808040 3872899 3851782 3735465 3813529 3922550 3819840 3693756 3626090 3565932 3592875 3628471
6140 3628471 3580972 3377138 3352770 3376665 3240729 3160285 3315763 3216890 3183224 3068354 3100303
6129 3100303 3157149 2937941 2911600 3061816 3118524 2911358 2836060 2903716 2839086 2845752 2734399
6118 2734399 2791973 2772926 2770744 2820376 2787968 2913669 2786824 2732202 2697129 2751121 2806085
6107 2806085 2723034 2735396 2784218 2812374 2803892 2647380 2528944 2711602 2637011 2730519 2689124
6096B689124j1616j54104q6983Q9802j3097N7288j4209K3131j1137o5348p357
6085B495494L5988p611R9902m4569k008m5972K1368K1561n7693L0557J3286J2006
6073B572309R728j50830k5345J21557J9801M1212n4814J8054k7040J4424n8703
6062B480353N0438P2116j41689Q0661m9491M678J69270j69309j52654J67455K151
6051B513979Q5572N0227o6386J34593o6677j51486J89943P2643N3462m3459m5260
6040B727151J04700l4801J04450n9320r6181L7700L9826N6381R0089M301k2437
6029B951859J00275j01922p235m923N4501N6177O568m0005k7467J95167P5855
6018C258850J20441k24601O3156J61235J76916N7098j14612R3839N6374R4184
$$ plain form
6096 2689124 2677508 2523404 2436421 2526223 2513126 2570414 2556205 2579336 2568199 2502851 2495494
6085 2495494 2531482 2523871 2623773 2579204 2577196 2531224 2552592 2574153 2516460 2547017 2560303 2572309
6073 2572309 2582037 2431207 2405862 2527419 2547220 2588432 2533618 2551672 2524632 2539056 2480353
6062 2480353 2530791 2602907 2461218 2541879 2492388 2497066 2666336 2497027 2344373 2511828 2513979
6051 2513979 2599551 2649778 2583392 2717985 2651308 2499822 2689765 2762408 2815870 2772411 2727151
6040 2727151 2831851 2797050 2901500 2842180 2745999 2783699 2823525 2879906 2969995 2974296 2951859
6029 2951859 3052134 2950212 2942977 2938054 2992555 3048732 3055300 3015295 2987828 3182995 3258850
6018 3258850 3379291 3154690 3217846 3379081 3555997 3613095 3498483 3592322 3648696 3742880
6008C742880K1369J26216l151J72259J28400J06473r7946M3197J17128L7097K49841
5997D643763L2638k7868J28847J00623R5141k05614P0317J49228L863o0578j5876
5986D914484Q6250n0427j14369J05918J53603O4541Q2859L8260K50289L15064
5976E846472J24331L3272K70370J6909r1194K74096j0405L8410l00791k62434
5966E939036Q0717m3414N0080j06376p9502M4669M7168M0383R0978j80001O6760
5955E950498J16930L7733Q695K8416N1029N0759K14862k1572j37536o8229k07398
5944F024187k8781J52694r1745J20158l7398l3483l1428q2172R7914k8313O4758
5933F126391J8624J49050j9617j5114N816K6743J68311J99841K1256J86150K6464
$$ plain form
6008 3742880 3764249 3890465 3887314 4059573 4187973 4294446 4196500 4239697 4356825 4393922 4643763
5997 4643763 4676401 4648533 4777380 4878003 4973144 4767530 4837847 4987075 4990938 4930360 4914484
5986 4914484 5000734 4950307 4835938 4941856 5095459 5160000 5242859 5281119 5531408 5846472
5976 5846472 5970803 6004075 6274445 6291354 6200160 6474256 6463851 6502261 6201470 5939036
5966 5939036 6019753 5976339 6026419 5920043 5840541 5885210 5932378 5972761 6063739 5883738 5950498
5955 5950498 6067428 6105161 6113856 6142272 6193301 6244060 6458922 6437350 6299814 6231585 6024187
5944 6024187 5995406 6148100 6056355 6176513 6139115 6105632 6074204 5992032 6089946 6061633 6126391
5933 6126391 6145015 6294065 6274448 6259334 6265150 6291893 6460204 6660045 6681301 6867451 6893915
5922F893915q5861J66402k495L298J79970K40475J95346K63700O8914P5923L59631
5911H359218Q5799K16587R2603R6423K27307K50762M53140K71439K59861K64338
5901A0577477L86844M21623K76890N22978O24187L78511M53695O41868O75252
5892A4959325P11522Q08234R69659J084223J042303J085065J460032J336378J264952
5883B4721693J194025J263328J005755P98436N32808K20977L45219J23647L185
5874C0209073J0284O3828Q0376L45895M60087O39265P76860P69802J116307J237118
5864C5708895J651324J784234J671169J683115J364806J199166J068080O32723
5856D6763512p2487m51079q12381j200861j135946j208400j397578j309510j036508
$$ plain form
5922 6893915 6808054 6974456 6971961 6975259 7155229 7395704 7591050 7854750 7923664 7999587 8359218
5911 8359218 8445017 8661604 8754207 8850630 9077937 9328699 9781839 10053278 10313139 10577477
5901 10577477 10964321 11385944 11662834 12185812 12809999 13188510 13642205 14284073 14959325
5892 14959325 15670847 16479081 17448740 18532963 19575266 20660331 22120363 23456741 24721693
5883 24721693 25915718 27179046 28184801 28983237 29516045 29737022 30082241 30205888 30209073
5874 30209073 30219357 30283185 30363561 30709456 31169543 31808808 32585668 33355470 34471777 35708895
5864 35708895 37360219 39144453 40815622 42498737 43863543 45062709 46130789 46763512
5856 46763512 46691025 46239946 45427565 44226704 43090758 41882358 40484780 39175270 38138762
5847C8138762p78963p89637o63657n47145m42629j35194P7514N9467J9183J12158
5837C5049859K18854K7763K9354k28080o02445j020581j121262j209906j271534
5828B9872022j243452j227806j196843j288062j242588r44839q79495o17857p44224
5819B0486856r08955p25839p96854o91034m62724o29132n56183l44878m36679
5810A4934578m87931k77345k90074k38657k60668o4765k13846k27613k28563k44034
5800A2401082k36697j01491J9079j10067l5427k7391p1672j8754k5789k01643
5790A1591230k11701M995J91127p9919J2703Q7130J28942J05062K1890m9216P8332
5779A1880575J4419J01189J59898J17371J4992M0152J09767J05443K12754Q3505
$$ plain form
5847 38138762 37359799 36570162 35906505 35359360 34916731 34781537 34859051 34918518 34937701 35049859
5837 35049859 35268713 35296476 35325830 35097750 34495305 33474724 32353462 31143556 29872022
5828 29872022 28628570 27400764 26203921 24915859 23673271 22728432 21848937 21231080 20486856
5819 20486856 19577901 18852062 18055208 17364174 16901450 16272318 15716135 15371257 14934578
5810 14934578 14446647 14169302 13879228 13640571 13379903 13315138 13101292 12873679 12645116 12401082
5800 12401082 12164385 12062894 12081973 11971906 11936479 11909088 11837416 11818662 11792873 11591230
5790 11591230 11379529 11384524 11575651 11495732 11508435 11595565 11724507 11829569 11851459 11802243 11880575
5779 11880575 11894994 11996183 12156081 12273452 12288444 12328596 12438363 12543806 12756560 12840065
5769A2840065K68560P6555j03609J91684K42551M46420L03934K79710J06488J46642
5759A4799000K58334L30364R5907R4377K71906K47762K65460K24503J97642K14640
5749A6999895L65381K27804L14116K39836L82093L26303N28994L94220K97461
5740B0076103N17645L51855N47651M15231M48457O79054O74298M22621P14186
5731B4847101O12068N26775N17083N31282K58058N55185O03275N00159O27321
5722B9578307O28946P57281O92982R39748R40892R49516J118340J335757J315723
5713C8257492J182459J473275J633624J703918J882985J849670J714486J750075
5705E1447984J971416K015298K106861K584536K511057K592645K597198K835742
$$ plain form
5769 12840065 13108625 13185180 13081571 13273255 13515806 13962226 14266160 14545870 14652358 14799000
5759 14799000 15057334 15387698 15483605 15577982 15849888 16097650 16363110 16587613 16785255 16999895
5749 16999895 17365276 17593080 17907196 18147032 18529125 18855428 19384422 19778642 20076103
5740 20076103 20593748 20945603 21493254 21908485 22356942 23035996 23710294 24132915 24847101
5731 24847101 25459169 25985944 26503027 27034309 27292367 27847552 28450827 28950986 29578307
5722 29578307 30207253 30964534 31657516 32597264 33538156 34487672 35606012 36941769 38257492
5713 38257492 39439951 40913226 42546850 44250768 46133753 47983423 49697909 51447984
5705 51447984 53419400 55434698 57541559 60126095 62637152 65229797 67826995 70662737
5697G0662737L063369L449757L775751M418477N115434N707001O314696P329989
5689A09837211P957054Q085047Q831292Q723215Q718356Q894027R473301R929436
5681A80448939J1606099J3025328J4486448J4934916J4652602J3317527J1009483
5674B73481342P246405K206685j962481m817422m806848k635660J95363K972088
5666B71879472M798363N784355O331179O874466P792742R541281J2274346J5416876
5658C40693080J8005423J9190012J9213006J7826790J5092957J0101033J677110
5651D41799411p428006j3840102j6891603j6438279j4983699j4639018j4126699
5644C43452005j2861068j0900643r037778o801961m585014k632725j216726j44800
$$ plain form
5697 70662737 73726106 77175863 80951614 85370091 90485525 96192526 102507222 109837211
5689 109837211 117794265 125879312 134710604 143433819 152152175 161046202 170519503 180448939
5681 180448939 192055038 205080366 219566814 234501730 249154332 262471859 273481342
5674 273481342 280727747 282934432 280971951 276154529 271347681 268712021 268907384 271879472
5666 271879472 276677835 282462190 288793369 295667835 303460577 313001858 325276204 340693080
5658 340693080 358698503 377888515 397101521 414928311 430021268 440122301 441799411
5651 441799411 434371405 420531303 403639700 387201421 372217722 357578704 343452005
5644 343452005 330590937 319690294 310652516 303850555 299265541 296632816 295416090 295271290
5636B95271290K075521N295998Q127170R050086Q254997O211660L416670j722157
5628C35981235r834596j8324810k3902818k5118795k3311087j9863072j5953609
5621A99672448j2922005j1330698j0559008j0157598r811455r456699q809468
5614A26625517q235362p885941p541444p063336o260111n844399m997121m218832
5606G4578971l856800l578846l158527k869903k592829k412378k301119k163011
5598E1645558k058448j916993j549655j513847j457903j359698j035127j264477
5590C9489410j257253r21330r74664q19698j120377q32118p74059r63861q31227
5581C0994823o16215n79069n83726o78960n69915m21438l64242o63750o11867
$$ plain form
5636 295271290 297346811 302642809 310769979 319820065 328075062 334286722 337703392 335981235
5628 335981235 326146639 307821829 283919011 258800216 235489129 215626057 199672448
5621 199672448 186750443 175419745 164860737 154703139 144891684 135434985 126625517
5614 126625517 118390155 110504214 102962770 95899434 89639323 83794924 78797803 74578971
5606 74578971 70722171 67143325 63984798 61114895 58522066 56109688 53808569 51645558
5598 51645558 49587110 47670117 46120462 44606615 43148712 41789014 40753887 39489410
5590 39489410 38232157 37310827 36336163 35516465 34396088 33563970 32789911 31826050 30994823
5581 30994823 30378608 29799539 29215813 28536853 27966938 27545500 27181258 26517508 25905641
5572B5905641k27994m95850l12355l95939k55670l54630m95087l05995l24319
5563B2737802k54861j86752j93514j00922k89469k80543K845n5560j09561j65458
5553B1104007j66868j63237M077J17129r936k3331m610j0242j14141j88240k38657
5542B0305951l57274m27856o0258j50603q4354j55677r5045K1687j93992k36807
5532A8565772j21924n6993r419J60831j54539n7375J30673K7517m6619N7193N3903
5521A8549020Q4697J75518L23635j3138N5820o00K16893M2196o6960R9609n4243
5510A9412447o3789l9667N4369J81322Q2126J26002J0928O3646K35695R4354K33739
5499B0391172J39861K96466K46890K17021K61289K54907L42642L06548K78381
$$ plain form
5572 25905641 25677647 25181797 24869442 24473503 24217833 23863203 23368116 23062121 22737802
5563 22737802 22482941 22296189 22102675 22001753 21712284 21431741 21434586 21379026 21269465 21104007
5553 21104007 20937139 20773902 20777979 20895108 20885172 20861841 20857231 20846989 20732848 20544608 20305951
5542 20305951 19948677 19520821 19460563 19309960 19225606 19069929 18974884 18996571 18802579 18565772
5532 18565772 18443848 18386855 18377436 18538267 18383728 18326353 18457026 18484543 18437924 18495117 18549020
5521 18549020 18633717 18809235 19132870 19119732 19175552 19174952 19391845 19434041 19367081 19466690 19412447
5510 19412447 19348658 19308991 19363360 19544682 19626808 19752810 19763738 19827384 20063079 20157433 20391172
5499 20391172 20531033 20827499 21074389 21291410 21552699 21807606 22150248 22456796 22735177
5490B2735177K51964L55837L27102L09737N00772L28106N74939N66829M88693
5481B6439156O28018O95810O97919P78933Q07865Q54491P42675Q88887J049876
5472C3583630J049759J230607J180969J319737J281197J466048J436583J589458
5464D4137988J627776J668305J878773K105489K355671K463103K274017K334010
5456F0845132K527261K614876K617618K859004L062403L544196L972213M445631
5448H6488334N030753N369663N959936O667050P484737P943891Q766619R744624
5440A43455607J0941001J2144325J3666777J4738394J5751070J6161777J5722351
5433B42581302J4424048J2276430Q925034N427903J975153q14818k030659k115883
$$ plain form
5490 22735177 22987141 23342978 23670080 23979817 24480589 24808695 25383634 25950463 26439156
5481 26439156 27067174 27762984 28460903 29239836 30047701 30902192 31644867 32533754 33583630
5472 33583630 34633389 35863996 37044965 38364702 39645899 41111947 42548530 44137988
5464 44137988 45765764 47434069 49312842 51418331 53774002 56237105 58511122 60845132
5456 60845132 63372393 65987269 68604887 71463891 74526294 78070490 82042703 86488334
5448 86488334 91519087 96888750 102848686 109515736 117000473 124944364 133710983 143455607
5440 143455607 154396608 166540933 180207710 194946104 210697174 226858951 242581302
5433 242581302 257005350 269281780 278206814 283634717 285609870 284795052 282764393 280648510
5425B80648510j275247J92345J853384K984145M498087N643670O581751P188336
5417C08314981P519258P987338Q804120R254987J0026904J0254011R411998P898584
5409C79472181N560654L132550J72420k921547n668084p782742q462128q336304
5401C55167000p489536o039140m985509m390560m402402m759569n219222n230311
5393C12650751m406534l367930k522093k212842j670398j884035k568682l452465
5385B90565772n050510o790971q082785q709036q928024q355495p642826o928714
5377B30077411o457612o483832o705111p137249q347784r180432r626501r655606
5369A66483284q924194p957362o627146n677646m949955m251455l776553l320593
$$ plain form
5425 280648510 279373263 279565608 281418992 284403137 288901224 294544894 301126645 308314981
5417 308314981 315834239 323821577 332625697 341880684 351907588 362161599 371573597 379472181
5409 379472181 385032835 388165385 388337805 385416258 379748174 371965432 363503304 355167000
5401 355167000 347677464 341638324 336652815 332262255 327859853 323100284 317881062 312650751
5393 312650751 308244217 304876287 302354194 300141352 298470954 296586919 294018237 290565772
5385 290565772 285515262 278724291 270641506 261932470 253004446 244648951 237006125 230077411
5377 230077411 223619799 217135967 210430856 203293607 194945823 185765391 176138890 166483284
5369 166483284 157559090 149601728 142974582 137296936 132346981 128095526 124318973 120998380
5361A20998380l070903k992000l163067l336414l357061l691229l744055l750685
5353I3892966l824663l644640l437243l037457k850326k469117k322689k232733
5345G0074098j907546j637559j321012j473012j440253j033669r20001j033087
5337E9307959q13403j014024j126791j122792j451228j558577j762429j917472
5329D8541243j830799j733268j759327j532339j415082j374123j476648j330330
5321C6089327j230622j122213j033116j146507r44765q84928j033750o75589o23236
5312B7394601o14976n85349n88154m06820l49185l28792j74938j07050j41535
5303B4097802k62973p1715k38805m76153n43177p21790o28203o09586o30910m47345
$$ plain form
5361 120998380 117927477 114935477 111772410 108435996 105078935 101387706 97643651 93892966
5353 93892966 90068303 86423663 82986420 79948963 77098637 74629520 72306831 70074098
5345 70074098 68166552 66528993 65207981 63734969 62294716 61261047 60341046 59307959
5337 59307959 58494556 57480532 56353741 55230949 53779721 52221144 50458715 48541243
5329 48541243 46710444 44977176 43217849 41685510 40270428 38896305 37419657 36089327
5321 36089327 34858705 33736492 32703376 31556869 30612104 29727176 28693426 28017837 27394601
5312 27394601 26779625 26194276 25606122 25199302 24850117 24521325 24346387 24239337 24097802
5303 24097802 23834829 23763114 23524309 23048156 22504979 21783189 21154986 20545400 19914490 19467145
5293A9467145n23320o41543m48729m20084l96809j81002m49208l52719l41185
5284A5712546k31987j82352l23780o5487k97300j32915r2142o2867J08003J53418
5274A4585137J55042J00032Q4494K78326K1844k5635q0064m11863m21217l58457
5264A3927639l03937k75414n40596j82386j05587l08139l41051j25110k94390
5255A1451029k75877N4837J29071p7158M1511L9030k00492p2802k58604l06146
5245A0524399j70430j43333R6844j20192o7654k2475o8082K3525P3116o7744r7212
5234I960762j38464j81304j23757k03451N0885j4038j67041n9509J37690J16319
5224I378092j65740K7489R3089o1544J34251K48348K22170K07311L61318K96369
$$ plain form
5293 19467145 18943825 18302282 17853553 17433469 17036660 16855658 16406450 16053731 15712546
5284 15712546 15480559 15298207 14974427 14908940 14611640 14478725 14386583 14323716 14431719 14585137
5274 14585137 14740179 14840211 14924705 15203031 15224875 15199240 15119176 14707313 14286096 13927639
5264 13927639 13623702 13348288 12807692 12625306 12519719 12211580 11870529 11745419 11451029
5255 11451029 11175152 11229989 11359060 11281902 11323413 11362443 11161951 11089149 10830545 10524399
5245 10524399 10353969 10210636 10307480 10187288 10119634 10097159 10029077 10052602 10125718 10057974 9960762
5234 9960762 9822298 9640994 9517237 9313786 9364671 9350633 9183592 9124083 9261773 9378092
5224 9378092 9212352 9239841 9332930 9271386 9405637 9653985 9876155 10083466 10444784 10741153
5214A0741153J78341K03539K45491J60533M6361j15621k05762l16768k11168k01832
5204A0524267k30664m99757k46316o2620j55804k06871j3868O2904j64591j45898
5194H860782o6238K4698p4952o7684q2029j27000k9523K0196j68407j68128K8855
5183H150570R6073L38915o1848k3282J34240J26241R9975J19314L03666J79572
5173I463436J75921L06958K45751J76828K67820K83156K37257M40579M21836M06373
5163A2425915P81696N19085L49777N12728M24865M15736N06190N88220M29757
5154A6953969N16485P33089P60865P20895R34073J203358J305572J348548J499017
5145B5975871J728026J967699K369648K546510K775057L144899L642138L969479
$$ plain form
5214 10741153 10919494 11123033 11368524 11529057 11575418 11459797 11254035 10937267 10726099 10524267
5204 10524267 10293603 9793846 9547530 9484910 9329106 9122235 9108367 9171271 9006680 8860782
5194 8860782 8794544 8819242 8744290 8676606 8594577 8467577 8438054 8458250 8289843 8121715 8150570
5183 8150570 8246643 8585558 8523710 8500428 8634668 8760909 8860884 8980198 9283864 9463436
5173 9463436 9639357 9946315 10192066 10368894 10636714 10919870 11157127 11597706 12019542 12425915
5163 12425915 13207611 13726696 14076473 14589201 15014066 15429802 15935992 16524212 16953969
5154 16953969 17470454 18203543 18964408 19685303 20619376 21822734 23128306 24476854 25975871
5145 25975871 27703897 29671596 32041244 34587754 37362811 40507710 44149848 48119327
5137D8119327M125387L913019L422015K853253J789201P64572m40191j153592
5129F3392991j423595j685817j288281q42942k46840J93151N20584Q35908J436349
5120F0891508J755121K115532K626999K900410K982824L010367K735006K441930
5112H1459697J698436R28392Q5435j065633j848731k756556l294953l707651l332908
5103F8165528l076402k689300k100555j457085j420641j038500p97291l25962
5095E5259792J33487K35170M00391L43981M08803k84932o19938j144072j982899
5086E2749783k629398k901119l124117k974441k630428k565022k100317j922444
5078C1902497j931715j772441j721700j414783j382616j242369j315613j274371
$$ plain form
5137 48119327 52244714 56157733 59579748 62433001 64222202 64986774 64546583 63392991
5129 63392991 61969396 60283579 58995298 58152356 57905516 58098667 58619251 59455159 60891508
5120 60891508 62646629 64762161 67389160 70289570 73272394 76282761 79017767 81459697
5112 81459697 83158133 84086525 84171960 83106327 81257596 78501040 75206087 71498436 68165528
5103 68165528 65089126 62399826 60299271 58842186 57421545 56383045 55585754 55259792
5095 55259792 55393279 55628449 56028840 56372821 56781624 56496692 55876754 54732682 52749783
5086 52749783 50120385 47219266 44095149 41120708 38490280 35925258 33824941 31902497
5078 31902497 29970782 28198341 26476641 25061858 23679242 22436873 21121260 19846889
5070A9846889j066808q34418r82045q28567p12282o19487p02298n60036p32591
5061A2808357n08506l40911m26905n26746o32831l79131k58345j52128m34122
5052I148732l16137l66517k42580q0762l35198k00115k07344j88932k89359k45068
5042F676720j02754j94006j65353j41514j53684l04614p7479N4470P902k10050
5032E389638j83319p2940O8716k29007N9378j12147k01248j16399j07902L9129
5022D533899p7719J1792r1631n5236J20298j62740L6631J8232R7029J51019j10403
5011D471171l5834j83140J8667P5922N2335J8425k3723o7721J14936k5675J00987
5000D516350J77214L95373R6593J35953L03696J84166M57581M81538M50949O28628
$$ plain form
5070 19846889 18780081 17945663 16963618 16135051 15422769 14803282 14100984 13540948 12808357
5061 12808357 12299851 11958940 11532035 11005289 10372458 9993327 9734982 9582854 9148732
5052 9148732 8832595 8466078 8223498 8142736 7807538 7607423 7400079 7211147 6921788 6676720
5042 6676720 6573966 6379960 6214607 6073093 5919409 5614795 5537316 5591786 5599688 5389638
5032 5389638 5206319 5133379 5202095 4973088 5032466 4920319 4719071 4602672 4494770 4533899
5022 4533899 4456180 4467972 4376341 4321105 4441403 4278663 4315294 4333526 4430555 4581574 4471171
5011 4471171 4435337 4252197 4270864 4346786 4399121 4417546 4393823 4326102 4441038 4415363 4516350
5000 4516350 4693564 5088937 5185530 5321483 5625179 5809345 6266926 6748464 7199413 7828041
4990G828041P97988P38292N57371M46224M21655r5253j77817m88440p33019o36069
4980H658973p56002o12323l23940k32166k84202l95652j63180l20814m63187j08951
4970D998556k49705m25971k27547r4313j26180k03524j74870K2458M0976j42540
4960C417340K2875l9981O5061p6571r8131J05587o1996L3307m5723O6971j54155
4949C234584l1939J42573J54118J19680K14867J15968k7954J47023L33813L84197
4939D786930L20480M75519M97123O97678P81306N72326O81263N82356K90720j0661
4929I675040l44992n06674q78397n93622q40715n86733l61048k19850k25935k94908
4919D822166k48076m00436k46400j20415k51583j77277j21383j10737j7643j56144
$$ plain form
4990 7828041 8626029 9364321 9921692 10367916 10789571 10694318 10516501 10028061 9295042 8658973
4980 8658973 7902971 7290648 6966708 6734542 6450340 6054688 5891508 5570694 5107507 4998556
4970 4998556 4748851 4322880 4095333 4001020 3874840 3671316 3496446 3518904 3559880 3417340
4960 3417340 3440215 3400234 3465295 3388724 3290593 3396180 3334184 3367491 3321768 3388739 3234584
4949 3234584 3202645 3345218 3499336 3619016 3833883 3949851 3921897 4068920 4402733 4786930
4939 4786930 5107410 5582929 6080052 6777730 7559036 8131362 8812625 9394981 9685701 9675040
4929 9675040 9330048 8823374 7944977 7351355 6510640 5923907 5562859 5343009 5117074 4822166
4919 4822166 4574090 4173654 3927254 3806839 3555256 3377979 3256596 3145859 3128216 2972072
4909B972072n4620Q7839n9170j63114j7128k05071J29552K92474K1597j76687
4899B827744p1702J63549J08944K1966L7779J77306l7906j5662r559J5667L56443
4888C574569J59225Q1877K00581J38699K14830Q3453J65498L45068R8894L45975
4878E408669L48583N40769P86718Q62573J143856J032116Q48382P11063L87956
4869A2070685J17024m96511r37292j107185r16379r55700p36366p25942j94752
4860F117582k02642m05491l65799l38887j23817m64346k90329j99795k39884k52609
4850C233983l54479k08333k42707j28862o1445o0234r1224l4965j20359j03052
4840A828323o3279r1358J59134j05323r1276q8663p5938l4453Q5176n9452p2157
$$ plain form
4909 2972072 2917452 3005291 2946121 2783007 2765879 2560808 2690360 2982834 3004431 2827744
4899 2827744 2756042 2919591 3028535 3050501 3088280 3265586 3227680 3212018 3202459 3218126 3574569
4888 3574569 3733794 3815671 4016252 4154951 4369781 4453234 4618732 4963800 5062694 5408669
4878 5408669 5757252 6298021 7084739 7947312 9091168 10123284 10971666 11682729 12070685
4869 12070685 12187709 11691198 10753906 9646721 8730342 7774642 7038276 6312334 6117582
4860 6117582 5914940 5509449 5143650 4804763 4680946 4216600 3926271 3726476 3486592 3233983
4850 3233983 2879504 2671171 2428464 2299602 2238157 2177923 2086699 2051734 1931375 1828323
4840 1828323 1765044 1673686 1832820 1727497 1636221 1547558 1471620 1437167 1522343 1462891 1390734
4829A390734k1800K83948j73772k64647O7304M255m5005k39159m5648J14745M4931
4818A115886O5242o2842N4310R264N6314k41098k9594J41063N2270O9392j05374
4807A124833J0699l9566n7070p3232n7542J54733Q0677j33841j30342q4340R2088
4796H87097L7964k2916M6135m2570j9740p735j23676J34058o527J2378Q4551J09192
4784A088211R1229p7320j81399j05032Q7884n0048j46156N5763o6682o5526L7434
4773F68358K5920q7361k5321O1927J47776p2282k6729l8406R9099O583L0255p4739
4761G15080p6284m514J6916R4660n1905l785K60j3528l4418N6246j28015L1457
4749F02170l1948j87051j36235q3239K17078O1722Q8642O9017r727K3762M3439
$$ plain form
4829 1390734 1368934 1652882 1479110 1214463 1281767 1286022 1241017 1001858 956210 1070955 1115886
4818 1115886 1181128 1118286 1172596 1181860 1238174 997076 967482 1108545 1160815 1230207 1124833
4807 1124833 1135532 1095966 1038896 965664 908122 1062855 1143532 1009691 879349 795009 887097
4796 887097 925061 902145 948280 905710 885970 878235 754559 888617 882090 894468 979019 1088211
4784 1088211 1179440 1102120 920721 815689 903573 853525 707369 763132 696450 630924 668358
4773 668358 694278 606917 581596 643523 791299 719017 692288 653882 752981 759564 789819 715080
4761 715080 638796 634282 651198 745858 693953 690168 690428 676900 642482 698728 570713 602170
4749 602170 570222 383171 246936 163697 380775 442497 531139 600156 590429 614191 657630
4738F57630o0969l8646N5178j57351O2869q2975J35655n0984r3408J04400J30516
4727F61915l8466j0687n4808k3240j023P8541P998M14q6078J9741M0852P1087
4715F66246j6270r1935j08000j62913M862J24069J28122p3496K0797j44409M4794
4704C91867K775m4232L6773k9245J7683Q9292r318l3131o9710L5759K48131M161
4692F40805o4405M0548p1015M6632o3509j3978N627o164k2062R394Q5474J0665
4680E98012m6477j4685M4789M284k8079P210L9891l7400J74927q1497J59062m3053
4668G76984j64079J06602L8217N2723m3644k3384j65964r4495l6407R9016k4933
4657E20636k3502P2621k117k5769J17237m1323k17813J66642K34001j68822k5577
$$ plain form
4738 657630 596661 558015 613193 455842 518711 435736 571391 520407 426999 531399 661915
4727 661915 623449 612762 557954 534714 533691 612232 620230 620644 534566 554307 595159 666246
4715 666246 649976 558041 450041 287128 291990 416059 544181 470685 491482 347073 391867
4704 391867 394642 350410 387183 357938 375621 464913 455595 422464 352754 388513 636644 640805
4692 640805 576400 616948 545933 592565 529056 515078 520705 514541 492479 501873 587347 598012
4680 598012 551535 536850 581639 585923 557844 565054 604945 567545 742472 660975 820037 776984
4668 776984 612905 719507 757724 810447 766803 743419 577455 482960 446553 545569 520636
4657 520636 497134 569755 567638 541869 659106 617783 399970 566612 800613 631791 606214
4646F06214M6408J52757M4658j21809K1320j07065r5967J10431K9084p331L4758
4635G13458O3861J33516j94803l0202k1429J67069n4392j62744K00504r5078Q6976
4624H06736N5885m6270l3284J0339j30808R674j8635P0673J47866L727k7121j03647
4612G45135n841J13834J66307j89033j23723n8997J89884J34848j93590l923J435
4601G76336l4004J02235J3985n6495m9768m4948J37404J65392j44117r0429q7097
4590F88494k2786J20632k1879p0669M8118n0912n6168m4120m3490N157M0761N7655
4578F50793o9426R9292p9749J33205j59002l05004O8870J70371J0923M2921N0323
4567F13517p8120r0698K2703q3395r2250J21509J59550o7034p6959N6913O132
$$ plain form
4646 606214 652622 805379 850037 728228 749548 642483 546516 656947 686031 678700 713458
4635 713458 777319 910835 716032 685830 664401 831470 777078 614334 814838 719760 806736
4624 806736 862621 816351 783067 793406 662598 672272 653637 724310 872176 875903 848782 745135
4612 745135 739294 853128 1019435 830402 706679 647682 837566 972414 778824 774901 776336
4601 776336 742332 844567 858552 802057 752289 707341 844745 1010137 866020 775591 688494
4590 688494 665708 786340 764461 693792 741910 690998 634830 590710 547220 552377 593138 650793
4578 650793 581367 680659 600910 734115 575113 270109 338979 509350 520273 563194 613517
4567 613517 535397 444699 467402 384007 291757 413266 572816 505782 428823 485736 491868
4556D91868J39795J1270j91840q6838M4362o3369R9031M9811N33m0238R3237m8617
4544D99005N5634M0527j52487j79831J26473J6462j25563J85044j52224j02525
4534B10515J48706J22457O3044j23186j15754O0883R5283j6345j85764J79027
4524D38866M5409k12086l4637K0487M2089J554J11880n208J5472k4027O2112O8808
4512E30719j39393j42352l7754P7449R6165O0263O8385o1299m6540J5676j47066
4501B74253j61982J23781O3660J3575O8686j7810K4531J2881L7674o6735L7645
4490D10159m2049j1476J30419j19010k6247J308M3700R3457j19499Q763M2379
4479D11904K755L1454L5666m4598R2811N9517Q134O748j08112L8929O3246q9219
$$ plain form
4556 491868 631663 642933 451093 364255 408617 345248 444279 494090 494623 454385 547622 499005
4544 499005 554639 595166 442679 262848 389321 405783 280220 465264 313040 210515
4534 210515 359221 481678 544722 421536 305782 366665 461948 445603 259839 438866
4524 438866 484275 272189 237552 258039 300128 301682 413562 408354 423826 399799 461911 530719
4512 530719 391326 248974 211220 288669 384834 445097 513482 452183 405643 421319 274253
4501 274253 112271 236052 299712 313287 381973 364163 388694 401575 439249 372514 410159
4490 410159 368110 356634 487053 368043 341796 343104 386804 480261 360762 369525 411904
4479 411904 414659 446113 481779 437181 529992 589509 597643 604391 496279 535208 598454 509235
4467E09235K6309J14583q3375J28095o6157q755L0505m5324k4639J26928r8781
4456F08624j48004k2027Q2514K64457n3798j13832J7141K13208j83449P5737k7453
4445G13118R8833r8162o8883J5977n5063R7708k7613J790M5563j296r6370P6746
4433G02348Q7796M3215K0881L2188K1073m6935l6965N1172J4545J74861n7753
4422A006426q7279R2123J30697j47673R778r2648l442O2447P9424m6160o1683
4411I42010K8809m6033M2822p3810R5378j48833j10187K0749O3475L4591N2410
4400I01381J05114J05933P0860j67889j22074O1297j03290J7200K61962N4051
4390A184545L7123M7014n0025j0320J01061k6233j5492Q0777j31469j80915q0313
$$ plain form
4467 509235 535544 650127 566752 694847 628690 619935 650440 605116 580477 707405 608624
4456 608624 460620 438593 521107 785564 731766 617934 635075 848283 664834 740571 713118
4445 713118 811951 713789 644906 660883 605820 703528 675915 677705 723268 721972 625602 702348
4433 702348 790144 833359 854240 886428 907501 860566 823601 874773 889318 1064179 1006426
4422 1006426 919147 1011270 1141967 994294 1004072 911424 907982 970429 1049853 1003693 942010
4411 942010 970819 924786 967608 893798 989176 840343 730156 750905 814380 848971 901381
4400 901381 1006495 1112428 1183288 1015399 893325 954622 851332 868532 1130494 1184545
4390 1184545 1221668 1268682 1218657 1208337 1309398 1283165 1267673 1348450 1216981 1036066 955753
4379I55753J76681L2276l4004M391l0823K488N9723P0150k05179j26386q553q4721
4367H11796N7207J28803j47999m9893J0838L4720M3040m7849R4713m8619j6811
4356H69946n60L0954N0280j33680L7792k0391n4620N7352K5359r487O81K4032
4344H77658k535J08507j02780q1032n9183L5774J22986P6585K5549K5270J34127
4333A160926j47876J4343J09585J05859Q1133m2553K5221K3405q7381r9531J26374
4322A269505J6160q918j39332j8775Q1352k0875l5565O9012r3332k1513O3864
4311A161583P6848j7784j08721j07525L5914m180P5726J72326j0354P498K6695
4300A308026o733K05408R0082J64479L04414O5785K46764L9578M2447o0562l02259
$$ plain form
4379 955753 1132434 1164710 1130706 1135097 1104274 1106762 1166485 1236635 1031456 905070 896517 811796
4367 811796 869003 997806 849807 799914 810752 845472 888512 840663 935376 886757 869946
4356 869946 869386 900340 950620 816940 854732 834341 779721 837073 862432 852945 853626 877658
4344 877658 875123 983630 880850 799818 740635 776409 899395 975980 1001529 1026799 1160926
4333 1160926 1013050 1027393 1136978 1242837 1323970 1281417 1306638 1330043 1242662 1143131 1269505
4322 1269505 1285665 1276747 1137415 1118640 1199992 1179117 1143552 1212564 1119232 1097719 1161583
4311 1161583 1238431 1220647 1111926 1004401 1040315 1036135 1111861 1284187 1273833 1281331 1308026
4300 1308026 1301293 1506701 1596783 1761262 2065676 2131461 2378225 2417803 2460250 2399688 2097429
4289B097429k91160n3378j21436j12314k0291K092n4055O0664j33630j45899p9910
4278A148112k7995j7141K1946n6975j4813n8665q371J37460k34082o8207J49484
4267I70753J43027m7543j15044q0133J5903p3721P2149P2453p3696N8723L4077
4256I76948Q9311j56471o8640p9772m2187O5601n8140M7606K06013K0422m1826
4245I58865R377K8160o1593k3856P5165j3378N1051p0247Q000K10420j71366j7277
4233I83321r0172Q1804J92805j36098M4787k6127j29929K09943J44850k0119j15070
4222A139995p6325L3167N3522M79o9903N029n8797K07588J58522j2669k62L8299
4210A418645r7973j6965P6953m4083p566P0454N6379L255K1502J46957p7484o4640
$$ plain form
4289 2097429 1806269 1752891 1631455 1519141 1498850 1500942 1446887 1507551 1373921 1228022 1148112
4278 1148112 1120117 1102976 1124922 1067947 1053134 994469 986098 1123558 889476 821269 970753
4267 970753 1113780 1066237 951193 871060 886963 813242 885391 957844 884148 942871 976948
4256 976948 1066259 909788 841148 761376 719189 784790 726650 774256 980269 1000691 958865
4245 958865 968242 996402 934809 910953 986118 972740 1023791 953544 961544 1171964 1000598 983321
4233 983321 893149 974953 1167758 1031660 1076447 1050320 920391 1130334 1275184 1255065 1139995
4222 1139995 1063670 1096837 1150359 1150838 1080935 1085964 1027167 1234755 1393277 1380608 1380346 1418645
4210 1418645 1320672 1303707 1380660 1336577 1329011 1399465 1455844 1459099 1480601 1627558 1550074 1485434
4198A485434K3077m305k22915q5384K08376Q6802M1497L4804P4019m6309j45682
4187A449414m27J56820l7623o2918J95172j3063P2397K38514J35172m9761M5770
4176B129467L9592L4004k9291K4632N6480O8095R8671j30807k0100J42102o6742
4165B346103N3154k02359P1485K74651J30618k134P9515M7335r9651o4088j4995
4154B619634K09628J54524k469J05356j5145L7802J08002R921J34476J31661L7122
4143C530512j15247J71323L14991J9319o3954K2825L8184K23031L01059K76837
4133D718880q2119p2485N3856J20426O8144J67752L4287O8779J04109K13829Q693
4122E404151M9711J80401P3883K88086J35617J14139R1164J78307Q5113K68000
$$ plain form
4198 1485434 1508511 1504206 1281291 1195907 1404283 1491085 1532582 1567386 1641405 1595096 1449414
4187 1449414 1448987 1605807 1568184 1505266 1700438 1687375 1759772 1998286 2133458 2083697 2129467
4176 2129467 2169059 2203063 2173772 2198404 2254884 2322979 2421650 2290843 2270743 2412845 2346103
4165 2346103 2399257 2196898 2268383 2543034 2673652 2671518 2751033 2798368 2698717 2634629 2619634
4154 2619634 2829262 2983786 2981317 3086673 3071528 3109330 3217332 3227253 3361729 3493390 3530512
4143 3530512 3415265 3586588 3901579 3920898 3856944 3879769 3917953 4140984 4442043 4718880
4133 4718880 4636761 4564276 4618132 4738558 4806702 4974454 5008741 5077520 5181629 5395458 5404151
4122 5404151 5453862 5634263 5708146 5996232 6131849 6245988 6337152 6515459 6600572 6868572
4112F868572K19233p4092J58000L37410K63902O5484J43249Q7591J04844L09044
4102H483237J76548L17250j7392M9453K07560j05536o939K36803K36623K21910
4092I799517J12137p8824K24855m7365M2650j7478K72642P6819k4179J23632J04173
4081A0588579j42153p9719L5542j86408k0194j0722j243k24971j89966P558k29283
4070I547020j05143K664k00014j08717L9315j97291j05315n5767j94864k32811
4060H389077k51704q3303r7142p2746p6540k38678j72511j17076j41893j29555
4050G007929j22981r6657k65470k11264q0819p8718j48648K5408j05039j68045
4040E755696j64880j20581j93780k77602j20979r560N2598n7126k05163n73q1100
$$ plain form
4112 6868572 7087805 7013713 7171713 7509123 7773025 7838509 7981758 8069349 8174193 8483237
4102 8483237 8659785 8977035 8959643 9009096 9216656 9111120 9104181 9340984 9577607 9799517
4092 9799517 9911654 9832830 10057685 10010320 10052970 10035492 10308134 10384953 10360774 10484406 10588579
4081 10588579 10446426 10366707 10402249 10215841 10195647 10184925 10183682 9958711 9768745 9776303 9547020
4070 9547020 9441877 9444541 9244527 9135810 9175125 8977834 8872519 8816752 8621888 8389077
4060 8389077 8137373 8054070 7956928 7884182 7807642 7568964 7396453 7279377 7137484 7007929
4050 7007929 6884948 6788291 6522821 6311557 6230738 6152020 6003372 6028780 5923741 5755696
4040 5755696 5590816 5470235 5276455 4998853 4877874 4868314 4920912 4863786 4658623 4658050 4576950
4029D576950j25226L410j00663j67438O8719o0830j25968l6825R2284j64748j44158
4018C815507q4658j02989l8753k4174l6667M4599j22664j3341p3048k62608M8695
4007C149899j04621J50111J0950j535j0084r2014j18382j60444L7451O2098R4318
3996C017747j0336Q479m5306m8363r1890j6782n6466j30189O0876N2391J08487
3985B848648j6719r081j29486r7044R5701o3809j46295j8918J45308L0304Q348
3974B646957O6082j48348O7237K4402k26510J0503N9566Q2487l6349p563j28489
3963B409975o0778R400P1768j5298m1522j375p0148j01616N5923J44101N4468
3952B454898Q0632k0099j7712r6362Q0000k0054m6304M0159m5806o350j6016n799
$$ plain form
4029 4576950 4451724 4455134 4354471 4187033 4255752 4194922 4068954 4032129 4124413 3959665 3815507
4018 3815507 3730849 3627860 3589107 3564933 3528266 3572865 3450201 3436860 3363812 3101204 3149899
4007 3149899 3045278 3195389 3206339 3204804 3194720 3102706 2984324 2823880 2861331 2923429 3017747
3996 3017747 3007411 3015890 2970584 2922221 2830331 2813549 2757083 2626894 2687770 2740161 2848648
3985 2848648 2831929 2822848 2693362 2596318 2692019 2628210 2481915 2462997 2608305 2638609 2646957
3974 2646957 2713039 2564691 2631928 2656330 2429820 2440323 2499889 2582376 2546027 2538464 2409975
3963 2409975 2349197 2358597 2430365 2415067 2373545 2372170 2302022 2200406 2256329 2400430 2454898
3952 2454898 2535530 2515431 2497719 2401357 2481357 2461303 2414999 2455158 2409352 2403002 2386986 2381187
3940B381187J2165p1783P6615l3964j23638J12412O5859j81693P8979j3243j38741
3929B164155Q0670Q6719P4032j2093J5909N4491l8989p7512L8048Q1794k4107
3918B443117L5736m7259O6129q3853N0731J06652r2647j1592J9428j30112J35461
3907B491791L6616J28259K7042j56095j55691J5708Q6704J07310J25596j35982
3897B571258o9665q5623J75750J9012m1889M3126M0110L1954o9319K5521l4053
3886B606182q4525K2955k6115n0595J15110m6219j55407l3324J29674O5056J0262
3875B553054J23265l3233p3638L0113J13738j32346P0759q7374Q9220P4440N9400
3864B787398j10011k0025J17496K5827M6948m8224n9470k1523N4294J81738o6878
$$ plain form
3940 2381187 2393352 2321569 2398184 2364220 2240582 2352994 2418853 2237160 2316139 2302896 2164155
3929 2164155 2244825 2331544 2405576 2393483 2409392 2463883 2424894 2347382 2385430 2467224 2443117
3918 2443117 2478853 2431594 2497723 2413870 2464601 2571253 2478606 2467014 2486442 2356330 2491791
3907 2491791 2528407 2656666 2683708 2527613 2371922 2387630 2474334 2581644 2707240 2571258
3897 2571258 2501593 2415970 2591720 2610732 2568843 2611969 2652079 2684033 2614714 2640235 2606182
3886 2606182 2521657 2544612 2518497 2467902 2583012 2536793 2381386 2348062 2477736 2542792 2553054
3875 2553054 2676319 2643086 2569448 2599561 2713299 2580953 2651712 2564338 2653558 2727998 2787398
3864 2787398 2677387 2657362 2774858 2800685 2847633 2799409 2739939 2718416 2772710 2954448 2887570
3853B887570j80824k8654j5970O2602M0845J72516R4111j04363m2196l9395J12271
3842B958513j08001j75897M9187J12923J39965J56554k56486K8287k7821j98209
3832B679015J25136O9457j7456p4232M7839J49478o5542j19489M9347O0895J0589
3821B915037l0871L5290J19401Q0816q1909q8265R1470M9690j74044l4751m225
3810B877639J9551N6531J02394r9221K03459R1277l6681q9091j1632n4577J5823
3799C075472j12480P2763J37940j2391Q1581L1617j4228j75672R7826Q117k41268
3788B949277L3803J4548J23484J59869q0602M147K6940P1069J2562j57707j5111
3777C142279j42182J58921q6803j31063k3825J31372K32337J03309N6050k7639
$$ plain form
3853 2887570 2706746 2678092 2662122 2724724 2765569 2938085 3032196 2927833 2885637 2846242 2958513
3842 2958513 2850512 2674615 2723802 2836725 2976690 3133244 2876758 2905045 2877224 2679015
3832 2679015 2804151 2873608 2856152 2781920 2829759 2979237 2913695 2794206 2843553 2904448 2915037
3821 2915037 2884166 2919456 3038857 3119673 3037764 2949499 3040969 3090659 2916615 2881864 2877639
3810 2877639 2897190 2953721 3056115 2956894 3160353 3251630 3214949 3125858 3114226 3059649 3075472
3799 3075472 2962992 3035755 3173695 3161304 3242885 3274502 3260274 3084602 3182428 3190545 2949277
3788 2949277 2983080 2997628 3121112 3280981 3200379 3204526 3231466 3302535 3315097 3157390 3142279
3777 3142279 3000097 3159018 3072215 2941152 2917327 3048699 3281036 3384345 3440395 3412756
3767C412756K4200q671m0393j43000J73208J37790M5711k24343q533P4353J01743
3756C544821j14074j02127l765l6933J54022n5118N6337Q9129p6787l1274J43562
3745C567793J07259o1730N1113o2934n7590N9830j7190j00259K1000Q937J50372
3734C666601N7362j09516m6052R1428J03141r3388m602J2249n1496j45551J76813
3723C656989o4701p2951R9069M8291k2668k9609j52711l9951P809J0523M9696
3712C489786m0564l544P8303Q8669L4674j25591M3538J21619L2041L1767j0570
3701C740128j32944r8570L5685n1246K5360N6884P8238j12965n4471n0083R9060
3690C535076k4497k13650Q1712K00767P0242o66k52333O4575M3271M0873P941
$$ plain form
3767 3412756 3436956 3428285 3387892 3244892 3418100 3555890 3601601 3377258 3368725 3443078 3544821
3756 3544821 3430747 3328620 3324855 3287922 3441944 3386826 3443163 3532292 3455505 3424231 3567793
3745 3567793 3675052 3613322 3664435 3601501 3543911 3603741 3586551 3486292 3507292 3516229 3666601
3734 3666601 3723963 3614447 3568395 3659823 3762964 3669576 3664974 3677223 3625727 3480176 3656989
3723 3656989 3592288 3519337 3618406 3666697 3644029 3614420 3461709 3421758 3429567 3440090 3489786
3712 3489786 3449222 3445678 3523981 3612650 3647324 3521733 3565271 3686890 3718931 3750698 3740128
3701 3740128 3607184 3508614 3544299 3493053 3518413 3575297 3653535 3540570 3486099 3436016 3535076
3690 3535076 3510579 3296929 3378641 3579408 3649650 3648984 3396651 3461226 3504497 3545370 3553311
3679C553311n5781N5109l3129o4712M3553o4211l0363J38110J23602q5318J05822
3668C685993j20933l2307J65220J9338K4601j90344j01678O0796k2874M584J43233
3657C635629n7362K0523m4027J11447J26221M3685q8672K4079J96934j5120j2362
3646C940975N4666Q696m8653j06841M9784k4586K0464K09271r9244M8628N16J19677
3634D173353l0891n1422N2753M7881l1541l2013R8902O3772M5875R4574Q0135
3623D511378M3381o0178q6390L4652J48729K03668o2779p9024k6562J3563J80613
3612D821051L78O0945N9339j23511N643q187J70037Q7686m3107R5792J47517j28468
3600E145115J26566J69625j0900K300K0987P301j29429J57537k5357j7397J02763
$$ plain form
3679 3553311 3497530 3552639 3519510 3454798 3498351 3434140 3403777 3541887 3665489 3580171 3685993
3668 3685993 3565060 3532753 3697973 3717311 3741912 3551568 3449890 3510686 3487812 3492396 3635629
3657 3635629 3578267 3598790 3554763 3666210 3792431 3836116 3747444 3771523 3968457 3953337 3940975
3646 3940975 3995641 4004337 3955684 3848843 3898627 3874041 3894505 4103776 4004532 4053160 4053676 4173353
3634 4173353 4142462 4091040 4143793 4191674 4160133 4128120 4227022 4290794 4336669 4431243 4511378
3623 4511378 4554759 4494581 4408191 4442843 4591572 4795240 4732461 4653437 4626875 4640438 4821051
3612 4821051 4821429 4882374 4941713 4818202 4823845 4815658 4985695 5073381 5030274 5126066 5273583 5145115
3600 5145115 5271681 5441306 5430406 5432706 5453693 5460994 5331565 5489102 5463745 5446348 5549111
3589E549111n2468l9732l9275J20775j38442K75233O9339J4576J56842K05212
3579F121171J9367R4590n1093M6232Q0376p2946m3266J53948L36907k2311P2526
3568F735501J44782J4721J27795J20589K6096m3501O1020m8393J87811K58618
3558G585039k3427p3110M7603J41245l4370K90574O7167o7032J08127Q6791K25631
3547H354238J49085P179P3849N7152L60227M2408P5049K5104M931Q0057J60599
3536I389878K19299M0844J01318K22206L11205K2064K38727Q9091J60142J06783
3526A0901557r209J09275K18564J13091J78511K34367J48074K74914J61175J20487
3516A2450806K43349J36048J65823J78837K76154L05216J63064K65513L35823
$$ plain form
3589 5549111 5496643 5456911 5417636 5538411 5399969 5675202 5744541 5759117 5915959 6121171
3579 6121171 6140538 6235128 6184035 6230267 6310643 6237697 6194431 6348379 6685286 6662975 6735501
3568 6735501 6880283 6895004 7022799 7143388 7169484 7125983 7187003 7138610 7326421 7585039
3558 7585039 7561612 7488502 7536105 7677350 7642980 7933554 8000721 7933689 8041816 8128607 8354238
3547 8354238 8503323 8510502 8584351 8641503 9001730 9044138 9119187 9144291 9149222 9229279 9389878
3536 9389878 9609177 9650021 9751339 9973545 10284750 10306814 10545541 10634632 10794774 10901557
3526 10901557 10892348 11001623 11220187 11333278 11511789 11746156 11894230 12169144 12330319 12450806
3516 12450806 12694155 12830203 12996026 13174863 13451017 13756233 13919297 14184810 14520633
3507A4520633N83292L61082K51770K66839M67848M75761M19679M84688N04835
3498A8336427O18278P73402N21502O68234N60939N79301Q22989N44454L95329
3489B3820855M00542L88937K07934q4918P2611j65118k21516n21855n95675n41094
3479B2760703l42462n63071p72058m59439n32549m54933m03630n30985l28686
3470A8372890n26415m53518j94086j73478j27056k83246m52805j60498K1058r4856
3460A5927990m7522k7854m8760M9504J54668K18995M09231L64743K15998j8576
3450A7198417k50660k07110m67845n04050n30059o19984k82768l10340k22166
3441A3803435m12138k87619j51930L0959k69545j18744m2147j03992K3144M8775
$$ plain form
3507 14520633 15103925 15465007 15716777 15983616 16451464 16927225 17346904 17831592 18336427
3498 18336427 18954705 19728107 20249609 20917843 21478782 22058083 22881072 23425526 23820855
3489 23820855 24221397 24610334 24818268 24733350 24805961 24640843 24419327 23897472 23301797 22760703
3479 22760703 22418241 21855170 21083112 20623673 20091124 19636191 19232561 18701576 18372890
3470 18372890 17846475 17392957 17198871 17025393 16898337 16615091 16162286 16001788 16022846 15927990
3460 15927990 15880468 15852614 15803854 15853358 16008026 16227021 16636252 17000995 17216993 17198417
3450 17198417 16947757 16740647 16272802 15768752 15238693 14618709 14335941 14025601 13803435
3441 13803435 13391297 13103678 12951748 12982707 12713162 12594418 12552271 12448279 12471423 12520198
3431A2520198J02905p6126J42612L33743J49833M09800M49577P09814P72270P24368
3421A6238994P02959N24683L89134l2632l22927p23053q91575r19159q14791m84434
3411A3667199m81858l93095m80750l51597l60566l06778k16714l29982l27009
3402A0418850j93277r3222j3877j80228k06219k53775k4822K28431J65078N1126
3392I898065J42438K63628K48493L38671K63161J44040L6729p6794m33269m56384
3382A0368778k64078m72675l63413l75070m17749k41702l23458p8282j00699l6399
3372G695253l43354l00012p4134j52974r6548j61948j33126j98603j23212k0055
3362F091287j44309R5590l3305j80124r1597k9892n9646j70318M0343p7059j89917
$$ plain form
3431 12520198 12623103 12546977 12689589 13023332 13173165 13582965 14032542 14742356 15514626 16238994
3421 16238994 16941953 17466636 17855770 17823138 17500211 16777158 15885583 14966424 14151633 13667199
3411 13667199 13185341 12792246 12311496 11959899 11599333 11292555 11075841 10745859 10418850
3402 10418850 10225573 10132351 10118474 9938246 9732027 9478252 9453430 9681861 9846939 9898065
3392 9898065 10040503 10304131 10552624 10891295 11154456 11298496 11335225 11258431 10825162 10368778
3382 10368778 10104700 9632025 9268612 8893542 8475793 8234091 7910633 7832351 7731652 7695253
3372 7695253 7351899 7051887 6977753 6824779 6728231 6566283 6433157 6234554 6111342 6091287
3362 6091287 5946978 6042568 6009263 5829139 5737542 5707650 5648004 5477686 5518029 5440970 5251053
3351E251053q7168j61158J47909R6933p5478j39439K1959p5635o8886q8764m5147
3340D776179q1429K1574j5370j9404k3878J65288m2197n6057j6650n6349P682
3329D659389j71170m6865k9925Q5544J16618J1162M3588n1122k48602k3391O384
3318D351610l9858n1313j29346o0252R0640M073M4239j00389K05326o98k70223
3307D043809R466r736J30224j40927l23002P0617J16048m5146j62428O4124J3597
3296C766646P670n1229L5163q73J46183k7357O1813k94821m6740J46544o521k8184
3284C708294L5099n5537j06394J52507K7310p0021j07022J08752j983j25410K38271
3273C803866J16247k40827j11552P9898K9637J4094J0098q2644K6747j06183L1712
$$ plain form
3351 5251053 5163885 5002727 5150636 5247569 5172091 5032652 5054611 4978976 4910090 4821326 4776179
3340 4776179 4694750 4716324 4700954 4681550 4657672 4822960 4780763 4724706 4708056 4651707 4659389
3329 4659389 4488219 4441354 4411429 4496973 4613591 4624753 4668341 4617219 4368617 4345226 4351610
3318 4351610 4311752 4260439 4131093 4070841 4161481 4165554 4209793 4109404 4314730 4314032 4043809
3307 4043809 4053275 4043539 4173763 4032836 3709834 3780451 3896499 3851353 3688925 3753049 3766646
3296 3766646 3774316 3723087 3758250 3757377 3903560 3876203 3938016 3643195 3596455 3742999 3736478 3708294
3284 3708294 3743393 3687856 3581462 3733969 3761279 3691258 3584236 3692988 3691005 3565595 3803866
3273 3803866 3920113 3679286 3567734 3647632 3677269 3691363 3701461 3618817 3645564 3539381 3571093
3262C571093J77114M550j51011O3204Q4861J2651K4477o6450O6310q978n228J4516
3250C787109J04877J61651j4748J26202L1627J652K1019P8815P3203N2787K1932
3239D446126L2420m2837j06776P897K74609J81716N0780o1777J26057M1833J71751
3228E121799Q56J81744K5913J08517J33982L829K17414J75564j25682p6069P1755
3217E839622j3559r97p2556J04773J66534l2700K7433J26866J43659j8404R7294
3206F367965M0459M756L7204K44326k8034l1699M883J30515J94693N1688J52889
3195G169645J12851K07959J34155K59749K21707J22043j978J47987M1821N4561
3185H470500J29365N4450P2895q2766N0086J67874Q723K68534K47573K54665J83385
$$ plain form
3262 3571093 3748207 3752757 3601746 3664950 3749811 3762462 3786939 3720489 3786799 3777821 3772593 3787109
3250 3787109 3891986 4053637 4038889 4165091 4196718 4198370 4219389 4298204 4371407 4424194 4446126
3239 4446126 4478546 4435709 4328933 4336830 4611439 4793155 4843935 4782158 4908215 4950048 5121799
3228 5121799 5122655 5304399 5330312 5438829 5572811 5576640 5794054 5969618 5843936 5767867 5839622
3217 5839622 5826063 5825066 5752510 5857283 6023817 5991117 6018550 6145416 6289075 6270671 6367965
3206 6367965 6408424 6413180 6450384 6694710 6666676 6634977 6639860 6770375 6965068 7016756 7169645
3195 7169645 7282496 7490455 7624610 7884359 8106066 8228109 8226131 8374118 8415939 8470500
3185 8470500 8599865 8654315 8727210 8644444 8694530 8862404 8871127 9139661 9387234 9641899 9825284
3174I825284p0139p4105O9997J01629l3407L9841K47178J65663R1902l3209J51883
3163A0482517J11646K31704K98550K22165K1462K13142L38654J69199K89649L50531
3153A2729219J53930K20947J23140L32663K27954L09316O6823R7040j25614L8181
3143A4173599j4018j13618p8584j55666j164M628j21114j95880j01367j49408
3133A3247408P8585Q1164o724O6634N8533J45497P5068P5580K31330R7929J33856
3122A4284860q3977j18124j43754p8949n3317j89397j77082k50591k46307j86954
3112A2756408k94145k39557j35670k32689k80525j25446j83578k82376J7747r8874
3102A0901295k26409r1093k04129R9069l20130k39204k31713k55921l59535j44971
$$ plain form
3174 9825284 9755145 9681040 9751037 9852666 9819259 9859100 10106278 10271941 10363843 10330634 10482517
3163 10482517 10594163 10825867 11124417 11346582 11368044 11581186 11919840 12089039 12378688 12729219
3153 12729219 12883149 13104096 13227236 13559899 13787853 14097169 14163992 14261032 14135418 14173599
3143 14173599 14159581 14045963 13967379 13811713 13810549 13815177 13694063 13498183 13396816 13247408
3133 13247408 13325993 13407157 13400433 13467067 13525600 13671097 13746165 13821745 14053075 14151004 14284860
3122 14284860 14200883 14082759 13939005 13860056 13806739 13617342 13440260 13189669 12943362 12756408
3112 12756408 12462263 12222706 12087036 11854347 11573822 11448376 11264798 10982422 11000169 10901295
3102 10901295 10674886 10583793 10379664 10478733 10158603 9919399 9687686 9431765 9072230 8927259
3092H927259j3030k73797k62607k76649r6153k20510j76210r6987l01411j66553
3082G043352r1359k34984l97082j85001j01642J4048q1297n5685J00274k90687
3072E719937q7082j39219k37846P41m6052k04105j52397n1394N799l3481j51027
3061D623874k43837q4276o6767j43268q8928k0113j8484l1303j5337q0598j10475
3050C720488r9995J284j30865j02096k6040M7202j1822j24241n8545O6795j7622
3039C264543j52321j02510j56620N2417L3332k52707k4042O8900L3230j00768
3029B663454j56435p5681L4429K5651J61249l1213j57522j99906j31270k1482
3019B111274j29047J7380Q1327j64159J30366P3539R7539p9633j84132j17229
$$ plain form
3092 8927259 8914229 8640432 8377825 8101176 8005023 7784513 7608303 7511316 7209905 7043352
3082 7043352 6951993 6717009 6319927 6134926 6033284 6047332 5966035 5910350 6010624 5719937
3072 5719937 5632855 5493636 5255790 5256531 5210479 5006374 4853977 4802583 4808382 4774901 4623874
3061 4623874 4380037 4295761 4228994 4085726 3996798 3976685 3958201 3926898 3911561 3830963 3720488
3050 3720488 3620493 3621777 3490912 3388816 3362776 3409978 3398156 3273915 3215370 3282165 3264543
3039 3264543 3112222 3009712 2853092 2905509 2938841 2686134 2662092 2730992 2764222 2663454
3029 2663454 2507019 2431338 2465767 2491418 2652667 2621454 2463932 2264026 2132756 2111274
3019 2111274 1982227 1999607 2080934 1916775 2047141 2120680 2218219 2138586 1954454 1837225
3009A837225j74470r1930J51320N6818l9414m1797j991J0877j78825q3741O184
2998A450256R8399q1051p5510j3950P8336m5452k4858m0000N7883o095p6140O8873
2986A390691q6419r3260m9371K4336M3966k26112R3475j2682m8354J11738p5974
2975A072034j29207J36326j20005J4722K269O718k1773n8383k09003K2531j5736
2964G00493P8919J50083r0003M1753l9233N4382R417o9047M4009m9253j48266
2953F83254K29O4407L7738m22K7052N1338j61530l755Q9955m4770Q8804j01951
2941G30349K4926m5256j35639K2306j01732M4098J58216q7562J1439J21157k38159
2930E04143p8831J37735M135J29484J4945j73102m4371l7984J2339o5400j3628
$$ plain form
3009 1837225 1662755 1570825 1722145 1778963 1739549 1697752 1695761 1706638 1527813 1444072 1450256
2998 1450256 1548655 1467604 1392094 1378144 1456480 1411028 1386170 1346170 1404053 1397958 1321818 1390691
2986 1390691 1304272 1211012 1161641 1185977 1229943 1003831 1097306 1084624 1036270 1148008 1072034
2975 1072034 942827 1079153 959148 973870 976139 982857 961084 902701 693698 716229 700493
2964 700493 779412 929495 839492 881245 842012 896394 905811 836764 880773 831520 683254
2953 683254 683483 747890 785628 785206 812258 863596 702066 698311 788266 743496 832300 730349
2941 730349 755275 710019 574380 596686 494954 539052 697268 609706 621145 742302 504143
2930 504143 425312 563047 567182 696666 711611 538509 494138 456154 468493 403093 389465
2919C89465l2766q8601J21785J067J11350r843o7731l9136j9992o2237n5793K2648
2907B70216q0071k440K3903n0848K06517Q6883k4804o9855j26751J49650l6784
2896C45616m3973J80268j76465k4679J02945N0349n9049Q1800J54323j51408n950
2885D53777k3946n2407J02418j24609m5154R6660r4477J08474L2409K8895j27653
2874C54387j89317O9591R9520k6106l7910k0916m5559J3392L1809k0701O5858
2863B94048j00961k6567j6887j50628K28793m354q5914n750k0128p5336J72477
2852B08793N7458N4919j11384q5136N2512R2832j82840k8980J42142j54302l3093
2841A2921J99905j24343j20229k0727j5007J18924p1312J43878j97461j2337J82433
$$ plain form
2919 389465 356699 268098 389883 390950 502300 492457 424726 385590 365598 303361 247568 270216
2907 270216 190145 187705 211608 160760 367277 454160 429356 359501 232750 382400 345616
2896 345616 301643 481911 305446 280767 383712 434061 375012 456812 611135 459727 453777
2885 453777 429831 377424 479842 355233 310079 406739 312262 420736 453145 482040 354387
2874 354387 165070 234661 334181 308075 270165 249249 203690 217082 248891 228190 294048
2863 294048 193087 166520 149633 -995 227798 223444 137530 131780 111652 36316 208793
2852 208793 266251 321170 209786 124650 177162 269994 87154 58174 200316 46014 12921
2841 12921 212826 88483 -31746 -52473 -67480 51444 -19868 124010 -73451 -85788 96645
2830I6645J51198j11029k22951n9168J13322L1811l4969R3176M9046p0918L1893
2819F8056R2081n8493l1664J1895J2609L1752j33415p6242o4955L9133R6210q854
2807b1887P098m3836J31219O6769o4346j2111j32199P1171J23912q660n4262k810
2795F0058j13820J40688M2079j97465j40055J08775J79928j06172j17854N7895
2785h5943m3015n4608L6519N6058K06119J7246M1372j19435O1094n305J06144
2774B16246j6015l00930Q8459J25925r7900r065j23137p5400j49004J65565J08900
2763f6356O1659J89225k0317q9134j748L1275k38459k7933m5893J9336q972m1780
2751b39097O9999J08824n5566J2579L7967j7308M4707o8503N7115q1968q5475
$$ plain form
2830 96645 247843 136814 -86137 -145305 -31983 -172 -35141 58035 107081 36163 68056
2819 68056 160137 101644 69980 81875 94484 126236 -7179 -83421 -148376 -109243 -13033 -21887
2807 -21887 -14789 -58625 72594 139363 75017 62906 -69293 1878 125790 117130 62868 60058
2795 60058 -53762 86926 129005 -68460 -208515 -99740 80188 -25984 -143838 -85943
2785 -85943 -128958 -183566 -147047 -90989 115130 132376 173748 54313 115407 110102 216246
2774 216246 200231 -100699 -12240 113685 15785 6720 -116417 -191817 -340821 -175256 -66356
2763 -66356 -4697 184528 164211 75077 73329 104604 -133855 -161788 -207681 -188345 -197317 -239097
2751 -239097 -169098 -60274 -115840 -103261 -65294 -82602 -37895 -106398 -49283 -131251 -216726
2740b16726P4018J6210L0374q5887L9204J43066j28138j20123Q5146j53621O0515
2729b55962K70330k9130p3555K1140j73944l0676O8301o7818P694n9296j00107
2718d23023L25206P5044j02624m4213r414p338m6644R0826q663m6793p8988O5902
2706b10722j5661L3388J30935K1955j16586K14121j06445j42662J13443J76213
2696I7979j06205n471j50473J05592J5212j81716m5112K2556J10138L8371j33922
$$ plain form
2740 -216726 -142708 -126498 -96124 -182011 -142807 259 -127879 -248002 -162856 -316477 -255962
2729 -255962 14368 -14762 -88317 -67177 -241121 -271797 -203496 -271314 -263620 -322916 -423023
2718 -423023 -97817 -22773 -125397 -169610 -179024 -186362 -233006 -142180 -150843 -197636 -276624 -210722
2706 -210722 -226383 -192995 -62060 -40105 -156691 57430 -49015 -191677 -78234 97979
2696 97979 -8226 -13697 -164170 -58578 -43366 -225082 -270194 -247638 -137500 -99129 -233051
$$ [...]
##END NTUPLES=NMR SPECTRUM
##END=
