##TITLE=1H_TG-2389-b2
 200.13MHz, CDCl3,
 8 sc
 
 22.8.2025
##JCAMPDX= 6.0         $$ Bruker NMR JCAMP-DX V2.0
##DATA TYPE= NMR SPECTRUM
##DATA CLASS= NTUPLES
##ORIGIN= UXNMR, Bruker Analytische Messtechnik GmbH
##OWNER= pz
$$ XWIN-NMR		Version 3.5
$$ Fri Aug 22 13:50:24 2025 Russian Standard Time (UT+4h)  she@DPX200
##.OBSERVE FREQUENCY= 200.1308
##.OBSERVE NUCLEUS= ^1H
##.ACQUISITION MODE= SIMULTANEOUS
##.ACQUISITION SCHEME= undefined
##.AVERAGES= 8
##.DIGITISER RES= 18
##SPECTROMETER/DATA SYSTEM= spect
##.PULSE SEQUENCE= zg30
##.SOLVENT NAME= CDCl3
##.SHIFT REFERENCE= (INTERNAL, CDCl3, 0, 15.9508)
##AUDIT TRAIL= $$ (NUMBER, WHEN, WHO, WHERE, WHAT)
$$ ##TITLE= Audit trail, XWIN-NMR		Version 3.5
$$ ##JCAMPDX= 5.01
$$ ##ORIGIN= Bruker BioSpin GmbH
$$ ##OWNER= she
$$ F:/spectra/data/she/nmr/H-C/1/pdata/1/auditp.txt
$$ ##AUDIT TRAIL=  $$ (NUMBER, WHEN, WHO, WHERE, WHAT)
(   1,<2025-08-22 13:47:51.37 +0400>,<she>,<DPX200>,
      <created by zg, POWCHK disabled, PULCHK disabled
       configuration hash MD5:
       00 E9 B6 7A A2 85 ED C7 34 08 36 98 17 FE 4E 26
       data hash MD5: 16K
       33 87 70 4F 44 44 75 B6 35 08 FA 58 65 0F ED B5>)
(   2,<2025-08-22 13:47:59.01 +0400>,<she>,<DPX200>,
      <Start of raw data processing
       efp BC_mod = 2 LB = 0.25 FT_mod = 6 PKNL = 1 PHC0 = -1563.279 PHC1 = 10.79229 SI = 16K 
       data hash MD5: 16K
       07 BA C2 62 82 3F 83 59 7C FF FF 5F 55 7D B2 E3>)
(   3,<2025-08-22 13:48:17.78 +0400>,<she>,<DPX200>,
      <pk PHC0 = 1.977297 PHC1 = -0.3999997 
       data hash MD5: 16K
       9D 56 8C C5 FC C5 74 0E 2F 05 20 FE 17 E7 93 A2>)
(   4,<2025-08-22 13:48:21.76 +0400>,<she>,<DPX200>,
      <abs ABSG = 5 
       data hash MD5: 16K
       A7 A9 A3 D5 E2 64 DA B7 4D BE 19 9F A1 F5 DE F2>)
$$ ##END=
$$ 
$$ hash MD5
$$ 84 54 3E A8 89 B7 E6 86 4E 3E 1B 6F F5 9F 17 A9
##$RELAX= 
##$RELAX= 
##$RELAX= 
##$RELAX= 
##$RELAX= 
##$RELAX= 
$$ Bruker specific parameters
$$ --------------------------
##$DU= <F:/spectra>
##$EXPNO= 1
##$NAME= <H-C>
##$PROCNO= 1
##$TYPE= <nmr>
##$USER= <she>
##$AMP= (0..31)
100 100 100 100 100 100 100 100 100 100 100 100 100 100 100 100 100 100 
100 100 100 100 100 100 100 100 100 100 100 100 100 100 
##$AQSEQ= 0
##$AQ_mod= 1
##$AUNM= <au_zg>
##$AUTOPOS= <>
##$BF1= 200.13
##$BF2= 200.13
##$BF3= 200.13
##$BF4= 200.13
##$BF5= 200.13
##$BF6= 200.13
##$BF7= 200.13
##$BF8= 200.13
##$BYTORDA= 1
##$CFDGTYP= 0
##$CFRGTYP= 5
##$CHEMSTR= <none>
##$CNST= (0..31)
1 1 145 1 1 1 1 1 1 1 1 1 1 1 1 1 1 1 1 1 1 1 1 1 1 1 1 1 1 1 1 1 
##$CPDPRG= <>
##$CPDPRG1= <>
##$CPDPRG2= <>
##$CPDPRG3= <>
##$CPDPRG4= <mlev>
##$CPDPRG5= <mlev>
##$CPDPRG6= <mlev>
##$CPDPRG7= <mlev>
##$CPDPRG8= <mlev>
##$CPDPRGB= <>
##$CPDPRGT= <>
##$D= (0..31)
0 0.7 0 0 0 0 0 0 0 0 0 0.03 0 0 0 0 0 0 0 0 0 0 0 0 0 0 0 0 0 0 0 0 
##$DATE= 1755856071
##$DBL= (0..7)
120 120 120 120 120 120 120 120 
##$DBP= (0..7)
150 150 150 150 150 150 150 150 
##$DBP07= 0
##$DBPNAM0= <>
##$DBPNAM1= <>
##$DBPNAM2= <>
##$DBPNAM3= <>
##$DBPNAM4= <>
$$ [...]
##$SUBNAM3= <"">
##$SUBNAM4= <"">
##$SUBNAM5= <"">
##$SUBNAM6= <"">
##$SUBNAM7= <"">
##$SUBNAM8= <"">
##$SUBNAM9= <"">
##$SW= 18.0517779522481
##$SWIBOX= (0..15)
0 0 2 0 0 0 0 0 0 0 0 0 0 0 0 0 
##$SW_h= 3612.71676300578
##$TD= 16384
##$TD0= 1
##$TE= 0
##$TE2= 300
##$TE3= 300
##$TEG= 300
##$TL= (0..7)
0 120 120 120 120 120 120 120 
##$TP= (0..7)
150 150 150 150 150 150 150 150 
##$TP07= 0
##$TPNAME0= <>
##$TPNAME1= <>
##$TPNAME2= <>
##$TPNAME3= <>
##$TPNAME4= <>
##$TPNAME5= <>
##$TPNAME6= <>
##$TPNAME7= <>
##$TPOAL= (0..7)
0.5 0.5 0.5 0.5 0.5 0.5 0.5 0.5 
##$TPOFFS= (0..7)
0 0 0 0 0 0 0 0 
##$TUNHIN= 0
##$TUNHOUT= 0
##$TUNXOUT= 0
##$USERA1= <user>
##$USERA2= <user>
##$USERA3= <user>
##$USERA4= <user>
##$USERA5= <user>
##$V9= 5
##$VALIST= <valist>
##$VCLIST= <CCCCCCCCCCCCCCC>
##$VD= 0
##$VDLIST= <DDDDDDDDDDDDDDD>
##$VPLIST= <PPPPPPPPPPPPPPP>
##$VTLIST= <TTTTTTTTTTTTTTT>
##$WBST= 1024
##$WBSW= 4
##$XGAIN= (0..3)
0 0 0 0 
##$XL= 0
##$YL= 0
##$YMAX_a= 132417
##$YMIN_a= -176063
##$ZGOPTNS= <>
##$ZL1= 120
##$ZL2= 120
##$ZL3= 120
##$ZL4= 120
##$ABSF1= 12.04644
##$ABSF2= -6.005392
##$ABSG= 5
##$ABSL= 3
##$ALPHA= 0
##$AQORDER= 0
##$ASSFAC= 0
##$ASSFACI= 0
##$ASSFACX= 0
##$ASSWID= 0
##$AUNMP= <proc_1d>
##$AZFE= 0.1
##$AZFW= 0.1
##$BCFW= 0
##$BC_mod= 2
##$BYTORDP= 0
##$COROFFS= 0
##$CY= -3
##$DATMOD= 1
##$DC= 0
##$DFILT= <>
##$DTYPP= 0
##$F1P= 0
##$F2P= 0
##$FCOR= 1
##$FTSIZE= 16384
##$FT_mod= 6
##$GAMMA= 0
##$GB= 0
##$INTBC= 1
##$INTSCL= 3.241238e-09
##$ISEN= 128
##$LB= 0.25
##$LEV0= 0
##$LPBIN= 0
##$MAXI= 10000
##$MC2= 0
##$MEAN= 0
##$ME_mod= 0
##$MI= 1.114404
##$NCOEF= 0
##$NC_proc= -8
##$NLEV= 6
##$NOISF1= 3.799351
##$NOISF2= 2.8
##$NSP= 0
##$NTH_PI= 0
##$NZP= 0
##$OFFSET= 15.95077
##$PC= 1
##$PHC0= -1561.302
##$PHC1= 10.39229
##$PH_mod= 1
##$PKNL= yes
##$PPARMOD= 0
##$PSCAL= 0
##$PSIGN= 0
##$REVERSE= no
##$SF= 200.129414140059
##$SI= 16384
##$SIGF1= 3
##$SIGF2= 2
##$SINO= 0.751879
##$SIOLD= 32768
##$SREGLST= <19F.Aceton>
##$SSB= 0
##$STSI= 16384
##$STSR= 0
##$SW_p= 3612.71676300577
##$SYMM= 0
##$S_DEV= 0
##$TDeff= 16384
##$TDoff= 0
##$TI= <>
##$TILT= no
##$TM1= 0
##$TM2= 0
##$TOPLEV= 0
##$USERP1= <user>
##$USERP2= <user>
##$USERP3= <user>
##$USERP4= <user>
##$USERP5= <user>
##$WDW= 1
##$XDIM= 16384
##$YMAX_p= 474373377
##$YMIN_p= -4820222
$$ End of Bruker specific parameters
$$ ---------------------------------
##NTUPLES= NMR SPECTRUM
##VAR_NAME=  FREQUENCY,     SPECTRUM/REAL,   SPECTRUM/IMAG
##SYMBOL=    X,             R,               I
##VAR_TYPE=  INDEPENDENT,   DEPENDENT,       DEPENDENT
##VAR_FORM=  AFFN,          ASDF,            ASDF
##VAR_DIM=   16384,         16384,           16384
##UNITS=     HZ,            ARBITRARY UNITS, ARBITRARY UNITS
##FACTOR=    0.220516191357247, 1,           1
##FIRST=     3192.21833085432, 0,            0
##LAST=      -420.498432151449, 0,           0
##MIN=       -420.498432151449, -4820222,    0
##MAX=       3192.21833085432, 474373377,    0
$$ Real data points
##PAGE= N=1
##DATA TABLE= (X++(R..R)), XYDATA
$$ [...]
$$ plain form
11616 301397 -99983 -232988 -304854 -130971 412493 816999 653430 906111 597165 64764
11606 64764 73170 -249002 -476455 -449306 -729759 -1481252 -441063 143920 185998 -474448
11596 -474448 -562206 -606517 -454062 -216820 -35731 78091 88067 -127224 -172818 336159
11586 336159 323135 15879 -863150 23702 788662 169130 -151190 167820 -324680 -362538
11576 -362538 144312 -393711 -1346 117194 -166565 -241898 -616277 -959967 -447124 -61583
11566 -61583 -484957 -641174 -556646 75336 127327 69701 25366 227114 33770 -273772
11556 -273772 -431758 -320606 -265988 -766449 -668160 26964 116326 -558904 -1102149 -829514
11546 -829514 -394719 -335209 -95591 545662 627156 224147 18470 -380865 -602757 -146952
$$ packed form
11616C01397m01380j33005p1866J73883N43464M04506j63569K52681l08946n32401
11606F4764Q406l22172k27453K7149k80453p51493J040189N84983M2078o60446
11596d74448q7758m4311J52455K37242J81089J13822R976k15291m5594N08977
11586C36159j3024l07256q79029Q86852P64960o19532l20320L19010m92500l7858
11576c62538N06850n38023L92365J18540k83759p5333l74379l43690N12843L85541
11566f1583m23374j56217Q4528O31982N1991n7626m4335K01748j93344l07542
11556b73772j57986J11152N4618n00461R8289O95124Q9362o75230n43245K72635
11546h29514M34795N9510K39618O41253Q1494m03009k05677l99335k21892M55805
$$ plain form
11536 -146952 -339135 -266859 -355624 -81142 -50621 -75296 215884 -404672 -895785 -588641
11526 -588641 -189322 -841740 -1037995 -954902 -32088 -30759 -125360 -767999 -367757 101691
11516 101691 73679 -366997 92511 79709 -351062 -1025269 -708614 -292261 -450874 -334563
11506 -334563 -689572 -807903 -1179277 -860071 -695500 -933384 -549317 -128050 343306 -74064
11496 -74064 141023 6881 -138266 -222070 -720322 -595648 -106240 -30390 -100118 119798
11486 119798 -15356 332301 -525526 -484536 294552 549923 -154296 -515801 -124521 312575
11476 312575 -555708 -769921 -169151 17383 331616 503714 631158 858992 -124525 -299070
11466 -299070 368081 259244 -45743 179131 4711 289270 39151 -341976 -353828 -377109
$$ packed form
11536a46952j92183P2276q8765K74482L0521k4675K91180o20556m91113L07144
11526e88641L99319o52418j96255Q3093R22814J329r4601o42639M00242M69448
11516A01691k8012m40676M59508j2802m30771o74207L16655M16353j58613J16311
11506c34563l55009j18331l71374L19206J64571k37884L84067M21267M71356m17370
11496g4064K15087j34142j45147q3804m98252J24674M89408P5850o9728K19916
11486A19798j35154L47657q57827M0990P79088K55371p04219l61505L91280M37096
11476C12575q68283k14213O00770J86534L14233J72098J27444K27834r83517j74545
11466b99070O67151j08837l04987K24874j74420K84559k50119l81127j1852k3281
$$ plain form
11456 -377109 744193 847512 79366 36918 146334 -24749 202079 -400037 -684270 -341652
11446 -341652 -440790 -482211 -192245 172566 346617 -318979 81588 220735 662521 -94222
11436 -94222 -584719 -806440 -1139979 -456335 -160190 -99448 -185675 343772 525253 217834
11426 217834 -44430 158165 -150895 -85245 -683638 -703745 -460891 -62300 -624208 -194944
11416 -194944 -536271 -137217 -283157 -95211 176448 317548 23115 -240890 63590 -111492
11406 -111492 -223200 49200 -221487 -701295 -492227 281140 10983 -80305 -18000 6991
11396 6991 170682 365535 340024 40112 -631564 -1012757 -310165 -530965 -337980 -601800
11386 -601800 -78231 -293485 -655494 -727158 -983157 -487430 -295909 -520515 7356 161931
$$ packed form
11456c77109J121302J03319p68146m2448J09416j71083K26828o02116k84233L42618
11446c41652r9138m1421K89966L64811J74051o65596M00567J39147M41786p56743
11436i4222m90497k21721l33539O83644K96145O0742q6227N29447J81481l07419
11426B17834k62264K02595l09060O5650n98393k0107K42854L98591n61908M29264
11416a94944l41327L99054j45940J87946K71659J41100k94433k64005L04480j75082
11406a11492j11708K72400k70687m79808K09068P73367k70157r1288O2305K4991
11396F991J63691J94853k5511k99912o71676l81193P02592k20800J92985k63820
11386f01800N23569k15254l62009p1664k55999M95727J91521k24606N27871J54575
$$ plain form
11376 161931 300275 -534576 -325083 -744637 -119196 64807 -651524 -802769 -364322 -308909
11366 -308909 -261920 582885 350091 250784 471460 143247 -62596 76108 668702 509055
11356 509055 -42542 -10317 -177312 -118837 -354559 -1027579 -640789 -177332 -284782 -393885
11346 -393885 362130 381492 -98895 112428 162697 -245361 235230 225704 -760925 -1181679
11336 -1181679 -996468 -49097 139783 -23513 -10161 -120340 284691 794997 755635 144383
11326 144383 218993 -451177 -141870 316531 -243296 -361129 114283 -49919 -206562 -200247
11316 -200247 -80685 -39678 339375 533168 13634 -147749 -321586 -14216 -292320 105494
11306 105494 -368288 -418608 21004 -595879 -361474 16223 97050 -646265 -717981 -10302
$$ packed form
11376A61931J38344q34851K09493m19554O25441J84003p16331j51245M38447N5413
11366c08909M6989Q44805k32794r9307K20676l28213k05843J38704N92594j59647
11356E09055n51597L2225j66995N8475k35722o73020L86790M63457j07450j09103
11346c93885P56015J9362m80387K11323N0269m08058M80591r526r86629m20754
11336a181679J85211R47371J88880j63296J3352j10179M05031N10306l9362o11252
11326A44383P4610o70170L09307M58401n59827j17833M75412j64202j56643O315
11316b00247J19562M1007L79053J93793n19534j61383j73837L07370k78104L97814
11306A05494m73782n0320M39612o16883K34405L77697Q0827p43315p1716P07679
$$ plain form
11296 -10302 -172933 -452193 -849351 -481643 -630892 -716516 -1055763 -1187671 -415163 41227
11286 41227 -21294 -246839 -258925 -614031 -1058718 -959572 -669735 -972361 -1287437 -765875
11276 -765875 -105099 379844 785466 770379 705113 182545 242877 594240 125658 446302
11266 446302 616717 566905 344649 496014 368836 -60600 -476827 -59113 -439653 -186704
11256 -186704 -237660 108615 -181854 -650777 -330229 -511896 -1286007 -861977 -497871 -102504
11246 -102504 -107307 -407387 -40027 215352 537229 -28426 -298742 -180329 265101 -64128
11236 -64128 -121145 -747741 -584984 249211 143983 398118 49708 198717 446891 -35134
11226 -35134 41727 35760 152184 -12060 391891 -38538 -201266 205814 -329497 -502283
$$ packed form
11296a0302j62631k79260l97158L67708j49249q5624l39247j31908P72508M56390
11286D1227o2521k25545j2086l55106m44687R9146K89837l02626l15076N21562
11276g65875O60776M84943M05622j5087o5266n22568O0332L51363m68582L20644
11266D46302J70415m9812k22256J51365j27178m29436m16227M17714l80540K52949
11256a86704n0956L46275k90469m68923L20548j81667p74111M24030L64106L95367
11246a02504m803l00080L67360K55379L21877n65655k70316J18413M45430l29229
11236f4128n7017o26596J62757Q34195j05228K54135l48410J49009K48174m82025
11226c5134P6861n967J16424j64244M03951m30429j62728M07080n35311j72786
$$ plain form
11216 -502283 241973 -1901 -92212 -513579 -658845 -808721 -413607 94809 335540 -68430
11206 -68430 -284840 -161357 -633065 -322858 -230705 179858 -36403 -19698 -296273 -451754
11196 -451754 -23396 251226 104256 442258 191675 -55513 301483 408406 198084 -834656
11186 -834656 16069 639550 -70521 -844236 -673245 -510019 -299977 436536 762185 273498
11176 273498 -345554 -111250 -90230 91442 -398629 89845 -346116 -49986 62212 -657526
11166 -657526 169469 78356 -66086 64275 -271110 -444906 453352 485346 -125814 156039
11156 156039 -42903 385822 674555 683623 172022 162624 646764 334225 323882 768541
11146 768541 1036675 618296 804404 574910 346762 131399 -44222 137544 367326 458088
$$ packed form
11216e02283P44256k43874r0311m21367j45266j49876L95114N08416K40731m03970
11206f8430k16410J23483m71708L10207R2153M10563k16261J6705k76575j55481
11196d51754M28358K74622j46970L38002k50583k47188L56996J06923k10322j032740
11186h34656Q50725O23481p10071p73715J70991J63226K10042P36513L25649m88687
11176B73498o19052K34304K1020J81672m90071M88474m35961K96130J12198p19738
11166f57526Q26995r1113j44442J30361l35385j73796Q98258L1994o11160K81853
11156A56039j98942M28725K88733R068n11601r398M84140l12539j0343M44659
11146G68541K68134m18379J86108k29494k28148k15363j75621J81766K29782R0762
$$ plain form
11136 458088 338330 4148 1555 -545625 -269602 416703 538547 84675 144424 191048
11126 191048 -84589 -330908 -210673 90744 -114059 -76627 -291029 -429212 -17588 286992
11116 286992 255433 79060 -128987 335520 -285108 -432982 -617242 -481615 386652 236376
11106 236376 -4332 -433131 275832 -145573 26857 490486 214284 -205165 -1231195
11097 -1231195 -477078 281839 776715 749977 164526 336390 -151483 9535 -94061 -147835
11087 -147835 -173803 180315 495516 -462941 -791278 -227422 -20453 144009 -102118 -44195
11077 -44195 513864 323432 205587 -132094 109148 -176495 -607983 -476668 -149126 -331436
11067 -331436 -346591 -98642 219345 625596 673950 464041 48224 -538236 -70405 -290856
$$ packed form
11136D58088j19758l34182k593n47180K76023O86305J21844m53872N9749M6624
11126A91048k75637k46319J20235L01417k04803L7432k14402j38183M11624L04580
11116B86992l1559j76373k08047M64507o20628j47874j84260J35627Q68267j50276
11106B36376k40708m28799P08963m21405J72430M63629k76202m19449j026030
11097a231195P54117P58917M94876k6738n85451J71864m87873J61018j03596n3774
11087a47835k5968L54118L15201r58457l28337N63856K06969J64462k46127N7923
11077d4195N58059j90432j17845l37681K41242k85643m31488J31315L27542j82310
11067c31436j5155K47949L17987M06251M8354k09909m15817n86460M67831k20451
$$ plain form
11057 -290856 -661911 -35315 497696 812126 188452 -312878 -147722 29439 -39828 -258984
11047 -258984 -357205 -259990 2699 648112 -3827 -316719 -186473 584917 -4998 -51959
11037 -51959 190468 284251 168618 121958 731871 1414008 1338982 287124 162298 -411886
11027 -411886 -109980 -415398 -112438 -20287 -451212 -598986 -879840 -88184 -247649 70312
11017 70312 -277947 -683919 138966 318853 240501 -339700 -166650 -142078 158677 -146535
11007 -146535 -296571 220594 299271 81209 699619 410549 -233361 -426809 -154749 -426992
10997 -426992 -610188 -718169 -564494 -873093 165472 -15438 -191458 -509530 -38230
10988 -38230 82901 9239 264698 61482 -189281 75648 498706 -469086 -595165 269832
$$ packed form
11057b90856l71055O26596N33011L14430o23674n01330J65156J77161o9267k19156
11047b58984r8221R7215K62689O45413o51939l12892J30246P71390n89915m6961
11037e1959K42427R3783j15633m6660O09913O82137p5026j051858j24826n74184
11027d11886L01906l05418L02960R2151m30925j47774k80854P91656j59465L17961
11017G0312l48259m05972Q22885J79887p8352n80201J73050K4572L00755l05212
11007a46535j50036N17165P8677k18062O18410k89070o43910j93448K72060k72243
10997d26992j83196j07981J53675l08599J038565j80910j76020l18072M71300
10988c8230J21131p3662K55459k03216k50763K64929M23058r67792j26079Q64997
$$ plain form
10978 269832 903388 502584 -84293 -536913 -1010741 -528291 126262 -59399 310876 -497605
10968 -497605 45474 403129 336393 -5510 275101 101944 -438504 -313594 -383345 -309732
10958 -309732 -772066 -620389 -892501 -1094634 -650947 -795102 61770 133399 -3679 62837
10948 62837 -305122 -20938 251921 -29581 -433667 -29525 48443 265812 -88081 185386
10938 185386 98360 103363 362691 -3980 327958 -6977 -605274 -530746 471256 -191667
10928 -191667 -486863 -358876 -136318 -26112 4521 216185 904269 528826 677125 94048
10918 94048 240611 390820 71241 72757 -177522 -462274 124887 -381807 332060 976016
10908 976016 508145 708591 294894 162160 -85163 -141021 -19110 -367924 -111140 350349
$$ packed form
10978B69832O33556m00804n86877m52620m73828M82450O54553j85661L70275q08481
10968d97605N43079L57655o6736l41903K80611j73157n40448J24910o9751P3613
10958c09732m62334J51677k72112k02133M43687j44155Q56872P1629j37078O6516
10948F2837l67959K84184K72859k81502m04086M04142P7968K17369l53893K73467
10938A85386q7026N003K59328l66671L31938l34935n98297P4528J002002o62923
10928a91667k95196J27987K22558J10206L0633K11664O88084l75443J48299n83077
10918I4048J46563J50209l19579J516k50279k84752N87161n06694P13867O43956
10908I76016m67871K00446m13697j32734k47323n5858J21911l48814K56784M61489
$$ plain form
10898 350349 527249 322653 -60698 -9197 -27121 117909 336949 -398683 -864266 -584575
10888 -584575 -816484 -806454 -454050 -97353 11170 -7594 -29331 -398981 63842 245110
10878 245110 -675237 -209222 227918 310007 431122 545450 368159 253517 514631 -74841
10868 -74841 -736710 -395882 -904943 -457893 168199 17081 266612 616289 351187 -55320
10858 -55320 -611294 -419060 -322189 -128057 88427 557838 697708 -363579 -354584 183030
10848 183030 -19320 222395 690619 511435 -54568 -234564 -422405 114836 -158685 -217937
10838 -217937 -130414 -128143 486127 337638 -270750 53723 192383 -462639 -376639 284438
10828 284438 535613 298239 471326 519356 135004 -47187 -527917 347097 -511070 -423408
$$ packed form
10898C50349J76900k04596l83351N1501j7924J45030K19040p35632m65583K79691
10888e84575k31909J0030L52404L56697J08523j8764k1737l69650M62823J81268
10878B45110r20347M66015M37140Q2089J21115J14328j77291j14642K61114n89472
10868g4841o61869L40828n09061M47050O26092j51118K49531L49677k65102m06507
10858e5320n55974J92234R6871J94132K16484M69411J39870j061287Q995N37614
10848A83030k02350K41715M68224j79184n66003j79996j87841N37241k73521n9252
10838b17937Q7523K271O14270j48489o08388L24473J38660o55022Q6000O61077
10828B84438K51175k37374J73087M8030l84352j82191m80730Q75014q58167Q7662
$$ plain form
10818 -423408 -812738 -343457 -81264 -74584 284893 542106 749108 330421 -9220 422900
10808 422900 690817 511554 746038 17096 -111130 166832 512485 835634 597393 877873
10798 877873 732282 101865 -90571 -201893 44275 47879 464885 499767 435648 -152746
10788 -152746 115218 308453 -98321 97850 544926 267503 -25700 -518871 -3059 -88257
10778 -88257 -406854 -76543 394124 685880 379893 -553081 -300225 -283809 -295581 -247333
10768 -247333 232938 151227 -29451 182468 345312 221822 815218 616532 589911 116407
10758 116407 432715 130395 -149364 267739 273220 260915 156491 685942 582894 -277776
10748 -277776 -130404 87837 -487255 -1133374 -881017 -126848 110486 247889 -423989 -389455
$$ packed form
10818d23408l89330M69281K62193O680L59477K57213K07002m18687l39641M32120
10808D22900K67917j79263K34484p28942j28226K77962L45653L23149k38241K80480
10798H77873j45591o30417j92436j11322K46168L604M17006L4882o4119n88394
10788a52746K67964J93235m06774J96171M47076k77423k93203m93171N15812q5198
10778h8257l18597L30311M70667K91756l05987r32974K52856J6416j1772M8248
10768b47333M80271q1711j80678K11919J62844j23490N93396j98686k6621m73504
10758A16407L16308l02320k79759M17103N481j2305j04424N29451j03048q60670
10748b77776J47372K18241n75092o46119K52357P54169K37334J37403o71878L4534
$$ plain form
10738 -389455 136285 319561 187416 -266928 -323064 450283 869432 684630 26382 306339
10728 306339 310581 201098 429900 707792 455665 232114 720757 709487 649008 814526
10718 814526 855632 397438 -226537 452095 363800 418395 275011 345931 310686 274598 456337
10707 456337 126644 58377 -316871 314686 528270 -668521 -565118 -201459 -152476 -811150
10697 -811150 -361907 -67882 145966 106684 107216 85339 412428 -114514 -512248 -314028
10687 -314028 -65522 388523 -154788 339703 131230 462507 55180 -302629 -574800 -627217
10677 -627217 -649071 -1045253 -985412 -426642 -260305 -349391 141796 -117084 -657360 -404226
10667 -404226 97098 996561 349205 -157654 238819 -75599 308212 -76203 -396705 -195549
$$ packed form
10738c89455N25740J83276j32145m54344n6136P73347M19149j84802o58248K79957
10728C06339M242j09483K28802K77892k52127k23551M88643j1270o0479J65518
10718H14526M1106m58194o23975O78632q8295N4595j43384P0920l5245l6088J81739
10707D56337l29693o8267l75248O31557K13584j196791J03403L63659M8983o58674
10697h11150M49243K94025K13848l9282N32k1877L27089n26942l97734J98220
10687c14028K48506M54045n43311M94491k08473L31277m07327l57809k72171n2417
10677f27217k1854l96182N9841N58770J66337q9086M91187k58880n40276K53134
10667d04226N01324Q99463o47356n06859L96473l14418L83811l84415l20502K01156
$$ plain form
10657 -195549 -72527 284137 -295496 -133731 912202 998502 482456 325872 538582 -653978
10647 -653978 -809245 -378818 -632972 -624374 -241770 -40884 76085 134102 101767 146623
10637 146623 -49794 -115762 425201 175041 181938 96287 -425776 136551 674836 513023
10627 513023 30837 -207049 -242154 -304164 -386890 -306760 -259077 -7016 502186 375524
10617 375524 280705 15910 -475388 -385925 -364990 74234 10264 -37997 440188 302275
10607 302275 -301141 -233496 -54450 69601 583505 1168710 797199 2908 60349 202142
10597 202142 211807 35186 -133371 190514 1164878 1012257 449812 191674 -203097 -55289
10587 -55289 3972 -85326 -89116 283150 183830 -103227 65862 563220 161253 -350029 -250925
$$ packed form
10657a95549J23022L56664n79633J61765J045933Q6300n16046j56584K12710j192560
10647f53978j55267M30427k54154Q598L82604K00886J16969N8017l2335M4856
10637A46623j96417o5968N40963k50160O897q5651n22063N62327N38285j61813
10627E13023m82186k37886l5105o2010q2726Q0130M7683K52061N09202j26662
10617C75524r4819k64795m91298Q9463K0935M39224o3970m8261M78185j37913
10607C02275o03416O7645J79046J24051N13904N85205l71511p94291N7441J41793
10597B02142R665j76621j68557L23885R74364j52621n62445k58138l94771J47808
10587e5289N9261q9298l790L72266r9320k87057J69089M97358m01967n11282R9104
$$ plain form
10576 -250925 -47138 -282180 -76225 -116983 517854 107398 -56250 -441510 -547165 -520151
10566 -520151 -735121 116641 363444 359396 -592387 -379584 -294257 -365906 -983103 -761762
10556 -761762 -89225 -14904 187223 -185541 89692 361824 235639 6208 -147140 32488
10546 32488 481371 90632 -253152 229891 461318 -881665 -1169157 -437611 -144434 -794250
10536 -794250 -769927 -542737 87921 401438 -59100 58685 -16354 -56350 -546963 -207528
10526 -207528 -335725 -638924 -624833 -337549 -818445 -687207 -385222 -118509 121028 43930
10516 43930 99968 143204 -685825 -457423 285882 -244470 -453141 162647 163805 411657
10506 411657 500635 83519 368085 720692 212190 241482 63912 341293 -211904 234485
$$ packed form
10576b50925K03787k35042K05955m0758O34837m10456j63648l85260j05655K7014
10566e20151k14970Q51762K46803m048r51783K12803Q5327p1649o17197K21341
10556g61762O72537P4321K02127l72764K75233K72132j26185k29431j53348J79628
10546C2488M48883l90739l43784M83043K31427j342983k87492P31546K93177o49816
10536g94250K4323K27190O30658L13517m60538J17785p5039l9996m90613L39435
10526b07528j28197l03199J4091K87284m80896J31238L01985K66713K39537p7098
10516D3930N6038M3236q29029K28402P43305n30352k08671O15788J158K47852
10506D11657Q8978m17116K84566L52607n08502K9292j77570K77381n53197M46389
$$ plain form
10496 234485 482899 -78971 -651636 -377564 103881 46528 117235 168528 -199253 -36379
10486 -36379 264458 544731 270602 -379259 -382771 -363796 50664 213747 422909 -206395
10476 -206395 -231337 20833 631169 236416 -117029 -527968 -166476 -197793 -115876 -626599
10466 -626599 -228589 243199 58584 -4609 -213550 182099 445607 -133096 -894182 -363895
10456 -363895 29125 290374 671702 360858 74922 433880 526071 12097 655384 833514
10446 833514 384533 359206 427217 385980 716758 532627 344203 235322 720465 653278
10436 653278 97508 220059 921290 922205 1082745 1012127 727496 786035 909708 1148019
10426 1148019 1090555 983689 750071 794329 520990 206522 406883 313504 731158 1094405
$$ packed form
10496B34485K48414n61870n72665K74072M81445n7353P0707N1293l67781J62874
10486c6379L00837K80273k74129o49861l512J8975M14460J63083K09162o29304
10476b06395k4942K52170O10336l94753l53445m10939L61492l1317Q1917n10723
10466f26599L98010M71788j84615o3193k08941L95649K63508n78703p61086N30287
10456c63895L93020K61249L81328l10844k85936L58958R2191n13974O43287J78130
10446H33514m48981k5327O8011m1237L30778j84131j88424j08881M85143o7187
10436F53278n55770J22551P01231R15J60540p0618k84631N8539J23673K38311
10426A148019n7464j06866k33618M4258k73339l14468K00361r3379M17654L63247
$$ plain form
10416 1094405 137556 -167536 8637 572991 923208 501838 404379 811980 170059 126362
10406 126362 696048 633213 569020 453134 153267 723917 153035 321432 437340 87796
10396 87796 317525 -360413 -503465 -68756 145845 179377 762624 646917 348338 309090
10386 309090 390384 220783 190831 -100232 216598 501383 -112135 -95586 57229 240660
10376 240660 -220461 7012 110652 -134939 358039 34050 -743029 -705977 -740618 -239705
10366 -239705 -250472 314567 470777 -512652 -56978 506027 -36058 -399463 89367 418996
10356 418996 184045 70536 -122571 92999 -125788 132045 276649 59128 106674 348670
10346 348670 473565 228715 -83454 305508 -235596 -149494 254000 -726380 -920792 -353450
$$ packed form
10416A094405r56849l05092J76173N64354L50217m21370r7459M07601o41921m3697
10406A26362N69686o2835o4193j15886k99867N70650n70882J68397J15908l49544
10396H7796K29729o77938j43052M34709K14601L3532N83247j15707k98579l9248
10386C09090Q1294j69601k9952k91063L16830K84785o13518J6549J52815J83431
10376B40660m61121K27473J03640k45591M92978l23989p77079L7052l4641N00913
10366b39705j0767N65039J56210r83429M55674N63005n42085l63405M88830L29629
10356D18996k34951j13509j93107K15570k18787K57833J44604k17521M7546K41996
10346C48670J24895k44850l12169L88962n41104Q6102M03494r80380j94412N67342
$$ plain form
10336 -353450 -149331 259886 639055 755525 702480 446514 559306 84608 -52073 470919
10326 470919 -59923 -361118 -396222 -113531 365007 242639 184535 -82834 80008 538638
10316 538638 812265 683464 662197 295465 2378 -356855 -98539 -407460 123734 110495
10306 110495 -246268 218806 282340 -132526 -104654 6342 -126585 -287096 586401 314745
10296 314745 -24356 -621709 -325416 -592032 -316400 313193 419478 435640 -159547 13456
10286 13456 628097 974348 75482 536933 88195 236099 -181900 -27203 205912 172589
10276 172589 -654725 -712902 -167297 -32824 21062 -479097 -149768 -118253 -1018490 -27191
10266 -27191 233385 -590910 -744055 -674773 53458 -223289 -439387 -260128 -14281 -351891
$$ packed form
10336c53450K04119M09217L79169J16470n3045k55966J12792m74698j36681N22992
10326D70919n30842l01195l5104K82691M78538j22368n8104k67369J62842M58630
10316E38638K73627j28801k1267l66732k93087l59233K58316l08921N31194j3239
10306A10495l56763M65074O3534m14866K7872J10996j32927j60511Q73497k71656
10296C14745l39101n97353K96293k66616K75632O29593J06285J6162n95187J73003
10286A3456O14641L46251q98866M61451m48738J47904m17999J54697K33115l3323
10276A72589q27314n8177N45605J34473N3886n00159L29329L1515r00237R91299
10266b7191K60576q24295j53145O9282P28231k76747k16098J79259K45847l37610
$$ plain form
10256 -351891 -249308 901040 726102 437342 307973 44265 196363 -96201 -70871 -305195
10246 -305195 187836 195637 -918064 -90909 96687 -204929 -360454 278363 333364 -722047
10236 -722047 -1072391 65697 311242 112878 -90883 -529848 15267 -359963 -978019
10227 -978019 -1167270 -978226 -452649 509929 -73019 92 -523591 74532 378771 -229492
10217 -229492 -476623 -293240 -349722 -546533 64855 73752 182227 -416527 -566234 -259920
10207 -259920 -383128 -248375 -430328 -523973 -345296 28803 166087 206932 -156623 308151
10197 308151 -141439 -432146 -773849 -163683 12442 -241491 600905 971113 553537 19783
10187 19783 11035 341251 352161 468444 102727 164373 573768 289497 100020 21708 617444
$$ packed form
10256c51891J02583J150348j74938k88760j29369k63708J52098k92564K5330k34324
10246c05195M93031P801j113701Q27155J87596l01616j55525O38817N5001j055411
10236g22047l50344J138088K45545j98364k03761m38965N45115l75230o18056
10227i78019j89251J89044N25577R62578n82948P3111n23683N98123L04239o08263
10217b29492k47131J83383n6482j96811O11388Q897J08475n98754j49707L06314
10207b59920j23208J34753j81953r3645J78677L74099J37284M0845l63555M64774
10197C08151m49590k90707l41703O10166J76125k53933Q42396L70208m17576n33754
10187A9783q748L30216J0910J16283l65717O1646M09395k84271j89477p8312N95736
$$ plain form
10176 617444 682171 283458 223236 -509208 -89364 -253533 352704 184960 -146823 -251027
10166 -251027 -875938 -630145 -751592 17863 -484464 -283650 300516 -149812 151758 26531
10156 26531 -796560 -34812 -128935 -296260 -56502 -211184 -141283 472339 -147113 167243
10146 167243 -205801 -329573 -145152 41806 -157956 -55462 113536 429588 349349 228649
10136 228649 -334746 -27843 -78640 253081 219889 101674 763314 278819 58812 285980
10126 285980 -285738 -137904 62097 -536736 -81328 916900 882240 512088 794580 376514
10116 376514 278184 419872 -305618 410613 683948 361184 -100945 -187992 50342 90525
10106 90525 -319372 635 313591 656249 542101 103669 443370 214393 292285 270068
$$ packed form
10176F17444O4727l98713o0222p32444M19844j64169O06237j67744l31783j04204
10166b51027o24911K45793j21447P69455n02327K00814N84166m50328L01570j25227
10156B6531q23091P61748r4123j67325K39758j54682O9901O13622o19452L14356
10146A67243l73044j23772J84421J86958j99762J02494J68998L16052q0239j20700
10136B28649n63395L06903n0797L31721l3192j18215O61640m84495k20007K27168
10126B85980n71718J47834K00001n98833M55408R98228l4660l70152K82492m18066
10116C76514r8330J41688p25490P16231K73335l22764m62129q7047K38334M0183
10106I0525m09897L20007L12956L42658j14148m38432L39701k28977P7892k2217
$$ plain form
10096 270068 423905 425741 25072 -205686 286969 625191 415156 284037 564915 155159
10086 155159 -139627 -354601 -530438 -691152 -212446 -537403 -562473 -645042 -570146 -101038
10076 -101038 -121947 4770 195894 14112 -139275 81484 731341 114554 -202953 -116913
10066 -116913 -1052163 -604945 986320 294681 439006 132618 -115497 22546 -80937
10057 -80937 -9824 -110820 99643 982248 92147 -297985 275629 121372 -277041 195277
10047 195277 -26158 -172987 -494081 99952 702106 123098 -187901 -134072 -88584 326859
10037 326859 684296 -355367 -149057 636577 337866 -171360 -660817 -492773 42568
10028 42568 777082 324228 -1002767 -568940 -100763 -580995 -285119 82379 -132522 89260
$$ packed form
10096B70068J53837J836m00669k30758M92655L38222k10035j31119K80878m09756
10086A55159k94786k14974j75837j60714M78706l24957k5070q2569P4896M69108
10076a01038k0909J26717J91124j81782j53387K20759O49857o16787l17507Q6040
10066a16913r35250M47218J591265o91639J44325l06388k48115J38043j03483
10057h0937P1113j00996K10463Q82605q90101l90132N73614j54257l98413M72318
10047A95277k21435j46829l21094N94033O02154n79008l10999N3829M5488M15443
10037C26859L57437j039663K06310P85634k98711n09226m89457J68044N35341
10028D2568P34514m52854j326995M33827M68177m80232K95876L67498k14901K21782
$$ plain form
10018 89260 339013 256664 798489 997770 800352 689172 458153 200202 -58973 201745
10008 201745 -126815 -517139 -147210 452726 457521 471275 165927 -155069 -589132 -439738
9998 -439738 -676803 -918653 -930122 -308953 -263942 245474 -442757 -496086 238344 636200
9988 636200 57211 -149516 -75586 785156 241501 99831 373661 681324 563627 352833
9978 352833 376464 -269965 -613442 -805586 -790234 -839554 -448105 -969038 -1041774 -484813
9968 -484813 -399546 -153905 217267 -746894 -585008 -98772 -24218 481859 174768 -40020
9958 -40020 -283798 -307062 -15576 318930 314018 490341 273165 -400837 -40473 -577840
9948 -577840 -632654 50002 -231668 -445971 -221449 52833 128417 185119 186200 191196 273327
$$ packed form
10018H9260K49753q2349N41825J99281j97418j11180k31019k57951k59175K60718
10008B01745l28560l90324L69929N99936M795J3754l05348l20996m34063J49394
9998d39738k37065k41850j1469O21169M5011N09416o88231n3329P34430L97856
9988F36200n78989k06727P3930Q60742n43655j41670K73830L07663j17697k10794
9978C52833K3631o46429l43477j92144J5352m9320L91449n20933p2736N56961
9968d84813Q5267K45641L71172r64161J61886M86236P4554N06077l07091k14788
9958d0020k43778k3264K91486L34506m912J76323k17176o74002L60364n37367
9948e77840n4814O82656k81670k14303K24522K74282P5584N6702J081M996Q2131
$$ plain form
9937 273327 -392399 -932596 -614895 338989 938831 743174 22423 347117 238649 -31112
9927 -31112 -131201 -4120 480633 831013 542063 57890 6109 194396 735655 1023803
9917 1023803 786792 667372 640833 621231 815964 790302 861530 678817 490344 236143
9907 236143 273526 87144 6752 11626 -188025 574546 258726 -21199 -701953 -534631
9897 -534631 746594 913865 116117 -371277 223208 1230298 43374 -293294 -267587
9888 -267587 -623880 39446 57877 -78184 -155939 166866 341903 -115125 336969 1103156
9878 1103156 1146583 670713 302916 -172748 -10737 461607 -184287 209212 343224 493210
9868 493210 485092 640097 615641 932833 583676 145234 -160230 11551 509642 627195
$$ packed form
9937B73327o65726n40197L17701R53884N99842j95657p20751L24694j08468k69761
9927c1112j00089J27081M84753L50380k88950m84173n1781J88287N41259K88148
9917A023803k37011j19420k6539j9602J94733k5662P1228j82713j88473k54201
9907B36143L7383j86382q0392M874j99651P62571l15820k79925o80754J67322
9897e34631J281225J67271p97748m87394N94485J007090j186924l36668K5707
9888b67587l56293O63326J8431j36061p7755L22805J75037m57028M52094P66187
9878A103156M3427m75870l67797m75664J62011M72344o45894L93499J34012J49986
9868D93210q118J55005k4456L17192l49157m38442l05464J71781M98091J17553
$$ plain form
9858 627195 78440 227179 273135 136852 730525 730260 127985 -185732 11770 454361
9848 454361 149868 247900 292340 -252569 -402849 -509947 673474 629803 634160 652043 759653
9837 759653 757113 776145 619189 603561 552456 86989 -300056 -845510 -297772 146611 -336184
9826 -336184 402728 676289 66152 66872 424193 183587 -301741 162285 163197 -291699 69466
9815 69466 293610 -91161 -267109 -104779 29157 -149712 360747 -732332 -740829 -37092
9805 -37092 424631 328484 159867 633420 257878 323830 481643 100730 45157 379259
9795 379259 -534984 -1212403 -490380 865275 773660 373009 359776 226129 225197 60638
9785 60638 -295373 143623 99339 29685 -28229 341989 953938 425851 442516 309705 420767
$$ packed form
9858F27195n48755J48739M5956j36283N93673k65o02275l13717J97502M42591
9848D54361l04493R8032M4440n44909j50280j07098J183421m3671M357J7883J07610
9837G59653k540J9032j56956j5628n1105m65467l87045n45454N47738M44383m82795
9826c36184P38912K73561o10137P20L57321k40606m85328M64026R12m54896L61165
9815F9466K24144l84771j75948J62330J33936j78869N10459j093079q497P03737
9805c7092M61723r6147j68617M73553l75542O5952J57813l80913n5573L34102
9795C79259r14243o77419P22023J355655r1615m00651j3233j33647r32j64559
9785F0638l56011M38996m4284o9654n7914L70218O11949n28087J6665j32811J11062
$$ plain form
9774 420767 208437 -178293 -142150 165314 -92710 147595 410514 661128 256010 -65029
9764 -65029 360369 61243 -347106 -293704 -220962 -183616 -492028 -570829 -602175 -27629 598238
9753 598238 80560 394457 450637 73149 39997 -267517 50913 424492 -79018 257782
9743 257782 241744 257527 -304262 593920 761170 314506 69248 431507 462745 651563
9733 651563 487056 756366 1279251 394148 537307 335499 354019 1055981 1293128 779236
9723 779236 515201 -33851 254787 188114 -284934 -543060 -87574 -67449 -505615 3928
9713 3928 80362 466054 274805 -131245 578133 976305 1411017 1164960 142687 557379
9703 557379 546145 245444 125325 -247973 89121 260640 229416 -45780 102800 240396
$$ packed form
9774D20767k12330l86730L6143L07464k58024K40305K62919K50614m05118l21039
9764f5029M25398k99126m08349N3402P2742L7346l08412p8801l1346N74546O25867
9753E98238n17678L13897N6180l77488l3152l07514L18430L73579n03510L36800
9743B57782j6038J5783n61789Q98182J67250m46664k45258L62259L1238J88818
9733F51563j64507K69310N22885q85103J43159k01808J8520P01962K37147n13892
9723G79236k64035n49052K88638o6673m73048k58126M55486K0125m38166N09543
9713C928P6434L85692j91249m06050P09378L98172M34712k46057j022273M14692
9703E57379j1234l00701j20119l73298L37094J71519l1224k75196J48580J37596
$$ plain form
9693 240396 467750 307181 1014839 1150023 1319867 1232161 689617 671720 106385 366764
9683 366764 1019187 580029 224745 871206 232453 410091 791901 829755 1194965 181421
9673 181421 -155934 757218 1229052 624906 427931 733192 959025 928789 777847 585354
9663 585354 513235 609939 1228659 959781 1083059 1019191 745366 456625 -960523 -267317
9653 -267317 416669 538538 114969 58067 536586 454172 865764 224798 20556 143765
9643 143765 849387 1087941 335059 299012 -9820 171744 309752 239023 796760 1285270
9633 1285270 1680759 1601808 1568324 1787190 1349757 1001473 1432744 1264866 1659384 1601690
9623 1601690 1960042 1911768 1264942 1792725 1402335 1055270 1349215 927250 1027495 1050066
$$ packed form
9693B40396K27354j60569P07658J35184J69844q7706n42544j7897n65335K60379
9683C66764O52423m39158l55284O46461o38753J77638L81810L7854L65210j013544
9673A81421l37355R13152M71834o04146j96975L05261K25833l0236j50942j92493
9663E85354p2119R6704O18720k68878J23278o3868k73825k88741j417148O93206
9653b67317O83986J21869m23569n6902M78519q2414M11592o40966k04242J23209
9643A43765P05622K38554p52882l6047l08832J81564J38008p0729N57737M88510
9633A285270L95489p8951l3484K18866m37433l48284M31271j67878L94518n7694
9623A601690L58352m8274o46826N27783l90390l47065K93945m21965J00245K2571
$$ plain form
9613 1050066 1504280 1712679 1732226 1341069 1084602 747170 1032167 1183032 414654 1002007
9603 1002007 1514624 2040861 1278147 881067 914721 823500 1222880 2084274 2220995 2616866
9593 2616866 2077258 1601620 1284061 1661163 1579361 2144735 1562182 1234960 982349 799647
9583 799647 1100151 1081185 735494 943997 1217816 821061 627304 758781 1094744 1014975
9573 1014975 773233 397838 365607 1243392 1430552 1036964 978498 783927 1028227 1291416
9563 1291416 1157065 877952 853190 1108932 1656017 1252302 882913 1465069 1176842 1482181
9553 1482181 1624969 757416 712913 656873 204269 -261352 1023119 960344 788340 974879
9543 974879 1436118 1102017 1136538 852348 537158 879492 1288949 1281175 1338378 931315
$$ packed form
9613A050066M54214K08399J9547l91157k56467l37432K84997J50865p68378N87353
9603A002007N12617N26237p62714l97080L3654r1221L99380Q61394J36721L95871
9593B616866n39608m75638l17559L77102q1802N65374n82553l27222k52611j82702
9583G99647L00504j8966l45691K08503K73819l96755j93757J31477L35963p9769
9573A014975k41742l75395l2231Q77785J87160l93588n8466j94571K44300K63189
9563A291416j34351k79113k4762K55742N47085m03715l69389N82156k88227L05339
9553A482181J42788q67553m4503n6040m52604m65621J284471o2775j72004J86539
9543I74879M61239l34101L4521k84190l15190L42334M09457p774N7203m07063
$$ plain form
9533 931315 1480026 1452140 578422 460823 606001 520873 811595 579518 -244314 746532
9523 746532 1554730 1392501 819529 1156409 1310196 1248865 995615 879788 366632 547855
9513 547855 777144 1097835 1013464 634604 894944 1453471 1318357 1266527 1026377 1235203
9503 1235203 1424227 1128209 1103647 1044267 1167753 492529 548842 450541 436355 976985
9493 976985 1608765 2129106 1279284 1288982 1084354 584013 901300 1036227 1388212 1342292
9483 1342292 1401697 1462538 1666879 2021886 1788000 2086038 2590663 3006892 2670620 1622118
9473 1622118 1645924 1076285 1229683 1734843 2248765 2507043 1420198 1053404 1557138 1440516
9463 1440516 1729824 2483991 2341448 1930553 1149935 1620215 1948457 1893354 2607636 2105181
$$ packed form
9533I31315N48711k7886q73718j17599J45178q5128K90722k32077q23832R90846
9523G46532Q08198j62229n72972L36880J53787o1331k53250j15827n13156J81223
9513E47855K29289L20691q4371l78860K60340N58527j35114n1830k40150K08826
9503A235203J89024k96018k4562n9380J23486o75224N6313r8301j4186N40630
9493I76985O31780N20341q49822R698k04628n00341L17287J34927L51985m5920
9483A342292N9405O0841K04341L55007k33886K98038N04625M16229l36272j048502
9473A622118K3806n69639J53398N05160N13922K58278j086845l66794N03734j16622
9463A440516K89308P54167j42543m10895p80618M70280L28242n5103P14282n02455
$$ plain form
9453 2105181 2267110 1286510 1537245 1753981 1523681 1300480 1348187 1376276 1529088 1704164
9443 1704164 2287180 2876215 2282107 2202699 2925927 2562502 2368816 2825183 2904196 3091646
9433 3091646 2579410 2259103 1952813 2182139 2422350 2365688 2238764 2403838 2452975 2168223
9423 2168223 2009729 2469558 2570756 2170359 1619132 1657130 2155806 2659064 2494553 2868506
9413 2868506 2649489 2277420 2383238 2650198 2351513 2242605 2358029 2499098 2382497 2817097
9403 2817097 3020262 3335877 3922258 3486687 3186437 2895222 2638849 3102922 3312384 3358964
9393 3358964 4027651 3368545 3312463 3148058 3001834 2980776 3264445 3229264 2947420 3613058
9383 3613058 3769479 3790640 3792392 4060099 3640003 3675702 4236187 4203200 3311583 3527486
$$ packed form
9453B105181J61929r80600K50735K16736k30300k23201M7707K8089J52812J75076
9443A704164N83016N89035n94108p9408P23228l63425j93686M56367P9013J87450
9433C091646n12236l20307l06290K29326K40211n6662j26924J65074M9137k84752
9423B168223j58494M59829J01198m00397n51227L7998M98676N03258j64511L73953
9413B868506k19017l72069J05818K66960k98685j08908J15424J41069j16601M34600
9403B817097K03165L15615N86381m35571l00250k91215k56373M64073K09462M6580
9393C358964O68687o59106n6082j64405j46224k1058K83669l5181k81844O65638
9383C613058J56421K1161J752K67707m20096L5699N60485l2987q91617K15903
$$ plain form
9373 3527486 3574086 4463049 4444839 4607010 4718787 4975456 4783933 4550754 4951971 5646093
9363 5646093 5274741 4519563 4022606 4116432 3901994 4117119 4900507 5013251 5129287 4982230
9353 4982230 5228937 5289446 5898644 5688891 5604289 5411789 5548926 5686011 6208484 5942070
9343 5942070 6296059 6463323 6705115 6803971 6431758 6760345 6948190 7146760 6998037 7053255
9333 7053255 8031753 7941211 8011168 8678933 8777649 9042273 8950446 8865414 9011567 8589496
9323 8589496 8986831 9023176 9890372 10821336 10934210 10746412 11388422 12074108 12226892 12039112
9313 12039112 12590687 13144505 13073062 13831012 14399807 14662751 15559977 16497326 17912839
9304 17912839 18852851 19474386 20582440 22133702 22779215 23686208 25899536 27796335 29243040
$$ packed form
9373C527486M6600Q88963j8210J62171J11777K56669j91523k33179M01217O94122
9363E646093l71352p55178m96957R3826k14438K15125P83388J12744J16036j47057
9353D982230K46707O0509O09198k09753q4602j92500J37137J37085N22473k66414
9343E942070L53989J67264K41792R8856l72213L28587J87845J98570j48723N5218
9333G053255R78498r0542O9957O67765R8716K64624r1827q5032J46153m22071
9323H589496L97335L6345Q67196R30964J12874j87798O42010O85686J52784j87780
9313A2039112N51575N53818p1443P57950N68795K62944Q97226R37349J415513
9304A7912839R40012O21535J108054J551262O45513R06993K213328J896799J446705
$$ plain form
9295 29243040 31155424 33638594 36243899 38782324 41429026 44476244 48008408 52323486
9287 52323486 56390812 61056920 66510708 73694423 82202650 92340553 104110438 117760840
9279 117760840 132885931 148515635 164389562 180085154 193456158 202700525 210972940
9272 210972940 216955518 218014560 213598419 204382178 195036339 186206067 175536150 162223981
9264 162223981 151125712 142902843 136261643 130942432 125878201 121353569 118544037 116683317
9256 116683317 114604619 112687681 111649712 110559312 109774113 110296489 112611366 116567436
9248 116567436 122379670 130268502 140061034 152140778 165511139 180722695 195914273
9241 195914273 210952100 224213329 232861496 238997346 243279552 242408988 236934999 228256806
$$ packed form
9295B9243040J912384K483170K605305K538425K646702L047218L532164M315078
9287E2323486M067326M666108N453788P183715Q508227J0137903J1769885J3650402
9279A17760840J5125091J5629704J5873927J5695592J3371004R244367Q272415
9272B10972940N982578J059042m416141r216241r345839q830272j0669917j3312169
9264A62223981j1098269q222869o641200n319211n064231m524632k809532j860720
9256A16683317k078698j916938j037969j090400p85199N22376K314877L956070
9248A16567436N812234P888832R792532J2079744J3370361J5211556J5191578
9241A95914273J5037827J3261229Q648167O135850M282206q70564n473989q678193
$$ plain form
9233 228256806 215525242 203061220 190390310 175132340 160622866 148663377 138292957
9226 138292957 129596154 122107705 115401112 109263243 103691311 98014404 91077141 84919726
9218 84919726 79148744 74230829 69334871 64486288 60092629 55673472 52689410 49844491
9210 49844491 47107960 44487831 42451118 40187346 37728270 36219162 34822429 33586668
9202 33586668 31846427 29673724 28832767 27846670 26670846 25379624 24604839 24294193 23029552
9193 23029552 21449866 20601226 19615536 18825795 18917672 19136400 18222539 17632127 16759865
9184 16759865 16123298 15800468 15082719 14790499 14261670 13855350 13575449 14229884 14016759
9175 14016759 13896573 13348949 12621288 12533638 11683937 11841828 12055843 12095400 11699499 11118189
$$ packed form
9233B28256806j2731564j2464022j2670910j5257970j4509474j1959489j0370420
9226A38292957q696803p488449o706593o137869n571932n676907o937263o157415
9218H4919726n770982m917915m895958m848583m393659m419157k984062k844919
9210D9844491k736531k620129k036713k263772k459076j509108j396733j235761
9202C3586668j740241k172703q40957r86097j175824j291222p74785l10646j264641
9193B3029552j579686q48640r85690p89741R1877K18728r13861n90412q72262
9184A6759865o36567l22830p17749k92220n28829m06320k79901O54435k13125
9175A4016759j20186n47624p27661q7650q49701J57891K14015L9557l95901n81310
$$ plain form
9165 11118189 11220490 10893806 10308578 10478852 10251634 9239980 9438006 9231745 9376556
9156 9376556 9379079 9649078 8874294 8233470 8411856 8598339 8302482 8121314 7927047 7606691
9146 7606691 7587586 7531839 7774795 7718131 7024235 6965345 7084567 6993139 7111119 7372527
9136 7372527 6973553 6729886 6149197 6444590 6737213 6918965 6989076 6434671 7345595 6864171
9126 6864171 6823232 6991689 6190054 5570508 6135125 6422363 6398432 6185888 5847572 6059758
9116 6059758 5478166 5715566 5430761 5488310 5449124 5413510 6416568 5940407 6130913 6328080
9106 6328080 5828502 5585575 5251868 5115421 5666199 5271877 5838197 5563459 5445410 5060750
9096 5060750 4803358 4702176 4891881 4980839 5358710 4877298 4094987 4098102 4065537 4618446
$$ packed form
9165A1118189J02301l26684n85228J70274k27218j011654J98026k06261J44811
9156I376556K523K69999p74784o40824J78386J86483k95857j81168j94267l20356
9146G606691j9105n5747K42956n6664o93896n8890J19222r1428J17980K61408
9136G372527l98974k43667n80689K95393K92623J81752P0111n54405R10924m81424
9126F864171m0939J68457q01635o19546N64617K87238k3931k12544l38316K12186
9116F059758n81592K37400k84805N7549l9186l5614J003058m76161J90506J97167
9106F328080m99578k42927l33707j36447N50778l94322N66320k74738j18049l84660
9096E060750k57392j01182J89705Q8958L77871m81412p82311L115l2565N52909
$$ plain form
9086 4618446 4879346 5057239 4700071 4756289 4228502 4040220 3724981 3795455 3852847 4261971
9076 4261971 4610118 4316870 4153130 4159669 4019431 4402021 4024752 4970972 5514412 4858779
9066 4858779 5180296 4973432 5267537 4679721 5406657 4587384 4177283 4135881 3719964 4199700
9056 4199700 4035247 4439374 4036658 3911618 4484563 4588295 4310487 4043479 4082398 4314143
9046 4314143 4292548 4436906 4496316 3831951 3414450 4137228 4345140 4734549 4798691 5002874
9036 5002874 4218829 3708360 3895129 3936420 4256522 3735070 3395975 3256777 3202102 3442192
9026 3442192 3198777 3049409 2816292 2809008 3244789 3401564 2822214 2932720 2786379 2716862
9016 2716862 3584991 3942326 3617390 3804226 4132330 4085156 3770258 3467073 3997857 4414923
$$ packed form
9086D618446K60900J77893l57168N6218n27787j88282l15239P0474N7392M09124
9076D261971L48147k93248j63740O539j40238L82590l77269R46220N43440o55633
9066D858779L21517k06864K94105n87816P26936q19273m10101m1402m15917M79736
9056D199700j64453M04127m02716j25040N72945J03732k77808k67008L8919K31745
9046D314143k1595J44358N9410o64365m17501P22778K07912L89409O4142K04183
9036E002874p84045n10469J86769M1291L20102n21452l39095j39198n4675K40090
9026C442192k43415j49368k33117p284M35781J56775n79350J10506j46341o9517
9016B716862Q68129L57335l24936J86836L28104m7174l14898l03185N30784M17066
$$ plain form
9006 4414923 3775907 3792025 4054642 3613007 3100066 3142176 3601231 3684718 3611198 3382877
8996 3382877 3205910 3025887 3187082 3067407 3301649 3057959 2714035 2668789 2243108 2571735
8986 2571735 2709204 2583966 3009598 3033570 3004758 2972243 3251554 3167420 3387939 3018175
8976 3018175 3246219 4100847 4209958 3696425 3232287 3157673 3641326 3257280 3156528 3522016
8966 3522016 3340914 3573123 3923126 3809251 3680066 3551834 2983323 3748265 3940811 3604448
8956 3604448 3148712 3668422 3860518 4009373 4229521 4034642 3619634 3500422 3950547 3435093
8946 3435093 3256776 3264181 3285796 3934915 4853356 4602789 4127013 4691855 5387414 5933018
8936 5933018 5646175 5202456 4960823 4710078 4893882 5405615 5627553 4843995 4720393 4769644
$$ packed form
9006D414923o39016J6118K62617m41635n12941M2110M59055Q3487p3520k28321
8996C382877j76967j80023J61195j19675K34242k43690l43924m5246m25681L28627
8986B571735J37469j25238M25632K3972k8812l2515K79311q4134K20519l69764
8976C018175K28044Q54628J09111n13533m64138p4614M83653l84046j00752L65488
8966C522016j81102K32209L50003j13875j29185j28232n68511P64942J92546l36363
8956C604448m55736N19710J92096J48855K20148j94879m15008j19212M50125n15454
8946C435093j78317P405K1615O49119R18441k50567m75776N64842O95559N45604
8936E933018k86843m43719k41633k50745J83804N11733K21938p83558j23602M9251
$$ plain form
8926 4769644 5617917 5083967 5079384 5434548 4834076 5760747 6480763 6427806 6474454 6633965
8916 6633965 6456375 6786847 6536870 6983787 6817361 6951836 7137033 7185955 7081984 7423111
8906 7423111 6965655 6565778 6140536 6099690 6676821 6489944 6639763 6115399 6342236 6779231
8896 6779231 6481375 6216621 6055364 6496223 6396317 6066677 5855821 5393407 5412893 5565569
8886 5565569 6388288 6856313 7670637 6781476 6935436 7166249 7372534 7425397 7003557 7055761
8876 7055761 7340017 7523013 7494786 7166928 7016515 6790653 6885941 6995265 6605320 7289272
8866 7289272 7112125 7283430 7485654 7202048 7312924 7696217 8382217 8123241 7698615 7615823
8856 7615823 7964978 8588120 8778498 8818382 9043200 8847403 8537183 8767709 8583274 8664970
$$ packed form
8926D769644Q48273n33950m583L55164o00472R26671P20016n2957M6648J59511
8916F633965j77590L30472k49977M46917j66426J34475J85197M8922j03971L41127
8906G423111m57456l99877m25242m0846N77131j86877J49819n24364K26837M36995
8896F779231k97856k64754j61257M40859r9906l29640k10856m62414J9486J52676
8886E565569Q22719M68025Q14324q89161J53960K30813K06285N2863m21840N2204
8876G055761K84256J82996k8227l27858j50413k25862R5288J09324l89945O83952
8866G289272j77147J71305K02224k83606J10876L83293O86000k58976m24626q2792
8856G615823L49155O23142J90378L9884K24818j95797l10220K30526j84435Q1696
$$ plain form
8846 8664970 9038365 9286439 8860236 8535915 8106802 8604193 8926231 8553310 8027460 8155952
8836 8155952 7967558 8111551 8131770 8602196 8505504 8798135 9037993 9463610 9285761 9072329
8826 9072329 10334395 10216434 10014944 10677616 11470459 10836152 10997778 10873414 11290124
8817 11290124 11290838 10972301 10631062 10966541 10535511 10547269 10686595 11021153 11375272 11128349
8807 11128349 11085440 10898075 10918310 10896220 10705359 10721978 11455031 11390756 11126639 11424376
8797 11424376 11574007 11718277 11934162 12336234 13144520 12975019 12875033 12824421 13520114 14274157
8787 14274157 13856019 13611821 14505892 14786696 14771620 14845779 16191139 16889335 16839159 16652769
8777 16652769 17376840 17657598 17718817 18420278 19107110 20745207 21014146 21154401 22712066
$$ packed form
8846H664970L73395K48074m26203l24321m29113M97391L22038l72921n25850J28492
8836H155952j88394J43993K0219M70426r6692K92631K39858M25617j77849k13432
8826I072329J262066j17961k01490O62672P92843o34307J61626j24364M16710
8817A1290124P14l18537l41239L35479m31030J1758J39326L34558L54119k46923
8807A1128349m2909j87365K0235k2090j90861J6619P33053o4275k64117K97737
8797A1424376J49631J44270K15885M02072Q08286j69501r9986n0612O95693P54043
8787A4274157m18138k44198Q94071K80804j5076P4159J345360O98196n0176j86390
8777A6652769P24071K80758O1219P01461O86832J638097K68939J40255J557665
$$ plain form
8768 22712066 23899227 24552887 26220161 27436688 28605361 29792848 31595716 34005619
8760 34005619 36384641 38844080 42451737 45595333 49186145 53426114 57948225 63789038
8752 63789038 68343551 73208122 77563996 81694767 85947934 90531258 94279374 97339900
8744 97339900 99536318 100879578 100605529 99556575 98057729 94888547 91018385 87883716
8736 87883716 86390161 85501225 85611168 86145715 87549379 89225096 92220465 96569691 100308672
8727 100308672 105695823 111924957 119255079 128549651 139510453 153655250 170700808 190138353
8719 190138353 212106215 237272400 263699398 290750396 317075220 342787457 365092474
8712 365092474 384862800 405204100 424872701 440240389 453773650 465833470 474373377
$$ packed form
8768B2712066J187161O53660J667274J216527J168673J187487J802868K409903
8760C4005619K379022K459439L607657L143596L590812M239969M522111N840813
8752F3789038M554513M864571M355874M130771M253167M583324L748116L060526
8744I7339900K196418J343260k74049j048954j498846l169182l870162l134669
8736H7883716j493555q88936J09943N34547J403664J675717K995369M349226L738981
8727A00308672N387151O229134P330122R294572J0960802J4144797J7045558J9437545
8719A90138353K1967862K5166185K6426998K7050998K6324824K5712237K2305017
8712C65092474J9770326K0341300J9668601J5367688J3533261J2059820Q539907
$$ plain form
8705 474373377 473852994 461807779 444528322 424239951 400559112 375835658 348678657
8698 348678657 318668012 291846273 269123260 250491831 234233018 221434867 209855516
8691 209855516 199437631 191713046 184700076 178625461 175000258 173269643 173239431 175428065
8683 175428065 180424934 187638888 196442684 207984128 220369294 233142060 244932483
8676 244932483 254800426 258698402 257075350 253747843 249287476 243873455 235533844 221087321
8668 221087321 204638575 189709090 176330875 165003022 155498521 145791168 137005759
8661 137005759 129642993 123115916 117350478 111908014 108718477 105863761 103097537 101006630
8653 101006630 99408323 98226977 97068546 95929479 95190446 95374995 96949119 98119386
$$ packed form
8705D74373377n20383j2045215j7279457k0288371k3680839k4723454k7157001
8698C48678657l0010645k6821739k2723013j8631429j6258813j2798151j1579351
8691B09855516j0417885p724585p012970o074615l625203j730615l0212K188634
8683A75428065M996869P213954Q803796J1541444J2385166J2772766J1790423
8676B44932483R867943L897976j623052l327507m460367n414021q339611j4446523
8668B21087321j6448746j4929485j3378215j1327853r504501r707353q785409
8661A37005759p362766o527077n765438n442464l189537k854716k766224k090907
8653A01006630j598307j181346j158431j139067p39033J84549J574124J170267
$$ plain form
8645 98119386 99761064 103136246 107032128 111155439 117037214 121674986 125476802 128537911
8637 128537911 129244772 129889947 130163111 128942366 127132886 123502007 119019083 115231657
8629 115231657 112007844 110480158 109017644 107774268 105868677 103129792 99639094 95300667
8621 95300667 90717044 85404329 80052392 74303744 70124560 66707026 63397889 60457106
8613 60457106 58207779 56373425 53778685 52088830 50607002 48901636 47398350 46329309
8605 46329309 45033695 43791333 43052084 42586968 41537744 40927999 39941416 39021472 38146884
8596 38146884 37800908 37465649 36175277 35465280 34260937 33525082 33043603 32345909 32956421
8587 32956421 33963168 33924657 33970967 34509946 34942513 35658876 36277352 37063370 39339695
$$ packed form
8645I8119386J641678L375182L895882M123311N881775M637772L801816L061109
8637A28537911P06861O45175K73164j220745j809480l630879m482924l787426
8629A15231657l223813j527686j462514j243376j905591k738885l490698m338427
8621I5300667m583623n312715n351937n748648m179184l417534l309137k940783
8613F0457106k249327j834354k594740j689855j481828j705366j503286j069041
8605D6329309j295614j242362p39249m65116j049224o09745r86583r19944q74588
8596C8146884l45976l35259j290372p09997j204343p35855m81479o97694O10512
8587C2956421J006747l8511M6310N38979M32567P16363O18476P86018K276325
$$ plain form
8578 39339695 42053867 43416043 45248084 46682970 47067535 47528133 46888803 45331119 44030787
8569 44030787 43038852 41646779 40204656 39214479 38599606 37714699 37180693 36685785 36646613
8560 36646613 36205720 36318198 36425110 36286916 36032561 35293732 34491577 34273919 33810334
8551 33810334 33386348 33535157 33850783 34474384 35149207 35699227 36705731 36958211 37819760
8542 37819760 38370547 38895142 39493965 41238076 42561245 43995530 44958014 46678812 48649569
8533 48649569 50290034 52805477 55966243 60248707 63739076 68198299 74003396 80931513
8525 80931513 88868916 98701528 108726224 119329002 130662412 140133345 148018302 154971535
8517 154971535 156949142 156381053 157823310 159373119 161067351 163308141 164222199 163070831
$$ packed form
8578C9339695K714172J362176J832041J434886L84565M60598o39330j557684j300332
8569D4030787r91935j392073j442123r90177o14873q84907n34006m94908l9172
8560C6646613m40893J12478J06912j38194k54355p38829q02155k17658m63585
8551C3810334m23986J48809L15626O23601O74823N50020J006504K52480Q61549
8542C7819760N50787N24595N98823J744111J323169J434285R62484J720798J970757
8533D8649569J640465K515443L160766M282464L490369M459223N805097O928117
8525H0931513P937403R832612J0024696J0602778J1333410R470933P884957O953233
8517A54971535J977607n68089J442257J549809J694232K240790R14058j151368
$$ plain form
8509 163070831 156981028 149727420 143927400 139768703 136299601 134228066 133550375 134216455
8501 134216455 135786401 139640870 144924894 152892643 163391401 176295970 191295685 207722997
8493 207722997 225317020 241837972 258679185 273509691 281653816 286428698 292102619
8486 292102619 301068720 313240017 327617729 343209930 356654404 368758760 380364358
8479 380364358 390947996 401885551 409521731 411446695 406729625 393504956 370990640
8472 370990640 344376540 317679937 292359434 267716871 245146185 225752824 209592463
8465 209592463 196169137 184153964 174661495 167658679 162152073 158378647 156453656 155742095
8457 155742095 155392690 155806520 155882180 155275692 153878147 149000578 144895100 141272916 139074461
$$ packed form
8509A63070831o089803p253608n800020m158697l469102k071535o77691O66080
8501A34216455J569946L854469N284024P967749J0498758J2904569J4999715J6427312
8493B07722997J7594023J6520952J6841213J4830506Q144125M774882N673921
8486B92102619Q966101J2171297J4377712J5592201J3444474J2104356J1605598
8479C80364358J0583638J0937555P636180J924964m717070j3224669k2514316
8472C70990640k6614100k6696603k5320503k4642563k2570686j9393361j6160361
8465B09592463j3423326j2015173r492469p002816n506606l773426j924991p11561
8457A55742095l49405M13830P5660o06488j397545m877569m105478l622184k198455
$$ plain form
8448 139074461 136176478 133407645 129834524 123275780 114509928 105623262 97563941 90656821
8440 90656821 83616499 77361777 72908882 68439204 64554322 61493669 58459251 55910776
8432 55910776 52845692 50325684 47718026 45033144 43161414 41412046 39462664 37627861
8424 37627861 36344310 34600045 33201636 31896612 30894228 30308486 28974182 27310566
8416 27310566 26577031 26025846 24683554 24778964 23877943 22984732 23014700 22186352 21527113 21447340
8406 21447340 20932412 20489626 19794309 18421855 17960708 17977574 17755404 17301126 16957588
8397 16957588 16329400 15910773 15683074 15547448 14821425 14253195 14454724 13584530 13050214
8388 13050214 12852229 12753080 13059351 12708160 12673578 12195349 12084628 12326063 11395219 11431965
$$ packed form
8448A39074461k897983k768833l573121o558744q765852q886666q059321o907120
8440I0656821p040322o254722m452895m469678l884882l060653l034418k548475
8432E5910776l065084k520008k607658k684882j871730j749368j949382j834803
8424C7627861j283551j744265j398409j305024j002384n85742j334304j663616
8416B7310566p33535n51185j342292R5410r01021q93211K9968q28348o59239p9773
8406B1447340n14928m42786o95317j372454m61147J6866k22170m54278l43538
8397A6957588o28188m18627k27699j35626p26023n68230K01529q70194n34316
8388A3050214j97985r9149L06271l51191l4582m78229j10721K41435r30844L6746
$$ plain form
8378 11431965 11447527 11513335 11527323 11514222 11561049 11879770 11439490 11183064 11545926 11315095
8368 11315095 11157560 10680270 10993533 10196646 9473899 9438595 9177488 9130563 9507354 9875972
8358 9875972 9752326 9067173 8325889 8075396 7850558 7635201 7928069 8290233 8364539 7676795
8348 7676795 8244035 7630549 7051759 6783203 7255065 7451410 6731280 6893758 7273939 7029812
8338 7029812 7480310 6825278 6780348 7054301 6323088 6265415 6598054 6708977 6467139 6241205
8328 6241205 5429236 5446955 5104162 5480040 5823356 5697826 5056442 5396814 5882884 5926292
8318 5926292 5615690 5470153 5435076 5099951 5402196 5191494 4680441 4731575 5518767 5632492
8308 5632492 5288610 5316887 4848138 4986408 5485558 4888051 4651041 4181300 4236375 4096366
$$ packed form
8378A1431965J5562O5808J3988j3101M6827L18721m40280k56426L62862k30831
8368A1315095j57535m77290L13263p96887p22747l5304k61107m6925L76791L68618
8358I875972j23646o85153p41284k50493k24838k15357K92868L62164P4306o87744
8348G676795N67240o13486n78790k68556M71862J96345p20130J62478L80181k44127
8338G029812M50498o55032m4930K73953p31213n7673L32639J10923k41838k25934
8328F241205q11969J7719l42793L75878L43316j25530o41384L40372M86070M3408
8318E926292l10602j45537l5077l35125L02245k10702n11053N1134P87192J13725
8308E632492l43882K8277m68749J38270M99150n97507k37010m69741N5075j40009
$$ plain form
8298 4096366 3328495 4019029 3885621 3248120 2571267 3176264 3666781 3467114 3258603 3372774
8288 3372774 3336192 3069545 2967022 3486540 3840332 3261425 3325984 3507596 3333702 3231792
8278 3231792 3332344 3135471 3638754 3393855 3947814 3752908 3270461 3471903 3361053 2879163
8268 2879163 2715404 2777733 3561312 2694462 2385245 2799161 2759854 2651475 2443848 3147410
8258 3147410 2797643 2855416 2646559 2546198 2663904 2578765 2501542 2348995 3078694 2625771
8248 2625771 2204131 1818460 2257783 2620827 2484967 2355727 2113478 2451348 2108299 1805988
8238 1805988 1415879 1285908 904464 1222475 1324416 1502425 1084356 1695959 1672555 1741308
8228 1741308 1951460 1459076 1084310 1078013 984130 1438525 1355547 1550348 1642954 1373528
$$ packed form
8298D096366p67871O90534j33408o37501o76853O04997M90517j99667k08511J14171
8288C372774l6582k66647j02523N19518L53792n78907O4559J81612j73894j01910
8278C231792J00552j96873N03283k44899N53959j94906m82447K01442j10850m81890
8268B879163j63759O2329P83579q66850l09217M13916l9307j08379k07627P03562
8258C147410l49767N7773k08857j00361J17706q5139p7223j52547P29699m52923
8248B625771m21640l85671M39323L63044j35860j29240k42249L37870l43049l02311
8238A805988l90109j29971l81444L18011J01941J78009m18069O11603k3404O8753
8228A741308K10152m92384l74766o297r3883M54395q2978J94801R2606k69426
$$ plain form
8218 1373528 796806 747137 1351596 1379428 648728 913333 1799663 1555721 1360778 1108719
8208 1108719 1726691 1685623 1372950 1456981 1746993 1450089 1142988 1085787 1244584 948750
8198 948750 823729 1321469 1386829 2756447 2508053 3235674 -1675221 -4820222 -1886154
8189 -1886154 -1224674 -569762 -1208583 -253957 -167250 -203139 213097 616272 979695 1254014
8179 1254014 928261 967341 341189 12640 -170407 486357 858516 581788 381795 393411
8169 393411 637437 761223 230359 204777 514105 188486 293051 301125 315546 497137
8159 497137 823549 758737 658612 609703 930455 770212 538197 762035 891292 960152
8149 960152 870537 429085 505236 441124 342161 799451 288019 137964 5853 -213375
$$ packed form
8218A373528n76722m9669O04459K7832p30700K64605Q86330k43942j94943k52059
8208A108719O17972m1068l12673Q4031K90012k96904l07101n7201J58797k95834
8198I48750j25021M97740O5360J369618k48394P27621m910895l145001K934068
8189a886154O61480O54912o38821R54626Q6707l5889M16236M03175L63423K74319
8179A254014l25753L9080o26152l28549j83047O56764L72159k76728j99993J1616
8169C93411K44026J23786n30864k5582L09328l25619J04565Q074J4421J81591
8159D97137L26412o4812j00125m8909L20752j60243k32015K23838J29257O8860
8149I60152q9615m41452P6151o4112r8963M57290n11432j50055j32111k19228
$$ plain form
8139 -213375 -108881 361805 755294 326918 708724 1002984 860283 658863 856366 783654
8129 783654 1006373 930496 1042196 1261638 891017 541937 221317 459861 410178 506943
8119 506943 784089 1054700 1210762 1050955 904231 1042395 1468918 974134 124702 450132
8109 450132 897647 868049 982748 329727 766723 980726 463968 -48972 364172 763751
8099 763751 556400 288500 -134398 139675 722806 941675 912216 167180 231681 302265
8089 302265 247561 259667 496314 607293 176235 -221601 -156599 749283 828373 906200 580478
8078 580478 436714 -319759 235119 -44727 -235034 -280665 -524515 -186764 116554 -99178
8068 -99178 153906 -249303 -210219 294045 554946 481788 -30416 -406411 37177 468112
$$ packed form
8139b13375J04494M70686L93489m28376L81806K94260j42701k01420J97503p2712
8129G83654K22719p5877J11700K19442l70621l49080l20620K38544m9683R6765
8119E06943K77146K70611J56062j59807j46724J38164M26523m94784q49432L25430
8109D50132M47515k9598J14699o53021M36996K14003n16758n12940M13144L99579
8099G63751k07351k67900m22898K74073N83131K18869k9459p45036O4501P0584
8089C02265n4704J2106K36647J10979m31058l97836O5002R05882P9090P7827l25722
8078E80478j43764p56473N54878k79846j90307m5631k43850L37751L03318k15732
8068i9178K53084m03209L9084N04264K60901p3158n12204l75995M43588M30935
$$ plain form
8058 468112 87125 145288 187555 315125 -438624 -783944 -366767 -666297 -635512 78639
8048 78639 -88884 -277871 30931 -104536 115338 673180 179276 630320 334250 700878
8038 700878 874738 632135 930969 352874 918381 1271288 1103201 767708 809963 404214
8028 404214 252029 190042 343581 210542 -104562 473889 436298 322296 827115 649772
8018 649772 476500 627602 588177 812582 442678 427104 199366 214073 -60299 127922
8008 127922 226970 -6163 202176 169621 -179012 -477040 -1004981 -745444 -433907 21992
7998 21992 376041 110247 -192554 -421116 -70272 382902 -841682 -891332 -723782 -1149417
7988 -1149417 -712362 -914208 -896449 -261108 453203 -233213 -464927 -620644 -351764 -92030
$$ packed form
8058D68112l80987N8163M2267J27570p53749l45320M17177k99530L0785P14151
8048G8639j67523j88987L08802j35467K19874N57842m93904M51044k96070L66628
8038G00878J73860k42603K98834n78095N65507L52907j68087l35493M2255m05749
8028D04214j52185o1987J53539j33039l15104N78451l7591j14002N04819j77343
8018F49772j73272J51102l9425K24405l69904j5574k27738J4707k74372J88221
8008A27922R9048k33133K08339l2555l48633k98028n27941K59537L11537M55899
7998B1992L54049k65794l02801k28562L50844M53174j224584m9650J67550m25635
7988a149417M37055k01846J7759O35341P14311o86416k31714j55717K68880K59734
$$ plain form
7978 -92030 -135123 -369071 -732437 -812515 -1043753 -803107 -706491 -406832 -382428 -406903 -470506
7967 -470506 -203152 -87153 -579990 -65170 340930 -237440 -149608 -521076 -488952 -494153
7957 -494153 -1586464 -1563834 -940073 -612450 -425425 -486069 -336437 -541266 -223251 -255740
7947 -255740 -1036071 258155 -98111 14445 612832 376426 -88602 -593991 -215722 -446528
7937 -446528 -12598 218180 331226 136874 103762 -257711 58055 -170658 -645839 -927573
7927 -927573 -925469 -631614 -65067 71231 -332963 -324532 -663396 -885105 -1012963 -785695
7917 -785695 -129706 -138551 -719567 -897978 -698063 -842028 -1232459 -992267 -861070 -56571
7907 -56571 142595 -216522 -373153 20790 664905 161677 -623615 -769042 -975293 -1259941
$$ packed form
7978i2030m3093k33948l63366q0078k31238K40646R6616K99659K4404k4475o3603
7967d70506K67354J15999m92837N14820M06100n78370Q7832l71468L2124n201
7957d94153j092311K2630O23761L27623J87025o0644J49632k04829L18015l2489
7947b55740p80331J294226l56266J12556N98387k36406m65028n05389L78269k30806
7937d46528M33930K30778J13046j94352l3112l61473L15766k28713m75181k81734
7927i27573K104K93855N66547J36298m04194Q431l38864k21709j27858K27268
7917g85695O55989q845n81016j78411J99915j43965l90431K40192J31197Q04499
7907e6571J99166l59117j56631L93943O44115n03228p85292j45427k06251k84648
$$ plain form
7897 -1259941 -889493 -1001421 -1062433 -1247260 -1137972 -1008425 -434057 -312546 -718439 -548162
7887 -548162 -1009220 -810936 -827494 -168004 -537279 -1047439 -898349 -501700 -340125 -782547
7877 -782547 -1369037 -1087698 -896783 -652535 -988638 -899713 -558091 -367735 -12279 436165
7867 436165 737009 151054 -199305 -203397 -398813 -411641 -526305 -743706 -1576335 -1118391
7857 -1118391 -1360026 -1391556 -570709 -524136 -385169 -90670 -426603 -417766 -194912 -130553
7847 -130553 -506031 -628490 -142634 -526970 -981316 -782141 -550865 -627537 -335396 -506207
7837 -506207 -831976 -764089 -964325 -598387 -194617 -194205 -3347 -140851 -93492 -86109 -38262
7826 -38262 -569175 -416680 -779328 -1141464 -1196704 -1241028 -1563440 -1144338 -609273 -561486
$$ packed form
7897a259941L70448j11928o1012j84827J09288J29547N74368J21511m05893J70277
7887e48162m61058J98284j6558O59490l69275n10160J49090L96649J61575m42422
7877g82547n86490K81339J90915K44248l36103Q8925L41622J90356L55456M48444
7867D36165L00844n85955l50359m092j95416j2828j14664k17401q32629M57944
7857a118391k41635l1530Q20847M6573J38967K94499l35933Q837K22854O4359
7847a30553l75478j22459M85856l84336m54346J99175K31276p6672K92141j70811
7837e06207l25769O7887k00236L65938M03770M12J90858j37504M7359P383M7847
7826c8262n30913J52495l62648l62136n5240m4324l22412M19102N35065M7787
$$ plain form
7816 -561486 -580358 -458106 -400913 -795767 -1155819 -1120100 -505565 -470741 -716306 -863161
7806 -863161 -920946 -1048132 -907664 -898847 -1453532 -837229 -329488 -513762 -1055044 -1154378
7796 -1154378 -1275519 202288 302772 -372231 -468379 82174 -542351 -719159 -675811 -829701
7786 -829701 127969 -38835 -97550 291596 150390 -337750 -721682 -599697 -484608 -342651
7776 -342651 -342585 -95722 -18076 -138135 -362833 -547682 -443094 -489749 -65592 -40435 -364275
7765 -364275 -549677 -478590 297168 559367 -167870 294926 -99551 -329600 -250192 -449995
7755 -449995 -338463 -801581 3353 -274721 -1081060 -1043881 -751972 -172895 -166831 -21282
7745 -21282 38588 107326 -67400 -33100 116553 318212 -179924 -837703 -95677 367689
$$ packed form
7816e61486j8872J22252N7193l94854l60052L5719O14535L4824k45565j46855
7806h63161n7785j27186J40468Q817n54685O16303N07741j84274n41282r9334
7796a154378j21141J477807J00484o75003r6148N50553o24525j76808M3348j53890
7786h29701R57670j66804n8715L89146j41206m88140l83932J21985J15089J41957
7776c42651O6K46863P7646j20059k24698j84849J04588m6655M24157K5157l23840
7765c64275j85402P1087P75758K62199p27237M62796l94477k30049P9408j99803
7755d49995J11532m63118Q04934k78074q06339L7179K91909N79077O064J45549
7745b1282N9870O8738j74726L4300J49653K01659m98136o57779P42026M63366
$$ plain form
7735 367689 67582 -173956 -656070 -632089 -136622 -575702 -803877 -448296 -343392 -166225
7725 -166225 -60922 -154941 -761163 -765187 -457208 -664764 -527235 -108846 -142862 -287722
7715 -287722 -627994 -544700 -260951 -280218 -635096 -132257 -299655 -206723 403311 317614
7705 317614 69577 207054 48358 250733 433625 -264308 -278713 319606 286783 731708
7695 731708 957218 741334 686889 525631 422169 844379 257091 441374 1228674 1202318
7685 1202318 683108 843395 1447967 1234650 1244789 1086910 1583202 1772778 1789501 2208292
7675 2208292 2784324 2830264 3338755 3690378 3542270 4253436 5434781 6449563 6929203
7666 6929203 7729488 9282978 9768446 10950881 12814086 14586257 16103642 17840899 19510355
$$ packed form
7735C67689l00107k41538m82114K3981M95467m39080k28175L55581J04904J77167
7725a66225J05303r4019o06222m024L07979k07556J37529M18389l4016j44860
7715b87722l40272Q3294K83749j9267l54878N02839j67398R2932O10034q5697
7705C17614k48037J37477j58696K02375J82892o97933j4405N98319l2823M44925
7695G31708K25510k15884n4445j61258j03462M22210n87288J84283P87300k6356
7685A202318n19210J60287O04572k13317J0139j57879M96292J89576J6723M18791
7675B208292N76032M5940N08491L51623j48108P11166J181345J014782M79640
7666F929203Q00285J553490M85468J182435J863205J772171J517385J737257J669456
$$ plain form
7657 19510355 20049138 20589000 20000289 18676535 16494790 14925985 13384275 12587661 11510534
7648 11510534 10346051 8418713 7954164 7247060 5873572 5655373 5756581 5726192 5345151
7639 5345151 4732214 3530824 3234866 2948451 3173586 2924395 2726617 2349978 1978430
7630 1978430 1762233 1965222 1410430 1475137 1104785 605737 996659 592153 1201173 537289
7620 537289 498081 1272872 1470316 870471 18956 38315 65622 586353 85356 -25120
7610 -25120 -713262 -348627 603902 937221 423022 -48675 62915 -235633 -63081 -24884
7600 -24884 162277 608536 -155358 137425 87725 63765 -740489 -998986 -643400 -417240
7590 -417240 476815 -342815 -427363 -136647 -724832 -756692 -208764 -86566 -289783 -96454
$$ packed form
7657A9510355N38783N39862n88711j323754k181745j568805j541710p96614j077127
7648A1510534j164483j927338m64549p07104j373488k18199J01208l0389l81041
7639E345151o12937j201390k95958k86415K25135k49191j97778l76639l71548
7630A978430k16197K02989n54792O4707l70352m99048L90922m04506O09020o63884
7620E37289l9208P74791J97444n99845q51515J9359K7307N20731n00997j10476
7610b5120o88142L64635R52529L33319n14199m71697J11590k98548J72552L8197
7600b4884J87161M46259p63894K92783m9700k3960q04254k58497L55586K26160
7590d17240Q94055q19630q4548K90716n88185l1860N47928J22198k03217J93329
$$ plain form
7580 -96454 -374368 -281063 25704 271961 293241 -216632 -248287 -430588 -285349 -320391 -359445
7569 -359445 -264151 323355 -216387 -583888 169417 -241827 -318766 -622214 -558461 -531296
7559 -531296 -486232 -351202 -510363 -358074 -673045 -830693 -565488 458291 519386 126597
7549 126597 460815 239208 523002 386178 -35202 -626392 -1105548 -812481 -983212 -267052
7539 -267052 -102148 169224 -167053 -149959 -155742 -272023 -284510 302243 340505 33351 -162031
7528 -162031 19320 -213957 -874088 -443599 -674695 -548974 -476750 -39639 -319049 -107614
7518 -107614 -533039 -679951 -776673 -1059819 -666429 -296295 -677878 -172349 -145340 200700
7508 200700 220622 -138751 -339370 48903 256458 -212502 -232898 -62477 -776770 -757390
$$ packed form
7580i6454k77914R3305L06767K46257K1280n09873l1655j82301J45239l5042l9054
7569c59445R5294N87506n39742l67501P53305m11244p6939l03448O3753K7165
7559e31296M5064J35030j59161J52289l14971j57648K65205J023779O1095l92789
7549A26597L34218k21607K83794j36824m21380n91190m79156K93067j70731P16160
7539b67052J64904K71372l36277J7094n783j16281j2487N86753L8262l07154j95382
7528a62031J81351k33277o60131M30489k31096J25721P2224M37111k79410K11435
7518a07614m25425j46912r6722k83146L93390L70134l81583N05529K7009L46040
7508B00700J9922l59373k00619L88273K07555m68960k0396J70421p14293J9380
$$ plain form
7498 -757390 -377226 -566726 -1122509 -700154 -615335 -812158 -464008 -611654 -73139 -102642
7488 -102642 124329 -72633 25037 -559850 -490719 -187772 -585582 -940922 1322 -142756
7478 -142756 -404758 -944397 -52460 -200395 -122800 -1073537 -1491206 -719705 -546241 -400984
7468 -400984 -372631 -275706 -372025 -372347 299842 447113 -37507 -136625 44986 21162 122586
7457 122586 -220088 -1047470 -520509 -524171 -607225 -534478 -1098965 -1262587 -1045448 -875525
7447 -875525 -889595 -986298 -1238756 -1096384 -887169 -935691 -648759 -872450 -193981 -79820
7437 -79820 -494258 -376019 -321260 -733630 -837643 -783153 -102111 -370731 -938701 180222
7427 180222 445509 -303254 -984591 -744400 -441278 -213824 -336117 -608120 -318433 -490927
$$ packed form
7498g57390L80164j89500n55783M22355Q4819j96823L48150j47646N38515k9503
7488a02642K26971j96962R7670n84887O9131L02947l97810l55340R42244j44078
7478a42756k62002n39639Q91937j47935P7595r50737m17669P71501J73464J45257
7468d00984K8353R6925r6319l22O72189J47271m84620r9118J81611k3824J01424
7457A22586l42674q27382N26961l662q3054P2747n64487j63622K17139J69923
7447h75525j4070r6703k52458J42372K09215m8522K86932k23691O78469J14161
7437g9820m14438J18239N4759m12370j04013N4490O81042k68620n67970J118923
7427A80222K65287p48763o81337K40191L03122K27454j22293k72003K89687j72494
$$ plain form
7417 -490927 -216393 -379098 -247972 -325796 -98854 127863 -482482 -519850 -384423 300150
7407 300150 2492 -697230 -335298 -331345 -688427 -247728 -42883 -222152 -812617 -764253
7397 -764253 -275594 -347839 -623784 -293619 202726 -132613 -476520 -451634 -73802 -351047
7387 -351047 643433 56730 -21787 -112057 -530596 -836303 -1574184 -993181 -408080 -467298
7377 -467298 -414726 -479367 -845031 -720560 -429679 -508965 125720 143657 384488 537741
7367 537741 -293125 -614655 -489040 -337348 -639170 -230965 206479 -73969 -443798 -362368
7357 -362368 -377061 -742066 -713555 -342865 -332613 -393197 -83462 313586 249552 -252375 -757246
7346 -757246 -330982 601198 1056006 925762 855440 272153 535763 382012 55581 173422
$$ packed form
7417d90927K74534j62705J31126p7824K26942K26717o10345l7368J35427O84573
7407C00150k97658o99722L61932L953l57082M40699K04845j79269n90465M8364
7397g64253M88659p2245k75945L30165M96345l35339l43907K4886L77832k77245
7387c51047R94480n86703p8517r0270m18539l05707p37881N81003N85101n9218
7377d67298N2572o4641l65664J24471K90881p9286O34685J7937K40831J53253
7367E37741q30866l21530J25615J51692l01822M08205M37444k80448l69829Q1430
7357c62368j4693l65005K8511L70690J0252o0584L09735L97048o4034n01927n04871
7346g57246M26264R32180M54808j30244p0322n83287K63610j53751l26431J17841
$$ plain form
7336 173422 218457 596649 746524 740675 558715 1109690 657186 513630 1221987 1439116
7326 1439116 1258896 1683480 1934139 1940736 1842630 1866930 1447485 1627858 1540397 1822297
7316 1822297 2284180 1905494 1596966 988989 920151 1229107 791560 847839 1288149 1083503
7306 1083503 834431 1020842 435363 1609 134568 62593 -248160 747388 1349872 523529
7296 523529 -27219 -89203 562910 1135210 1143583 1153366 545210 -82176 288533 53307 119979
7285 119979 463707 1090619 793769 781403 585346 817528 190721 215979 158619 418387
7275 418387 -221152 -669406 -644728 -176536 371668 459286 124444 -303745 75182 389343
7265 389343 424708 512492 380811 523428 41562 -169285 522015 365401 85180 757116
$$ packed form
7336A73422M5035L78192J49875n849j81960N50975m52504j43556P08357K17129
7326A439116j80220M24584K50659O597r8106K4300m19445J80373q7461K81900
7316A822297M61883l78686l08528o07977o8838L08956m37547N6279M40310k04646
7306A083503k49072J86411n85479m33754J32959p1975l10753R95548O02484q26343
7296E23529n50748o1984O52113N72300Q373R783o08156o27386L70709k35226O6672
7285A19979L43728O26912k96850j2366j96057K32182o26807K5258n7360K59768
7275D18387o39539m48254K4678M68192N48204Q7618l34842m28189L78927L14161
7265C89343L5365Q7784j31681J42617m81866k10847O91300j56614k80221O71936
$$ plain form
7255 757116 805383 776854 776366 -94412 -21060 531113 153071 -50924 -340634 -393616 403018
7244 403018 444391 604886 248543 533879 732213 235397 472868 895721 838400 931994
7234 931994 535043 1264117 1438500 497386 686586 697301 1079247 1272422 764533 396762
7224 396762 915385 537692 494153 456265 91621 1003923 852695 110579 297575 981962
7214 981962 724266 861599 1543066 1957482 975099 890066 857831 948314 1227231 1066024
7204 1066024 1416135 892428 602233 571457 1365461 1161961 707831 752184 1184441 1364848
7194 1364848 1217586 1195118 1383421 1575527 1744553 1630814 1490786 1526606 1045328 1374059
7184 1374059 823886 815659 1377031 1644933 1113973 1201816 1763255 1652467 1017357 1245680
$$ packed form
7255G57116M8267k8529m88q70778P3352N52173l78042k03995k89710n2982P96634
7244D03018M1373J60495l56343K85336J98334m96816K37471M22853n7321R3594
7234I31994l96951P29074J74383r41114J89200J0715L81946J93175n07889l67771
7224C96762N18623l77693m3539l7888l64644R12302j51228p42116J86996O84387
7214I81962k57696J37333O81467M14416r82383q5033l2235R0483K78917j61207
7204A066024L50111n23707k90195l0776P94004k03500m54130M4353M32257J80407
7194A364848j47262k2468J88303J92106J69026j13739j40028L5820m81278L28731
7184A374059n50173q227N61372K67902n30960Q7843N61439j10788o35110K28323
$$ plain form
7174 1245680 965953 612292 1457073 2010848 1818341 1070985 1481608 2343842 1998423 2033964
7164 2033964 1724986 1841290 1772048 1258757 1114901 1504234 2149683 1469953 963259 1212642
7154 1212642 1219616 1489292 2124565 1978634 2182094 1732329 1333188 1801823 1630115 2081216
7144 2081216 2126821 1369965 1559758 2125172 2663929 2299612 2202686 2010123 2273512 2688764
7134 2688764 2301039 2526313 2608652 1818507 1591630 2100746 2582471 2665742 2592327 2159837
7124 2159837 1755349 2269045 2375494 1893598 1851678 2377122 2890466 3227274 2842651 3619516
7114 3619516 3177301 3087831 2703121 3132933 3416832 3370158 3309958 3506883 2923947 3140478
7104 3140478 3473367 3709073 4182230 3509963 4071137 4305625 4247581 4295247 4103795 3809933
$$ packed form
7174A245680k79727l53661Q44781N53775j92507p47356M10623Q62234l45419L5541
7164B033964l08978J16304o9242n13291j43856L89333O45449o79730n06694K49383
7154A212642O974K69676O35273j45931K03460m49765l99141M68635j71708M51101
7144B081216M5605p56856J89793N65414N38757l64317r6926j92563K63389M15252
7134B688764l87725K25274Q2339p90145k26877N09116M81725Q3271p3415m32490
7124B159837m04488N13696J06449m81896m1920N25444N13344L36808l84623P76865
7114C619516m42215q9470l84710M29812K83899m6674o0200J96925n82936K16531
7104C140478L32889K35706M73157o72267N61174K34488n8044M7666j91452k93862
$$ plain form
7094 3809933 4255204 4546997 5362973 5533913 5913102 5651911 5651845 5670765 5318191 5577205
7084 5577205 6032987 5401148 5348211 5412498 6572030 6401765 6398448 6780650 6753565 7041668
7074 7041668 7262124 7709982 7991416 7871982 7962708 8438592 8458035 8353952 8494420 9392254
7064 9392254 9661891 9604965 9710457 10251708 10753570 11238469 11536714 12340965 13244770 12978902
7054 12978902 13622376 14348897 15333603 16106544 16759615 17396202 17695504 18400748 19283500
7045 19283500 20812087 22096697 23143021 24810902 26280937 27630590 29478549 31557170
7037 31557170 33681623 35865817 37650070 39795785 42246651 44331737 47408276 50924855
7029 50924855 54099232 57703296 61887835 67817991 73849143 82071808 91206098 100602222
$$ packed form
7094C809933M45271K91793Q15976J70940L79189k61191o6J8920l52574K59014
7084E577205M55782o31839n2937O4287J159532j70265l317L82202k7085K88103
7074G041668K20456M47858K81434j19434R0726M75884J9443j04083J40468Q97834
7064I392254K69637n6926J05492N41251N01862M84899K98245Q04251R03805k65868
7054A2978902O43474P26521R84706P72941O53071O36587K99302P05244Q82752
7045A9283500J528587J284610J046324J667881J470035J349653J847959K078621
7037C1557170K124453K184194J784253K145715K450866K085086L076539L516579
7029E0924855L174377L604064M184539N930156O031152Q222665R134290R396124
$$ plain form
7021 100602222 110829473 122934341 136991730 152325339 170733786 192260311 218454666
7014 218454666 248626379 282478583 320572179 360651441 397859349 430159947 454004463
7007 454004463 463387950 456103996 438064845 410951524 375777345 338201160 304545540
7000 304545540 274665297 249093007 226538238 207159216 189718529 173322734 157792507
6993 157792507 144069047 131654116 120784399 110557900 101363076 93482083 85851849
6986 85851849 79851996 73759871 69042190 65092620 60654062 57181711 53872823 51024759
6978 51024759 48720289 46310874 43310187 41517064 39967151 38092459 36509960 34885283
6970 34885283 33850139 31531383 30298381 28859431 28181006 27485719 26624463 25207081 24526701
$$ packed form
7021A00602222J0227251J2104868J4057389J5333609J8408447K1526525K6194355
7014B18454666L0171713L3852204L8093596M0079262L7207908L2300598K3844516
7007D54004463R383487p283954j8039151k7113321l5174179l7576185l3655620
7000C04545540k9880243k5572290k2554769j9379022j7440687j6395795j5530227
6993A57792507j3723460j2414931j0869717j0226499r194824p880993p630234
6986H5851849n999853o092125m717681l949570m438558l472351l308888k848064
6978E1024759k304470k409415l000687j793123j549913j874692j582499j624677
6970C4885283j035144k318756j233002j438950o78425o95287q61256j417382o80380
$$ plain form
6961 24526701 23656720 22874942 22208271 21023377 20121955 19494713 19361785 19347264 18496976
6952 18496976 18574086 18235771 18016707 17651100 18096259 18009411 18079107 18133947 17441284 17724521
6942 17724521 17693633 17390357 17699634 19046582 19773492 21247757 22458761 23773434 26028653
6933 26028653 28775717 30820485 32844719 35745470 39526820 42568153 44822421 46052408
6925 46052408 46916973 46661216 44978253 43130405 40904034 37090843 34032790 31251018
6917 31251018 28916989 26221550 24109494 22871043 21701473 19941746 18845382 16855970
6909 16855970 15801070 14853372 13715878 12646019 12375505 11798161 10626436 10561934 10259849
6900 10259849 10306346 9623908 8554974 8847406 8472221 8201761 8403257 7905346 7045281
$$ packed form
6961B4526701q69981p81778o66671j184894r01422o27242j32928j4521q50288
6952A8496976P7110l38315k19064l65607M45159q6848O9696N4840o92663K83237
6942A7724521l0888l03276L09277J346948P26910J474265J211004J314673K255219
6933B6028653K747064K044768K024234K900751L781350L041333K254268J229987
6925D6052408Q64565k55757j682963j847848k226371l813191l058053k781772
6917C1251018k334029k695439k112056j238451j169570j759727j096364j989412
6909A6855970j054900r47698j137494j069859k70514n77344j171725o4502l02085
6900A0259849M6497o82438j068934K92432l75185k70460K01496m97911q60065
$$ plain form
6891 7045281 6258605 6475787 6111829 5947805 6045017 5327937 5382625 5567789 5170476 5459043
6881 5459043 5352655 5472191 5657402 5985463 5377778 4489539 4245283 4023827 4109743 4203422
6871 4203422 3465344 3027032 3623663 3576640 2832332 3326464 2772428 2200949 2251730 2313706
6861 2313706 2712284 3481668 3627289 3660104 3231144 2554173 2136290 1814343 2177521 1907983
6851 1907983 1415744 2019859 2064820 1910446 2089959 2262284 2484321 2824709 2267992 2554809
6841 2554809 2404762 2306210 1798276 1493452 1691280 1351216 1621010 2368096 1844626 1368505
6831 1368505 1894345 1996296 1778319 1664725 2001749 1733899 1678447 1292055 844592 882029
6821 882029 750264 784962 802614 808218 1078309 1179830 884895 1084439 1139587 933418 1336407
$$ packed form
6891G045281p86676K17182l63958j64024R7212p17080N4688J85164l97313K88567
6881E459043j06388J19536J85211L28061o07685q88239k44256k21456Q5916R3679
6871D203422p38078m38312N96631m7023p44308M94132n54036n71479N0781O1976
6861B313706L98578P69384J45621L2815m28960o76971m17883l21947L63178k69538
6851A907983m92239O04115M4961j54374J79513J72325K22037L40388n56717K86817
6841B554809j50047r8552n07934l04824J97828l40064K69794P47086n23470m76121
6831A368505N25840J01951k17977j13594L37024k67850n5452l86392m47463L7437
6821H82029j31765L4698J7652N604K70091J01521k94935J99544N5148k06169M02989
$$ plain form
6810 1336407 1708057 1539358 1688600 1050876 887942 524994 952593 1600346 1634718 1777586
6800 1777586 1881312 2008192 1572704 1774555 2589230 3392644 3207331 3658137 3880436 3852839
6790 3852839 3875909 4242013 3867533 3656462 3506399 3098405 2386280 1616793 1895041 1860298
6780 1860298 2232290 2405621 2417207 2009858 1811327 1917841 1748882 1865787 1628625 1765384
6770 1765384 1710258 2066359 1764834 1868240 1337626 700953 690469 560191 513026 844035
6760 844035 1042070 734265 389298 396450 518190 683263 518963 695591 608110 491113
6750 491113 410562 -106815 131315 418296 318136 -125815 -523616 -364645 41527 -295527
6740 -295527 -218284 515702 161463 415110 528573 729092 93494 -102321 93358 487555
$$ packed form
6810A336407L71650j68699J49242o37724j62934l62948M27599O47753L4372J42868
6800A777586J03726J26880m35488K01851Q14675Q03414j85313M50806K22299k7597
6790C852839K3070L66104l74480k11071j50063m07994p12125p69487K78248l4743
6780A860298L71992J73331J1586m07349j98531J06514j68959J16905k37162J36759
6770A765384n5126L56101l01525J03406n30614o36673j0484j30278m7165L31009
6760H44035J98035l07805l44967P152J21740J65073j64300J76628q7481j16997
6750D91113q0551n17377K38130K86981j00160m43951l97801J58971M06172l37054
6740b95527P7243P33986l54239K53647J13463K00519o35598j95815J95679L94197
$$ plain form
6730 487555 929297 538500 46439 52738 512733 429774 -219980 557565 794664 117213
6720 117213 371424 151146 -116826 -588990 -297987 267128 279656 737108 524950 -30862
6710 -30862 136820 127763 40256 116701 -137240 -72685 693876 641587 603685 215719 194964
6699 194964 540394 685043 1651235 1547933 1183195 1617143 599555 978393 1527557 2318145
6689 2318145 2060922 1922351 1573537 1338183 1385816 1500132 685040 1333610 1654039 901341
6679 901341 740880 888218 714469 554431 853800 901390 362999 -149302 -104418 -216131
6669 -216131 -747107 -328220 -363721 -1077213 -522132 -302262 -75363 147555 329579 12698
6659 12698 79096 220260 260221 -301293 -498703 148950 -297328 -277117 -301169 -279344 580937
$$ packed form
6730D87555M41742l90797m92061O299M59995q2959o49754P77545K37099o77451
6720A17213K54211k20278k67972m72164K91003N65115J2528M57452k12158n55812
6710c0862J67682r057q7507P6445k53941O4555P66561n2289l7902l87966k0755
6699A94964L45430J44649R66192j03302l64738M33948j017588L78838N49164P90588
6689B318145k57223j38571l48814k35354M7633J14316q15092O48570L20429p52698
6679I01341j60461J47338j73749j60038K99369M7590n38391n12301M4884j11713
6669b16131n30976M18887l5501p13492N55081K19870K26899K22918J82024l16881
6659A2698O6398J41164L9961n61514j97410O47653m46278K0211k4052K1825Q60281
$$ plain form
6648 580937 243818 605768 429463 -34744 482881 348658 -142145 127579 -206977 -120008
6638 -120008 -625374 -358572 97145 112129 78031 496979 645137 300807 819858 607775
6628 607775 121305 879474 390925 69388 -554990 -626205 -172694 -282616 -413154 -463517
6618 -463517 -475310 -874242 -361753 -349633 -416261 -191621 -42240 -334450 -365865 -167983
6608 -167983 -584431 -425601 -250304 -603694 -403022 -619984 -309913 142832 -201807 -455552
6598 -455552 -976064 -522395 -507726 -168950 114049 -45851 -821046 -710372 -351176 -431777
6588 -431777 -455267 -436086 -462835 -402727 336774 439417 572385 11169 -107277 59760
6578 59760 11423 -732753 -664028 -1008059 -882767 -219397 -63624 249790 482972 307700
$$ packed form
6648E80937l37119L61950j76305m64207N17625j34223m90803K69724l34556Q6969
6638a20008n05366K66802M55717J4984l4098M18948J48158l44330N19051k12083
6628F07775m86470P58169m88549l21537o24378p1215M53511j09922j30538n0363
6618d63517j1793l98932N12489J2120o6628K24640J49381k92210l1415J97882
6608a67983m16448J58830J75297l53390K00672k16962L10071M52745l44639k53745
6598d55552n20512M53669J4669L38776K82999j59900p75195J10674L59196q0601
6588d31777k3490J9181k6749O0108P39501J02643J32968n61216j18446J67037
6578E9760m8337p44176O8725l44031J25292O63370J55773L13414K33182j75272
$$ plain form
6568 307700 -7737 1271 583870 672732 317206 -6633 31661 132808 -79914 -118787 -235681
6557 -235681 169916 734124 -17474 -136914 -209477 -614124 13390 -189571 -247814 -491654
6547 -491654 -172543 -198550 -947012 -300170 107499 292374 -404168 -343721 139859 -355066
6537 -355066 128971 719593 236588 321822 301722 -386164 -325284 -386394 -331721 -506015 -747478
6526 -747478 122779 -140784 -19979 -78158 143987 563742 -43656 -582463 -203875 481653
6516 481653 765367 255636 -442679 77455 -20100 -34151 14451 -303047 -218449 423123
6506 423123 85069 120628 47708 -533590 -492498 -513515 -276779 -13122 394372 569145
6496 569145 210861 38916 86317 -309752 -617223 -366380 -18569 -58918 471951 -124185
$$ packed form
6568C07700l15437R008N82599Q8862l55526l23839L8294J01147k12722l8873j16894
6557b35681M05597N64208p51598j19440p2563m04647O27514k02961n8243k43840
6547d91654L19111k6007p48462O46842M07669J84875o96542O0447M83580m94925
6537c55066M84037N90622m83005Q5234k0100o87886O0880o1110N4673j74294k41463
6526g47478Q70257k63563J20805n8179K22145M19755o07398n38807L78588O85528
6516D81653K83714n09731o98315N20134r7555j4051M8602l17498Q4598O41572
6506D23123l38054L5559p2920n81298M1092k1017K36736K63657M07494J74773
6496E69145l58284j71945M7401l96069l07471K50843L47811m0349N30869n96136
$$ plain form
6486 -124185 372507 574280 748339 808431 388430 320380 627603 1131979 710899 452677
6476 452677 509590 522640 -344603 -587511 -271184 577723 559079 761336 668617 590972 518526
6465 518526 295130 5876 165997 499859 742372 652242 495747 661052 205401 427735
6455 427735 476754 380051 125863 128234 200157 -164808 -15302 -200955 -627507 -356927 -277093
6444 -277093 -368735 -351194 127630 1024298 -74625 -56598 377203 450294 -242416 89653
6434 89653 -249633 -551310 -598082 -761913 -815317 -244968 -206810 -156099 -635791 -621577 -104618
6423 -104618 -170632 -21357 50120 49762 -178668 -703458 -1195852 -1128969 -515082 -612341 -496162
6412 -496162 -479712 -570313 53176 -357922 -536113 -736380 -662184 -552766 -322741 -568951
$$ packed form
6486a24185M96692K01773J74059O0092m20001o8050L07223N04376m21080k58222
6476D52677N6913J3050q67243k42908L16327Q48907j8644K02257r2719p7645p2446
6465E18526k23396k89254J60121L33862K42513r0130j56495J65305m55651K22334
6455D27735M9019r6703k54188K371P1923l64965J49506j85653m26552K70580P9834
6444b77093r1642J7541M78824Q96668j098923J8027M33801P3091o92710L32069
6434H9653l39286l01677m6772j63831n3404N70349L8158N0711m79692J4214N16959
6423a04618o6014J49275P1477l58k28430n24790m92394O6883O13887r7259J16179
6412d96162J6450r0601O23489m11098j78191k00267P4196J09418K30025k46210
$$ plain form
6402 -568951 -395192 -301273 -432080 -225454 -355339 -562306 -507206 -165866 84850 12283
6392 12283 -420713 -890098 583780 286628 -151257 434332 473798 -286248 -216911 -428090
6382 -428090 444628 587391 34653 -276584 -438964 -599477 -143026 352467 145749 -648419
6372 -648419 -428217 517866 462152 -123676 -271094 -952783 -1121796 -76163 129893 -42541
6362 -42541 -525907 -269006 663796 748250 952437 248625 -452282 -757476 -366099 52662
6352 52662 368627 43504 267478 472308 531882 822525 777418 844763 727081 1174010
6342 1174010 545376 739218 323319 170411 127650 675412 143130 488371 459496 241602
6332 241602 683218 863813 632937 343905 262540 -10737 -403019 90238 632136 416848
$$ packed form
6402e68951J73759R3919j30807K06626j29885k06967N5100L41340K50716p2567
6392A2283m32996m69385J473878k97152m37885N85589L9466p60046O9337k11179
6382d28090Q72718J42763n52738l11237j62380j60513M56451M95493k06718p94168
6372f48419K20202R46083n5714n85828j47418o81689j69013J045633K06056j72434
6362d2541m83366K56901R32802Q4454K04187p03812p00907l05194L91377M18761
6352E2662L15965l25123K23974K04830N9574K90643m5107O7345j17682M46929
6342A174010o28634J93842m15899j52908m2761N47762n32282L45241k8875k17894
6332B41602M41616J80595k30876k89032q1365k73277l92282M93257N41898k15288
$$ plain form
6322 416848 -53691 263023 -4028 -653352 -847051 -663669 -78222 -141068 105116 752751
6312 752751 318424 -141355 -326184 -321226 -243229 -132166 83846 513257 381835 -92228
6302 -92228 -20313 -494321 215044 -8164 -767182 -352548 121216 -108649 214739 147394
6292 147394 255855 575470 683413 327562 -52549 -528588 -304905 -347463 -199295 404361
6282 404361 815232 297459 845461 168951 -333214 53500 136694 640994 750606 841693
6272 841693 187817 341169 635793 290331 462175 650183 411665 223453 -435610 -269690
6262 -269690 -529901 -24282 51635 -324238 -433267 -238928 315742 433463 591531 249740
6252 249740 5739 -150806 -42150 1174515 639450 563784 1093195 1215996 425313 223340
$$ packed form
6322D16848m70539L16714k67051o49324j93699J83382N85447o2846K46184O47635
6312G52751m34327m59779j84829M958P7997J11063K16012M29411j31422m74063
6302i2228P1915m74008P09365k23208p59018M14634M73764k29865L23388o7345
6292A47394J08461L19615J07943l55851l80111m76039K23683m2558J48168O03656
6282D04361M10871n17773N48002o76510n02165L86714Q3194N04300J09612R1087
6272H41693o53876J53352K94624l45462J71844J88008k38518j88212o59063J65920
6262b69690k60211N05619P5917l75873j09029J94339N54670J17721J58068l41791
6252B49740k44001j56545J08656J216665n35065p5666N29411J22801p90683k01973
$$ plain form
6242 223340 109724 -27152 478775 171239 -164233 124965 377918 210621 678004 831466
6232 831466 512449 524226 433739 234797 866283 651255 -133764 -155256 -224538 279192
6222 279192 4889 -628181 1340 210948 400024 931651 1269236 1193146 684759 258744
6212 258744 148797 -158576 367018 856906 1241721 1419309 1859764 2584813 1957244 1645335
6202 1645335 1326724 1321400 1395458 1452387 1006200 1021836 1191328 1378638 1100984 1581510
6192 1581510 1606524 1554292 1317873 1493863 1636492 1480467 2107415 1857238 2167742 1873458
6182 1873458 1243421 743769 1228043 1719291 1259662 347060 821362 707293 612722 1083494
6172 1083494 1563867 868267 769692 1085967 1736969 1404488 865946 1707797 1742163 1923825
$$ packed form
6242B23340j13616j36876N05927l07536l35472K89198K52953j67297M67383J53462
6232H31466l19017J1777r0487j98942O31486k15028p85019k1492o9282N03730
6222B79192k74303o33070O29521K09608J89076N31627L37585p6090n08387m26015
6212B58744j09947l07373N25594M89888L84815J77588M40455P25049o27569l11909
6202A645335l18611n324P4058N6929m46187J5636J69492J87310k77654M80526
6192A581510K5014n2232k36419J75990J42629j56025O26948k50177L10504k94284
6182A873458o30037m99652M84274M91248m59629r12602M74302j14069r4571M70772
6172A083494M80373o95600r8575L16275O51002l32481n38542Q41851L4366J81662
$$ plain form
6162 1923825 2191084 1752003 1830765 2166394 2090544 1903813 2069143 2349637 2352118 1898464
6152 1898464 1751052 2338254 1988720 1989409 2101755 1837100 2220398 1784478 1355134 1851262
6142 1851262 2176373 2503776 2052006 1595538 1419895 1151781 1317512 1132256 581900 1102042
6132 1102042 707314 714676 1185196 909632 1199612 1153368 1335312 1635575 746252 1287873
6122 1287873 1887291 1767488 1418133 932661 758092 1308955 1762844 1558340 1568179 1118962
6112 1118962 1352482 1447864 1537203 1553219 1573341 2171169 2730793 3001764 2822564 1978904
6102 1978904 2151086 2473155 2345893 2453810 2353434 2025808 2131097 1430940 1510310 1400874
6092 1400874 1334528 2116538 2464067 2606313 1785147 2096493 1844019 2002833 2423421 2140046
$$ packed form
6162A923825K67259m39081P8762L35629p5850j86731J65330K80494K481m53654
6152A898464j47412N87202l49534O89J12346k64655L83298m35920m29344M96128
6142A851262L25111L27403m51770m56468j75643k68114J65731j85256n50356N20142
6132A102042l94728P362M70520k75564K89980m6244J81944L00263q89323N41621
6122A287873N99418j19803l49355m85472j74569N50863M53889k04504R839m49217
6112A118962K33520R5382Q9339J6016K0122N97828N59624K70971j79200q43660
6102A978904J72182L22069j27262J07917j00376l27626J05289p00157P9370j09436
6092A400874o6346P82010L47529J42246q21166L11346k52474J58814M20588k83375
$$ plain form
6082 2140046 1960411 1476315 1443040 1376670 1631500 1514270 1904165 2084452 2096305 1669235
6072 1669235 881581 1148829 1067254 1242692 1018652 975667 1062403 1269979 1480831 1353559
6062 1353559 1213136 1530742 2001157 1646346 1118304 674277 1666141 2093732 1698798 1489892
6052 1489892 1425282 1883429 1267985 1143773 1402051 1452781 979159 1436027 2140884 1660718
6042 1660718 1372331 1673785 2396276 2840584 2777815 2038502 2481812 2321268 1945970 1687327
6032 1687327 1429491 1807254 2065984 2221800 1786048 1688398 1933119 2078524 2227206 1625679
6022 1625679 1686257 1790437 2070699 2685501 2469187 2127293 2142092 2192611 2653610 3108392
6012 3108392 2776316 2757279 2945129 2818716 2786619 3422568 4035654 4354881 3967900 4121511
$$ packed form
6082B140046j79635m84096l3275o6370K54830j17230L89895J80287J1853m27070
6072A669235p87654K67248q1575J75438k24040m2985Q6736K07576K10852j27272
6062A353559j40423L17606M70415l54811n28042m44027R91864M27591l94934k08906
6052A489892o4610M58147o15444j24212K58278N0730m73622M56868P04857m80166
6042A660718k88387L01454P22491M44308o2769p39313M43310j60544l75298k58643
6032A687327k57836L77763K58730J55816m35752r7650K44721J45405J48682o01527
6022A625679O0578J04180K80262O14802k16314l41894J4799N0519M60999M54782
6012C108392l32076j9037J87850j26413l2097O35949O13086L19227l86981J53611
$$ plain form
6002 4121511 4232128 4228747 4227940 4739511 4275183 4458252 3966477 3813729 3696838 3993026
5992 3993026 4948034 4470859 3736562 3675325 4399690 4317604 4393507 5311119 5186464 4324380
5982 4324380 4972193 5053435 5435935 5565629 6494346 6421542 5466845 5976534 5984935 6235699
5972 6235699 6266980 6370727 6465509 6582234 6210616 5932318 6043448 6046111 6085474 5725065
5962 5725065 5925715 5974256 6128116 6399847 5996996 6106040 6383469 6534576 6319290 6356836
5952 6356836 6369654 6223333 6556596 6650131 6940986 6642971 6877178 7000807 7251997 7236792
5942 7236792 7396417 7145350 7630892 8250527 7878834 8172121 7826007 7745373 7675357 8134098
5932 8134098 8846128 9150606 9575520 10011287 9705497 9778654 9751235 9843929 10300238 10778754
$$ packed form
6002D121511J10617l381q07N11571m64328J83069m91775j52748j16891K96188
5992C993026R55008m77175p34297o1237P24365q2086P5903R17612j24655q62084
5982D324380O47813Q1242L82500J29694R28717p2804r54697N09689Q401K50764
5972F235699L1281J03747R4782J16725l71618k78298J11130K663L9363l60409
5962E725065K00650M8541J53860K71731m02851J09044K77429J51107k15286L7546
5952F356836J2818j46321L33263R3535K90855k98015K34207J23629K51190j5205
5942G236792J59625k51067M85542O19635l71693K93287l46114q0634p0016M58741
5932H134098P12030L04478M24914M35767l05790P3157k7419R2694M56309M78516
$$ plain form
5922 10778754 10923889 11536905 11949415 12137162 13099950 12948324 12987713 14407681 14745648
5913 14745648 15263137 16472920 17596898 18033880 18935121 20476247 21028296 21718471 23168019
5904 23168019 24725454 26474707 28613736 30873330 33531654 36187149 39677720 43713666
5896 43713666 47745274 52154574 57250530 63867015 71602325 80922462 91300330 101899205
5888 101899205 112856619 123269474 132089581 138790866 142072625 140295439 135782674 129441268
5880 129441268 123734491 119060802 115869182 113879867 113708219 114591189 116605806 119832435
5872 119832435 125484922 133267885 143172745 155822995 169563283 184698363 200022106
5865 200022106 214143421 227239855 235588779 238536047 235201088 228099209 218655698 206566711
$$ packed form
5922A0778754J45135O13016M12510J87747R62788j51626L9389J419968L37967
5913A4745648N17489J209783J123978M36982R01241J541126N52049O90175J449548
5904B3168019J557435J749253K139029K259594K658324K655495L490571M035946
5896D3713666M031608M409300N095956O616485P735310R320137J0377868J0598875
5888A01899205J0957414J0412855Q820107O701285L281759j777186m512765o341406
5880A29441268n706777m673689l191620j989315j71648Q82970K014617L226629
5872A19832435N652487P782963R904860J2650250J3740288J5135080J5323743
5865B00022106J4121315J3096434Q348924K947268l334959p101879r443511j2088987
$$ plain form
5857 206566711 194334971 181178742 168568403 158724334 150456618 143283955 138347955 134508493
$$ packed form
5857B06566711j2231740j3156229j2610339r844069q267716p172663m936000l839462
$$ [...]
##END NTUPLES=NMR SPECTRUM
##END=
