##TITLE=1H_TG-2389-b1
 200.13MHz, CDCl3,
 8 sc
 
 21.8.2025
##JCAMPDX= 6.0         $$ Bruker NMR JCAMP-DX V2.0
##DATA TYPE= NMR SPECTRUM
##DATA CLASS= NTUPLES
##ORIGIN= UXNMR, Bruker Analytische Messtechnik GmbH
##OWNER= pz
$$ XWIN-NMR		Version 3.5
$$ Thu Aug 21 14:09:12 2025 Russian Standard Time (UT+4h)  she@DPX200
##.OBSERVE FREQUENCY= 200.1313
##.OBSERVE NUCLEUS= ^1H
##.ACQUISITION MODE= SIMULTANEOUS
##.ACQUISITION SCHEME= undefined
##.AVERAGES= 8
##.DIGITISER RES= 18
##SPECTROMETER/DATA SYSTEM= spect
##.PULSE SEQUENCE= zg30
##.SOLVENT NAME= CDCl3
##.SHIFT REFERENCE= (INTERNAL, CDCl3, 0, 14.5613)
##AUDIT TRAIL= $$ (NUMBER, WHEN, WHO, WHERE, WHAT)
$$ ##TITLE= Audit trail, XWIN-NMR		Version 3.5
$$ ##JCAMPDX= 5.01
$$ ##ORIGIN= Bruker BioSpin GmbH
$$ ##OWNER= she
$$ F:/spectra/data/she/nmr/H-C/1/pdata/1/auditp.txt
$$ ##AUDIT TRAIL=  $$ (NUMBER, WHEN, WHO, WHERE, WHAT)
(   1,<2025-08-21 14:07:55.09 +0400>,<she>,<DPX200>,
      <created by zg, POWCHK disabled, PULCHK disabled
       configuration hash MD5:
       00 E9 B6 7A A2 85 ED C7 34 08 36 98 17 FE 4E 26
       data hash MD5: 16K
       09 02 22 0D 6C 6B BB D9 54 B2 60 00 C0 03 BD F3>)
(   2,<2025-08-21 14:07:57.50 +0400>,<she>,<DPX200>,
      <Start of raw data processing
       efp BC_mod = 2 LB = 0.25 FT_mod = 6 PKNL = 1 PHC0 = -1558.921 PHC1 = 6.79229 SI = 16K 
       data hash MD5: 16K
       40 0D D3 94 4F 67 8E 43 19 46 1D 59 F9 EA 6A 0C>)
(   3,<2025-08-21 14:08:15.98 +0400>,<she>,<DPX200>,
      <pk PHC0 = -4.973631 PHC1 = 6 
       data hash MD5: 16K
       25 1C EA 60 DF 9C 97 63 E8 CB 4C 7A 4E F7 87 A7>)
(   4,<2025-08-21 14:08:19.85 +0400>,<she>,<DPX200>,
      <abs ABSG = 5 
       data hash MD5: 16K
       4C 7C AA CE 76 36 1D D8 80 34 B9 3D 37 F3 99 4C>)
$$ ##END=
$$ 
$$ hash MD5
$$ A4 27 CB 92 10 B5 50 0A 82 36 D5 9D 28 FE C2 15
##$RELAX= 
##$RELAX= 
##$RELAX= 
##$RELAX= 
##$RELAX= 
##$RELAX= 
$$ Bruker specific parameters
$$ --------------------------
##$DU= <F:/spectra>
##$EXPNO= 1
##$NAME= <H-C>
##$PROCNO= 1
##$TYPE= <nmr>
##$USER= <she>
##$AMP= (0..31)
100 100 100 100 100 100 100 100 100 100 100 100 100 100 100 100 100 100 
100 100 100 100 100 100 100 100 100 100 100 100 100 100 
##$AQSEQ= 0
##$AQ_mod= 1
##$AUNM= <au_zg>
##$AUTOPOS= <>
##$BF1= 200.13
##$BF2= 200.13
##$BF3= 200.13
##$BF4= 200.13
##$BF5= 200.13
##$BF6= 200.13
##$BF7= 200.13
##$BF8= 200.13
##$BYTORDA= 1
##$CFDGTYP= 0
##$CFRGTYP= 5
##$CHEMSTR= <none>
##$CNST= (0..31)
1 1 145 1 1 1 1 1 1 1 1 1 1 1 1 1 1 1 1 1 1 1 1 1 1 1 1 1 1 1 1 1 
##$CPDPRG= <>
##$CPDPRG1= <>
##$CPDPRG2= <>
##$CPDPRG3= <>
##$CPDPRG4= <mlev>
##$CPDPRG5= <mlev>
##$CPDPRG6= <mlev>
##$CPDPRG7= <mlev>
##$CPDPRG8= <mlev>
##$CPDPRGB= <>
##$CPDPRGT= <>
##$D= (0..31)
0 0.7 0 0 0 0 0 0 0 0 0 0.03 0 0 0 0 0 0 0 0 0 0 0 0 0 0 0 0 0 0 0 0 
##$DATE= 1755770874
##$DBL= (0..7)
120 120 120 120 120 120 120 120 
##$DBP= (0..7)
150 150 150 150 150 150 150 150 
##$DBP07= 0
##$DBPNAM0= <>
##$DBPNAM1= <>
##$DBPNAM2= <>
##$DBPNAM3= <>
##$DBPNAM4= <>
$$ [...]
##$SUBNAM3= <"">
##$SUBNAM4= <"">
##$SUBNAM5= <"">
##$SUBNAM6= <"">
##$SUBNAM7= <"">
##$SUBNAM8= <"">
##$SUBNAM9= <"">
##$SW= 18.0517328524113
##$SWIBOX= (0..15)
0 0 2 0 0 0 0 0 0 0 0 0 0 0 0 0 
##$SW_h= 3612.71676300578
##$TD= 16384
##$TD0= 1
##$TE= 0
##$TE2= 300
##$TE3= 300
##$TEG= 300
##$TL= (0..7)
0 120 120 120 120 120 120 120 
##$TP= (0..7)
150 150 150 150 150 150 150 150 
##$TP07= 0
##$TPNAME0= <>
##$TPNAME1= <>
##$TPNAME2= <>
##$TPNAME3= <>
##$TPNAME4= <>
##$TPNAME5= <>
##$TPNAME6= <>
##$TPNAME7= <>
##$TPOAL= (0..7)
0.5 0.5 0.5 0.5 0.5 0.5 0.5 0.5 
##$TPOFFS= (0..7)
0 0 0 0 0 0 0 0 
##$TUNHIN= 0
##$TUNHOUT= 0
##$TUNXOUT= 0
##$USERA1= <user>
##$USERA2= <user>
##$USERA3= <user>
##$USERA4= <user>
##$USERA5= <user>
##$V9= 5
##$VALIST= <valist>
##$VCLIST= <CCCCCCCCCCCCCCC>
##$VD= 0
##$VDLIST= <DDDDDDDDDDDDDDD>
##$VPLIST= <PPPPPPPPPPPPPPP>
##$VTLIST= <TTTTTTTTTTTTTTT>
##$WBST= 1024
##$WBSW= 4
##$XGAIN= (0..3)
0 0 0 0 
##$XL= 0
##$YL= 0
##$YMAX_a= 118538
##$YMIN_a= -190422
##$ZGOPTNS= <>
##$ZL1= 120
##$ZL2= 120
##$ZL3= 120
##$ZL4= 120
##$ABSF1= 14.57346
##$ABSF2= -3.478373
##$ABSG= 5
##$ABSL= 3
##$ALPHA= 0
##$AQORDER= 0
##$ASSFAC= 0
##$ASSFACI= 0
##$ASSFACX= 0
##$ASSWID= 0
##$AUNMP= <proc_1d>
##$AZFE= 0.1
##$AZFW= 0.1
##$BCFW= 0
##$BC_mod= 2
##$BYTORDP= 0
##$COROFFS= 0
##$CY= -3
##$DATMOD= 1
##$DC= 0
##$DFILT= <>
##$DTYPP= 0
##$F1P= 0
##$F2P= 0
##$FCOR= 1
##$FTSIZE= 16384
##$FT_mod= 6
##$GAMMA= 0
##$GB= 0
##$INTBC= 1
##$INTSCL= 3.241238e-09
##$ISEN= 128
##$LB= 0.25
##$LEV0= 0
##$LPBIN= 0
##$MAXI= 10000
##$MC2= 0
##$MEAN= 0
##$ME_mod= 0
##$MI= 1.114404
##$NCOEF= 0
##$NC_proc= -8
##$NLEV= 6
##$NOISF1= 3.799351
##$NOISF2= 2.8
##$NSP= 0
##$NTH_PI= 0
##$NZP= 0
##$OFFSET= 14.56134
##$PC= 1
##$PHC0= -1563.895
##$PHC1= 12.79229
##$PH_mod= 1
##$PKNL= yes
##$PPARMOD= 0
##$PSCAL= 0
##$PSIGN= 0
##$REVERSE= no
##$SF= 200.130192194115
##$SI= 16384
##$SIGF1= 3
##$SIGF2= 2
##$SINO= 0.751879
##$SIOLD= 32768
##$SREGLST= <19F.Aceton>
##$SSB= 0
##$STSI= 16384
##$STSR= 0
##$SW_p= 3612.71676300578
##$SYMM= 0
##$S_DEV= 0
##$TDeff= 16384
##$TDoff= 0
##$TI= <>
##$TILT= no
##$TM1= 0
##$TM2= 0
##$TOPLEV= 0
##$USERP1= <user>
##$USERP2= <user>
##$USERP3= <user>
##$USERP4= <user>
##$USERP5= <user>
##$WDW= 1
##$XDIM= 16384
##$YMAX_p= 329047864
##$YMIN_p= -1286489
$$ End of Bruker specific parameters
$$ ---------------------------------
##NTUPLES= NMR SPECTRUM
##VAR_NAME=  FREQUENCY,     SPECTRUM/REAL,   SPECTRUM/IMAG
##SYMBOL=    X,             R,               I
##VAR_TYPE=  INDEPENDENT,   DEPENDENT,       DEPENDENT
##VAR_FORM=  AFFN,          ASDF,            ASDF
##VAR_DIM=   16384,         16384,           16384
##UNITS=     HZ,            ARBITRARY UNITS, ARBITRARY UNITS
##FACTOR=    0.220516191357247, 1,           1
##FIRST=     2914.16383925333, 0,            0
##LAST=      -698.552923752447, 0,           0
##MIN=       -698.552923752447, -1286489,    0
##MAX=       2914.16383925333, 329047864,    0
$$ Real data points
##PAGE= N=1
##DATA TABLE= (X++(R..R)), XYDATA
$$ [...]
12897b91696K15963K49551j77281k82725j03257J38718L13569J77175l4906J51195
$$ -291696 -75733 173818 -3463 -286188 -389445 -250727 62842 240017 205111 356306
12887C56306k37840j24153k84701l22297M003K97261L50675r916m54920L29978
$$ 356306 118466 -5687 -290388 -612685 -608682 -311421 39254 29338 -425582 -95604
12877i5604K45512l3056j17155J67894k73067l72158L98343k15752l1251L57943
$$ -95604 149908 116852 -303 167591 -105476 -477634 -79291 -295043 -326294 31649
12867C1649j49111r3707j26746M8753M08942J23158k68264k57139J64786k9107
$$ 31649 -117462 -211169 -337915 -289162 119780 242938 -25326 -282465 -117679 -146786
12857a46786J42632m25333K38721K59319r6129q4003J77310J4675l5701m17897
$$ -146786 -4154 -429487 -190766 68553 -27576 -111579 65731 80406 44705 -373192
12847c73192K07427M98388N1095n38987J18621L28713l63756Q8293l99086K74151
$$ -373192 -165765 332623 383718 -155269 -36648 292065 -71691 16602 -382484 -108333
12837a08333J42985j40475j0610k56325L54443L41961P8517m33380l68197L44859
$$ -108333 34652 -105823 -116433 -372758 -18315 323646 402163 -31217 -399414 -54555
12827e4555p5028n3617K26706N3785Q1092J4712l16870r7627N2715J85314l71238
$$ -54555 -129583 -183200 43506 97291 178383 193095 -123775 -221402 -168687 16627 -354611
12816c54611K81488M7243M6328j65688J14196J41770m16578J09545J17801l30940
$$ -354611 -73123 -25880 20448 -145240 -31044 110726 -305852 -196307 -78506 -409446
12806d09446j20637N42778J14443K13505j73053k40796J09665l73008P4419K9158
$$ -409446 -530083 12695 127138 340643 167590 -73206 36459 -336549 -262130 -232972
12796b32972j38219J7189K52220L78931k10871n51777K63560j84479o047M67916
$$ -232972 -371191 -354002 -101782 277149 66278 -485499 -221939 -406418 -412465 55451
12786E5451j06027M1254J68597k81474l12331l80238K36517M41314M0850l30101
$$ 55451 -50576 -9322 159275 -122199 -434530 -814768 -578251 -136937 -96087 -426188
12776d26188m3211K8299r4293O6156P1525K57436j395o1485N6518j59905L81375
$$ -426188 -469399 -441100 -535393 -469237 -397712 -140276 -141671 -203156 -146638 -306543 74832
12765G4832J21657K49355m34742o03054M63711J28567p3242j51811L08019q67
$$ 74832 196489 445844 11102 -591952 -128241 326 -72916 -224727 83292 82425
12755H2425J87062r537j86937N3874j20769r7742k9579K33755J13086K0368j94935
$$ 82425 269487 259950 73013 126887 6118 -91624 -121203 112552 225638 246006 51071
12744E1071l8970k62309k6729k80824k93401L92177k3651M18062l54304M57557
$$ 51071 12101 -250208 -276937 -557761 -851162 -458985 -482636 -64574 -418878 38679
12734C8679K90808l07771J71987J24574r7590l1026N8248q4821l98446K30799
$$ 38679 329487 21716 193703 318277 220687 189661 247909 163088 -235358 -4559
12724d559j01620J79616j57923J30362N12510j59396j92734o14205k88263K37370
$$ -4559 -106179 73437 -84486 45876 558386 398990 206256 -407949 -696212 -458842
12714d58842K60610l02804j99714K11871L5094K92201R9851o1752m50651j05802
$$ -458842 -198232 -501036 -700750 -488879 -453785 -161584 -61733 -123485 -574136 -679938
12704f79938O24243L53848k62382k22622P0278q3142j24526K36341j01570l63466
$$ -679938 -55695 298153 35771 -186851 -116573 -199715 -324241 -87900 -189470 -552936
12694e52936J86419J70873L91783L30138l98544l8731n0283o06111L86466P6790
$$ -552936 -366517 -195644 196139 526277 127733 89002 38719 -567392 -180926 -104136
12684a04136K10870j53668j89293N7758K51162k37029K84123k15397j38608K19042
$$ -104136 106734 -46934 -236227 -178469 72693 -164336 119787 -95610 -234218 -15176
12674a5176j12632J93855m5623j15130k28982O988Q319K78044q7407j36343P1590
$$ -15176 -127808 66047 20424 -94706 -323688 -316700 -308381 -30337 -117744 -254087 -182497
12663a82497j64867L25287M26531j26060l07172l85282J143j99078Q9200K59482
$$ -182497 -347364 -22077 404454 278394 -28778 -414060 -412917 -611995 -522795 -263313
12653b63313L71144J03953P0690m22591K3166K56840J84863o2171m57846K95621
$$ -263313 107831 211784 282474 -140117 -116951 139889 324752 262581 -195265 100356
12643A00356l5098k60935M5236m7801K12081j1500k77523o5902L0256K70539j18920
$$ 100356 65258 -195677 -150441 -198242 13839 2339 -275184 -341086 -310830 -40291 -159211
12632a59211k88848J84039J00804N8607k80544j86087p9901P2144L69029L9991
$$ -159211 -448059 -264020 -163216 -104609 -385153 -571240 -651141 -578997 -209968 -169977
12622a69977L183M90000o1401k80826l48327J35329K71963j02784J85107j26k39799
$$ -169977 -166794 323206 261805 -19021 -367348 -232019 39944 -62840 122267 122141 -117658
12611a17658J45390J41151J62220K16357n69354L04552L99283m51510n4701J01919
$$ -117658 27732 168883 331103 547460 -21894 282658 681941 230431 175730 277649
12601B77649k14301p5395j36941K40920K282J91421o21044J88141L35859R0665
$$ 277649 63348 -12047 -148988 91932 94214 285635 -335409 -147268 188591 279256
12591B79256o48145m39239M27824N12169n8763l62034P6953J03722M08968K05133
$$ 279256 -368889 -808128 -380304 131865 73102 -288932 -211979 -108257 300711 505844
12581E05844k47589n02740m30935K44174J15062L08732j21942K9596j47695N5187
$$ 505844 258255 -244485 -675420 -431246 -316184 -7452 -129394 -99798 -247493 -192306
12571a92306M8659l72522J88823K33639J56451P5408Q8917k40222R650Q8580j08184
$$ -192306 -143647 -516169 -327346 -93707 62744 138152 227069 -13153 -3503 85077 -23107
12560b3107r7687k27356l613N6391K96989k18667j76534L94119k36771m2884K88975
$$ -23107 -120794 -348150 -351763 -295372 1617 -217050 -393584 535 -236236 -279120 9855
12549I855L29548k83808p8303M506J3407O1392J15568j93059o7229p0673K52816
$$ 9855 339403 55595 -22708 -18202 -4795 56597 172165 -20894 -88123 -158796 94020
12538I4020n8656q6651M23074K9762k11627K5164l69677Q8783O85951o7606l68751
$$ 94020 35364 -51287 371787 401549 189922 215086 -154591 -65808 620143 552537 183786
12527A83786l4689n2791J86447l3295K3406J39770m01914K54156p9533k14637
$$ 183786 149097 96306 282753 249458 272864 412634 10720 264876 185343 -29294
12517b9294K24740k21508l50751n0176M54091Q4805k38170m324j31010m82444
$$ -29294 195446 -26062 -376813 -426989 27102 111907 -126263 -130587 -261597 -744041
12507g44041L07919L16563k41645k07504j06981M39821M17597l64665j91681k5659
$$ -744041 -436122 -119559 -361204 -568708 -675689 -235868 181729 -182936 -374617 -400276
12497d00276K44382K10267l4867J53740N5048r6428P4369k27420q1776l7536p715
$$ -400276 -155894 54373 19506 173246 228294 131866 206235 -21185 -102961 -140497 -148212
12486a48212K36171k58912l40928J0099q9786N01963J78562J61559m0782n8622
$$ -148212 87959 -170953 -511881 -501782 -591568 -89605 88957 250516 209734 151112
12476A51112l81234J65279k70520j99293N67355L24174j01276R2200K59278l61264
$$ 151112 -230122 -64843 -335363 -534656 32699 356873 255597 347797 607075 245811
12466B45811J31545j9038j84963l10693J03023n71506K91546K29432j90913p9995
$$ 245811 377356 358318 173355 -137338 -34315 -605821 -314275 -84843 -275756 -355751
12456c55751o1240l15330l5873N13801j22682K95400J53600o388l39107j04839
$$ -355751 -416991 -732321 -768194 -254393 -377075 -81675 71925 65537 -273570 -378409
12446c78409J02082o9935M35923L3947J70398m1811j47604k27742j44726L50684
$$ -378409 -276327 -346262 89661 123608 294006 252195 104591 -123151 -267877 82807
12436H2807j82148j54615P4089K81108K99291m07845m68366L18612p786J06833
$$ 82807 -99341 -253956 -179867 101241 400532 -7313 -475679 -157067 -164853 -58020
12426e8020J09204L668L5620J85942l89476J64340K62169l83575J7884j61528
$$ -58020 51184 54852 90472 276414 -113062 51278 313447 -70128 -52244 -213772
12416b13772J55954J37617p1228m2426j10479j55180N58703K0533j598P5400p1681
$$ -213772 -57818 79799 8571 -33855 -144334 -299514 259189 279722 278124 353524 281843
12405B81843n8181m21386k42609L61950n73032N9033N86367J76333P3405N4428
$$ 281843 223662 -197724 -440333 -78383 -651415 -592382 -6015 170318 243723 298151
12395B98151l04467k48378k11860L22022R6994j55443k99638L6505J91143J36878
$$ 298151 -6316 -254694 -466554 -144532 -47538 -202981 -502619 -466114 -274971 -138093
12385a38093L55461N6094j61822j35885k018K02577L52155l34119m20602K4279
$$ -138093 217368 273462 111640 -24245 -26263 176314 528469 194350 -226252 -201973
12375b01973O6782J41475j07323J42228R8273l21322P349j76355j53143K90301
$$ -201973 -135191 6284 -101039 41189 139462 -181860 -174511 -350866 -504009 -213708
12365b13708l30287P32088M56876k02521m65787l4181J55247q6696r7585L9402
$$ -213708 -543995 188093 644969 442448 -23339 -57520 97727 11031 -86554 -47152
12355d7152J36106r4374N6694J92068n09742J5224J12764j02001M2313l1265P3461
$$ -47152 88954 -5420 51274 243342 -266400 -251176 -138412 -240413 -198100 -229365 -155904
12344a55904m71345K5028M24634M00236j66474j65549L04156P1593j06076J90311
$$ -155904 -627249 -602221 -177587 222649 56175 -109374 194782 266375 160299 350610
12334C50610m89266O1016r4614K14122k67928K44055J01101Q3802q0319J53470
$$ 350610 -138656 -77640 -172254 41868 -226060 17995 119096 202898 122579 276049
12324B76049p1556l3367j77464L5950k92688j21536L60600m8381j77695K52710
$$ 276049 204493 171126 -6338 29612 -263076 -384612 -24012 -72393 -250088 2622
12314B622j81014K88376L93688k05339m77335l48243K99589K42508J34429j34935
$$ 2622 -178392 109984 503672 298333 -179002 -527245 -227656 14852 149281 14346
12304A4346n25161J50651K82015j29253R1184j85220R4331J40195J8971o9754
$$ 14346 -510815 -360164 -78149 -207402 -116218 -301438 -207107 -66912 -47941 -117695
12294a17695l4949J57399j90115j46541J95858L6330k80356J43041L05820P9294
$$ -117695 -152644 4755 -185360 -331901 -136043 -99713 -380069 -237028 68792 148086
12284A48086l51604R2551k1206l69240L35322K66911P5360L69053q560k20004
$$ 148086 -203518 -110967 -132173 -501413 -166091 100820 176180 545233 536673 316669
12274C16669j07825k86818n3316J2699J09775K53987K0466k76574J8854J01777
$$ 316669 208844 -77974 -131290 -118591 -8816 245171 265637 -10937 7917 109694
12264A09694K4569j87723o6904j90266J00761k08154L82201O9472p9255j00998
$$ 109694 134263 -53460 -120364 -310630 -209869 -418023 -35822 33650 -45605 -146603
12254a46603O1546J50726j62028O5054M23353k87067n22800M19992L88984m81883
$$ -146603 -85057 65669 -96359 -31305 392048 104981 -417819 2173 391157 -90726
12244i0726Q678J80657l35455o7989O7321N16368j71402k89977Q4049j5146m6760
$$ -90726 -82048 98609 -236846 -304835 -237514 278854 107452 -182525 -98476 -113622 -160382
12233a60382L9951J20065l19929R0026K82887j34365r946L82374n5346n7497j73282
$$ -160382 -120431 -366 -320295 -230269 52618 -81747 -91693 290681 235335 177838 4556
12222D556j78605Q8507j5584J61515N8363l04820R0987n7797J20488j88590k01199
$$ 4556 -174049 -85542 -101126 60389 118752 -186068 -95081 -152878 -32390 -220980 -422179
12211d22179o6517L06186L62743J62691J44582j83640k63941j70163K66618J2835
$$ -422179 -488696 -182510 180233 342924 487506 303866 39925 -130238 136380 149215
12201A49215k52687L98465m18398l07373J40429j31388J54842J69661L99186m3935
$$ 149215 -103472 294993 -123405 -430778 -290349 -421737 -266895 -97234 301952 258017
12191B58017L2583R9440k06400j54900J03784j45639J36307m110j82015M6797
$$ 258017 290600 390040 183640 28740 132524 -13115 123192 119082 -62933 -16136
12181a6136J69870j26173k31150l3274m34836L90712K49682m7897J22731j35950
$$ -16136 153734 27561 -203589 -236863 -671699 -280987 -31305 -79202 43529 -92421
12171i2421P8636J19784k3737l14166k97099J3813K82050j65524Q0097K77282
$$ -92421 -13785 105999 82262 -231904 -529003 -515190 -233140 -398664 -318567 -41285
12161d1285j75728l99870j4137K48393K85650K39132j22496J78179J41343L19407
$$ -41285 -217013 -616883 -631020 -382627 -96977 142155 19659 197838 339181 658588
12151F58588l42586n54481R8457J27136J75180Q3935n67336l69165O73157N56466
$$ 658588 316002 -238479 -140022 -12886 162294 246229 -321107 -690272 -17115 539351
12141E39351n8594o52701L77502L8087K47583l65556j09902N55414k67716o68213
$$ 539351 480757 -171944 205558 243645 491228 125672 15770 571184 303468 -364745
12131c64745J65975K69558P8638j38266J39485k20713J6340L044j9107N6562J6502
$$ -364745 -198770 70788 149426 11160 150645 -70068 -53728 -50684 -69791 -13229 3273
12120C273p2143J07263l6922l92998j37813L33317O81081l18023J09583R3558
$$ 3273 -68870 38393 1471 -391527 -529340 -196023 485058 167035 276618 370176
12110C70176j14099k61765K54537K80194l37994m41070J47565M08237j9969k81557
$$ 370176 256077 -5688 248849 529043 191049 -250021 -102456 305781 285812 4255
12100D255L77847k10177L08046j02550j1981l39666L754J69198j63374K48959
$$ 4255 382102 171925 479971 377421 365440 25774 29528 198726 35352 284311
12090B84311o8262J07114J42226O1710K5699k49055J3766j67498J56462M0418
$$ 284311 216049 323163 465389 527099 552798 303743 317509 150011 306473 346891
12080C46891l20525J85966K71491J52146K1467k17008l07120N84252L35083J6531
$$ 346891 26366 212332 483823 635969 657436 440428 133308 717560 1052643 1069174
12070A069174k80247K10799l4310K60837j20804j5797K40960K01578M20027J79034
$$ 1069174 788927 999726 965416 1226253 1105449 1089652 1330612 1532190 1952217 2131251
12060B131251l71536n88935M9734N2955j96529K71734k35901k40763j3634l27067
$$ 2131251 1759715 1170780 1220514 1273469 1076940 1348674 1112773 872010 858376 531309
12050E31309l05277k40019K33714o4505j16481J39430J20406N4693j10257n4822
$$ 531309 226032 -13987 219727 155222 38741 178171 298577 353270 243013 188191
12040A88191L02064j39605l16994j46467m0755K4917k85734J85842J45783l69946
$$ 188191 490255 350650 33656 -112811 -153566 -128649 -414383 -228541 -82758 -452704
12030d52704k57718K47194J11128J96137J29299K8028N34383L9979p58779R8480
$$ -452704 -710422 -463228 -352100 -155963 -26664 1364 535747 575726 -183053 -84573
12020h4573J26070k31132K30875L1480P3419p0935m66002J25015K56267l0902
$$ -84573 41497 -189635 41240 72720 146139 75204 -390798 -265783 -9516 -40418
12010d0418J65338m2236j37007l83324R2413K65477j97457j03068K26692Q4119
$$ -40418 124920 82684 -54323 -437647 -345234 -79757 -277214 -380282 -153590 -69471
12000f9471j75792j69599K62856k47348J74220K91729Q0781j43445j30961J96076
$$ -69471 -245263 -414862 -152006 -399354 -225134 66595 147376 3931 -127030 69046
11990F9046P259k7234K27457L4572k97911M0803p018j238k38J3966O06650j21690
$$ 69046 76305 49071 276528 311100 13189 53992 46974 45736 45498 59464 666114 544424
11978E44424n17464N9594J54144j38621n2053K02943P8104j7115l93786r3064
$$ 544424 26960 86554 240698 102077 50024 252967 331071 313956 -79830 -172894
11968a72894M9269l1021J12120L52178K28575l51049R799K28666l16302L15858
$$ -172894 -123625 -154646 -42526 309652 538227 187178 196977 425643 109341 425199
11958D25199J27384l34833N08633O3870n03199J51478M34465M5591N3622K23076
$$ 425199 552583 217750 726383 790253 287054 438532 872997 918588 972210 1195286
11948A195286K84532k12156M7526k56889k72473k58881K93077K77408l41986j54151
$$ 1195286 1479818 1267662 1315188 1058299 785826 526945 820022 1097430 755444 601293
11938F01293q8298q27L20752n76952j84476L26156j30427k7287J7284P8486q9388
$$ 601293 512995 512168 832920 255968 71492 397648 267221 239934 257218 335704 246316
11927B46316O7348J388K1121l36413J42596K74428J62301J90035l47046p2061
$$ 246316 313664 315052 336173 -240 142356 416784 579085 769120 422074 350013
11917C50013L55935J38695J74679L844L43686Q3922L44921j72547o5018J57660
$$ 350013 705948 844643 1019322 1023166 1366852 1450774 1795695 1623148 1558130 1715790
11907A715790k73361o36102J62605j58716L17915k40394k12874k70378l03792
$$ 1715790 1442429 806327 968932 810216 1128131 887737 674863 404485 100693
11898A00693J28560j48741J39758o406L10809j2154m51849j76692K94582r324
$$ 100693 229253 80512 220270 213864 524673 512519 60670 -116022 178560 169236
11888A69236j30770N3209n5763j39485K77157j83991j16258L0907k9813l1720
$$ 169236 38466 91675 35912 -103573 173584 -10407 -126665 -95758 -125571 -157291
11878a57291l48239P56K36181L79463M12166l99881m13844J78960K77557J83964
$$ -157291 -505530 -504774 -268593 110870 523036 123155 -290689 -111729 165828 349792
11868C49792L00415l15645n7801o29823K78260K06510j04517m30266m8728J57886
$$ 349792 650207 334562 276761 -353062 -74802 131708 27191 -403075 -451803 -293917
11858b93917k8704N77663J0318p2900j05291r5726J64735J13335K3501N8942k61424
$$ -293917 -322621 255042 265360 192460 87169 -8557 156178 269513 293014 351956 90532
11847I0532j03113l36006K61125J62385J34228j60290J94367j01375M8778o3663
$$ 90532 -12581 -348587 -87462 74923 209151 48861 243228 141853 190631 126968
11837A26968l25436M81111j42358j5432j72187J1292O0400q9395j95457k9945
$$ 126968 -198468 282643 140285 124853 -47334 -36042 24358 -65037 -260494 -290439
11827b90439J92036K39181j68346q6064N21034j21014n8202k04499j96147K10710
$$ -290439 -98403 140778 -27568 -113632 407402 286388 228186 23687 -172460 38250
11817C8250J70110l03889K29783M1847O703j20430l12410K41168J34547m3910
$$ 38250 208360 -95529 134254 176101 182804 62374 -250036 -8868 125679 81769
11807H1769J11058l08894l9970J42310Q9915k38302l6299M42601j39266l06190
$$ 81769 192827 -116067 -156037 -13727 76188 -162114 -198413 244188 104922 -201268
11797b01268n821K86459l08478P9440K27620q4636k33794l0786j79962o5365n6168
$$ -201268 -207089 79370 -229108 -149668 77952 -6684 -240478 -271264 -451226 -516591 -572759
11786e72759K45466K63J5776r875L63945J31696m14677J67716l02816O9242P15727
$$ -572759 -327293 -327030 -311254 -321129 42816 174512 -240165 -72449 -375265 -306023 409704
11775D09704J04771l09764J61531j45005l68936K44199L30718l19881j11727J06752
$$ 409704 514475 204711 366242 221237 -147699 96500 427218 107337 -4390 102362
11765A02362k97497J24534J9713j81658J67220J65334J51725k00068j99897R8622
$$ 102362 -195135 -70601 -50888 -232546 -65326 100008 251733 51665 -148232 -49610
11755d9610J95564K407j28966n19073k93419L25973L44746J73523j20866M68814
$$ -49610 145954 148361 19395 -499678 -793097 -467124 -122378 51145 -69721 399093
11745C99093j30231j26187m34859J27673K60961j91832j02988M30946J90820k51491
$$ 399093 268862 142675 -292184 -164511 96450 -95382 -198370 232576 423396 171905
11735A71905m34719p0961J63507K0982j32045K28976N8906o4907J4605l35574
$$ 171905 -262814 -333775 -170268 -149286 -281331 -52355 6551 -58356 -43751 -379325
11725c79325k82954L36490J55382l46536K78657l5333K92559N9567l58343m8131
$$ -379325 -662279 -325789 -170407 -516943 -238286 -273619 18940 78507 -279836 -327967
11715c27967j08311j49610L94979n3927o0299K76265j39409K62804K44385l45930
$$ -327967 -436278 -585888 -190909 -244836 -305135 -28870 -168279 94525 338910 -7020
11705g020j22041l25758Q2264Q7175J66766j99723l70025l75295N95561j3045
$$ -7020 -129061 -454819 -372555 -285380 -118614 -318337 -688362 -1063657 -468096 -481141
11695d81141r53R5598M68604j22528j05518N25006l08569m07547J63632L78021
$$ -481141 -482094 -386496 82108 -40420 -145938 379068 70499 -337048 -173416 204605
11685B04605k21198j64687K24434k27696K12315K7699k06857K70410J54266k8995
$$ 204605 -16593 -181280 43154 -184542 27773 55472 -151385 119025 273291 244296
11675B44296m57736l2073L41244M92848j98539l16496k24462L58884j3897O6346
$$ 244296 -213440 -245513 95731 588579 390040 73544 -150918 207966 194069 260415
11665B60415q1298l29028j36878R4515J57652O9582J40776k65565j78760J24152
$$ 260415 179117 -149911 -286789 -192274 -34622 34960 175736 -89829 -268589 -144437
11655a44437K27706r8020j84017N8227O6347K69177L74219J29462j92678m53325
$$ -144437 83269 -14751 -198768 -140541 -74194 194983 569202 698664 505986 52661
11645E2661j97175O5958K1426j15612j59310j43240L4780O02151P8154k93412
$$ 52661 -144514 -78556 -57130 -172742 -332052 -475292 -440512 161639 239793 -53619
11635e3619J89714R4486k55308L63659J18009J13645k53893o50942L28185J17832
$$ -53619 136095 230581 -24727 338932 456941 570586 316693 -334249 -6064 111768
11625A11768l56535m28502q7831Q40619j8549k20616J95630j55214L60610j30755
$$ 111768 -244767 -673269 -761100 79519 60970 -159646 35984 -119230 241380 110625
11615A10625j13272L12152k21296k33688j61717m3392j074J29051M9945j23346
$$ 110625 -2647 309505 88209 -145479 -307196 -350588 -351662 -222611 -172666 -296012
11605b96012L02356k59730j18200K53529O05431K05097k25201k87537j47360J71923
$$ -296012 6344 -253386 -371586 -118057 487374 692471 467270 179733 32373 204296
11595B04296k44385J90046l2722k21668j84825k37467J42685J3576L3818L06951
$$ 204296 -40089 149957 117235 -104433 -289258 -526725 -384040 -370464 -336646 -29695
11585b9695L31467l37626k04526J38896j43661K14588M53046j59472j25051j35796
$$ -29695 301772 -35854 -240380 -101484 -245145 -30557 422489 263017 137966 2170
11575B170K16335j00555k61174j0918P8269K90753O1146k77138j10388K34309
$$ 2170 218505 117950 -143224 -154142 -75873 214880 276026 -1112 -111500 122809
11565A22809q9451j90582J21578P2741n63068L75669O2579k62702J60477J25060
$$ 122809 33358 -157224 -35646 37095 -525973 -150304 -87725 -350427 -189950 -64890
11555f4890l68990J50932L41299N10647j01979K7430j5774m44132n9556Q4550
$$ -64890 -433880 -282948 58351 568998 467019 494449 478675 34543 -25013 59537
11545E9537k45147j9069J80068j59284J12363j27141p0532L60693j02390J62440
$$ 59537 -185610 -204679 -24611 -183895 -71532 -198673 -269205 91488 -10902 151538
11535A51538j62109J46845J05842m37643J66589m37433K99071P6826K39641j9690
$$ 151538 -10571 136274 242116 -195527 -28938 -466371 -167300 -90474 149167 129477
11525A29477M3112L15249k85430m61171J94060J36641J47699m608n69940j8903
$$ 129477 172589 487838 202408 -258763 -64703 71938 219637 215029 -354911 -373814
11515c73814l1021j7565K26601J83873j91035R6735K83833l19941j16973J28541
$$ -373814 -404835 -422400 -195799 -11926 -202961 -106226 177607 -142334 -259307 -130766
11505a30766J95184j15725K16705k9177m6106K22785r7866j89739k7163k35492
$$ -130766 64418 -51307 165398 136221 90115 312900 215034 25295 -1868 -237360
11495b37360J14804J92623k0412m20860K14306J11577m14125Q1977J6650J84187
$$ -237360 -122556 70067 49655 -371205 -156899 -45322 -459447 -377470 -360820 -176633
11485a76633K44029k25763j17175M65888j11541l18696R8975L19058j63799J55845
$$ -176633 67396 -158367 -275542 190346 78805 -239891 -140916 178142 14343 170188
11475A70188O3375j76394j97944J17805j18106L79255j4348k22471J66428Q0541
$$ 170188 233563 57169 -140775 -22970 -141076 238179 223831 1360 167788 248329
11465B48329l1449P3034J76067p99603n83175L26532L9296K79005L72266j7134
$$ 248329 216880 289914 465981 -333622 -916797 -590265 -550969 -271964 100302 83168
11455H3168j14991j46526O713L17725K00964m65347R5214J05233q5244J44914
$$ 83168 -31823 -178349 -171636 146089 347053 -118294 -23080 82153 -3091 141823
11445A41823n9227j23657n5912J16466n24438L46220N22868k5780J12288l76781
$$ 141823 82596 -41061 -96973 19493 -504945 -158725 364143 338363 450651 73870
11435G3870P9519J75424O7620n41521N7464L03804J60308l26222j43236k33616
$$ 73870 153389 328813 396433 -145088 -87624 216180 376488 50266 -92970 -326586
11425c26586j39456L08023k00726K27003K62496j98809l8029K44522K41746m6070
$$ -326586 -466042 -158019 -358745 -131742 130754 -68055 -106084 138438 380184 334114
11415C34114R6584K7790p9606l95022j96740J60855K56589j62680m7148k53589
$$ 334114 430698 458488 378882 -16140 -212880 -52025 204564 41884 -5264 -258853
11405b58853J13498N1002K50549M0278l97372J90633O2476K68947j44827k2640
$$ -258853 -145355 -94353 156196 196474 -200898 -10265 52211 321158 176331 153691
11395A53691n3081J0279J8838l1868Q2070P5330m71579K37854P9698j27862N26123
$$ 153691 100610 110889 129727 97859 179929 255259 -216320 21534 101232 -26630 499493
11384D99493K41211l34624j93882R1996j35507k29432K62917k54449j91134J04105
$$ 499493 740704 406080 212198 304194 168687 -60745 202172 -52277 -243411 -139306
11374a39306O68916j23010m09839J2206j19585R2629n3515n4189k57143N43358
$$ -139306 529610 406600 -3239 8967 -110618 -17989 -71504 -125693 -382836 160522
11364A60522K89717K5570L5430k44629L18763k65513m07716M938L36657l15394
$$ 160522 450239 475809 511239 266610 585373 319860 -87856 -82918 253739 -61655
11354f1655J86530K49962J83509L29842k23738k15845q3211l91267L0167K34758
$$ -61655 124875 374837 558346 888188 664450 448605 365394 -25873 4294 239052
11344B39052J0894k75164l41017O78925j74771M67473m1052j11429l1838K466
$$ 239052 249946 -25218 -366235 312690 137919 605392 564340 452911 421073 423539
11334D23539l12269J00046o5735r2838L1152J21258J11511j68722l33558L85841
$$ 423539 111270 211316 145581 52743 83895 205153 316664 147942 -185616 200225
11324B00225P6922j66598J46096j39929J17246m37356K39994j67008J47289k09210
$$ 200225 277147 110549 256645 116716 233962 -203394 36600 -130408 16881 -192329
11314a92329l5407p6004J8039K69779O2927K6737j23659K1208R8033J29922L41026
$$ -192329 -227736 -303740 -285701 -15922 47005 73742 -49917 -28709 69324 199246 540272
11303E40272J31210m12070l6790J7814K7214P4064k36361L11184N2402K28632
$$ 540272 671482 259412 222622 240436 267650 341714 105353 416537 468939 697571
11293F97571j45676m52923K81634m3339Q2459J85710l04079j40944j11093j70343
$$ 697571 551895 98972 380606 337267 419726 605436 301357 160413 49320 -121023
11283a21023N038n6869Q637N75424j28718l40524L56028J49723j98490R7728J83278
$$ -121023 -115985 -172854 -164217 411207 282489 -58035 297993 447716 249226 346954 530232
11272E30232j7421j01707l0602m6809k43887j39263K89435L40585k53858l41699
$$ 530232 512811 411104 380502 333693 89806 -49457 239978 580563 326705 -14994
11262a4994J53830J89027l48086J63669l7200J32409o3760j58252k21005K09290
$$ -14994 138836 327863 -20223 143446 106246 238655 174895 16643 -204362 4928
11252D928K51478l2889j66136j99158l3824J29632K56397K53952k02449j85502
$$ 4928 256406 223517 57381 -141777 -175601 -45969 210428 464380 261931 76429
11242G6429J51357k1258Q8038r2002K15290j23541p99162L39471N70272K87817
$$ 76429 227786 206528 294566 202564 417854 294313 -504849 -165378 404894 692711
11232F92711k54049j99769j55401j71931j60113m126K23949j26342J90211l88668
$$ 692711 438662 238893 83492 -88439 -248552 -252678 -28729 -155071 35140 -353528
11222c53528J96336K01143j23047k36963K39462M55882J49914K40564k89464k86007
$$ -353528 -157192 43951 -79096 -316059 -76597 379285 529199 769763 480299 194292
11212A94292r3873K82825k24343P1331K8698l5512j29834l5021m6663M35707J72718
$$ 194292 100419 383244 158901 230232 258930 223418 93584 58563 11900 447607 620325
11201F20325J6959J8907o20352J98606j48108J24809J21325o3449J45936Q0733
$$ 620325 637284 656191 35839 234445 86337 211146 332471 269022 414958 495691
11191D95691j61349J96177K3837l39283l2676k59776L9217K87737j57876O3696
$$ 495691 334342 530519 554356 215073 182397 -77379 -38162 249575 91699 155395
11181A55395L62411l00821j46502Q6763k8652K2619J82530k75434k15434J22686
$$ 155395 517806 216985 70483 157246 128594 151213 333743 58309 -157125 -34439
11171c4439J84391K80281j15324j27543q9559J55364j22173j7220j03990l44234
$$ -34439 149952 430233 314909 187366 97807 253171 130998 113778 9788 -334446
11161c34446K28941K2270o6033K41171J11284k94257k68317L49886L87919J38207
$$ -334446 -105505 -83235 -149268 91903 203187 -91070 -359387 -9501 378418 516625
11151E16625p1491j73347N0438L64579k68773k1370m8199k32187j66635Q4969
$$ 516625 445134 271787 322225 686804 418031 396661 348462 116275 -50360 34609
11141C4609m15832K3762M9580O28449j13121k28475j74273j54734M12379J22606
$$ 34609 -381223 -357461 -307881 320568 207447 -21028 -195301 -350035 62344 184950
11131A84950j64546K22583J01193o5938j91856J9733M48050l06977j74745j1030
$$ 184950 20404 242987 344180 278242 86386 106119 554169 247192 72447 61417
11121F1417J13499J68595M49755K5856q0948o8464J1313n3102J0475k48652j44112
$$ 61417 174916 343511 793266 819122 738174 669710 681023 627921 638396 389744 245632
11110B45632j8684k48665J01122K16425K97260j87592R6406k12828l42274K98918
$$ 245632 226948 -21717 79405 295830 593090 405498 501904 289076 -53198 245720
11100B45720K27712J12294k2928q9738m74833J42139J78124O2594k93481L41278
$$ 245720 473432 585726 562798 473060 -1773 140366 318490 381084 87603 428881
11090D28881K42604n1875K44920K465l80634M2648j95425K11286n765k30468Q8954
$$ 428881 671485 619610 864530 866995 486361 529009 333584 544870 539105 308637 397591
11079C97591j31620k81756J22230M90024j09313j87242K22743J01321l6205k20766
$$ 397591 265971 -15785 106445 596469 487156 299914 522657 623978 587773 367007
11069C67007K5440R1195l31076J19804J68778q5156M75460o2418j3650j09416
$$ 367007 392447 483642 152566 272370 441148 355992 831452 769034 755384 645968
11059F45968k38529O7633K11863K76091j65773k91158J41142o3870o79058K68420
$$ 645968 407439 475072 686935 963026 797253 506095 647237 583367 -95691 172729
11049A72729K27893M8308L53429j17788j23098n6834k43276j7714K42711J33944
$$ 172729 400622 448930 802359 684571 561473 504639 261363 243649 486360 620304
11039F20304j75672k12724M43821j03294J05407K1018o3945j62169k7269N9456
$$ 620304 444632 231908 675729 572435 677842 698860 634915 472746 445477 504933
11029E04933k31359J76394p5132K00899j60883j322M50673J15754p47432K89699
$$ 504933 273574 449968 374836 575735 414852 413530 864203 979957 232525 522224
11019E22224j7161R2154n0768K05028K51585l56194k91802J4254J81302k75661
$$ 522224 505063 597217 546449 751477 1003062 646868 355066 369320 550622 274961
11009B74961K97341P8905J04049J47988k04516Q1111q0767J04317L92684k17467
$$ 274961 572302 651207 755256 903244 698728 779839 699072 803389 1196073 978606
10999I78606q9073m22589l20439L44748L73976j63356j20317p1718r2819J73089
$$ 978606 889533 466944 146505 491253 865229 701873 581556 509838 417019 590108
10989E90108j10340K56253Q4621M2337k11966p430j69227M0091J07670N15432
$$ 590108 479768 736021 820642 862979 651013 643583 474356 514447 622117 1137549
10979A137549j01361m59932n908K44504j19803K98614j0132o72382O9489J53543
$$ 1137549 1036188 576256 570348 814852 695049 993663 983531 311149 380638 534181
10969E34181j29712J37513K39577L038L7596o1802R1355R465k23140K3994K03405
$$ 534181 404469 541982 781559 784597 822193 760391 851746 861211 638071 662065 865470
10958H65470q4822j99764N9145j07350l6685L4289j40335O86445j58493k94516
$$ 865470 780648 580884 640029 532679 495994 530283 389948 1076393 917900 623384
10948F23384m8829K70107k61237l3138J25498M07794j54334n12656J61253K31751
$$ 623384 574555 844662 583425 550287 675785 1083579 929245 416589 577842 809593
10938H09593l71624k50224M30531L41107J03984M01400k42301j52487m68763J63927
$$ 809593 437969 187745 618276 959383 1063367 1464767 1222466 1069979 601216 765143
10928G65143N09269k55830k56141j49019M4588K48421K71196p1274n5835k24046
$$ 765143 1274412 1018582 762441 613422 658010 906431 1177627 1106353 1050518 826472
10918H26472l72084L0017J68355N5518L27730j52613p095K38912l685j89207L8394
$$ 826472 454388 484405 652760 708278 1036008 883395 876300 1115212 1111527 922320 960714
10907I60714k09650J4822L53515M3286j44867L83211k42467p3421j92703K05308
$$ 960714 751064 765886 1119401 1162687 1017820 1401031 1158564 1085143 892440 1097748
10897A097748O44464k87609l11305K41474o705J03870j81395J11619L82948J23800
$$ 1097748 1742212 1454603 1143298 1384772 1378067 1481937 1300542 1412161 1795109 1918909
10887A918909j33736J4797k37263k51112L71579j63910o74084j43738P4656K19735
$$ 1918909 1785173 1799970 1562707 1311595 1683174 1519264 845180 701442 776098 995833
10877I95833J58013m71352N90593M01642L2730n10472l05536K75898L81718J54487
$$ 995833 1153846 682494 1273087 1674729 1707459 1196987 891451 1167349 1549067 1703554
10867A703554m17831n5866K40518m1927r0688j56061L90012j10534o6824N74561
$$ 1703554 1285723 1229857 1470375 1428448 1337760 1181699 1571711 1461177 1394353 1968914
10857A968914k49033N1663K61519l61296k32549M41460j80545R9314j90006J60067
$$ 1968914 1719881 1771544 2033063 1671767 1439218 1880678 1700133 1799447 1609441 1769508
10847A769508o3676K48746L2298j50389R8027j77137j32323q65049K9514K31661
$$ 1769508 1705832 1954578 1986876 1836487 1934514 1757377 1625054 760005 789519 1021180
10837A021180K53397L95447j11253j48722o4329j12440K00849L2547k98671J84541
$$ 1021180 1274577 1670024 1558771 1410049 1345720 1233280 1434129 1466676 1168005 1352546
10827A352546J70230J99158n06101K89705J06142o34466j54845J55110Q5243j25944
$$ 1352546 1522776 1721934 1215833 1505538 1611680 977214 822369 977479 1062722 936778
10817I36778M72886L3413q9484J62722J19466n23548j42893l288M51346l59626
$$ 936778 1409664 1443077 1353593 1516315 1635781 1112233 969340 966052 1417398 1057772
10807A057772N2913j1836M2377j95666L53510L08977j12411Q5762j38775l5458
$$ 1057772 1110685 1098849 1141226 945560 1299070 1608047 1495636 1581398 1442623 1407165
10797A407165o4028M2611O1945k36206k20593n0350p9629M26993M25697p6674
$$ 1407165 1343137 1385748 1447693 1211487 990894 940544 860915 1287908 1713605 1636931
10787A636931l90226J33774k9957J90169m80347J98046N6788L3826j68971n0319
$$ 1636931 1246705 1380479 1350522 1540691 1060344 1258390 1315178 1349004 1180033 1129714
10777A129714L63323L33727j60857l46245L39550j67570K86082J9204Q9280L00627
$$ 1129714 1493037 1826764 1665907 1319662 1659212 1491642 1777724 1796928 1886208 2186835
10767B186835j9398n16522P4605k8278j46451j25533K11849r7454L08647j60464
$$ 2186835 2167437 1650915 1725520 1697242 1550791 1425258 1637107 1539653 1848300 1687836
10757A687836k80218j5471J48965L06693k08251M21895K4260L7647l44291l26242
$$ 1687836 1407618 1392147 1541112 1847805 1639554 2061449 2085709 2123356 1779065 1452823
10747A452823j22888j89163L30555L81977N4231L1699L587J33574J50815k24251
$$ 1452823 1329935 1140772 1471327 1853304 1907535 1939234 1942821 2076395 2227210 2002959
10737B002959K4800k17507j42940L85592K80519K3149l06497j17914O0119L39877
$$ 2002959 2027759 1810252 1667312 2052904 2333423 2356572 2050075 1932161 1992280 2332157
10727B332157k6928k20817l75421K76027Q3475J63855j03411k29238J20662J23728
$$ 2332157 2305229 2084412 1708991 1985018 2068493 2232348 2128937 1899699 2020361 2144089
10717B144089m14540l04087j34315K21360J51630L55560J57274n20384m4141L22232
$$ 2144089 1729549 1425462 1291147 1512507 1664137 2019697 2176971 1656587 1612446 1934678
10707A934678K35568L10615j09517k66278L39268K0369k48204k07003J51965J2458
$$ 1934678 2170246 2480861 2371344 2105066 2444334 2464703 2216499 2009496 2161461 2173919
10697B173919P037j46927J60951M02061K13985m4937J58819j28311k03850J63719
$$ 2173919 2180956 2034029 2194980 2597041 2811026 2766089 2924908 2796597 2592747 2756466
10687B756466k15616j64533L9516L51202j77598J81431J60438l12303J35452K87648
$$ 2756466 2540850 2376317 2415833 2767035 2589437 2770868 2931306 2619003 2754455 3042103
10677C042103q002L53452k25670p3708j33751K21978L63337P5747J26015j84725
$$ 3042103 3034101 3387553 3161883 3088175 2954424 3176402 3539739 3615486 3741501 3556776
10667C556776k04018L79548P3926k11532J56335k17484J50534j47652j24314j98996
$$ 3556776 3352758 3732306 3806232 3594700 3751035 3533551 3684085 3536433 3412119 3213123
10657C213123K92123J69978M4632K2881J35039j10090N1807K54276j8307L4601
$$ 3213123 3505246 3675224 3719856 3742737 3877776 3767686 3819493 4073769 4055462 4090063
10647D090063J08031Q549J21806m09805K2522J53409K95206J80205l35601P3868
$$ 4090063 4198094 4206643 4328449 3918644 3941166 4094575 4389781 4569986 4234385 4308253
10637D308253K73655k38711l09638N91255L91565K96672J07201o8640j00590J44847
$$ 4308253 4581908 4343197 4033559 4624814 5016379 5313051 5420252 5351612 5251022 5395869
10627E395869L17874K05468l8634K36019J62055L28425j63120l60686J92554O0115
$$ 5395869 5713743 5919211 5880577 6116596 6278651 6607076 6443956 6083270 6275824 6335939
10617F335939k3711m34481N5108J71982j77661J39049L39520j00516J75150n8891
$$ 6335939 6312228 5877747 5932855 6104837 5927176 6066225 6405745 6305229 6480379 6421488
10607F421488n5824Q1431j75102l8607j91731L72843P98219j19062J96991n0959
$$ 6421488 6365664 6447095 6271993 6233386 6041655 6414498 7212717 7093655 7290646 7239687
10597G239687j48938j3491L58369J54198L71945L03719k26991N73711P2857r8656
$$ 7239687 7090749 7077258 7435627 7589825 7961770 8265489 8038498 8612209 8685066 8586410
10587H586410K75047P4926L93690K80677L09916J42290k40610M35539K29408L90184
$$ 8586410 8861457 8936383 9330073 9610750 9920666 10062956 9822346 10257885 10487293 10877477
10577A0877477L74072r9169P53802L36046k57483K43311J137548L97214l59011
$$ 10877477 11251549 11152380 11906182 12242228 11984745 12228056 13365604 13762818 13403807
10568A3403807N11795Q89869P25959R51840O32203N49112J146616J064838J053443
$$ 13403807 13915602 14805471 15531430 16483270 17115473 17664585 18811201 19876039 20929482
10559B0929482P04855O38283J094713J870061J054422J099788J897986J764829
$$ 20929482 21634337 22272620 23367333 25237394 26291816 27391604 29289590 31054419
10551C1054419K021230K060971K561180K414802L409298M207683M081079M760440
$$ 31054419 33075649 35136620 37697800 40112602 43521900 47729583 51810662 56571102
10543E6571102N154714N932205O195791P386284Q199485R096651R460317R882361
$$ 56571102 61725816 67658021 73853812 81240096 89439581 98536232 107996549 117878910
10535A17878910R823040R794594Q299549N180582M041749L037305N15692k821053
$$ 117878910 127701950 137496544 145796093 150976675 155018424 158055729 158571421 155750368
10527A55750368n498325o921303o529495o270603q223141p972942o503367m969521
$$ 155750368 150252043 143330740 136801245 130530642 122307501 114334559 107831192 102861671
10519A02861671l606572k332336j476308j114851m35497M171O48333J465585K098142
$$ 102861671 99255099 96922763 95446455 94331604 93896107 93900278 94548611 96014196 98112338
10510I8112338K031982K553235L109189L792310M245019N070900N781389O480867
$$ 98112338 100144320 102697555 105806744 109599054 113844073 118914973 124696362 131177229
10502A31177229P530017Q061169P800734Q527885P095536L477544J735119J224757
$$ 131177229 138707246 146768415 154569149 163097034 170192570 173670114 175405233 176629990
10494A76629990j865360n179822o544367r614095r639541r562800j1202286j1465014
$$ 176629990 174764630 169584808 163040441 153426346 143786805 134224005 123021719 111556705
10486A11556705j0335895q524836p294812o648583o179068n407904n019024m223739
$$ 111556705 101220810 92695974 85401162 78752579 72573511 67165607 62146583 57922844
10478E7922844l967471l869700l063903l585370k973302k701272k097477j689542
$$ 57922844 53955373 50085673 47021770 43436400 40463098 37761826 35664349 33974807
10470C3974807j783290j467209j329830j316237j272377r80924j475976j014047
$$ 33974807 32191517 30724308 29394478 28078241 26805864 25824940 24348964 23334917
10462B3334917n40690p45944j290578m18740m20278m53165m70249n32986l02280
$$ 23334917 22794227 22048283 20757705 20338965 19918687 19465522 18995273 18462287 18160007
10453A8160007m67898m01608n22481n36336m88677P7628m27274q48645k45408
$$ 18160007 17692109 17290501 16768020 16231684 15743007 15820635 15393361 14544716 14299308
10444A4299308n7865p02075m60329n88590n50196k78809o47300l78559l4985j90603
$$ 14299308 14241443 13539368 13079039 12490449 11940253 11661444 11014144 10635585 10600600 10409997
10434A0409997l51159n94536R6295L23008l45977J32395j33552m39620l72140
$$ 10409997 10058838 9464302 9560597 9883605 9537628 9670023 9536471 9096851 8724711
10425H724711k19549k23801j57618J38127j59733p4378m75687J41665J01257m46824
$$ 8724711 8505162 8281361 8123743 8261870 8102137 8027759 7552072 7693737 7794994 7348170
10415G348170l24627L48587K25900n01269k92733j05792K50096l28752j40029
$$ 7348170 7023543 7372130 7598030 7096761 6804028 6698236 6948332 6619580 6479551
10406F479551K02100l44688j34452K58552J68629J90682J01101m2108m53044j97076
$$ 6479551 6681651 6336963 6202511 6461063 6629692 6820374 6921475 6879367 6426323 6229247
10396F229247l0660o848L3171k53989j91619J31530n99278Q2129l2602J0314J00102
$$ 6229247 6198587 6191739 6224910 5970921 5779302 5910832 5311554 5393683 5361081 5371395 5471497
10385E471497J26007l15610K78973M6629k57090m3206j48975p6043K17468j89090
$$ 5471497 5597504 5281894 5560867 5607496 5350406 5307200 5158225 5082182 5299650 5110560
10375E110560j40063K19092L34645L03302l99609J03086l74536j02400P5970n2534
$$ 5110560 4970497 5189589 5524234 5827536 5427927 5531013 5156477 5054077 5130047 5077513
10365E077513J33038K57400m5744n71086r2052L42641K99416Q8615o5024o24218
$$ 5077513 5210551 5467951 5422207 4851121 4759069 5101710 5401126 5489741 5424717 4800499
10355D800499l85700J03247j65116K98701K29104j73137j70946k90313j61413
$$ 4800499 4414799 4518046 4352930 4651631 4880735 4707598 4536652 4246339 4084926
10346D084926J31700J6731j85114M60951j20591l18238J59069j55885J57816J90227
$$ 4084926 4216626 4233357 4048243 4509194 4388603 4070365 4229434 4073549 4231365 4421592
10336D421592k80729j28830L35034k53436N78365N0632k1859L31393o5194j05871
$$ 4421592 4140863 4012033 4347067 4093631 4671996 4722628 4700769 5032162 4966968 4861097
10326D861097l25612N41398j14842k04855j497l25646N3050j01353k72619M22605
$$ 4861097 4535485 5076883 4962041 4757186 4755689 4430043 4483093 4381740 4109121 4531726
10316D531726k35928m39286K87833k72017R337K12599k15472j70295j06488M50223
$$ 4531726 4295798 3856512 4144345 3872328 3881665 4094264 3878792 3708497 3602009 4052232
10306D052232O11232l00424j64844k08553J65649o9278l7612K94433n303L39453
$$ 4052232 4663464 4363040 4198196 3989643 4155292 4086014 4048402 4342835 4337532 4676985
10296D676985L56542n30341l78069M5407k82132j33774M559j06125K25249J22407
$$ 4676985 5033527 4503186 4125117 4170524 3888392 3754618 3759177 3653052 3878301 4000708
10286D000708m16338l78200P51453j74246l47243O3149j46493n6801L40695l984
$$ 4000708 3584370 3206170 3957623 3783377 3436134 3499283 3352790 3295989 3636684 3632700
10276C632700M137n3269j26378m31929k82753L38739L99477K3665K2864K3237
$$ 3632700 3636837 3583568 3457190 3025261 2742508 3081247 3480724 3504389 3527253 3550490
10266C550490r6986J53172J18477r26J8011L83044j50941p5874K60507n61529
$$ 3550490 3453504 3606676 3725153 3724227 3742238 4125282 3974341 3898467 4158974 3597445
10256C597445K5248K88060j49129j42602K42585l28161q6495K06276o3422K29550
$$ 3597445 3622693 3910753 3761624 3619022 3861607 3533446 3446951 3653227 3589805 3819355
10246C819355k00824L37477J91334l19585k08474j42836J6157M01446j07794k13280
$$ 3819355 3618531 3956008 4147342 3827757 3619283 3476447 3492604 3894050 3786256 3572976
10236C572976K68420R5913L208J51245r6473L01673l8925j30904L36279k0845
$$ 3572976 3841396 3937309 3940517 4091762 3995289 4296962 4258037 4127133 4463412 4442567
10226D442567m7487P1129k60807K50746N6748K62085m2531l68017O1790J75100
$$ 4442567 4395080 4466209 4205402 4456148 4512896 4774981 4732450 4364433 4426223 4601323
10216D601323K14110j52925j29260R522J04972J88675N3737L65637N6137n0442
$$ 4601323 4815433 4662508 4533248 4542770 4647742 4836417 4890154 5255791 5311928 5261486
10206E261486K9457J06578J515N51520J03191Q2419Q9153K09628L9946k36132
$$ 5261486 5290943 5397521 5399036 5950556 6053747 6136166 6225319 6434947 6474893 6238761
10196F238761K78357m74845K01350L06676l69978n82862j76283J06630J20421
$$ 6238761 6517118 6042273 6243623 6550299 6180321 5597459 5421176 5527806 5648227
10187E648227K91796R9176q5520J47936J27083j94437J44316j0942M07431J12363
$$ 5648227 5940023 6039199 5953679 6101615 6228698 6034261 6178577 6167635 6575066 6687429
10177F687429J74938K40748L40841l338J30531K3511O17222N42105j22510Q8765
$$ 6687429 6862367 7103115 7443956 7440618 7571149 7594660 8211882 8753987 8631477 8720242
10167H720242K39902K89058k17548j60240M21993o5166j77415n15336k40894Q6241
$$ 8720242 8960144 9249202 9031654 8871414 9293407 9228241 9050826 8535490 8294596 8380837
10157H380837M6690m20222K43622k48756m46394k70971k19787j23625m50788K83486
$$ 8380837 8427527 8007305 8250927 8002171 7555777 7284806 7065019 6941394 6490606 6774092
10147F774092K73377n0419n89264M90276L01449K36717k76442m8864N70126J17725
$$ 6774092 7047469 6997050 6407786 6898062 7199511 7436228 7159786 7110922 7681048 7798773
10137G798773k88208J23050O4392K88994m19L9157J05025J43778k60073k63984
$$ 7798773 7510565 7633615 7698007 7987001 7986582 8025739 8130764 8274542 8014469 7750485
10127G750485l7356K92420O78l19873p6835j65167k09217K52519K61676N74957
$$ 7750485 7713129 8005549 8006227 7686354 7609519 7444352 7235135 7487654 7749330 8324287
10117H324287K182j50336n315l09290J56247j05162J03523j10675J82878M33378
$$ 8324287 8326469 8176133 8170818 7861528 8017775 7912613 8016136 7905461 8088339 8521717
10107H521717k150o3876J50860j24444j54411K97144j69979j02354P0376L5502
$$ 8521717 8519567 8455691 8606551 8482107 8327696 8624840 8454861 8352507 8422883 8458385
10097H458385J70509q7755j24034J79012J47259M30633J61749p2367j40737q370
$$ 8458385 8628894 8541139 8417105 8596117 8743376 9174009 9335758 9263391 9122654 9114284
10087I114284K63005J36620j53444O6886N1756P8603k67958J43419K00814L47427
$$ 9114284 9377289 9513909 9360465 9427351 9479107 9557710 9289752 9433171 9633985 9981412
10077I981412Q5286j68138K59082K04230J80128p7185J45628n4551J68961k1135
$$ 9981412 10066698 9898560 10157642 10361872 10542000 10464815 10610443 10555892 10724853 10703718
10067A0703718j02469P8491J86355L76467j81983L12105M08119p991J74543l5326
$$ 10703718 10601249 10679740 10866095 11242562 11060579 11372684 11780803 11772812 11947355 11912029
10057A1912029r6978J56260n8326J71869K94015J93867K99020L12088K37695o201
$$ 11912029 11815051 11971311 11912985 12084854 12378869 12572736 12871756 13183844 13421539 13415338
10047A3415338J03925R7459O41131M16046N35251R752j84647O26965O25445N75270
$$ 13415338 13519263 13616722 14257853 14673899 15209150 15218902 15034255 15661220 16286665 16861935
10037A6861935j4454M54549M35105N15592L79411Q57696O38708J08004O80641
$$ 16861935 16847481 17302030 17737135 18252727 18632138 19489834 20128542 20236546 20917187
10028B0917187L34193P97377Q62385P06710Q59535J065123J458598J354100J164026
$$ 20917187 21251380 22048757 22911142 23617852 24477387 25542510 27001108 28355208 29519234
10019B9519234J712044J944227K308320K481538K876008L089302L308636L434873
$$ 29519234 31231278 33175505 35483825 37965363 40841371 43930673 47239309 50674182
10011E0674182M042308L081580L004409L555390K913228K764303K377852K041506
$$ 50674182 54716490 57798070 60802479 64357869 67271097 70035400 72413252 74454758
10003G4454758J992218J071595k30263r06655j302471k226702k448615j882329
$$ 74454758 76446976 77518571 77288308 76381653 75079182 72852480 70403865 68521536
9995F8521536j392036m48372K27343Q34665R69473J737889K212083K148813L284524
$$ 68521536 67129500 66681128 66908471 67743136 68712609 70450498 72662581 74811394 78095918
9986G8095918L716423M603489N318068O390376P637717R870672J1354561J2950400
$$ 78095918 81812341 86415830 91733898 98124274 105761991 115632663 126987224 139937624
9978A39937624J4925072J6172134J7480381J8577539J7749480J7203355J5058506
$$ 139937624 154862696 171034830 188515211 207092750 224842230 242045585 257104091
9971B57104091J2331935J3020119J2488743J0130463P881987P834950O673589
$$ 257104091 269436026 282456145 294944888 305075351 312957338 320792288 327465877
9964C27465877J581987m680756j0329012j3655138j5807724j6034676j5004841
$$ 327465877 329047864 324367108 314038096 300382958 284575234 268540558 253535717
9957B53535717j6808095j8348020j4737057j1082742r590981p480622n470256
$$ 253535717 236727622 218379602 203642545 192559803 182968822 175488200 170017944
9950A70017944m666833m199938l654678k518012j919646j563756j359848p44364
$$ 170017944 165351111 161151173 157496495 154978483 153058837 151495081 150135233 149390869
9942A49390869J255218K279962L856614N458486O962976R083983R050180Q227117
$$ 149390869 150646087 152926049 156782663 162241149 169204125 178288108 187338288 195565405
9934A95565405P162135K639700q91360j086506k025182l427488o694221j1699333
$$ 195565405 202727540 205367240 204475880 203389374 201364192 197936704 191242483 179543150
9926A79543150j2934980j2036036j0982622r726227r033873q767759p853947p242738
$$ 179543150 166608170 154572134 143589512 133863285 124829412 116061653 108207706 100964968
9918A00964968o485987n434263m753602m715881l670101l475245k725358k446631
$$ 100964968 94478981 89044718 84291116 79575235 75905134 72429889 69704531 67257900
9910F7257900k124608j394068q16690q71624o2483q2726K17636J391510K004130
$$ 67257900 65133292 63739224 62922534 62050910 61988427 61905701 62123337 63514847 65518977
9901F5518977J824957K044736K542655K159634J910100N29034j511367j406410
$$ 65518977 67343934 69388670 71931325 74090959 76001059 76530093 75018726 73612316
9893G3612316j697213j322533k167274l582060m166594m273521l450580l121742
$$ 73612316 71915103 70592570 68425296 64843236 60676642 56403121 52952541 49830799
9885D9830799k490725j775768j956979j702722j502760j860305j589077j519665
$$ 49830799 47340074 45564306 43607327 41904605 40401845 38541540 36952463 35432798
9877C5432798j051347o44373j181503r75368o93126o26936m28873n52871l48773
$$ 35432798 34381451 33737078 32555575 31580207 30887081 30260145 29831272 29278401 28929628
9868B8929628o76093m01432p05752k03368o12852l34597l94o64727o20545l22410
$$ 28929628 28253535 27852103 27146351 26942983 26330131 25995534 25995140 25330413 24709868 24387458
9858B4387458l0510k98473r44104l64043n04817k35055j58261j81570k46426o271
$$ 24387458 24356948 24058475 23114371 22750328 22245511 22010456 21852195 21670625 21424199 21417928
9848B1417928l40517j20900r3472K96152j71346l97404P9561K40090K11121m71763
$$ 21417928 21077411 20956511 20863039 21159191 20987845 20590441 20670002 20910092 21121213 20649450
9838B0649450K2403k442M25798o3730O315M2203J59402N42930k35180l650N13875
$$ 20649450 20671853 20669411 21095209 21031479 21037794 21079997 21239399 21782329 21547149 21543499 22057374
9827B2057374q0286j97006l8145R45326M61872j70529J02358N74803N75110P6182
$$ 22057374 21977088 21780082 21741937 22687263 23149135 22978606 23080964 23655767 24230877 24307059
9817B4307059M75283P30120N63862K19663k20794j39185K76989L96420P82705
$$ 24307059 24782342 25512462 26076324 26295987 26075193 25936008 26212997 26609417 27392122
9808B7392122L81252n9550j6858M79346M56103P96033P89948P94401P59463J460276
$$ 27392122 27773374 27713824 27696966 28176312 28632415 29428448 30218396 31012797 31772260 33232536
9798C3232536J428928J405506J775640J978340J503162K211601K109399K060067
$$ 33232536 34661464 36066970 37842610 39820950 41324112 43535713 45645112 47705179
9790D7705179K236828K285581K268284K206339L488749L639295M936750O041856
$$ 47705179 49942007 52227588 54495872 56702211 60190960 63830255 68767005 74808861
9782G4808861O043154O134503O816388P548369O871734O184190N038409K081736
$$ 74808861 80852015 86986518 93802906 101351275 108223009 114407199 119445608 121527344
9774A21527344K69493O89307J602421K162125J706713Q11916k21886l444282m341807
$$ 121527344 121796837 122486144 124088565 126250690 127957403 128769319 128547433 125103151 120761344
9765A20761344k496929r35143N72729J728338L540388N212376P604500R872415
$$ 120761344 118264415 117329272 117902001 119630339 123170727 128383103 135987603 145860018
9757A45860018J1861995J4146292J4409061J5848736J6939668J3709377J1203668
$$ 145860018 157722013 171868305 186277366 202126102 219065770 232775147 243978815
9750B43978815Q191231m151104p041437m04613K199853K632791N495309Q798044
$$ 243978815 252170046 248018942 240977505 240572892 242772745 245405536 250900845 259698889
9742B59698889J1172234J1813200R684328P098228L703161J690019j398247n339542
$$ 259698889 270871123 282684323 292368651 299466879 303170040 304860059 303461812 298122270
9734B98122270q917170j4981433k1556629k2013521k0646518j8924176j6175576
$$ 298122270 289205100 274223667 252667038 230653517 210006999 191082823 174907247
9727A74907247j3670604j1490293j0075257q818588p031825n737298n586406m203938
$$ 174907247 161236643 149746350 139671093 130852505 123820680 118083382 112496976 108293038
9719A08293038l143929j668442p28722r34516N5081J85723O0426K58253j040724
$$ 108293038 105149109 103480667 102751945 101817429 101872510 102058233 102118659 102376912 101336188
9710A01336188k369204k875893k670128j541661j285730j545089k428587l337483
$$ 101336188 98966984 96091091 93420963 91879302 90593572 89048483 86619896 83282413
9702H3282413n802688n924935m560352l520675l319890k393397j937532j674968
$$ 83282413 77479725 71554790 66994438 63473763 60153873 57760476 55822944 54147976
9694E4147976p13928j202396r27404j274904j106279j656079j655649k107832
$$ 54147976 53434048 52231652 51304248 50029344 48923065 47266986 45611337 43503505
9686D3503505k157332k307924j973593k222592k191185j572321j642459j437078
$$ 43503505 41346173 39038249 37064656 34842064 32650879 31078558 29436099 27999021
9678B7999021j822236j330909p17149j129100q22287n92933n11397p53475p53791
$$ 27999021 26176785 24845876 24128727 22999627 22177340 21584407 21073010 20319535 19565744
9669A9565744j52061p13869n13702k87630j52577o46093L5765n14055l44280j08040
$$ 19565744 19413683 18699814 18186112 17898482 17745905 17099812 17135577 16621522 16277242 16169202
9659A6169202k25266m40308o26631m50897j38083j40619j85476k74770k84638
$$ 16169202 15943936 15503628 14876997 14426100 14288017 14147398 13961922 13687152 13402514
9650A3402514k36390o03531j27832l78220q05740m09156P1482j29755k53101k49576
$$ 13402514 13166124 12562593 12434761 12056541 11250801 10841645 10913127 10783372 10530271 10280695
9640A0280695L69110k773l19435m8456j43903l32781M37579K60640j08612P8792
$$ 10280695 10649805 10647032 10327597 10279141 10135238 9802457 10240036 10500676 10392064 10470856
9630A0470856j7222l08666j48354J3439K7375K25023l21838k91169k8513j90880
$$ 10470856 10453634 10144968 9996614 10010053 10037428 10262451 9940613 9649444 9620931 9430051
9620I430051n65656j27014M47945l34801k81228j21319j32469O6785l12271q97853
$$ 9430051 8864395 8737381 9185326 8850525 8569297 8447978 8315509 8382294 8070023 7172170
9610G172170k49816J10866Q0833J23047l14005m10775k10679L27422K46537o14870
$$ 7172170 6922354 7033220 7114053 7237100 6923095 6512320 6301641 6629063 6875600 6260730
9600F260730m30124K96688L89158m14782o1122k50780l35829P221k50935J82976
$$ 6260730 5830606 6127294 6516452 6101670 6040548 5789768 5453939 5461160 5210225 5393201
9590E393201L8116j24781M4386q5690k81306o37456l37290M70642k81122m42959
$$ 5393201 5431317 5306536 5350922 5265232 4983926 4346470 4009180 4479822 4198700 3755741
9580C755741Q6476r0176Q7898M66J37377J11090l4810R5632L39708L57146l76911
$$ 3755741 3842217 3752041 3839939 3840405 3977782 4088872 4054062 4149694 4489402 4846548 4469637
9569D469637P3339p6105m15340l87647N9599O2456M6797k16010p0024l8041L03331
$$ 4469637 4542976 4466871 4051531 3663884 3723483 3785939 3832736 3616726 3546702 3508661 3811992
9558C811992J11423m24298m08645l648j49602M1567R3361m01961K83727j73958
$$ 3811992 3923415 3499117 3090472 3086824 2937222 2978789 3072150 2670189 2953916 2779958
9548B779958l6252j14159o7124K84379J66982j60549m04836L31194j78098L23822
$$ 2779958 2743706 2629547 2562423 2846802 3013784 2853235 2448399 2779593 2601495 2925317
9538B925317j82079k20286K25357j48610j16246j04125j28124k43682K10001L63639
$$ 2925317 2743238 2522952 2748309 2599699 2483453 2379328 2251204 2007522 2217523 2581162
9528B581162M33787p69724J62309n5359J5809M36187K0473k79364j39087N02904
$$ 2581162 3014949 2245225 2407534 2352175 2367984 2804171 2824644 2545280 2406193 2909097
9518B909097R1457J27211K97380j14157J75925L07626k02753N0106l89737J05505
$$ 2909097 3000554 3127765 3425145 3310988 3486913 3794539 3591786 3641892 3252155 3357660
9508C357660j80465p6259J96265J85934M3375k77415l79082j12341p2374P3713
$$ 3357660 3177195 3100936 3297201 3483135 3526510 3249095 2870013 2757672 2685298 2759011
9498B759011n72413K0646O18940n76252j47608l26387r267j39233m71339J12092
$$ 2759011 2186598 2207244 2826184 2249932 2102324 1775937 1766670 1627437 1156098 1268190
9488A268190K73011N25980j96876k60117J65228l00722K39326J78848l64200n2954
$$ 1268190 1541201 2067181 1870305 1610188 1775416 1474694 1714020 1892868 1528668 1475714
9478A475714K6518M8184o202n82360L05264J63282q3638k6622L3772j43785L9920
$$ 1475714 1502232 1550416 1544214 961854 1267118 1430400 1346762 1320140 1353912 1210127 1250047
9467A250047P2715m6231m62349m54799O442L45571L54869J930k58685k0110L13088
$$ 1250047 1322762 1276531 814182 359383 365825 711396 1066265 1068195 809510 789400 1102488
9456A102488J6053p18484j3526Q1859k09222L13044o5442J63881J86867K24308
$$ 1102488 1118541 400057 386531 468390 259168 572212 506770 670651 857518 1081826
9446A081826n8103q7751n4762m79446Q7037Q7386o0987k6840J16460K3937J12873
$$ 1081826 1023723 935972 881210 401764 488801 576187 515200 488360 604820 628757 741630
9435G41630M1977q4983J10326M9214J41355l60265Q4803o68927K49403K21080
$$ 741630 783607 698624 808950 858164 999519 639254 724057 55130 304533 525613
9425E25613K78819j63873j07508k62343n8996J2605j4993L1146k27309P57155
$$ 525613 804432 640559 533051 270708 211712 224317 209324 240470 13161 770316
9415G70316p8769j18521k04041J55654J02067j90671J80550k47460K93976N6622
$$ 770316 691547 573026 368985 524639 626706 436035 616585 369125 663101 719723
9405G19723k23915j01702m66019J65644P1401n6028O9801J53710m04689K06065
$$ 719723 495808 394106 -71913 93731 165132 109104 178905 332615 -72074 133991
9395A33991J20680l3439m89661j20221M71830N2958L49487J56802j81963j67731
$$ 133991 254671 221232 -268429 -388650 83180 136138 485625 642427 460464 292733
9385B92733j30470K56614M34664j25913l25422j93452J13770k23968N344N21175
$$ 292733 162263 418877 853541 727628 402206 208754 322524 98556 103900 625075
9375F25075L51938j82926k04319m12385o9865K6321k1187k04151K53523j45818
$$ 625075 977013 794087 589768 177383 107518 133839 112652 -91499 162024 16206
9365A6206K61309J58460m6131L84709j45492l45633j25393L21538k69424M6859
$$ 16206 277515 435975 389844 774553 629061 283428 158035 479573 210149 257008
9355B57008L3005j76717P0295r1293J67041q4j83631Q7316j93969M42496k55319
$$ 257008 290013 113296 183591 92298 259339 259255 75624 162940 -31029 411467 156148
9344A56148J61517l3568P3031J25865L9829J54485m95391l5525L40533J26174
$$ 156148 317665 284097 357128 482993 522822 677307 181916 146391 486924 613098
9334F13098m23137L8788K40117j31183j63507O5602K78154k52447j3442Q5787
$$ 613098 189961 228749 468866 337683 174176 239778 517932 265485 252043 337830
9324C37830m44073j82261J15239L8558m74916Q0729M56661J2953k14166q5529
$$ 337830 -106243 -288504 -173265 -134707 -609623 -528894 -72233 -59280 -273446 -358975
9314c58975J00800L0506j25144k01547k00598O1910M12512J54912L38387K28650
$$ -358975 -258175 -227669 -352813 -554360 -754958 -693048 -280536 -125624 212763 441413
9304D41413l53074o2327k48790j44703J96975Q9695l17426M19149P09214j53346
$$ 441413 88339 26012 -222778 -367481 -170506 -80811 -398237 20912 730126 576780
9294E76780P9694L49794K00628j03151M6550m02533k71859J37435P8112k28969
$$ 576780 656474 1006268 1206896 1103745 1150295 747762 475903 613338 691450 462481
9284D62481M5583K25059N4929P455k44526o7029j78286R2542M34127J04826m16029
$$ 462481 508064 733123 788052 795507 550981 483952 305666 398208 832335 937161 521132
9273E21132O9064j64737m31942Q442q8412k2400J55178K4527j67406K63563P2356
$$ 521132 590196 425459 -6483 1959 -86453 -108853 46325 70852 -96554 167009 239365
9262B39365k77746J11036l43580l87256J04805L2571j56421Q5835O2674M63709
$$ 239365 -38381 72655 -270925 -658181 -553376 -520805 -677226 -591391 -528717 -65008
9252f5008L69780J88963n19073j46749L45719K91508J85265j98534j78292m57704
$$ -65008 304772 493735 -25338 -172087 173632 465140 650405 451871 273579 -184125
9242a84125J39490J193l9609p6567l72769j05424L50951J12622J67969o0210k31918
$$ -184125 -44635 -43442 -83051 -159618 -532387 -637811 -286860 -174238 -6269 -66479 -298397
9231b98397k2767K8525L748J67309N6679r8053j09326J71444K26l43173L36364
$$ -298397 -321164 -292639 -288891 -121582 -64903 -162956 -272282 -100838 -100612 -443785 -107421
9220a07421j59613j09778L82536K98197k55054R3413k19275k44789K75654J07490
$$ -107421 -267034 -376812 5724 303921 48867 142280 -76995 -321784 -46130 61360
9210F1360k73284j2786L9505j36504m8003J4868j553M142n42890j52148K02419
$$ 61360 -211924 -224710 -185205 -321709 -369712 -354844 -356397 -352255 -895145 -1047293 -844874
9199h44874o301M40449r4934L20619L32225n0860l08909J13074N6388k13404l4361
$$ -844874 -851175 -410726 -505660 -185041 147184 96324 -212585 -99511 -43123 -256527 -290888
9188b90888K81898R0163j367M5248m1762K3659J42684k29532k92744k66259K76076
$$ -290888 -8990 81173 79806 125054 83292 106951 249635 20103 -272641 -538900 -262824
9177b62824q112l03691J94226J06195n1406l6205j78970j42093K38687J79627
$$ -262824 -270936 -574627 -380401 -274206 -325612 -361817 -540787 -682880 -444193 -264566
9167b64566n94311j16109N34895r961M45713p54099k241M16201k48162k00588
$$ -264566 -858877 -974986 -440091 -450052 -4339 -758438 -760679 -344478 -592640 -793228
9157g93228K9609J99152k07387O592k65886k47450P8162J93102L94227L52484
$$ -793228 -763619 -564467 -771854 -765262 -1031148 -1278598 -1200436 -1007334 -613107 -260623
9147b60623j84037n0004j50933P6900n5986J17035m4899j86888j98292P1416M84323
$$ -260623 -444660 -494664 -645597 -568697 -624683 -507648 -552547 -739435 -937727 -866311 -381988
9136c81988l32352j39400L52765j96843k18749M02501O2758O7335J5936k57875
$$ -381988 -714340 -853740 -500975 -697818 -916567 -514066 -451308 -383973 -368037 -625912
9126f25912m92622J37798l9742j22746P1640Q507n2487j70925N16440M78984n3764
$$ -625912 -1118534 -980736 -1020478 -1143224 -1071584 -1063077 -1115564 -1286489 -770049 -291065 -344829
9115c44829r0275P9128j51618j02251J18440k15668O69K7457k31036N35864k06202
$$ -344829 -435104 -355976 -507594 -609845 -491405 -707073 -706404 -678947 -909983 -374119 -580321
9104e80321l17386J51287O5703r476J61292J45455j1174j49874L53519Q1047n84994
$$ -580321 -897707 -746420 -680717 -690193 -528901 -383446 -394620 -544494 -190975 -109928 -694922
9093f94922q3852M44833r4261l9486p1090J66511o37647q8523M18853K11361L2102
$$ -694922 -778774 -333941 -428202 -467688 -538778 -372267 -1009914 -1098437 -679584 -468223 -436121
9082d36121n66559K11631N0986P366j49304k7703J70867k51335j50511J58389
$$ -436121 -1002680 -791049 -740063 -732697 -882001 -909704 -738837 -990172 -1140683 -982294
9072i82294K81961K85939o8542N03678j88334j35120p7446N3240K26380n7802
$$ -982294 -700333 -414394 -482936 20742 -167592 -302712 -380158 -326918 -100538 -158340
9062a58340j25612J94818K02457J77325l79988q9054Q216L7019m9007P7387J9318
$$ -158340 -283952 -89134 113323 290648 -89340 -178394 -170178 -133159 -182166 -104779 -85461
9051h5461K9246J16722J28086k29989J17372j84377n90391j32257L29082L81642
$$ -85461 -56215 60507 188593 -41396 75976 -108401 -698792 -831049 -501967 -120325
9041a20325n26451l03804N30750K03659J06960n2430J06368l44555J88073J26078
$$ -120325 -646776 -950580 -419830 -216171 -109211 -161641 -55273 -399828 -211755 -85677
9031h5677R6781l9698o38127J29889N14773L07926m89808O728j62880r0353J48639
$$ -85677 11104 -28594 -666721 -536832 -22059 285867 -203941 -197213 -360093 -450446 -301807
9020c01807j27113o2863L14369J33729P8515q1276J44381j93579k7589k2128O39959
$$ -301807 -428920 -491783 -177414 -43685 34830 -46446 97935 -95644 -123233 -145361 494598
9009D94598j97935J31292q7834n4675M4845o3485k73149k15228l0845K49475N1414
$$ 494598 296663 427955 340121 285446 330291 266806 -6343 -221571 -252416 -2941 48473
8998D8473o1101j28377j44252L55980j6806Q6979l0049J35818j35684m19570M553
$$ 48473 -12628 -141005 -285257 70723 53917 140896 110847 246665 110981 -308589 -304036
8987c04036L01342O9585m43178r418J7574J929L72j93913l6050l1417q6401K73495
$$ -304036 -2694 66891 -376287 -385705 -368131 -366202 -365830 -559743 -595793 -627210 -713611 -440116
8975d40116K82424K2636p597j88096j79604M40825N6812j33978l7047l08071J36555
$$ -440116 -157692 -135056 -142653 -330749 -510353 -69528 -12716 -146694 -183741 -491812 -355257
8964c55257p1438K4877J81844J78803m6614j61640k06836N53370m30138O4727
$$ -355257 -426695 -401818 -219974 -41171 -87785 -249425 -456261 97109 -333029 -268302
8954b68302o9604k10576o9455K15529k5592Q9212J66118j81327l88773l5559L68998
$$ -268302 -337906 -548482 -617937 -402408 -428000 -338788 -172670 -353997 -742770 -778329 -409331
8943d09331n6963R9310J99017q0423k07300k72610R054O44313k11888k51690l10239
$$ -409331 -466294 -366984 -167967 -248390 -455690 -728300 -719246 -74933 -286821 -538511 -848750
8932h48750L46857M48195j61955k20342J55384m39082L10896O76712k26158m10508
$$ -848750 -501893 -53698 -215653 -435995 -280611 -719693 -408797 267915 41757 -368751
8922c68751j25007M53560R7237k9227j10960J40050k09459K07442M02145K5902
$$ -368751 -493758 -40198 57039 27812 -83148 56902 -152557 54885 457030 482932
8912D82932k75726K07287L35789q7889k80920L63996j82488k79962J72095P9067
$$ 482932 207206 414493 750282 662393 381473 745469 562981 283019 455114 534181
8902E34181L3954j44798K46884r3241J66466q4948l24374J68187k9602l06533
$$ 534181 568135 423337 670221 576980 743446 658498 334124 502311 472709 166176
8892A66176j35137O1259K21076J78028j87570R4779R7828k82176P2679k59743
$$ 166176 31039 92298 313374 491402 303832 398611 496439 214263 286942 27199
8882B7199k20729M46205M30729j71363j24709L6199J18072K91126m32959k12582
$$ 27199 -193530 252675 683404 512041 387332 423531 541603 832729 399770 187188
8872A87188l57128N13088J33213j16571r436n36011j5418j95584M5455o0158l118
$$ 187188 -169940 343148 476361 359790 350354 -185657 -201075 -396659 -351204 -411362 -414480
8861d14480j63024q1724K34481J37598m24446M06724O96287L0780l41540m5230
$$ -414480 -577504 -659228 -424747 -287149 -711595 -304871 391416 422196 80656 35426
8851C5426k31337k89335L19583j65825l76286j30956R7520K2415K8211M23998
$$ 35426 -195911 -485246 -165663 -331488 -707774 -838730 -741210 -718795 -690584 -266586
8841b66586Q0835m4001n5122J36946m59737k26809K8604P38814j24094j08130
$$ -266586 -185751 -229752 -284874 -147928 -607665 -834474 -805870 -67056 -191150 -299280
8831b99280k7323J98991J96623n09290l18109L02754J28311p3903q4422k38266
$$ -299280 -326603 -127612 69011 -440279 -758388 -455634 -327323 -401226 -485648 -723914
8821g23914k23251L88677K18921m67663R1417N27298K76210m05020j0552j69842
$$ -723914 -947165 -558488 -339567 -807230 -715813 -188515 87695 -317325 -327877 -497719
8811d97719O2659J07452j12659l25435q6145K92198J48795Q7317J12446J73764
$$ -497719 -435060 -327608 -440267 -765702 -851847 -559649 -410854 -323537 -211091 -37327
8801c7327J30280k59382k16833j32981K23678K40254q2038j61583j39062j88864
$$ -37327 92953 -166429 -383262 -516243 -292565 -52311 -134349 -295932 -434994 -623858
8791f23858L3117K221j42804j22070J05108k50366j89738J82936O29925M7293
$$ -623858 -590741 -588520 -731324 -853394 -748286 -998652 -1188390 -1005454 -375529 -328236
8781c28236L22735l20018J77664L0072j12044L38977k59838k65336j37288O0119
$$ -328236 -5501 -325519 -147855 -117783 -229827 109150 -150688 -416024 -553312 -493193
8771d93193L38458j867O9551j31925p8148k21632J64230L27445K67367P5595l60725
$$ -493193 -154735 -156602 -87051 -218976 -297124 -518756 -354526 -27081 240286 315881 -44844
8760d4844k3927J57930K473P7667m00882l85270L39902K17076l3616j86596L82155
$$ -44844 -68771 89159 91632 169299 -231583 -616853 -276951 -59875 -93491 -280087 102068
8749A02068Q3271j8763j32386L799k66037J9453o0907j37037J48320k99362J62506
$$ 102068 185339 166576 34190 37989 -228048 -208595 -269502 -406539 -258219 -557581 -395075
8738c95075l0765Q0154Q5751o9348M69812j63399n15896l16524K27971R869J01843
$$ -395075 -425840 -345686 -259935 -329283 140529 -22870 -538766 -855290 -627319 -617450 -515607
8727e15607m04568K72866J04926j9750N52481m9183l2262k37955q1956Q9383k6173
$$ -515607 -920175 -647309 -542383 -562133 -9652 -58835 -91097 -329052 -411008 -321625 -347798
8716c47798L00944J26845n13563R2332K38310o1165j41764K37157l19114n03863
$$ -347798 -46854 79991 -433572 -341240 -102930 -164095 -305859 -68702 -387816 -891679
8706h91679L41836M87152o7808j43118l22860j32250N016j27205L24906K15363
$$ -891679 -549843 -62691 -130499 -273617 -596477 -728727 -723711 -850916 -526010 -310647
8696c10647M848K9686O4257j97701J84162N5414M75197l88811k3410N9318Q5837
$$ -310647 -305799 -276113 -211856 -409557 -225395 -169981 305216 -83595 -107005 -47687 38150
8685C8150j62003N6405j47935J13860N194l23878j01514J44122j17271J0780Q1862
$$ 38150 -123853 -67448 -215383 -101523 -96329 -420207 -521721 -377599 -494870 -484090 -402228
8674d02228N099J03005L06220o18957M2613Q62833j62086j25717n15284p3944
$$ -402228 -397129 -294124 12096 -606861 -564248 298585 136499 10782 -504502 -578446
8664e78446j55098O18468l5049K30837J67685J69665O88799l60773p1168J94926
$$ -578446 -733544 -115076 -150125 80712 248397 418062 1106861 746088 674920 869846
8654H69846O4551l06836m34357l18182M5056L48200K16968l8215L0599o4554n49191
$$ 869846 934397 627561 193204 -124978 -79922 268278 485246 447031 477630 413076 -136115
8643a36115n7097k82570K59626N1062K64385k4538k98246j77789n3920J72207
$$ -136115 -193212 -475782 -216156 -165094 99291 74753 -223493 -401282 -455202 -282995
8633b82995N03163m78139K8427J806J29581J02861n57817K46137j72745Q7242
$$ -282995 220168 -257971 -229544 -227738 -98157 4704 -553113 -306976 -479721 -392479
8623c92479K47344r4367J51262k46624j2823p7113L6149P03546Q1867l28802j68296
$$ -392479 -145135 -239502 -88240 -334864 -347687 -424800 -388651 314895 396762 67960 -100336
8612a00336j69268N65252N2624l38796k8465M85437L36185j24928m68408p6547
$$ -100336 -269604 295648 348272 9476 -18989 466448 802633 677705 209297 132750
8602A32750K01769q2537k98644O3976L2906j84284r3711J36774K65720j59095
$$ 132750 334519 251982 -46662 17314 50220 -134064 -227775 -91001 174719 15624
8592A5624P8127P1350j25766J44992O43917l52778m02016k67527P79303L09222
$$ 15624 93751 165101 39335 184327 828244 475466 73450 -194077 585226 894448
8582H94448K72701P5575J42267L95610k7163K19307l60384k98085j31117k50103
$$ 894448 1167149 1242724 1384991 1780601 1753438 1972745 1612361 1314276 1183159 933056
8572I33056O9888M6718k14902j34016K28869j77569k02692p6885k42507O1571
$$ 933056 1002944 1049662 834760 700744 929613 752044 549352 472467 229960 291531
8562B91531l30208L57366L43083l73627J02985j16387L84239j05421j07973J21874
$$ 291531 -38677 318689 661772 288145 391130 274743 658982 553561 445588 567462
8552E67462k76750m33650J62193K04158J83790l68753n22931R2256J79632j74421
$$ 567462 290712 -142938 19255 223413 407203 38450 -484481 -392225 -212593 -387014
8542c87014J33982M23154l84725k819K81043l11282J61531K51004p7814K95858
$$ -387014 -253032 170122 -214603 -217422 63621 -247661 -86130 164874 87060 382918
8532C82918p751K5986n2057k41881K40420j19897j49392M9174J62648M9228M1658
$$ 382918 375167 401153 349096 107215 347635 227738 78346 127520 290168 339396 381054
8521C81054m86810j73770K61889j5079K62811M57353j02965j72030J60067n24813
$$ 381054 -105756 -279526 -17637 -32716 230095 687448 584483 412453 572520 47707
8511D7707k46569J79902N97101J14358L41383K0243l98025R7190J34937l29821
$$ 47707 -198862 -18960 578141 692499 1033882 1054125 656100 753290 888227 558406
8501E58406k4297m33100K56327Q1004M483N8386J38192J97292l82424L1870j34393
$$ 558406 534109 101009 357336 438340 442823 501209 639401 836693 454269 486139 351746
8490C51746R910L9411J91337p9799k76716K22142j03756K61823J24880R0460o6486
$$ 351746 361656 401067 592404 512605 235889 458031 354275 616098 740978 831438 764952
8479G64952k42453J19514N22460L12210k38491k04100n41946K04754K6057l70309
$$ 764952 522499 642013 1164473 1476683 1238192 1034092 492146 696900 722957 352648
8469C52648L48708K71944l19052J83559J00345j28455k10203l9197L23764O7441
$$ 352648 701356 973300 654248 837807 938152 809697 599494 560297 884061 951502
8459I51502l20534J34152L54054K96227o7782L2861k61639J2367M06966K14434
$$ 951502 630968 765120 1119174 1415401 1347619 1380480 1118841 1131208 1538174 1752608
8449A752608j3814n73518k47540K64871L11119L21747l65292l38655m6669j67886
$$ 1752608 1738794 1165276 917736 1182607 1493726 1815473 1450181 1111526 1064857 896971
8439H96971o7990J3988L49101K4010M36699j15180j86624j82480M0347J8759Q9257
$$ 896971 828981 842969 1192070 1216080 1652779 1537599 1350975 1168495 1208842 1227601 1316858
8428A316858k04933M36996J71782j49102j04857M4252m1006l4685M19798K25439
$$ 1316858 1111925 1548921 1720703 1571601 1466744 1510996 1469990 1435305 1855103 2080542
8418B080542j74297l01040j73170K5744K31610Q2851j6481Q2502k19932n7380
$$ 2080542 1906245 1605205 1432035 1457779 1689389 1772240 1755759 1838261 1618329 1560949
8408A560949M655J36971L69478q7188k01410K65911L01934m24358k493L83161
$$ 1560949 1565604 1702575 2072053 1984865 1783455 2049366 2351300 1926942 1924449 2307610
8398B307610K69286K23018j85256o36223L34464j09489l94680M3430J8743K58015
$$ 2307610 2576896 2799914 2614658 1978435 2312899 2203410 1808730 1852160 1870903 2128918
8388B128918J47060K05328L43831n82768m7321L95627J21266k87553R7695n7979
$$ 2128918 2275978 2481306 2825137 2242369 2195048 2590675 2711941 2424388 2522083 2464104
8378B464104L7032n6145m94970O04759K62618l30344L12027l44214K47670K541
$$ 2464104 2501136 2444991 1950021 2554780 2817398 2487054 2799081 2454867 2702537 2705078
8368B705078j36535K57990P9921O4895J14818r9539M07881L43260p30036L42352
$$ 2705078 2568543 2826533 2906454 2971349 3086167 2986628 3394509 3737769 3007733 3350085
8358C350085J08695k43840J20063L53352M36904k73804l4213m26k78098K12644
$$ 3350085 3458780 3214940 3335003 3688355 4125259 3851455 3817242 3816816 3538718 3751362
8348C751362M42158L11376J15444L74438n3325n361R4066P4132M2023M3957K05774
$$ 3751362 4193520 4504896 4620340 4994778 4941453 4936092 5030158 5104290 5146313 5190270 5396044
8337E396044l35518K16120L25795O4150k07513M92058K81053L43576j37776j81851
$$ 5396044 5060526 5276646 5602441 5666591 5459078 5951136 6232189 6575765 6437989 6256138
8327F256138N85505M26449K99988K09291J48229P55063K14198K09188K75559M3529
$$ 6256138 6841643 7268092 7568080 7777371 7925600 8680663 8894861 9104049 9379608 9423137
8317I423137N39861Q33921N92157O71938P56487K79527R99116O29412M75893Q56651
$$ 9423137 9962998 10796919 11389076 12061014 12817501 13097028 14096144 14725556 15201449 16058100
8307A6058100J173263J006500J431465J070532J218525J740652J824397K232987
$$ 16058100 17231363 18237863 19669328 20739860 21958385 23699037 25523434 27756421
8299B7756421K502978K695271L095843L186453L697217L576185L786090L446457
$$ 27756421 30259399 32954670 36050513 39236966 42934183 46510368 50296458 53742915
8291E3742915K880424J441882Q80243L47402K50331n13790o28444O88084J342458
$$ 53742915 56623339 58065221 58945464 59292866 59543197 59029407 58400963 59089047 60431505
8282F0431505J631127K478058L518885M022672M494797N977886O320722P380737
$$ 60431505 62062632 64540690 68059575 72082247 76577044 82554930 88875652 96256389
8274I6256389Q844757J0331478J2614643J5444070J8097076K0736635K3643044
$$ 96256389 105101146 115432624 128047267 143491337 161588413 182325048 205968092
8267B05968092K5261772K4921062K2385287J8647222J1321933N44914q908076
$$ 205968092 231229864 256150926 278536213 297183435 308505368 309050282 300142206
8260C00142206j5958359k1146966k4531016k4591940k1687382j8569550j5245021
$$ 300142206 284183847 263036881 238505865 213913925 192226543 173656993 158411972
8253A58411972j3785813j2535395j1075199j0648180r983446q667464q853769
$$ 158411972 144626159 132090764 121015565 110367385 100383939 91716475 82862706
8246H2862706p870627o671804n749296n220639l973220l554704l832630l333438
$$ 82862706 74992079 68320275 62570979 57350340 53377120 49822416 45989786 42656348
8238D2656348k978418k318372k379664k102617j964285j346395j489167j912133
$$ 42656348 39677930 37359558 34979894 32877277 30912992 29566597 28077430 26165297
8230B6165297p68494j306457j362214j011111j056217p29154j080827r47353o69408
$$ 26165297 25396803 24090346 22728132 21717021 20660804 19931650 18850823 17903470 17234062
8221A7234062j234577p38256j023498q10616r37022k90756j5125m63191m89013
$$ 17234062 15999485 15261229 14237731 13427115 12490093 12199337 12184212 11721021 11232008
8212A1232008n62972n2644o6808k78112q62352p21279K9797k89284j11144m12574
$$ 11232008 10669036 10616392 10549584 10271472 9409120 8687841 8717638 8428354 8317210 7904636
8202G904636m73748k83545K2986p8845o32192m35555M1072K19114R76j94674j759414
$$ 7904636 7430888 7147343 7170329 7091484 6459292 6023737 6064809 6283923 6284899 6090225 4330811
8191D330811K90405N89713j14851O26311k07686l78497N41977N4584k74040o48580
$$ 4330811 4621216 5210929 5096078 5722389 5514703 5136206 5678183 5732767 5458727 4810147
8181D810147R780r9750M08733k51310k89387L9337m44564K75918j32431m88184
$$ 4810147 4819927 4720177 5128910 4877600 4588213 4627550 4182986 4458904 4326473 3838289
8171C838289k90666j17340l2557l0216J11964J77357m31838k07958j41735j04333
$$ 3838289 3547623 3430283 3397726 3367510 3479474 3656831 3224993 3017035 2875300 2770967
8161B770967l09188J68198k73998o425p1024k38569J13270M4580l4451L86779
$$ 2770967 2461779 2629977 2355979 2349554 2278530 2039961 2153231 2197811 2163360 2550139
8151B550139J92993m50683n58458J50353L03864J65241k20361j74513q4150p9718
$$ 2550139 2743132 2292449 1733991 1884344 2188208 2353449 2133088 1958575 1874425 1794707
8141A794707j27684J81986j00241j06220K22889J06610j80167J94743j22673m34634
$$ 1794707 1667023 1849009 1748768 1642548 1865437 1972047 1791880 1986623 1863950 1429316
8131A429316L4667j01603L45176Q2535j67570l44925n64762L44118J24929j83108
$$ 1429316 1463983 1362380 1707556 1790091 1622521 1277596 712834 1056952 1181881 998773
8121I98773n5576l18126J28542N76294J7267k55893K84921r1474q0198L26163
$$ 998773 943197 625071 753613 1329907 1347174 1091281 1376202 1284728 1204530 1530693
8111A530693K01165j65312j76498P5070k86956j49790j22507J04948m5812l96805
$$ 1530693 1731858 1566546 1390048 1465118 1178162 1028372 905865 1010813 965001 568196
8101E68196K16411M67348l0176J11252k84420R5585M85791k10554m94838L0841
$$ 568196 784607 1251955 1221779 1333031 1048611 1144196 1629987 1419433 924595 955436
8091I55436N69627O5852j00909L18895j27448L7042J89769J31040O178n2682L01750
$$ 955436 1525063 1590915 1490006 1808901 1681453 1718495 1908264 2039304 2045482 1992800 2294550
8080B294550J03779j04483k14915K90810q279J87898J02919O33231p2740m7477
$$ 2294550 2398329 2293846 2078931 2369741 2361462 2549360 2652279 3285510 3212770 3165293
8070C165293r4209M36781L76675l6801M66964P02276M84291K78752M56329Q53267
$$ 3165293 3071084 3507865 3884540 3847739 4314703 5016979 5501270 5780022 6236351 7089618
8060G089618M12726O31917J026567J062407R35049J175608J065897J895604K326076
$$ 7089618 7502344 8134261 9160828 10223235 11158284 12333892 13399789 15295393 17621469
8051A7621469J862937J970912K269271J978708J715538J166112L23166o02137
$$ 17621469 19484406 21455318 23724589 25703297 27418835 28584947 28908113 28305976
8043B8305976j357093j704911k042157j873054j871763k171924q15403j217031
$$ 28305976 26948883 25243972 23201815 21328761 19456998 17285074 16469671 15252640
8035A5252640j497415j356008j126007r43694r42351p31633p69393r93467r10106
$$ 15252640 13755225 12399217 11273210 10329516 9387165 8655532 7886139 6892672 5982566
8026E982566l07792m65017j60773k33932J00345m12610q10045l08825j95938l09371
$$ 5982566 5674774 5209757 5048984 4815052 4915397 4502787 3692742 3383917 3187979 2878608
8016B878608M0510k63012j35716l18305m83810J99764L3275p863m25627l32373
$$ 2878608 2919118 2656106 2520390 2202085 1718275 1918039 1951314 1943451 1517824 1185451
8006A185451q2776J09510J04393l11563J25230j89076o0281n4026J82388K06222
$$ 1185451 1102675 1212185 1316578 1005015 1130245 941169 880888 826862 1009250 1215472
7996A215472q2996J97166n36893n42458M20596m10469J7832Q1318K34781k34986
$$ 1215472 1132476 1329642 792749 250291 670887 260418 278250 359568 594349 359363
7986C59363J56514k1356k21837J65449R4075K9297n5848J80763K55064R6156j27018
$$ 359363 515877 494521 272684 438133 532208 561505 505657 686420 941484 1037640 910622
7975I10622n90660L02543O9353j1132l56968J04109k8373J19265m79276J98726
$$ 910622 319962 622505 691858 680726 323758 427867 399494 518759 39483 238209
7965B38209J83571l4553K77047n6707L22952j32208l0958l22661l82999O4695
$$ 238209 421780 387227 664274 607567 930519 798311 767353 444692 61693 126388
7955A26388K27701Q26647O20021m98074k45597l01771N98657j55960j10373m3666
$$ 126388 354089 1180736 1800757 1302683 1057086 755315 1353972 1198012 1087639 1043973
7945A043973l61657k7460K72764J67330k17574j93270j96935q7217j56549K88820
$$ 1043973 682316 654856 927620 1094950 877376 684106 487171 399954 243405 532225
7935E32225J61077k04338k50762O2406K04k98652j5270K33522n80432j77853R09996
$$ 532225 693302 488964 238202 300608 300812 2160 -13110 220412 -360020 -537873 372123
7924C72123J48181m67848m48811K15670j91419J28511J00883k73895M2977m43212
$$ 372123 520304 52456 -396355 -180685 -372104 -243593 -142710 -416605 -373628 -816840
7914h16840J98628J80638j45456j4647J86918L15348J85851j94600j79795q6134
$$ -816840 -618212 -437574 -583030 -597677 -410759 -95411 90440 -104160 -283955 -370089
7904c70089j26838m9729K9731M09503m7563J44894m8864j14571j07852O3540k05047
$$ -370089 -496927 -546656 -516925 -107422 -154985 -10091 -58955 -173526 -281378 -217838 -422885
7893d22885L84069k76481R223k19691l54945N68590K53283p1577n4400k05898
$$ -422885 -38816 -315297 -306074 -525765 -880710 -312120 -58837 -130414 -184814 -390712
7883c90712j06299j98423N95813J24253j87401L12197k17612o37490p5123M26295
$$ -390712 -497011 -695434 -99621 24632 -162769 149428 -68184 -705674 -780797 -354502
7873c54502K79176k61866l89657k54511j5877k38935N06908M14764j76047q62
$$ -354502 -75326 -337192 -726849 -981360 -997237 -1236172 -729264 -314500 -490547 -491409
7863d91409M40473K53672J64m48721j2192K406k6310K50903l67417Q5456j69403
$$ -491409 -50936 202736 202900 -245821 -258013 -255607 -281917 -31014 -398431 -312975 -482378
7852d82378N57480L3161m44709l93187j34900L50372M21288q4576K25323j49506
$$ -482378 75102 108263 -336446 -729633 -864533 -514161 -92873 -177449 47874 -101632
7842a01632K13762m5371O4129O1963j41488J31720R2769k03900n8200r5969l54261
$$ -101632 112130 66759 130888 192851 51363 183083 275852 71952 13752 -82217 -436478
7831d36478k51798K38130Q5533P6007l09904K9379L5815p7848K41974L80596M1223
$$ -436478 -688276 -450146 -364613 -288606 -598510 -569131 -533316 -611164 -369190 11406 52629
7820E2629l3811P5550P2317l36537j8833k2523r2483M34424J39019l8010k87208
$$ 52629 18818 94368 166685 -169852 -188685 -211208 -303691 130733 269752 231742 -55466
7809e5466O04374l30272j95262J66017J1391K15521l1562o89744K6144j48994
$$ -55466 548908 218636 23374 189391 200782 416303 384741 -305003 -278859 -427853
7799d27853M65465K60066p855k91421m41519M41800k41713L11423j5141j43468
$$ -427853 37612 297678 289823 -1598 -443117 -1317 -243030 68393 53252 -90216
7789i0216q3265M01408k02998k34977k42613J9173N77734P7948J62044k00889
$$ -90216 -173481 227927 24929 -210048 -452661 -433488 144246 222194 384238 183349
7779A83349l66794l02192m4617L04287K96660l40702J7104J99216L57268k30533
$$ 183349 -183445 -485637 -530254 -225967 70693 -270009 -252905 -53689 303579 73046
7769G3046k80232R4320N53775p0433k94456K093J3911J83775K24504J24962p1652
$$ 73046 -207186 -112866 440909 370476 76020 78113 92024 275799 500303 625265 553613
7758E53613j10520J49643M41956r3016k66764J49257O4992J6006K04305Q6802
$$ 553613 443093 592736 1034692 941676 674912 824169 889161 905167 1109472 1196274
7748A196274j25126j35760O96815q9690N8693J11512L27912M87470K08469M17772
$$ 1196274 1071148 935388 1632203 1542513 1601206 1712718 2040630 2528100 2736569 3154341
7738C154341J20440l2009J98718j37732M16888m33936k06050O04057m2830k06936
$$ 3154341 3274781 3242772 3441490 3303758 3720646 3286710 3080660 3684717 3641887 3434951
7728C434951l7047O3050j59499K90568K04013n37802q67017k63220J1922J92033
$$ 3434951 3397904 3460954 3301455 3592023 3796036 3258234 2391217 2127997 2139919 2331952
7718B331952m99341j17966j03759j74938J34433k83283j48394k48940K88615j65026
$$ 2331952 1832611 1714645 1610886 1435948 1570381 1287098 1138704 889764 1178379 1013353
7708A013353n28514M32924J23739n87194P6557j93030j41315M42612R4226k60004
$$ 1013353 484839 917763 1041502 454308 530865 337835 196520 639132 733358 473354
7698D73354K27943k41615l11073n5294P6973K59513k43013j29441P0869m7946
$$ 473354 701297 459682 148609 93315 170288 429801 186788 57347 128216 80270
7688H0270M58022L22234o24257k14584M82724K52823k14455k19702J23538p6109
$$ 80270 538292 860526 236269 21685 504409 757232 542777 323075 446613 370504
7678C70504j5392j11851n1642K8822O7527k36078L3258M49077j45300m92076L25545
$$ 370504 355112 243261 191619 220441 287968 51890 85148 534225 388925 -103151 222394
7667B22394M90720R533j14902o6621j5442m06942M53734J47697m34832k58215
$$ 222394 713114 722647 607745 541124 525682 118740 572474 720171 285339 27124
7657B7124K40170k4768M9354K42975k51181k67530j35247K32004L89960k45129
$$ 27124 267294 242526 291880 534855 283674 16144 -119103 112901 502861 257732
7647B57732j36740K37105J03258k81121K66226K8376N6343n41749J20859N98804
$$ 257732 120992 358097 461355 180234 446460 474836 531179 -10570 110289 709093
7637G09093k24895N1602K14271m73400l4167L23220L3257j76539J73863J14297
$$ 709093 484198 535800 750071 276671 242504 565724 598981 422442 596305 710602
7627G10602m29420j38791K81840M66k37030J5786L04765M6165o55232j66049M99931
$$ 710602 281182 142391 424231 424697 187667 203453 508218 554383 -100849 -266898 233033
7616B33033L89234r9353q6568j68153P2727Q5156l57567j12070m157Q8328M99286
$$ 233033 622267 522914 436346 268193 340920 426076 68509 -43561 -47718 40610 539896
7605E39896L7830j84252p1818k57224J02900J61489L8195j32107p9271k3122L06533
$$ 539896 577726 393474 321656 64432 167332 328821 367016 234909 155638 132516 439049
7594D39049J08225l34221p9142K23651j49738K58776J27831m2479k70448K34147
$$ 439049 547274 213053 133911 357562 207824 466600 594431 551952 281504 515651
7584E15651n6843k21724K13262N1178m2505k85091k6115J54625J35875N0858J65491
$$ 515651 458808 237084 450346 501524 459019 173928 147813 302438 438313 489171 654662
7573F54662m9157J37823r7019k6705m33928k8259J19574L53582J49110k52932
$$ 654662 605505 743328 646309 619604 185676 157417 276991 630573 779683 526751
7563E26751j35265m1616l00213L28895L8733m06159j46836j36164o234L17882
$$ 526751 391486 349870 49657 378552 417285 11126 -135710 -271874 -278108 39774
7553C9774Q1578k16739J50606J63483j59664N93366J03052J43505k62675j60103
$$ 39774 121352 -95387 55219 218702 59038 652404 755456 898961 636286 476183
7543D76183J47160n5849k28429l24873J43870l68113J04347N79374j88522j74229
$$ 476183 623343 567494 339065 14192 158062 -210051 -105704 473670 285148 110919
7533A10919q2566N03777O7298m3600l03694k2127O01257M9287o9334j47009m13545
$$ 110919 28353 532130 599428 555828 252134 230007 831264 880551 811217 664208 250663
7522B50663j96309M9603J14399K84992n1279j67369k15426M55207L04050j85304
$$ 250663 54354 103957 218356 503348 452069 284700 69274 524481 828531 643227
7512F43227j37363L04274l37412m4406M86618J0062Q4800l0237l84398J13469
$$ 643227 505864 810138 472726 428320 914938 925000 1009800 979563 595165 708634
7502G08634j0145j14033K15587l5057k66532M9641J11633K46466R1039P997M8615
$$ 708634 698489 584456 800043 764986 498454 548095 659728 906194 997233 1005230 1053845
7491A053845K33789J01263n26946n9743R8515j02434P9970M27699l21963l33858
$$ 1053845 1287634 1388897 861951 802208 900723 798289 878259 1305958 983995 650137
7481F50137K1431J45400O0256l73954L03915M31705j1138J0524j97776j83253
$$ 650137 671568 816968 877224 503270 807185 1238890 1227752 1238276 1040500 857247
7471H57247N25737J60667O3492k67953o3298J08168j94173N0293J85985k68238
$$ 857247 1382984 1543651 1607143 1339190 1275892 1384060 1189887 1240180 1426165 1157927
7461A157927L09914q6979J45054J77526l21952J43762J95072K6021L62K9640j27998
$$ 1157927 1467841 1380862 1525916 1703442 1381490 1525252 1720324 1746345 1746707 1776347 1648349
7450A648349J75644K31650q7366m13937R087J36037N4298J52579J4265j81025
$$ 1648349 1823993 2055643 1968277 1554340 1563427 1699464 1753762 1906341 1920606 1739581
7440A739581K63848K96671R7020J07004J39333j10017l0181l35814J75728L83868
$$ 1739581 2003429 2300100 2397120 2504124 2643457 2533440 2503259 2167445 2343173 2727041
7430B727041l98327J91059K28422n0840K62786K50900j30979Q5058K91524r8708
$$ 2727041 2328714 2519773 2748195 2697355 2960141 3211041 3080062 3165120 3456644 3357936
7420C357936j13101K10953J60831M10688J40242L66965K86087j45055N95431R5823
$$ 3357936 3244835 3455788 3616619 4027307 4167549 4534514 4820601 4675546 5270977 5366800
7410E366800k51575N73984R666l58026J4008m96542k51326J90991l07691j91397
$$ 5366800 5115225 5689209 5698875 5340849 5354857 4858315 4606989 4797980 4490289 4298892
7400D298892r9395k13017j92684n38299m14025Q8638n78984k25251K69472K34428
$$ 4298892 4199497 3986480 3793796 3255497 2841472 2930110 2351126 2125875 2395347 2629775
7390B629775R0737k05782n3022j85086J29948k80611K88321j46551j71532k4206
$$ 2629775 2720512 2514730 2461708 2276622 2406570 2125959 2414280 2267729 2096197 2071991
7380B071991L2256M8812J70077j36302k10336K58535O2213j63875P8942L33797
$$ 2071991 2104247 2153059 2323136 2186834 1976498 2235033 2297246 2133371 2212313 2546110
7370B546110j4432J01670n9391N34387J16967k02581m42941J75958P5541q0658
$$ 2546110 2531678 2633348 2573957 3108344 3225311 3022730 2579789 2755747 2831288 2750630
7360B750630j05562J1234J67009L8768J96579j41383l1164M89113k27665k34468
$$ 2750630 2645068 2656302 2823311 2862079 3058658 2917275 2886111 3375224 3147559 2913091
7350B913091j43084j65118q7179m61632k9502J11559k05393L31060j40178l09713
$$ 2913091 2770007 2604889 2517710 2056078 2026576 2138135 1932742 2263802 2123624 1813911
7340A813911j21006K5854M7282M2113k55641k94050M06402M70067M55070k92570
$$ 1813911 1692905 1718759 1766041 1808154 1552513 1258463 1664865 2134932 2590002 2297432
7330B297432n51856L9459l40961K418J21861j42882N31738m6357m87714k53923
$$ 2297432 1745576 1785035 1444074 1446492 1568353 1425471 1957209 1910852 1423138 1169215
7320A169215N19853k83920J34933K03513k06357j20677L11511L8262K58450j10065
$$ 1169215 1689068 1405148 1540081 1743594 1537237 1416560 1728071 1766333 2024783 1914718
7310A914718k03279l16499J49334K47817j67126j98252J76359R7876l628J05810
$$ 1914718 1711439 1394940 1544274 1792091 1624965 1426713 1603072 1700948 1697320 1803130
7300A803130l25440l7896j57456J95763J3572L48742N15564j08911l21101m16828
$$ 1803130 1477690 1439794 1282338 1478101 1491673 1840415 2355979 2247068 1925967 1509139
7290A509139J07739J74630k74218M6161J96180j45174J35589K54368m61970J90878
$$ 1509139 1616878 1791508 1517290 1563451 1759631 1614457 1750046 2004414 1542444 1733322
7280A733322L31967K47240J87850m175o1907J30234j23424n23622J05115L57897
$$ 1733322 2065289 2312529 2500379 2496204 2434297 2564531 2441107 1917485 2022600 2380497
7270B380497L9008n74855n7259O5844O03406m1956j40314J07346N19843k66560
$$ 2380497 2419505 1844650 1787391 1853235 2456641 2414685 2274371 2381717 2901560 2635000
7260B635000K7609J97573j16531J97826j6106m5484l02737o0041J31379M4968
$$ 2635000 2662609 2860182 2743651 2941477 2925371 2879887 2577150 2517109 2648488 2693456
7250B693456J4735L79973N4700k68634q7204J22940O8689L33580j56903K6890
$$ 2693456 2708191 3088164 3142864 2874230 2787026 2909966 2978655 3312235 3155332 3182222
7240C182222k5106k01453j74979J37102L99479Q1674j0514M5087l06276L93974
$$ 3182222 3157116 2955663 2780684 2917786 3317265 3398939 3388425 3433512 3127236 3521210
7230C521210K59236j62475J41464k80918n2801J66492j01876J25501k67748J27066
$$ 3521210 3780446 3617971 3759435 3478517 3425716 3592208 3490332 3615833 3348085 3475151
7220C475151L41530K91396q9761J17060p6314j62236j89863K90487M90925o3326
$$ 3475151 3816681 4108077 4018316 4135376 4059062 3896826 3706963 3997450 4488375 4425049
7210D425049J17800M97475j59487k71381L16697J57143J09714j73485o1977j27555
$$ 4425049 4542849 5040324 4880837 4609456 4926153 5083296 5193010 5019525 4957548 4829993
7200D829993K57766J35107J39310J29690J60154L31207k26237J00317J24737P5803
$$ 4829993 5087759 5222866 5362176 5491866 5652020 5983227 5756990 5857307 5982044 6057847
7190F057847M89740K62115J73810J34414K06516M02835o6606J46700J11527N44135
$$ 6057847 6547587 6809702 6983512 7117926 7324442 7727277 7660671 7807371 7918898 8463033
7180H463033n764P6356M07745M29399P34304J90983L19982J51824L10440M58163
$$ 8463033 8457269 8533625 8941370 9370769 10105073 10296056 10616038 10767862 11078302 11536465
7170A1536465M69564O67288L81985K94677M45874R57416N37117J296815R32343
$$ 11536465 12006029 12673317 13055302 13349979 13795853 14753269 15290386 16587201 17519544
7161A7519544R94123J088912R39639J690247J512936J786400J731787K046308
$$ 17519544 18513667 19602579 20542218 22232465 23745401 25531801 27263588 29309896
7153B9309896K682827K872929L112895L614979M538824M854118N747280O883182
$$ 29309896 31992723 34865652 37978547 41593526 46132350 50986468 56733748 63616930
7145F3616930P309219P250095O836720O326374M682119L053117M59239k733492
$$ 63616930 70926149 78176244 85012964 91339338 96021457 99074574 99533813 96800321
7137I6800321m099837l331773k874221j702283j139878J20762J036832K154917
$$ 96800321 92700484 89368711 86494490 84792207 83652329 83773091 84809923 86964840
7129H6964840L385001M338851N409384O869593Q676535R885640J0569838J0924852
$$ 86964840 90349841 94688692 100098076 106967669 115644204 125529844 136099682 147024534
7121A47024534J0577833Q480484O298098K647873j430279m819273p041946p692859
$$ 147024534 157602367 166082851 172380949 175028822 173598543 168779270 161737324 154044465
7113A54044465q138013q361915q136846o613540n225857m287335k897618j433162
$$ 154044465 145906452 137544537 129407691 122794151 117568294 113280959 110383341 108950179
7105A08950179j422416M44726J569276K252040L378126M433632M378070L169522
$$ 108950179 107527763 107972489 109541765 111793805 115171931 119605563 123983633 127153155
7097A27153155L333239J925382l53940l203575o709323q296017q937820q240497
$$ 127153155 130486394 132411776 132057836 128854261 122144938 113848921 104911101 96670604
7089I6670604p510443o209938n796168n078890m000365m165779l312130k551986
$$ 96670604 89160161 82950223 77154055 72075165 68074800 63909021 60596891 58044905
7081E8044905k694480k071618k308178k105628k658717k664835k434837k785291
$$ 58044905 55350425 53278807 50970629 48865001 46206284 43541449 41106612 38321321
7073C8321321k512998k584838k594387j427612j177795j971817j148820j770389
$$ 38321321 35808323 33223485 30629098 29201486 28023691 26051874 24903054 23132665
7065B3132665j457158j090091r54531j102081j169360p62635r68322o31133n82543
$$ 23132665 21675507 20585416 19630885 18528804 17359444 16596809 15628487 14997354 14414811
$$ [...]
##END NTUPLES=NMR SPECTRUM
##END=
