##TITLE=1H_TG-2389-b
 200.13MHz, CDCl3,
 8 sc
 
 21.8.2025
##JCAMPDX= 6.0         $$ Bruker NMR JCAMP-DX V2.0
##DATA TYPE= NMR SPECTRUM
##DATA CLASS= NTUPLES
##ORIGIN= UXNMR, Bruker Analytische Messtechnik GmbH
##OWNER= pz
$$ XWIN-NMR		Version 3.5
$$ Thu Aug 21 14:02:37 2025 Russian Standard Time (UT+4h)  she@DPX200
##.OBSERVE FREQUENCY= 200.1313
##.OBSERVE NUCLEUS= ^1H
##.ACQUISITION MODE= SIMULTANEOUS
##.ACQUISITION SCHEME= undefined
##.AVERAGES= 8
##.DIGITISER RES= 18
##SPECTROMETER/DATA SYSTEM= spect
##.PULSE SEQUENCE= zg30
##.SOLVENT NAME= CDCl3
##.SHIFT REFERENCE= (INTERNAL, CDCl3, 0, 14.5735)
##AUDIT TRAIL= $$ (NUMBER, WHEN, WHO, WHERE, WHAT)
$$ ##TITLE= Audit trail, XWIN-NMR		Version 3.5
$$ ##JCAMPDX= 5.01
$$ ##ORIGIN= Bruker BioSpin GmbH
$$ ##OWNER= she
$$ F:/spectra/data/she/nmr/H-C/1/pdata/1/auditp.txt
$$ ##AUDIT TRAIL=  $$ (NUMBER, WHEN, WHO, WHERE, WHAT)
(   1,<2025-08-21 14:01:08.95 +0400>,<she>,<DPX200>,
      <created by zg, POWCHK disabled, PULCHK disabled
       configuration hash MD5:
       00 E9 B6 7A A2 85 ED C7 34 08 36 98 17 FE 4E 26
       data hash MD5: 16K
       EB EC B8 EB 21 B5 50 16 DE CE 49 CF 42 BF 07 72>)
(   2,<2025-08-21 14:01:15.29 +0400>,<she>,<DPX200>,
      <Start of raw data processing
       efp BC_mod = 2 LB = 0.25 FT_mod = 6 PKNL = 1 PHC0 = -1561.662 PHC1 = 10.59229 SI = 16K 
       data hash MD5: 16K
       C8 3E 58 79 DE D6 63 D3 D5 35 69 84 CB 7D BC D0>)
(   3,<2025-08-21 14:01:30.37 +0400>,<she>,<DPX200>,
      <pk PHC0 = 2.740943 PHC1 = -3.8 
       data hash MD5: 16K
       BC 87 E2 80 5D 30 69 A6 04 B5 DB A1 4D 8B 5A D7>)
(   4,<2025-08-21 14:01:33.62 +0400>,<she>,<DPX200>,
      <abs ABSG = 5 
       data hash MD5: 16K
       3D DF 46 29 55 09 56 E9 57 8A DB 5E 4D 63 06 59>)
$$ ##END=
$$ 
$$ hash MD5
$$ E4 CC CD C1 43 E2 22 16 EF B4 15 96 7B BF 32 66
##$RELAX= 
##$RELAX= 
##$RELAX= 
##$RELAX= 
##$RELAX= 
##$RELAX= 
$$ Bruker specific parameters
$$ --------------------------
##$DU= <F:/spectra>
##$EXPNO= 1
##$NAME= <H-C>
##$PROCNO= 1
##$TYPE= <nmr>
##$USER= <she>
##$AMP= (0..31)
100 100 100 100 100 100 100 100 100 100 100 100 100 100 100 100 100 100 
100 100 100 100 100 100 100 100 100 100 100 100 100 100 
##$AQSEQ= 0
##$AQ_mod= 1
##$AUNM= <au_zg>
##$AUTOPOS= <>
##$BF1= 200.13
##$BF2= 200.13
##$BF3= 200.13
##$BF4= 200.13
##$BF5= 200.13
##$BF6= 200.13
##$BF7= 200.13
##$BF8= 200.13
##$BYTORDA= 1
##$CFDGTYP= 0
##$CFRGTYP= 5
##$CHEMSTR= <none>
##$CNST= (0..31)
1 1 145 1 1 1 1 1 1 1 1 1 1 1 1 1 1 1 1 1 1 1 1 1 1 1 1 1 1 1 1 1 
##$CPDPRG= <>
##$CPDPRG1= <>
##$CPDPRG2= <>
##$CPDPRG3= <>
##$CPDPRG4= <mlev>
##$CPDPRG5= <mlev>
##$CPDPRG6= <mlev>
##$CPDPRG7= <mlev>
##$CPDPRG8= <mlev>
##$CPDPRGB= <>
##$CPDPRGT= <>
##$D= (0..31)
0 0.7 0 0 0 0 0 0 0 0 0 0.03 0 0 0 0 0 0 0 0 0 0 0 0 0 0 0 0 0 0 0 0 
##$DATE= 1755770468
##$DBL= (0..7)
120 120 120 120 120 120 120 120 
##$DBP= (0..7)
150 150 150 150 150 150 150 150 
##$DBP07= 0
##$DBPNAM0= <>
##$DBPNAM1= <>
##$DBPNAM2= <>
##$DBPNAM3= <>
##$DBPNAM4= <>
$$ [...]
##$SUBNAM3= <"">
##$SUBNAM4= <"">
##$SUBNAM5= <"">
##$SUBNAM6= <"">
##$SUBNAM7= <"">
##$SUBNAM8= <"">
##$SUBNAM9= <"">
##$SW= 18.0517328524113
##$SWIBOX= (0..15)
0 0 2 0 0 0 0 0 0 0 0 0 0 0 0 0 
##$SW_h= 3612.71676300578
##$TD= 16384
##$TD0= 1
##$TE= 0
##$TE2= 300
##$TE3= 300
##$TEG= 300
##$TL= (0..7)
0 120 120 120 120 120 120 120 
##$TP= (0..7)
150 150 150 150 150 150 150 150 
##$TP07= 0
##$TPNAME0= <>
##$TPNAME1= <>
##$TPNAME2= <>
##$TPNAME3= <>
##$TPNAME4= <>
##$TPNAME5= <>
##$TPNAME6= <>
##$TPNAME7= <>
##$TPOAL= (0..7)
0.5 0.5 0.5 0.5 0.5 0.5 0.5 0.5 
##$TPOFFS= (0..7)
0 0 0 0 0 0 0 0 
##$TUNHIN= 0
##$TUNHOUT= 0
##$TUNXOUT= 0
##$USERA1= <user>
##$USERA2= <user>
##$USERA3= <user>
##$USERA4= <user>
##$USERA5= <user>
##$V9= 5
##$VALIST= <valist>
##$VCLIST= <CCCCCCCCCCCCCCC>
##$VD= 0
##$VDLIST= <DDDDDDDDDDDDDDD>
##$VPLIST= <PPPPPPPPPPPPPPP>
##$VTLIST= <TTTTTTTTTTTTTTT>
##$WBST= 1024
##$WBSW= 4
##$XGAIN= (0..3)
0 0 0 0 
##$XL= 0
##$YL= 0
##$YMAX_a= 346736
##$YMIN_a= -350018
##$ZGOPTNS= <>
##$ZL1= 120
##$ZL2= 120
##$ZL3= 120
##$ZL4= 120
##$ABSF1= 14.57567
##$ABSF2= -3.476162
##$ABSG= 5
##$ABSL= 3
##$ALPHA= 0
##$AQORDER= 0
##$ASSFAC= 0
##$ASSFACI= 0
##$ASSFACX= 0
##$ASSWID= 0
##$AUNMP= <proc_1d>
##$AZFE= 0.1
##$AZFW= 0.1
##$BCFW= 0
##$BC_mod= 2
##$BYTORDP= 0
##$COROFFS= 0
##$CY= -3
##$DATMOD= 1
##$DC= 0
##$DFILT= <>
##$DTYPP= 0
##$F1P= 0
##$F2P= 0
##$FCOR= 1
##$FTSIZE= 16384
##$FT_mod= 6
##$GAMMA= 0
##$GB= 0
##$INTBC= 1
##$INTSCL= 3.241238e-09
##$ISEN= 128
##$LB= 0.25
##$LEV0= 0
##$LPBIN= 0
##$MAXI= 10000
##$MC2= 0
##$MEAN= 0
##$ME_mod= 0
##$MI= 1.114404
##$NCOEF= 0
##$NC_proc= -6
##$NLEV= 6
##$NOISF1= 3.799351
##$NOISF2= 2.8
##$NSP= 0
##$NTH_PI= 0
##$NZP= 0
##$OFFSET= 14.57346
##$PC= 1
##$PHC0= -1558.921
##$PHC1= 6.79229
##$PH_mod= 1
##$PKNL= yes
##$PPARMOD= 0
##$PSCAL= 0
##$PSIGN= 0
##$REVERSE= no
##$SF= 200.130189768982
##$SI= 16384
##$SIGF1= 3
##$SIGF2= 2
##$SINO= 0.751879
##$SIOLD= 32768
##$SREGLST= <19F.Aceton>
##$SSB= 0
##$STSI= 16384
##$STSR= 0
##$SW_p= 3612.71676300578
##$SYMM= 0
##$S_DEV= 0
##$TDeff= 16384
##$TDoff= 0
##$TI= <>
##$TILT= no
##$TM1= 0
##$TM2= 0
##$TOPLEV= 0
##$USERP1= <user>
##$USERP2= <user>
##$USERP3= <user>
##$USERP4= <user>
##$USERP5= <user>
##$WDW= 1
##$XDIM= 16384
##$YMAX_p= 367154878
##$YMIN_p= -824573
$$ End of Bruker specific parameters
$$ ---------------------------------
##NTUPLES= NMR SPECTRUM
##VAR_NAME=  FREQUENCY,     SPECTRUM/REAL,   SPECTRUM/IMAG
##SYMBOL=    X,             R,               I
##VAR_TYPE=  INDEPENDENT,   DEPENDENT,       DEPENDENT
##VAR_FORM=  AFFN,          ASDF,            ASDF
##VAR_DIM=   16384,         16384,           16384
##UNITS=     HZ,            ARBITRARY UNITS, ARBITRARY UNITS
##FACTOR=    0.220516191357247, 1,           1
##FIRST=     2916.58924039071, 0,            0
##LAST=      -696.127522615073, 0,           0
##MIN=       -696.127522615073, -824573,     0
##MAX=       2916.58924039071, 367154878,    0
$$ Real data points
##PAGE= N=1
##DATA TABLE= (X++(R..R)), XYDATA
$$ [...]
9672G913840l91850m82095k77751l44479k35069n9093k02858p1722k89331l02804
$$ 7913840 7521990 7039895 6762144 6417665 6182596 6123503 5920645 5848923 5559592 5256788
9662E256788j12226j56739j48638J6684r6104r0923q1122N88K763j67436o5690
$$ 5256788 5144562 4987823 4839185 4855869 4759765 4668842 4587720 4588308 4591071 4423635 4357945
9651D357945r0651j43674j85119J6564j15968q5126n4441p6586q6661J05868j35181
$$ 4357945 4267294 4123620 3938501 3955065 3839097 3753971 3699530 3622944 3536283 3642151 3506970
9640C506970l6441Q0748o2445j01418j71296m9125j0614j39449n4059j11589j5205
$$ 3506970 3470529 3551277 3488832 3387414 3216118 3166993 3156379 3016930 2962871 2851282 2836077
9629B836077O5329M6272q880m7319m4532K3220J11108K7273L5064r6842j42943
$$ 2836077 2901406 2947678 2938798 2891479 2846947 2870167 2981275 3008548 3043612 2946770 2803827
9618B803827P2895p8845O0746L7340j41191j15090r5250l2062l8418J49189n7365
$$ 2803827 2876722 2797877 2858623 2895963 2754772 2639682 2544432 2512370 2473952 2623141 2565776
9607B565776l6982m9566N4275M8517j60843k9594J40997k2618M2100j02900P2768
$$ 2565776 2528794 2479228 2533503 2582020 2421177 2391583 2532580 2509962 2552062 2449162 2521930
9596B521930J55026L7287J3996j35859J3542Q1141j0823l5350J64622O7049j6488
$$ 2521930 2676956 2714243 2728239 2592380 2605922 2687063 2676240 2640890 2805512 2872561 2856073
9585B856073j29990L1485l0236l9790j09455j50828j15729J3140k59694N960q039
$$ 2856073 2726083 2757568 2727332 2687542 2578087 2427259 2311530 2324670 2064976 2070936 2062897
9574B062897l3065k5013j71366p9423Q1363O1809L416j89306k167R8794P5671
$$ 2062897 2029832 2004819 1833453 1754030 1835393 1897202 1900618 1711312 1709145 1807939 1883610
9563A883610j53906m1163J35670M3093r3379o2781Q2053R3718N7486q6175N1567
$$ 1883610 1729704 1688541 1824211 1867304 1773925 1711144 1793197 1886915 1944401 1858226 1909793
9552A909793m8979m7573J54138L3140j28622j3734l0165o386j10305j30330J0570
$$ 1909793 1860814 1813241 1967379 2000519 1871897 1858163 1827998 1821612 1711307 1580977 1591547
9541A591547J60644j56854o1541j94723j67643K3332N6937l8151k736o0957j9007
$$ 1591547 1752191 1595337 1533796 1339073 1171430 1194762 1251699 1213548 1210812 1149855 1130848
9530A130848n221Q2398r3907j4678K8602Q7915J0877p7264l8477k255J57883r0106
$$ 1130848 1125627 1208025 1114118 1099440 1128042 1215957 1226834 1149570 1111093 1108838 1266721 1176615
9518A176615q4347j3151l1223M0784J31148m4109Q5924q6468j66359K1388n7125
$$ 1176615 1092268 1079117 1047894 1088678 1219826 1175717 1261641 1175173 1008814 1030202 973077
9507I73077l8157J1997N9813J20791p9659j79577j29968N7851o5059j8355Q1520
$$ 973077 934920 946917 1006730 1127521 1047862 868285 738317 796168 731109 712754 794274
9496G94274p6838l0079j6932p243j8221O7235L7302Q476p0818O6541N7747N372
$$ 794274 717436 687357 670425 663182 644961 712196 749498 757974 687156 753697 811444 816816
9484H16816k3529l8284Q9837m2745j08837J5668n3224M0508M0540j6847l1456
$$ 816816 793287 755003 844840 802095 693258 708926 655702 696210 736750 719903 688447
9473F88447r629o172n1000m9264Q678l5756L0008Q8924L861K4568q9796j9862
$$ 688447 678818 672646 621646 572382 581060 545304 575312 664236 668097 692665 602869 583007
9461E83007n5501l4421J16962k8585j3641q6242N0315J4718l2405j5994k0350
$$ 583007 527506 493085 610047 581462 567821 481579 531894 546612 514207 498213 477863
9450D77863l1385m3739q3863R464O0121J76812p3589m8384J30517n3711j8108
$$ 477863 446478 402739 318876 328340 388461 565273 491684 443300 573817 520106 501998
9439E01998l1823m6660J14435k0497o4433q1612K9222J44524j8101L3710L6519
$$ 501998 470175 423515 537950 517453 453020 371408 400630 545154 527053 560763 597282
9428E97282m8796O2673j03844K0591O7802k8237P52N9383k7141k03378N1013l4832
$$ 597282 548486 611159 507315 527906 595708 567471 568223 627606 600465 397087 448100 413268
9416D13268P5979k6801L5411p3432r431L3068J40009Q0779j50833Q5734l5899
$$ 413268 489247 462446 497857 424425 414994 448062 588071 668850 518017 603751 567852
9405E67852p3439K710r8193l5073r9030Q0377m0659J4635n4500k5014O3973J73652
$$ 567852 494413 497123 398930 363857 264827 345204 304545 319180 264680 239666 303639 477291
9393D77291m7839N781L8107K8830l9581r6824M1179K4183Q0097J8016O0809P012
$$ 477291 429452 435233 473340 502170 462589 365765 406944 431127 511224 529240 590049 597061
9381E97061m9895q9119m1290J79627N7723m3235j6293k8113o9488j49839O9651
$$ 597061 547166 458047 416757 596384 654107 610872 594579 566466 496978 347139 416790
9370D16790P0194m7113J9249m8476L2892J01652M9789J8913j46090m0484M7288
$$ 416790 486984 439871 459120 410644 443536 545188 594977 613890 467800 427316 474604
9359D74604L2088J5464L1154O8982j13272j07330J47726j1004r8806o4124o9394
$$ 474604 506692 522156 553310 622292 509020 401690 549416 538412 439606 375482 306088
9348C06088O8889l1849j20863K6026R6603J04052l0407m3338j46510q0571J61891
$$ 306088 374977 343128 222265 248291 344894 448946 418539 375201 228691 148120 310011
9337C10011R6693r3832M5782m7772p0373L7528j076M7765J7073n632l7267M3535
$$ 310011 406704 312872 358654 310882 240509 278037 276961 324726 341799 336167 298900 342435
9325C42435j71506L8858M2666m2046J15476N8642q8420j68256q9752O1472K7211
$$ 342435 170929 209787 252453 210407 325883 384525 296105 127849 38097 99569 126780
9314A26780J68523J92837J1187j25425j40659o8726o3805R4232J21936m5226M3781
$$ 126780 295303 488140 499327 373902 233243 164517 100712 194944 316880 271654 315435
9303C15435l489n7138M8213J4561O4515J60237l4900m0231l6690k6857P6001K6576
$$ 315435 311946 254808 303021 317582 382097 542334 507434 467203 430513 403656 479657 506233
9291E06233l4164n6705Q15n6698K9432J02974q1338r2931J03292j09813N0716
$$ 506233 472069 415364 416179 359481 388913 491887 410549 317618 420910 311097 361813
9280C61813N016L4868l8187p6299m3772J8384K1119P4051j25751K6943q063p7164
$$ 361813 366829 401697 363510 287211 243439 261823 282942 356993 231242 258185 250122 172958
9268A72958r4175l5214j4242M1290J01396k1849M8453n1900o1640N9559k1579
$$ 172958 78783 43569 29327 70617 172013 150164 198617 146717 85077 144636 123057
9257A23057Q5230m0166J1108P6216N4820J11613J16578k0700j21966r8722p7251
$$ 123057 208287 168121 179229 255445 310265 421878 538456 517756 395790 297068 219817
9246B19817J01150n2921l3603N4595j29910K0811j2724o8471R1596p0673p6375
$$ 219817 320967 268046 234443 289038 159128 179939 167215 98744 190340 119667 43292
9235D3292l5507n6541K3664O448O0097j9825l7871R6579j09172N8847p81k5473
$$ 43292 7785 -48756 -25092 -18644 41453 21628 -16243 80336 -28836 30011 29230 3757
9223C757k1161m1768n2552P7628L3047L9282m5353r7262l2104R6472J5135J13973
$$ 3757 -17404 -59172 -111724 -34096 -1049 38233 -7120 -104382 -136486 -40014 -24879 89094
9211H9094m6465p3264m1232l0834L8743j0813J01486j36353M5572P146R9517J05284
$$ 89094 42629 -30635 -71867 -102701 -63958 -74771 26715 -109638 -64066 -56920 42597 147881
9199A47881j7687n0280j8776n082p5530L7321O6735j8604O8318o5731j62240J64754
$$ 147881 130194 79914 61138 56056 -19474 17847 84582 65978 134296 68565 -93675 71079
9187G1079N1727K3984j1052j80713Q7317L0689m3882M3505P6237p1496K6414N3383
$$ 71079 122806 146790 135738 -44975 42342 73031 29149 72654 148891 77395 103809 157192
9175A57192q4078p653l179O5875j39772R7137N8328n5598J26000o9495o0594j3224
$$ 157192 73114 65461 62282 128157 -11615 85522 143850 88252 214252 144757 84163 70939
9163G0939o220j23649K4042n3262J9223P6120p2971L918r2075O0216l0405J42220
$$ 70939 64719 -58930 -34888 -88150 -68927 7193 -65778 -61860 -153935 -93719 -124124 18096
9151A8096j75593N5715O3334P936K1825m5614j03506Q8935J00189Q4189m566k4360
$$ 18096 -157497 -101782 -38448 -30512 -8687 -54301 -157807 -68872 31317 115506 110940 86580
9139H6580J1336K0243k9143j38738J2781m7450O9459R920q6348k3112k6058J7309
$$ 86580 97916 118159 89016 -49722 -36941 -84391 -14932 -5012 -91360 -114472 -140530 -123221
9127a23221R6610l8900p4651n8464J29615k4889L863n2184j20313P2525J31129
$$ -123221 -26611 -65511 -140162 -198626 -69011 -93900 -90037 -142221 -262534 -190009 -58880
9116e8880k7892n8090j45983J4156J95054P7440m8788m335P9874p1376O0100o5515
$$ -58880 -86772 -144862 -290845 -276689 -81635 -4195 -52983 -57318 22556 -48820 11280 -54235
9104e4235n2005L8343n0560N7784N9769O047o9847J4181M9828o8541p7095K1118
$$ -54235 -106240 -67897 -118457 -60673 -904 5143 -64704 -50523 -695 -69236 -146331 -125213
9092a25213J54078n5078o8557P6688j5027J6168j09523M0078k2778Q5136J45852
$$ -125213 28865 -26213 -94770 -18082 -33109 -16941 -126464 -86386 -109164 -24028 121824
9081A21824k5159j18536P266j12516k8402Q6104P2120q8362J12057N429j13685
$$ 121824 96665 -21871 -14605 -127121 -155523 -69419 2701 -85661 26396 31825 -81860
9070h1860J220L7620M3430r3960j8629P0031r716j95815O9420N3714O0277O8150
$$ -81860 -80640 -43020 410 -93550 -112179 -42148 -51864 -247679 -178259 -124545 -64268 3882
9058C882L8422k17193J4751P4644o1726K2368N8532r1996m5156l9013M9190K598
$$ 3882 42304 -174889 -160138 -85494 -147220 -124852 -66320 -158316 -203472 -242485 -193295 -190697
9046a90697q210J22608K1840O875n3073l1481M1356K9845j11320k7043j11785
$$ -190697 -198907 -76299 -54459 -47584 -100657 -132138 -90782 -60937 -172257 -199300 -311085
9035c11085J06695K6321n2795l2786P399M9066J0718L9449P9633l1157J45272
$$ -311085 -204390 -178069 -230864 -263650 -256251 -207185 -196467 -157018 -77385 -108542 36730
9024C6730q1941j13202K8200j11934j1823R1755K3906P172J08915j44868j25565
$$ 36730 -45211 -158413 -130213 -242147 -253970 -162215 -138309 -131137 -22222 -167090 -292655
9013b92655J18875P8656l8660N7515l8431l6919J76416q9008q1695K0390N4886
$$ -292655 -173780 -95124 -133784 -76269 -114700 -151619 24797 -64211 -145906 -125516 -70630
9002g0630J10873j28028l1548M5970n938j76571j9582J04679M3530j42662Q5218
$$ -70630 40243 -87785 -119333 -73363 -79301 -255872 -275454 -170775 -127245 -269907 -184689
8991a84689J34554R6320P4183j05769n8963O2283Q279r9840j7557q5873P4761
$$ -184689 -50135 46185 120368 14599 -44364 17919 26198 -73642 -91199 -177072 -102311
8980a02311j6617k6142Q275M5748O523J29480J1351r2332l0981k8009N724K6313
$$ -102311 -118928 -145070 -136795 -91047 -84524 44956 56307 -36025 -67006 -95015 -89291 -62978
8968f2978L0714K4880p0975K41R0267J3689j47625N7802J07024j90696o2264K0482
$$ -62978 -32264 -7384 -78359 -78118 12149 25838 -121787 -63985 43039 -147657 -209921 -189439
8956a89439j2707N650O6516o4897K4970j27335M4053R3940l3760K5988M0696k092
$$ -189439 -202146 -196496 -129980 -194877 -169907 -297242 -253189 -159249 -193009 -167021 -126325 -128417
8944a28417o7765j8172J11352J03330N3483j9060p5019J5442Q1173j3285J5526
$$ -128417 -196182 -214354 -103002 328 53811 34751 -40268 -24826 56347 43062 58588
8933E8588j98577o3830J37101j06392k85L1766J09407N2552m292j5814l137j11772
$$ 58588 -139989 -203819 -66718 -173110 -173395 -141629 -32222 20330 16038 224 -2913 -114685
8921a14685N6589J32833j37309P9401m255m3951k5455M8881r4528J05326M0986
$$ -114685 -58096 74737 -62572 16829 12574 -31377 -56832 -7951 -102479 2847 43833
8910D3833J7205n222r6608j51719j9559O5154m5919j3644J78074Q1228P603m3381
$$ 43833 61038 55816 -40792 -192511 -212070 -146916 -192835 -206479 -28405 52823 60426 17045
8898A7045k9803m0285o9179P1132l8462M5944P7749m1670K1339k9045q7248M9073
$$ 17045 -12758 -53043 -122222 -51090 -89552 -43608 34141 -7529 13810 -15235 -102483 -53410
8886e3410k945k6106l2689l416j0252j7790J78216Q8610j26391m2540J2177Q9180
$$ -53410 -56355 -82461 -115150 -118566 -128818 -146608 31608 120218 -6173 -48713 -36536 52644
8874E2644K6318j63702k6079J12115M7678n3856O6267O1922r2978K3671n1083
$$ 52644 78962 -84740 -110819 1296 48974 -4882 61385 123307 30329 54000 2917
8863B917J2007l0014n5120m8382L0941J8098l8680j2262P9294j24295J65802K8255
$$ 2917 14924 -15090 -70210 -118592 -87651 -69553 -108233 -120495 -41201 -165496 306 28561
8851B8561j01144j0645j03691L1671M7896J41380R7938j06127o8180j8974o9160
$$ 28561 -72583 -83228 -186919 -155248 -107352 34028 131966 25839 -42341 -61315 -130475
8840a30475p1066L2097O1658O0037M6850J6163J1626o3983J8603J5145q7330J11153
$$ -130475 -201541 -169444 -107786 -47749 -899 15264 26890 -37093 -18490 -3345 -90675 20478
8828B0478L4602l8007l7822k0041m4969L1941J76221m6414j17011k2914j01210
$$ 20478 55080 17073 -20749 -40790 -85759 -53818 122403 75989 -41022 -63936 -165146
8817a65146M5443j4135J24695K7331j04502J2656M916J12177L5387p7727p6812
$$ -165146 -119703 -133838 -9143 18188 -86314 -73658 -68742 43435 78822 1095 -75717
8806g5717j13793J09220K2665k3781J26674o1032L3539j7656j59098J9662N3084
$$ -75717 -189510 -80290 -57625 -81406 45268 -15764 17775 119 -158979 -139317 -86233
8795h6233Q76q6153J41502N8036N531j65127J9808J14943j16747r477K6661P5731
$$ -86233 -85357 -171510 -30008 28028 33559 -131568 -111760 3183 -113564 -123041 -96380 -20649
8783b0649n7656M5864N2712p090L3337L7922L5722j618o7457p7859m0560J01391
$$ -20649 -78305 -32441 20271 13181 46518 84440 120162 118544 51087 -26772 -67332 34059
8771C4059r4408N1522J76198p3677q3048k2017J18462p654l8318q4922j2406j54770
$$ 34059 -60349 -8827 167371 93694 10646 -11371 107091 99437 61119 -23803 -36209 -190979
8759a90979R0904Q9759N8880K6443r3541O9844n6602O0134N4787N0631j82929
$$ -190979 -100075 -10316 48564 75007 -18534 51310 -5292 54842 109629 160260 -22669
8748b2669j34399j15945K53689r776K572R98O947L8856p715j15239N5268q2867
$$ -22669 -157068 -273013 -19324 -29100 -26528 -25530 -18583 20273 12558 -102681 -47413 -130280
8736a30280R1449m2833k981q370M6901p1014J7256o6922L4447J16806P464o695
$$ -130280 -38831 -81664 -84645 -93015 -46114 -117128 -99872 -166794 -132347 -15541 -8077 -14772
8724a4772N910J05349p2275j37239l7832M0609j8879K0099m9030J14591J9959
$$ -14772 -8862 96487 24212 -113027 -150859 -110250 -129129 -109030 -158060 -43469 -23510
8713b3510L4202j002m3786q7975M4638k6551n6987J3117N1308n985M7918k1762
$$ -23510 10692 9690 -34096 -122071 -77433 -103984 -160971 -147854 -96546 -102531 -54613 -76375
8701g6375k6815J63202n8217l0170J60838k05518L5721R167r8595M6027L1962
$$ -76375 -103190 60012 1795 -28375 132463 -73055 -37334 -28167 -126762 -80735 -48773
8690d8773P0408o3492P549M9232L3394Q2560o5288N2714J53569n5957o563n1840
$$ -48773 21635 -41857 -34308 14924 48318 130878 65590 118304 271873 215916 209353 157513
8678A57513J21125J6888P509O9425j11549J46355r9858N076L6640j30148j02656
$$ 157513 278638 295526 303035 372460 260911 407266 307408 312484 349124 218976 116320
8667A16320P2492O1492Q6224q1313L2600Q6436j15889j61211j2618m3829P3658
$$ 116320 188812 250304 336528 255215 287815 374251 258362 97151 84533 40704 114362
8656A14362J2670j194k2831M7207m5518N3698J8803p3318l6680q0334j38408l9786
$$ 114362 127032 125838 103007 150214 104696 158394 177197 103879 67199 -13135 -151543 -191329
8644a91329K60526k9447j09388p7182m9796Q8093P3133n1462l5706R2325j1173
$$ -191329 69197 39750 -69638 -146820 -196616 -108523 -35390 -86852 -122558 -30233 -41406
8633d1406J14409p5172o1365L6177l3602O4578n5280J59420l4749j6457P8348
$$ -41406 73003 -2169 -63534 -27357 -60959 3619 -51661 107759 73010 56553 134901
8622A34901j22377O6476M5212j39605l0969N7960l9112l6855L6397L7176P7539
$$ 134901 12524 79000 124212 -15393 -46362 11598 -27514 -64369 -27972 9204 86743
8611H6743K9363L43n8533o8379L7645K2298M5397j6853k3798o7810o7047R5907
$$ 86743 116106 116449 57916 -10463 27182 49480 94877 78024 54226 -13584 -80631 15276
8599A5276j02095q7267j3908J8259n831R9514M3701m3505l3784J19172j24807
$$ 15276 -86819 -174086 -187994 -169735 -175566 -76052 -32351 -75856 -109640 9532 -115275
8588a15275Q7512N0806r8742n1096l0952P0453M5717N4073j42594k4514M5551
$$ -115275 -27763 23043 -75699 -126795 -157747 -87294 -41577 12496 -130098 -154612 -109061
8577a09061o0213J72133j1929o013j17968k9933N026L6714R5436M4539j38497
$$ -109061 -169274 2859 -9070 -15083 -133051 -162984 -157958 -121244 -25808 18731 -119766
8566a19766K0550J06249K3496j7345n3550p909J10416n7370p572m1569r0068J26221
$$ -119766 -99216 7033 30529 13184 -40366 -48275 62141 4771 -2801 -44370 -134438 -8217
8554h217j05439j5609p3391J56476M4283N4721k0490r1017j30J18715j0931K4505
$$ -8217 -113656 -129265 -202656 -46180 -1897 52824 32334 -58683 -58813 59902 48971 73476
8542G3476l5705p6168r8780J40117J9046q1793p3306R1708L9724j12220M2622
$$ 73476 37771 -38397 -137177 2940 21986 -59807 -133113 -41405 -1681 -113901 -71279
8531g1279L7665n3483j6225L7721J61245p3680k7166K9964N329K2468M776J6716
$$ -71279 -33614 -87097 -103322 -65601 95644 21964 -5202 24762 30091 52559 57335 74051
8519G4051k0170o1238j02077n1780m8945M9560J18853m9531m2218J33225k7257
$$ 74051 53881 -7357 -109434 -161214 -210159 -160599 -41746 -91277 -133495 -270 -27527
8508b7527n0577J772J34834l3923n2927j15987J36482p8871r979J8509M8350L874
$$ -27527 -78104 -76332 58502 24579 -28348 -144335 -7853 -86724 -96703 -78194 -29844 -25970
8496b5970o3894m8891q4765N8064J9850p0515K5913J82654L4536O2058o9926j07014
$$ -25970 -89864 -138755 -223520 -165456 -145606 -216121 -190208 -7554 26982 89040 19114 -87900
8484h7900k721N9938n7635J5875M8934j7939M3240M352j02864Q632J0945K7513
$$ -87900 -90621 -30683 -88318 -72443 -23509 -41448 1792 6144 -96720 -88088 -77143 -49630
8472d9630M606P604R4926m8713n7684r82J6936j4250J6829q5324M0892j18356
$$ -49630 -45024 -37420 57506 8793 -48891 -49873 -32937 -47187 -30358 -115682 -74790 -193146
8460a93146K9730K8419O1853K7525O1744j1011M6334O5192j09594p9271n6498
$$ -193146 -163416 -134997 -73144 -45619 16125 5114 51448 116640 7046 -72225 -128723
8449a28723J1758j8315J56652J0608r4384n5729k7862J49187M4631j12289Q1615
$$ -128723 -116965 -135280 21372 31980 -62404 -118133 -145995 3192 47823 -64466 17149
8438A7149M3304j9828r5454n2697J29201j65238J3213Q6952J39284k1585j86379
$$ 17149 60453 40625 -54829 -107526 21675 -143563 -130350 -43398 95886 74301 -112078
8427a12078K4202L0275O8571j73989M7480J30120l1525p3129j70021k3946J21627
$$ -112078 -87876 -57601 10970 -163019 -115539 14581 -16944 -90073 -260094 -284040 -162413
8416a62413O2885K06672r9758l0736L5866n1566n7160O9396M8803L9847m3229
$$ -162413 -99528 107144 7386 -23350 12516 -39050 -96210 -26814 21989 61836 18607
8405A8607J32j12465K2537O2175l4013n7887o5094j73882J85459J56302m1416
$$ 18607 18739 -93726 -71189 -9014 -43027 -100914 -166008 -339890 -154431 1871 -39545
8394c9545K7323q5166l56N1768l8019M6564N8227N9980o238j5763M645j44362
$$ -39545 -12222 -97388 -97744 -45976 -83995 -37431 20796 80776 74538 58775 63420 -80942
8382h0942J20483n6949N7665k047q9268O0070Q5220j31450J44934k9679r5471
$$ -80942 39541 -17408 40257 38210 -51058 9012 94232 -37218 107716 78037 -17434
8371a7434J70867j13607j57376K2617O7434m7133J41680R7812r0577k1435j3252
$$ -17434 153433 39826 -117550 -94933 -27499 -74632 67048 164860 74283 52848 39596
8360C9596J4899p5065J7408o1688P7061K58939j4516R77m3507K7335L0596p2425
$$ 39596 54495 -20570 -3162 -64850 12211 271150 256634 257611 214104 241439 272035 199610
8348A99610l6915k3247K2841k2613P4179J17597j4852k06524J9021N7639J36963
$$ 199610 162695 139448 162289 139676 213855 331452 316600 110076 129097 186736 323699
8337C23699j36514j1667M2847j04853J274p1372p2646j0028J29290j7514j32160
$$ 323699 187185 175518 218365 113512 114786 43414 -29232 -39260 90030 72516 -59644
8326e9644j8766l5411J53751J5652K4401Q5616q9953M6944l6479j65648L7037
$$ -59644 -78410 -113821 39930 55582 79983 165599 75646 122590 86111 -79537 -42500
8315d2500J95192L6022M8943o7401J27634Q1767k4646j8810m0545l0735j14548
$$ -42500 152692 188714 237657 170256 297890 379657 355011 336201 295656 264921 150373
8304A50373K5988P7746k4231j0262j27068N7827q6650P1810l4840m5705O0750
$$ 150373 176361 254107 229876 219614 92546 150373 63723 135533 100693 54988 115738
8293A15738k4529L6857l2047o1896q7641N4207K1622K3736K2900P5915N6j1437
$$ 115738 91209 128066 96019 34123 -53518 689 22311 46047 68947 144862 144918 133481
8281A33481o1506o0733m1209o2034J01804p4775J33825J10468p4692j0261P9978
$$ 133481 71975 11242 -29967 -92001 9803 -64972 68853 179321 104629 94368 174346
8270A74346Q7763j69255M3450N2267N3318j6663R2099J45873m1374j00244k9614
$$ 174346 262109 92854 136304 188571 241889 225226 317325 463198 421824 321580 291966
8259B91966M9329M2498R2984L0380O3651J25701Q0915J68966J85412M1377J20721
$$ 291966 341295 383793 476777 507157 570808 696509 777424 946390 1131802 1173179 1293900
8248A293900J69576J19228J72761K7972q1083o7714l8963k8843j16426j05136
$$ 1293900 1463476 1582704 1755465 1783437 1702354 1634640 1595677 1566834 1450408 1345272
8238A345272j03312r1684k1698K4777l0356j0166n704j12842O3482p4174l9967
$$ 1345272 1241960 1150276 1128578 1153355 1122999 1112833 1107129 994287 1057769 983595 943628
8227I43628O8798j5469k60164p2811O0309j81288n6592j3339j88497M9573L3286
$$ 943628 1012426 996957 736793 663982 724291 543003 486411 473072 284575 334148 367434
8216C67434j02051n7782l002l7456O7751r2364j4661j5134p9646J82393Q9198
$$ 367434 265383 207601 204599 167143 234894 142530 127869 112735 33089 215482 304680
8205C04680m8712k33723j44584J22080J48913l3756p2431K9083r982L5850K6201
$$ 304680 255968 22245 -122339 -259 148654 114898 42467 71550 61568 97418 123619
8194A23619j23375j61744o63073N28351K73484m5951N2354r6591k0685O8099J51804
$$ 123619 244 -161500 -824573 -296222 -22738 -68689 -16335 -112926 -133611 -65512 86292
8183H6292J3972m6605l5779j5752j01509m758l1126k743j076J51640K0959n7744
$$ 86292 100264 53659 17880 2128 -99381 -104139 -135265 -138008 -139084 12556 33515 -24229
8171b4229P3936r3089r472J55465P363M6822q3016q848R2000j59858j24639Q7752
$$ -24229 49707 -43382 -52854 102611 109974 156796 73780 64932 156932 -2926 -127565 -39813
8159c9813q4022O5324J04409m6284J12559N0175j06884p4071J01970O3608m6499
$$ -39813 -123835 -58511 45898 -386 112173 162348 55464 -18607 83363 146971 100472
8148A00472J13581m0451j06008M9843O9417j23259j4185N2923o1144j7802J20520
$$ 100472 214053 173602 67594 117437 186854 63595 49410 102333 41189 23387 143907
8137A43907j75588j0987J64474p7778r0230R0263o4381Q3182J9563j4863m3682
$$ 143907 -31681 -42668 121806 44028 -46202 44061 -20320 62862 82425 67562 23880
8126B3880Q2337j02499k8406Q3530o0356Q138r213J44592n5609j55867J29392
$$ 23880 106217 3718 -24688 58842 -1514 6624 -2589 142003 86394 -69473 59919
8115E9919Q7962j27769L8857O4673k2790m235N0137q0416M4781O8346q9348j0180
$$ 59919 147881 20112 58969 123642 100852 96617 146754 66338 111119 179465 90117 79937
8103G9937j428j3844j2471P1342o3007j01029R0242n5759n437K8814P2713p3764
$$ 79937 78509 64665 52194 123536 60529 -40500 49742 -6017 -11454 17360 90073 16309
8091A6309R7028n6455n8726p434N130N060K071N3967m2605O6224J04378j8089
$$ 16309 113337 56882 -1844 -9278 -4148 912 2983 56950 14345 80569 184947 166858
8079A66858O9345n9731p6747L6857n3027N4399n5368N3334p4692J9977l7156n804
$$ 166858 236203 176472 99725 136582 83555 137954 82586 135920 61228 81205 44049 38245
8067C8245J88926O5256j02962o5153O4853n6531J21896j0155p050j4117k8676
$$ 38245 227171 292427 189465 124312 189165 132634 254530 244375 237325 223208 194532
8056A94532j68048L3997J74587K4050L3550n5802j15494j2260K6783J67322k9681
$$ 194532 26484 60481 235068 259118 292668 236866 121372 109112 135895 303217 273536
8045B73536k34086L6985J81534o0880P4145K23564j33174n873j9688J92061K3090
$$ 273536 39450 76435 257969 197089 271234 494798 361624 355751 336063 528124 551214
8034E51214p0168J65991L0713l6637o9733m6300M2008l1625Q161P3530O3977n855
$$ 551214 481046 647037 677750 641113 571380 525080 567088 535463 543624 617154 681131 675276
8022F75276P2708j1393k34574K5297K2321m2955l123Q427j79090p567K498m202
$$ 675276 747984 736591 502017 527314 549635 506680 503557 511984 332894 325327 327825 323623
8010C23623J3526n5362k4236n9878K9643m0021J52266J5414o3974j05671o2711
$$ 323623 337149 281787 257551 197673 227316 187295 339561 354975 291001 185330 122619
7999A22619O1715l348r2310p9020N6726R9045J40235p6526l7845j5902o6873O9596
$$ 122619 184334 180986 88676 9656 66382 165427 305662 229136 191291 175389 108516 178112
7987A78112K3192j4545j1149q4142j2318J53208O272j7523j19k1658l8106R4037
$$ 178112 201304 186759 175610 91468 79150 232358 238630 221107 220988 199330 161224 255261
7975B55261o1528n2235J7429j12249J00572J0674M3476J1940l2009K0890M9151
$$ 255261 193733 141498 158927 46678 147250 157924 201400 213340 181331 202221 251372
7964B51372M9697n5824j62405L21J93529K3150q4717K6820J00358M0757j03850
$$ 251372 301069 245245 82840 83161 276690 299840 215123 241943 342301 383058 279208
7953B79208m0000j1231m6856m1260k6315L8125J09461Q5372k529O6695j75570
$$ 279208 239208 227977 181121 139861 113546 151671 261132 346504 343975 410670 235100
7942B35100N5631R6443L560j05208J1486L8838o3072o7515N1796Q1236N4535n5064
$$ 235100 290731 387174 390734 285526 297012 335850 272778 205263 257059 338295 392830 337766
7930C37766j38759P2286P9887p4427q3999L9437J32060K8882N2559L4555k39440
$$ 337766 199007 271293 351180 276753 192754 232191 364251 393133 445692 480247 240807
7919B40807J46899p4330k4074J26497r4780J3493N2810O5545j96280j39760J61674
$$ 240807 387706 313376 289302 415799 321019 334512 387322 452867 256587 116827 278501
7908B78501O1921j8727k89M715J8793O6266M02j17671K23902m8657l8178J1468
$$ 278501 340422 321695 321406 326121 344914 411180 411582 293911 517813 469156 430978 442446
7896D42446r0254k923K8344K9211K936J63781r8186l4327j1031K3960J41481r6503
$$ 442446 352192 349269 377613 406824 409760 573541 475355 441028 429997 453957 595438 498935
7884D98935J07445L1264j00723L8293K6509n8531m1816J16938l2126n0637J03316
$$ 498935 606380 637644 536921 575214 601723 543192 501376 618314 586188 535551 638867
7873F38867J11205q7618j24447J3250P7868J2342O7066o408r3424O792R157L4584
$$ 638867 750072 662454 538007 551257 629125 641467 708533 702125 608701 615493 624650 659234
7861F59234M6155j28056J06482n0670p3977J21440l7674m2020J01332Q6384j7157
$$ 659234 705389 577333 683815 633145 559168 680608 642934 600914 702246 788630 771473
7850G71473j44013n4229L7047Q3251K3322P5034j8565M5117k2882n782l344J3116
$$ 771473 627460 573231 610278 693529 716851 791885 773320 818437 795555 789773 786429 799545
7838G99545J50925Q5038j66873j10670j1575J5360N6177k8472j7099P2378K0818
$$ 799545 950470 1035508 868635 757965 746390 761750 817927 789455 772356 844734 865552
7827H65552L6693j3312k2250j7588j1585J32326l6816j4385N3235l1581M0387
$$ 865552 902245 888933 866683 849095 837510 969836 933020 918635 971870 940289 980676
7816I80676o3216M8265Q1690j22282M3372K1603J20387j2773j23791p7102J93486
$$ 980676 917460 965725 1047415 925133 968505 990108 1110495 1097722 973931 896829 1090315
7805A090315O5189j5273J5216m052j1561R4693J50211m6878k1969N9953m3117
$$ 1090315 1155504 1140231 1155447 1151395 1139834 1234527 1384738 1337860 1315891 1375844 1332727
7794A332727Q8471J22681j39683R030J5112K5883J06742k2357O9437p673R4953
$$ 1332727 1421198 1543879 1404196 1413226 1428338 1454221 1560963 1538606 1608043 1600370 1695323
7783A695323L4684K0655p872J08009k1605N8709J08660J9982N3872J12720N1332
$$ 1695323 1730007 1750662 1742790 1850799 1829194 1887903 1996563 2016545 2070417 2183137 2234469
7772B234469J06518k7726K19629P7361J0346O6901J45207N6933n3265J29433O6418
$$ 2234469 2340987 2313261 2532890 2610251 2620597 2687498 2832705 2889638 2836373 2965806 3032224
7761C032224K70830R0859J31448K15090J39961J35304J09034J8669K07546K56347
$$ 3032224 3303054 3393913 3525361 3740451 3880412 4015716 4124750 4143419 4350965 4607312
7751D607312K66772K32324K55480K13014L35016K93646L97771N26505L75921L98941
$$ 4607312 4874084 5106408 5361888 5574902 5909918 6203564 6601335 7127840 7503761 7902702
7741G902702N34152M79061O26562O49366Q38513P95927R48558Q49108R97226J263481
$$ 7902702 8436854 8915915 9542477 10191843 11030356 11826283 12774841 13623949 14621175 15884656
7731A5884656J412990J581704J684621K023077K232363K495064K767705L481179
$$ 15884656 17297646 18879350 20563971 22587048 24819411 27314475 30082180 33563359
7723C3563359M175337M991661O305689P597698Q340996Q838915R558761R476703
$$ 33563359 37738696 42730357 49036046 56633744 64974740 73813655 83372416 92849119
7715I2849119P781323N126917J598765k560814m702979l361433j031677J189231
$$ 92849119 100630442 105757359 107356124 104795310 100092331 96730898 95699221 96888452
7707I6888452K738520L708979M423031L622323J090282k360178o706392j0119625
$$ 96888452 99626972 103335951 107758982 111381305 112471587 110111409 103405017 93285392
7699I3285392j0605797r246939p733695o347227n512577m695981m126165l895396
$$ 93285392 82679595 73432656 65698961 59351734 53839157 49143176 45017011 41121615
7691D1121615l534470l323537k905027k435850k132066j831390j703184j421184
$$ 41121615 37587145 34263608 31358581 28922731 26790665 24959275 23256091 21834907
7683B1834907j401773j314335j246406j153780r77622q27362p40911q10191o59765
$$ 21834907 20433134 19118799 17872393 16718613 15740991 14913629 14172718 13362527 12702762
7674A2702762o83790o34908o60205m91695n46294m23807l26707l52022k43449
$$ 12702762 12018972 11384064 10723859 10232164 9685870 9262063 8935356 8583334 8339885
7665H339885m27407m21772l31898k17327j72562l82147l80184k33539q8587j50713
$$ 8339885 7912478 7490706 7158808 6941481 6768919 6386772 6006588 5773049 5684462 5533749
7655E533749j83954k25799k15305j33763j10717k35698k36252j41569n4549m0866
$$ 5533749 5349795 5123996 4908691 4774928 4664211 4428513 4192261 4050692 3996143 3955277
7645C955277p6164j32516r2259n6649o4155j26635p1267n9269k16485j49035r5488
$$ 3955277 3879113 3746597 3654338 3597689 3533534 3406899 3335632 3276363 3059878 2910843 2815355
7634B815355R7016M717r5402j6563k1583j67351j72203p5114k453R02j22650K0799
$$ 2815355 2912371 2917088 2821686 2805123 2783540 2616189 2443986 2368872 2366419 2367321 2244671 2265470
7622B265470j6794r3521n8553J3348j5193K5983j18481j80481j9758q37O455K1536
$$ 2265470 2248676 2155155 2096602 2109950 2094757 2120740 2002259 1821778 1802020 1801183 1807638 1829174
7610A829174j3909J30366M834k8899q5747j31003j02603o4486j01441P2616M3460
$$ 1829174 1815265 1945631 1950465 1921566 1835819 1704816 1602213 1537727 1436286 1508902 1552362
7599A552362j95745n4971K0454R5343p1816J5115k7666R82l4999j1817J1988j9909
$$ 1552362 1356617 1301646 1322100 1417443 1345627 1360742 1333076 1334058 1299059 1287242 1299230 1279321
7587A279321n7358l2375j02485J2289m3310P4108m1085m3076J5687N667R0462
$$ 1279321 1221963 1189588 1087103 1099392 1056082 1130190 1089105 1046029 1061716 1067383 1157845
7576A157845k05106m7576m8553n3029L2659J946o5904l0778p385j0692O8905J8111
$$ 1157845 952739 905163 856610 803581 836240 838186 772282 741504 734119 723427 792332 810443
7564H10443m2753m1680j09269K1182J13452N0325j59347q2592j5122N708J53264
$$ 810443 767690 726010 616741 637923 751375 801700 642353 559761 544639 550347 703611
7553G03611j4661l1407n1328N4145L3426o9754q0951l4038K5379l900K3657k5172
$$ 703611 688950 657543 606215 660360 693786 624032 543081 509043 534422 530522 554179 529007
7541E29007n4827J1846Q0258o0613J1397j04795p8787P3436q55J11362M42k458
$$ 529007 474180 486026 566284 505671 517068 412273 333486 406922 406067 517429 517871 515413
7529E15413K6472k282N5709L9887p8316j84528k8439J79884R8599q0995p2102
$$ 515413 541885 539603 595312 635199 556883 372355 343916 523800 622399 541404 469302
7518D69302k8754n7809L7579m1980J72626n6911j20411n0664m6666Q1739j9656
$$ 469302 440548 382739 420318 378338 550964 494053 373642 322978 276312 358051 338395
7507C38395L1962O749n4293J40012J16610m5976j08893O1315q4379l2951n0671
$$ 338395 370357 377106 322813 462825 579435 533459 424566 485881 401502 368551 317880
7496C17880n0193J18778q4362J3490N822o116K8112P8296q9778j49606J6090J20298
$$ 317880 267687 386465 302103 315593 321415 315299 343411 421707 331929 182323 198413 318711
7484C18711J09455j3149k0503J0254j22259l6743L1389R3894k0064j34223j50759
$$ 318711 428166 415017 394514 404768 282509 245766 277155 371049 350985 216762 66003
7473F6003Q1480J2254j11629M8899M2529l915O8499p8733J692K4559J61228K5832
$$ 66003 147483 159737 48108 97007 139536 135621 204120 125387 127079 151638 312866 338698
7461C38698M6530m0100q634J623o7502p6594k9545o1127l9672J55474K678L7208
$$ 338698 385228 345128 336494 338117 270615 194021 164476 103349 63677 219151 221829 259037
7449B59037j07779K6820P0452P0486n7072k4079O3983n7644m3679Q4375R594k1806
$$ 259037 151258 178078 248530 319016 261944 237865 301848 244204 200525 284900 294494 272688
7437B72688K922r286K8453l434J4859o1072l2436N0212K467L9063Q097P8431M5080
$$ 272688 275610 266324 294777 291343 306202 245130 212694 262906 265373 304436 312533 390964 436044
7424D36044m9434j37988M6046l8674m3497J6287j6603O0261m549R4971k08968
$$ 436044 386610 248622 294668 255994 212497 228784 212181 272442 267893 362864 153896
7413A53896L5587J05583L8791J7155q6255M357o8929P7893j0929K3798n479Q7008
$$ 153896 189483 295066 333857 351012 264757 269114 200185 278078 267149 290947 285468 372476
7401C72476j25084O5473J21915L595r0736M7745K49951l7048P4243K7622j23357
$$ 372476 247392 312865 434780 438375 347639 395384 645335 608287 682530 710152 586795
7390E86795K069M0375P823J24840L8425o9778O5657r522p1060r107J56553L6530
$$ 586795 588864 629239 637062 761902 800327 730549 796206 786684 715624 706517 863070 899600
7378H99600j5263O147j80859k625j4714j22845m3599J08627m3012j80764q0221
$$ 899600 884337 890484 709625 707000 692286 569441 525842 634469 591457 410693 330472
7367C30472M8583m0761J3922l3329r972l3872N6623J9323n8370N3615m0286q2250
$$ 330472 379055 338294 352216 318887 308915 275043 331666 350989 292619 346234 305948 223698
7355B23698O6846l152o3342o4435J6787O5133k0733k5397J19572K144j02256p8390
$$ 223698 290544 287392 224050 159615 176402 241535 220802 195405 314977 317121 214865 136475
7343A36475m6528J03893J75247q6916q8420l8871J97002P3051l940j17380k22311
$$ 136475 89947 193840 369087 282171 193751 154880 351882 424933 420993 303613 81302
7332H1302J45588J15541j81351r6577K5534M9967L0882j0547m0814n0124O8333
$$ 81302 226890 342431 161080 64503 90037 140004 170886 160339 119525 69401 137734
7321A37734J42603L9834j20267p9421l1347k1869m2500J32083K6146j17687n0002
$$ 137734 280337 320171 199904 120483 89136 67267 24767 156850 182996 65309 15307
7310A5307Q3047q308O5769J9950O4724m8566R507o0948Q0072j17470O4617l2446
$$ 15307 98354 90046 155815 175765 240489 191923 201430 140482 220554 103084 167701 135255
7298A35255o2005K9744P1614N4976j10930O6843J08051k0390j3738n9033q5713
$$ 135255 73250 102994 174608 229584 118654 185497 293548 273158 259420 200387 114674
7287A14674J0193O0967L5825j009o5683j4505J6677k3506R3203R9290q0317n963
$$ 114674 124867 185834 221659 220650 154967 140462 157139 133633 226836 326126 245809 239846
7275B39846k5340L5209K5754n1773r8014j48525J1302K156J35510J05215m446
$$ 239846 214506 249715 275469 223696 125682 -22843 -11541 -9385 126125 231340 226894
7264B26894q5176k1236J7881M7551J6702l8607r5493O8312J1141M5387p9155J93763
$$ 226894 141718 120482 138363 185914 202616 164009 68516 136828 147969 193356 114201 307964
7252C07964l3731n5132q2853M1518J1261p9000J21330J3473j2113K2178p296r3545
$$ 307964 274233 219101 136248 177766 189027 110027 231357 244830 232717 254895 247599 154054
7240A54054O7348O4731p759j44221L6168P0368Q3303P2892j25812o2646J75564
$$ 154054 221402 286133 278374 134153 170321 240689 323992 396884 271072 208426 383990
7229C83990l9395p3908n3610N1899J04187J37656l0979o8965M3255j56098P1221
$$ 383990 344595 270687 217077 268976 373163 510819 479840 410875 454130 298032 369253
7218C69253N894K4559J29913P1364n5146r9531Q5062r958k1770Q6333L8396k4824
$$ 369253 375147 399706 529619 600983 545837 446306 531368 521410 499640 585973 624369 599545
7206E99545j33815N3225O5607J3004n6626j13397l1662k3148M4331K19626n1619
$$ 599545 465730 518955 584562 597566 540940 427543 395881 372733 417064 636690 585071
7195E85071P9599N7912K949j4689l3696j47969r5434K05846j42734m5985L127
$$ 585071 664670 722582 725531 710842 677146 529177 433743 639589 496855 450870 453997
7184D53997j1393k4694L6510J0139R2728q2734p4159Q1902k6749k7523q7268O0805
$$ 453997 442604 417910 454420 464559 557287 474553 400394 482296 455547 428024 340756 401561
7172D01561P507K775K6604J44657K565p3641R7723o9897j35609k3727L3405J63628
$$ 401561 409068 411843 438447 583104 585669 512028 609751 539854 404245 380518 413923 577551
7160E77551K748p4284j9688J7552l0654j02163K4059P5788J06333j71138j26465
$$ 577551 580299 506015 486327 503879 473225 371062 395121 470909 577242 406104 279639
7149B79639n3883m2749m2966J99069J34799j02813k3490k9151J40576r930r0744
$$ 279639 225756 183007 140041 339110 473909 371096 347606 318455 459031 449101 358357
7138C58357N3711L3059p8446j33248k9400l0111q8181M664R4848J36066J29375
$$ 358357 412068 445127 366681 233433 204033 173922 85741 90405 185253 321319 450694
7127D50694j47370Q0294P2761p0918j23514r382M4256M6536P6280J3625l2849
$$ 450694 303324 383618 456379 385461 261947 252565 296821 343357 419637 433262 400413
7116D00413o6590K062O3052L1683J8176N3L5114N2185o4151k3518J29693J93846
$$ 400413 333823 335885 398937 430620 448796 448849 483963 536148 471997 448479 578172 772018
7104G72018j49422j835J62364J8383j3078M4126J3765K6271K6993J11739q3228
$$ 772018 622596 620761 783125 801508 788430 832556 846321 872592 899585 1011324 928096
7093I28096j13640K1591M7462q8984l9447J9103R0420j9800m6544J61758J15907
$$ 928096 814456 836047 883509 794525 755078 774181 864601 844801 798257 960015 1075922
7082A075922R1648j18915o7703J38482J3839R2038J19795m2198k5961J29335j33800
$$ 1075922 1167570 1048655 980952 1119434 1133273 1225311 1345106 1302908 1276947 1406282 1272482
7071A272482j34581J12045O0264K5960k15110l5653n0071o6186J7856J4825p08
$$ 1272482 1137901 1249946 1310210 1336170 1121060 1085407 1035336 969150 987006 1001831 1001123
7060A001123Q3906J7614p9467j92605J2671J2911J91559O7578o5911R6205N6147
$$ 1001123 1085029 1102643 1023176 830571 843242 856153 1047712 1115290 1049379 1145584 1201731
7049A201731j46864l5482j6217o9829r5736Q084K514q5460o8450j32143J33683
$$ 1201731 1054867 1019385 1003168 933339 837603 845687 848201 762741 694291 562148 695831
7038F95831q1448J4816o2554r6329k9264l2804j5175J53564M4703j35213m5084
$$ 695831 614383 629199 566645 470316 441052 408248 393073 546637 591340 456127 411043
7027D11043K3034o866K7209M5202K1057k7561j15827n1208J8157n601K6273Q0820
$$ 411043 434077 427211 454420 499622 520679 493118 377291 326083 344240 338639 364912 445732
7015D45732K1361l0088p0144l541M099L1362R0277M4931l4949p8559j27441m4178
$$ 445732 467093 437005 366861 363320 367419 398781 489058 533989 499040 420481 293040 248862
7003B48862R4014Q5922N5154j00623k0103J4009M7965j3053N2136r3740j1012
$$ 248862 342876 428798 483952 383329 363226 377235 425200 412147 464283 370543 359531
6992C59531J67808p8858M8051P9508j35342P4923k6510j0386R1294N3403n1052
$$ 359531 527339 448481 496532 576040 440698 515621 489111 478725 570019 623422 572370
6981E72370j26933j25239j8112R3952l0771o7278L7645L6179j05729J39396L0038
$$ 572370 445437 320198 302086 396038 365267 297989 335634 371813 266084 405480 435518
6970D35518O7904o3413j08553L7270J1633l3721J506R7309k3793l5101l4562P8698
$$ 435518 503422 440009 331456 368726 380359 346638 348144 445453 421660 386559 351997 430695
6958D30695J00702L8710m2878j40820l9762p3201J77247N2860m549L0987j5215
$$ 430695 531397 570107 527229 386409 346647 273446 450693 503553 499004 529991 514776
6947E14776J4094R1818k13002k5274M7368j9080q873o6882J2456J20021l6832
$$ 514776 528870 620688 407686 382412 429780 410700 401827 334945 347401 467422 430590
6936D30590j1730K2045q8593N4513Q4200J05847r7744o0145p8606O6952j5894
$$ 430590 418860 440905 352312 406825 491025 596872 499128 438983 360377 427329 411435
6925D11435k5230J85365M1039j61562K3015j84923n5809J39887J42232o7713j51760
$$ 411435 386205 571570 612609 451047 474062 289139 233330 373217 515449 447736 295976
6914B95976N6861O5027R7682K2950k05711J6700L8384P5083O2048J2907M9889
$$ 295976 352837 417864 515546 538496 332785 349485 387869 462952 525000 537907 587796
6903E87796o3026q2431p4095Q8818Q6804Q8435j8514m8217j26239l1064M4050
$$ 587796 524770 442339 368244 457062 543866 632301 613787 565570 439331 408267 452317
6892D52317O9719n0264O5579p3182p4136l6751J71648j3124L0375J68614q2631
$$ 452317 522036 471772 537351 464169 390033 353282 524930 511806 542181 710795 628164
6881F28164j05301l4769Q4905k3087P454Q382k1105l8346L2823l2469j5205o1513
$$ 628164 522863 488094 572999 549912 557366 565748 544643 506297 539120 506651 491446 429933
6869D29933O4392J3139L9817L0018M9203k0510n6759q7436Q083O5345J40637p5129
$$ 429933 494325 507464 547281 577299 626502 605992 549233 461797 469880 535225 675862 600733
6857F00733K9552m3361J47625M0232r6240O4441n6071p7281J05038J22242k4901
$$ 600733 630285 586924 734549 774781 678541 742982 686911 609630 714668 836910 812009
6846H12009p3446o0681j19279J5283M8833P0082Q3630l3614k5411K1O4836K00367
$$ 812009 738563 677882 558603 573886 622719 692801 776431 742817 717406 717427 782263 982630
6834I82630l3913k7885P030p6182p9649k5803R773P784L1580k107l1668r6038
$$ 982630 948717 920832 927862 851680 772031 746228 756001 763785 795365 793258 761590 665552
6822F65552J38387J14362Q2975l9371J37106l9051k1671Q373J47225J9034K30792
$$ 665552 803939 918301 1001276 961905 1099011 1059960 1038289 1046662 1193887 1212921 1443713
6811A443713O6244J32411J79044N9595L495J6898j8427r8764p5741l2992j52500
$$ 1443713 1509957 1642368 1821412 1881007 1884502 1901400 1882973 1784209 1708468 1675476 1522976
6800A522976L8595m0803j2004J56335J90807l0409q5455J14597k7222P1162J69620
$$ 1522976 1561571 1520768 1508764 1665099 1855906 1825497 1740042 1854639 1827417 1898579 2068199
6789B068199J28994J64025J69531J90884N9475O4442M6001M6891j00256k35248
$$ 2068199 2197193 2361218 2530749 2721633 2781108 2845550 2891551 2938442 2838186 2602938
6779B602938j71135p0152q3772j38513n1550p951j38409n1017j4031N6157r47
$$ 2602938 2431803 2361651 2277879 2139366 2087816 2079865 1941456 1890439 1876408 1932565 1931618
6768A931618L8504J87578P7951n9739M8648J09703J05861M2833j57530p1883j20217
$$ 1931618 1970122 2157700 2235651 2175912 2224560 2334263 2440124 2482957 2325427 2253544 2133327
6757B133327R3178k37165j73066R900n0575l8765M2309j47422p0688j50230k5678
$$ 2133327 2226505 1989340 1816274 1826174 1775599 1736834 1779143 1631721 1561033 1410803 1385125
6746A385125Q1295p0918o933n3117l9383M9905N8161R8662j6543k2545p3116n7855
$$ 1385125 1466420 1395502 1388569 1335452 1296069 1345974 1404135 1502797 1486254 1463709 1390593 1332738
6734A332738j26524J0930O9062N6432N7399Q6256L2146p7786j23456P674p202
$$ 1332738 1206214 1217144 1286206 1342638 1400037 1486293 1518439 1440653 1317197 1324871 1317669
6723A317669j30116m4732J26171K10579n6235m3375M1275L5447J4082j3553k3958
$$ 1317669 1187553 1142821 1268992 1479571 1423336 1379961 1421236 1456683 1470765 1457212 1433254
6712A433254q0263L0407J99030J8717O018j6833j07090R7743k9669r979J38179
$$ 1433254 1352991 1383398 1582428 1601145 1607163 1590330 1483240 1580983 1551314 1541335 1679514
6701A679514r0374j52065J2169R5893Q2765q2481J00463j9976N9768k9392K4517
$$ 1679514 1589140 1437075 1449244 1545137 1627902 1545421 1645884 1625908 1685676 1656284 1680801
6690A680801L736Q0011P7338N5437l8248m5229l7192J03469j0345r636K8634n0079
$$ 1680801 1684537 1764548 1841886 1897323 1859075 1813846 1776654 1880123 1869778 1860142 1888776 1838697
6678A838697M4024Q4070R8082m7095j6353p0337j9095K2350K4834M2707j5996
$$ 1838697 1882721 1966791 2064873 2017778 2001425 1931088 1911993 1934343 1959177 2001884 1985888
6667A985888n1661Q0572N8361J5734K9765Q0592n270l5101L0328K6161j12286
$$ 1985888 1934227 2014799 2073160 2088894 2118659 2199251 2193981 2158880 2189208 2215369 2103083
6656B103083K18400O4682P483j42105Q6736J62192J05092J572p6368J13264K31030
$$ 2103083 2321483 2386165 2393648 2251543 2338279 2500471 2605563 2607135 2530767 2644031 2875061
6645B875061o0492r5108j03033j531J13601j362K3783P3898M5004k7789N4592
$$ 2875061 2814569 2719461 2616428 2614897 2728498 2727136 2750919 2824817 2869821 2842032 2896624
6634B896624k53L8376R1035q0927j0619J11932J03634J37095Q9636R909L2319
$$ 2896624 2896371 2934747 3025782 2944855 2934236 3046168 3149802 3286897 3376533 3386442 3418761
6623C418761l2069l6058O7362J20216o469q1503J36004M4404p5407R9781n4819
$$ 3418761 3386692 3350634 3417996 3538212 3531743 3450240 3586244 3630648 3555241 3655022 3600203
6612C600203L5074J08157Q674J56680O1002j06500N268J19443L8356J00379n5251
$$ 3600203 3635277 3743434 3752108 3908788 3969790 3863290 3868558 3988001 4026357 4126736 4071485
6601D071485M0244M1125O6458K4757J51910Q5983j06444K8492J02069R7644n0508
$$ 4071485 4111729 4152854 4219312 4244069 4395979 4481962 4375518 4404010 4506079 4603723 4553215
6590D553215l9915J13527m3118O4193K44654J7143J52494o5638P8531J59681J08101
$$ 4553215 4513300 4626827 4583709 4647902 4892556 4909699 5062193 4996555 5075086 5234767 5342868
6579E342868P0290K46439J09837M3741J50668Q0429L2232l2073K03182o057M5034
$$ 5342868 5413158 5659597 5769434 5813175 5963843 6044272 6076504 6044431 6247613 6241556 6286590
6568F286590J92459J57797R1830J13962J93550N0769j23046Q0698L16030J11528
$$ 6286590 6479049 6636846 6728676 6842638 7036188 7086957 6963911 7044609 7360639 7472167
6558G472167K78816M3619J94488J14990J65795K51040J81825L30892K08570J30420
$$ 7472167 7750983 7794602 7989090 8104080 8269875 8520915 8702740 9033632 9242202 9372622
6548I372622J6980J04484K60964L38745J67686J65958K50444P7893K28070K25862
$$ 9372622 9389602 9494086 9755050 10093795 10261481 10427439 10677883 10755776 10983846 11209708
6538A1209708N6481K30652L29965L01342K55537M47895K60777L41727M40672N20095
$$ 11209708 11266189 11496841 11826806 12128148 12383685 12831580 13092357 13434084 13874756 14394851
6528A4394851L76656M10325M66367L90287M45408M42276N69253N66002N32029
$$ 14394851 14771507 15181832 15648199 16038486 16483894 16926170 17495423 18061425 18593454
6519A8593454P10192O61222N39491P65679P62390R00096J021159J092607J244780
$$ 18593454 19303646 19964868 20504359 21270038 22032428 22932524 23953683 25046290 26291070
6510B6291070J340027J381222J532845J829393K123934K359079K533557L003395
$$ 26291070 27631097 29012319 30545164 32374557 34498491 36857570 39391127 42394522
6502D2394522L317506L601060L964259M811510N368650O265005P399466R058440
$$ 42394522 45712028 49313088 53277347 58088857 63457507 69722512 77121978 86180418
6494H6180418J1058577J3253468J4830302J6560063J7366431J6914725J4980006
$$ 86180418 97238995 110492463 125322765 141882828 159249259 176163984 191143990
6487A91143990J1024605M449824k489167p031280r642306q777904o175455m135111
$$ 191143990 202168595 206618419 204129252 197097972 187455666 178677762 172502307 168367196
6479A68367196k261598o68922M97653K356162M736634P884252J1912857J6626733
$$ 168367196 166105598 165436676 165934329 168290491 173027125 180911377 192824234 209450967
6471B09450967K0702699K3446464K6146099K7813771K6144106K0961314J2489458
$$ 209450967 230153666 253600130 279746229 307560000 333704106 354665420 367154878
6464C67154878l40746j0703862j5401737j7227826j7353996j6627479j8090919
$$ 367154878 366814132 356110270 340708533 323480707 306126711 289499232 271408313
6457B71408313j9324704j6633662j3198019j0257365p319598m007887q19090K699089
$$ 271408313 252083609 235449947 222251928 211994563 204674965 200667078 199847988 202547077
6449B02547077O546744J0417371J3401753J4917630J5426942J5340068J3216500
$$ 202547077 209093821 219511192 232912945 247830575 263257517 278597585 291814085
6442B91814085P619426p95474j1809885k1996518k6913885k5793525k2181270
$$ 291814085 299433511 298638037 286828152 264831634 237917749 212124224 189942954
6435A89942954j8826344j5889298j3559196j1580139j0552250r655994q870466
$$ 189942954 171116610 155227312 141668116 130087977 119535727 109879733 101009267
6428A01009267p929219o886653n974930n339563m617974m334245l955436l716190
$$ 101009267 93080048 86193395 80218465 74878902 70260928 65926683 61971247 58255057
6420E8255057l486891l097747k664512k484223k301686k121791j943726j662543
$$ 58255057 54768166 51670419 49005907 46521684 44219998 42098207 40154481 38491938
6412C8491938j626542j419938j332615j455577j148421j032149j058699j029358
$$ 38491938 36865396 35445458 34112843 32657266 31508845 30476696 29417997 28388639
6404B8388639q52849q56369p64812p89414q05963r69522o92074o71331n95863
$$ 28388639 27535790 26679421 25914609 25125195 24319232 23349710 22657636 21986305 21390442
6395B1390442n82242o41554m89223m29152n27901m30817m34230l66719l18438
$$ 21390442 20808200 20166646 19677423 19248271 18720370 18289553 17855323 17488604 17170166
6386A7170166k87285k16119l92316j79301k41644k66032k50986l06989l41762
$$ 17170166 16882881 16666762 16274446 16095145 15853501 15587469 15336483 15029494 14687732
6377A4687732k45241j29888k57250k02292j98661l4302k46281o8116m7072j90217
$$ 14687732 14442491 14312603 14055353 13853061 13654400 13620098 13373817 13305701 13258629 13068412
6367A3068412o2992o6821o5041J20467O8411m9238k7280R8978J2916n929o8703
$$ 13068412 13005420 12938599 12873558 12994025 13062436 13013198 12985918 13084896 13097812 13091883 13023180
6356A3023180l13366l47377k18669k51910j67628k00601k22850o2924j20250q422
$$ 13023180 12709814 12362437 12143768 11891858 11724230 11523629 11300779 11237855 11117605 11109183
6346A1109183j83030j1928j38531M9343r65j83857K1706N3524O93j724R9331L16224
$$ 11109183 10926153 10914225 10775694 10825037 10824072 10640215 10661921 10715445 10716138 10714414 10813745 11129969
6334A1129969j13644l2321j2386J84662K2183k8331K2398n8604m7556j61199o7105
$$ 11129969 11016325 10984004 10971618 11156280 11178463 11150132 11172530 11113926 11066370 10905171 10838066
6323A0838066K3380q8803Q6631m0640m0008M0418J82102M8245J8464L6980P0661
$$ 10838066 10861446 10772643 10859274 10818634 10778626 10819044 11001146 11049391 11067855 11104835 11175496
6312A1175496P5788J00198J22743N9242J09757J29082J61808J62567N1098K34193
$$ 11175496 11251284 11351482 11474225 11533467 11643224 11772306 11934114 12096681 12147779 12381972
6302A2381972J56039L44414J75117J69402K98275L58814M20739L41700K30589
$$ 12381972 12538011 12882425 13057542 13226944 13525219 13884033 14304772 14646472 14877061
6293A4877061K94857N10226K91786L03725N92578N03615O08691O58141N15534
$$ 14877061 15171918 15682144 15973930 16277655 16870233 17373848 17982539 18640680 19156214
6284A9156214P02244O34231Q45137R40975Q26767R43081J118948J187509J320417
$$ 19156214 19858458 20492689 21337826 22278801 23105568 24048649 25167597 26355106 27675523
6275B7675523J283580J417114J436829J637017J836753K096201K279504K446782
$$ 27675523 28959103 30376217 31813046 33450063 35286816 37383017 39662521 42109303
6267D2109303K562806K972909L308747L717521M222917M434411M906609N513155
$$ 42109303 44672109 47645018 50953765 54671286 58894203 63328614 68235223 73748378
6259G3748378O401307P162346Q196254R043828J0254455J1823419J3008991J4362763
$$ 73748378 80149685 87312031 95508285 104552113 114806568 126629987 139638978 154001741
6251A54001741J5382657J5876278J5463637J4271035J1756120Q266151L977370
$$ 154001741 169384398 185260676 200724313 214995348 226751468 235017619 238994989
6244B38994989j94851l636139n667387o190337o124799m906223l757002k241538
$$ 238994989 238800138 235163999 229496612 223306275 217181476 212275253 208518251 206276713
6236B06276713k30458J665885L796223N715038P855384R753123J1261221J2520256
$$ 206276713 206046255 207712140 211508363 217223401 225078785 234831908 246093129 258613385
6228B58613385J3046768J2631879J1287446R302546O469293L104964p50332n337724
$$ 258613385 271660153 284292032 295579478 304882024 311351317 314456281 313705949 308368225
6220C08368225r455956j2726044j4468973j4922892j3959117j2500082j0627865
$$ 308368225 298912269 286186225 271717252 256794360 242835243 230335161 219707296
6213B19707296q974444p067309n401368l925225k372385p45638N34371J381728
$$ 219707296 210732852 203665543 198264175 194338950 191966565 191220927 191755298 193137026
6205A93137026J961545K061893J487128J04094j752613m090164p003096r127527
$$ 193137026 195098571 197160464 198647592 198751686 196999073 192908909 185905813 176778286
6197A76778286j0468591j1161885j0921875j0455095r707243r005862q120440
$$ 176778286 166309695 155147810 144225935 133770840 124063597 115057735 106937295
6190A06937295p280028o804215o179342n661502n206284m723028m173869l950077
$$ 106937295 99657267 92853052 86673710 81012208 75805924 71082896 66909027 62958950
6182F2958950l509596l312921l002665k738134k686787k469933k470780k093461
$$ 62958950 59449354 56136433 53133768 50395634 47708847 45238914 42768134 40674673
6174D0674673j780554j708432j639320j404418j384630j331145j127179j129735
$$ 40674673 38894119 37185687 35546367 34141949 32757319 31426174 30298995 29169260
6166B9169260j068257q94872j044579p25619o08010o48915p33306p07784p53620
$$ 29169260 28101003 27206131 26161552 25435933 24827923 24179008 23445702 22737918 21984298
6157B1984298n67022o46278p41110p11912n13814m90843n91821o27648n16257
$$ 21984298 21417276 20770998 20029888 19317976 18804162 18313319 17721498 17093850 16577593
6148A6577593n30763n53065m21673j26663k90665k26909l12772l34681k67651
$$ 16577593 16046830 15493765 15072092 14945429 14654764 14427855 14115083 13780402 13512751
6139A3512751l16298j67839k55775k33479j28042j62202m20537n01673k75007
$$ 13512751 13196453 13028614 12772839 12539360 12411318 12249116 11828579 11326906 11051899
6130A1051899l12202j94654j04930j45795l09294m17869k11189j56124j05174
$$ 11051899 10739697 10545043 10440113 10294318 9985024 9567155 9355966 9199842 9094668
6121I094668j11150k65186j77610q9258k22728j14343j69284q7363j61860k86705
$$ 9094668 8983518 8718332 8540722 8451464 8228736 8114393 7945109 7857746 7695886 7409181
6111G409181j14976n1213l00504j06771j92925j32405j50648k65140j49019p8114
$$ 7409181 7294205 7242992 6942488 6835717 6642792 6510387 6359739 6094599 5945580 5867466
6101E867466j42255j47882j80882K804p4704j38265p9675j95613k6989j07795
$$ 5867466 5725211 5577329 5396447 5399251 5324547 5186282 5106607 4910994 4884005 4776210
6091D776210j49056j64122j33030R9639q5783k60283o6078K2333q6883p9349j5297
$$ 4776210 4627154 4463032 4330002 4429641 4343858 4083575 4017497 4039830 3952947 3873598 3858301
6080C858301j03531j56171J6898j6022j10534N9280m5895N004l4410J1300r1730
$$ 3858301 3754770 3598599 3615497 3599475 3488941 3548221 3502326 3507330 3472920 3484220 3392490
6069C392490P0212N8484j94210k27775n3466j55921m1670M7036k07517o2730r1836
$$ 3392490 3462702 3521186 3326976 3099201 3045735 2889814 2848144 2895180 2687663 2624933 2533097
6058B533097L8152q520j44771O1537j45889k2291K8195J7462o7595j13270j66064
$$ 2533097 2571249 2562729 2417958 2479495 2333606 2311315 2339510 2356972 2289377 2176107 2010043
6047B010043r0126j9928L0707N3355l8459j03599L4081M4631O2766k6724j07875
$$ 2010043 1919917 1899989 1930696 1984051 1945592 1841993 1876074 1920705 1983471 1956747 1848872
6036A848872o0462j36560J27241N883j53375J31272M7111n0856M0964k2121J1664
$$ 1848872 1788410 1651850 1779091 1784974 1631599 1762871 1809982 1759126 1800090 1777969 1789633
6025A789633p6824K2616k7629p7553J8011J01280n8334j13160K4269N6526j2898
$$ 1789633 1712809 1735425 1707796 1630243 1648254 1749534 1691200 1578040 1602309 1658835 1645937
6014A645937n1791j52813o6235P6691j25012l1301q1562j32302Q5859K0374J06120
$$ 1645937 1594146 1441333 1375098 1451789 1326777 1295476 1213914 1081612 1167471 1187845 1293965
6003A293965P988M3153k31235q0947N2279j14465p4383O6686R0477j9955n3535
$$ 1293965 1301953 1345106 1113871 1032924 1085203 970738 896355 963041 1053518 1033563 980028
5992I80028P5228R2236l4484N8482j32023n2853Q4002p4840k5716Q8635K4665
$$ 980028 1055256 1147492 1113008 1171490 1039467 986614 1070616 995776 970060 1058695 1083360
5981A083360L41p3682j07868J4679M0485K4241l5589l7210l6585K919j20472Q7320
$$ 1083360 1083701 1010019 902151 916830 957315 981556 945967 908757 872172 875091 754619 841939
5969H41939l7399k3494j0464p3408N2821K4241P7561J27303J069K5739O3476n4541
$$ 841939 804540 781046 770582 697174 749995 774236 851797 979100 980169 1005908 1069384 1014843
5957A014843j1797P3940o6804j4071o2655K1503L5125k6182K2253J09833J20417
$$ 1014843 1003046 1076986 1010182 996111 933456 954959 990084 963902 986155 1095988 1216405
5946A216405m9633m4600M7191N193K4806K34219P1984p8963q8953J80354N9235
$$ 1216405 1166772 1122172 1169363 1174556 1199362 1433581 1505565 1426602 1337649 1518003 1577238
5935A577238P0243l4877q837k4358l9571P0304J01883J69378K8981N8016J07109
$$ 1577238 1647481 1612604 1603767 1579409 1539838 1610142 1712025 1881403 1910384 1968400 2075509
5924B075509Q5432K7722Q3979J40403J13650k3029l5067j80460o5164O5383q8721
$$ 2075509 2160941 2188663 2272642 2413045 2526695 2503666 2468599 2288139 2222975 2288358 2199637
5913B199637p6547n6629j04975M9213M0154l0510R1411P1659P9191K1638R6699
$$ 2199637 2123090 2066461 1961486 2010699 2050853 2020343 2111754 2183413 2262604 2284242 2380941
5902B380941O3617n9256K8876k222Q0617J7276k44855j37641q6991j34360k15828
$$ 2380941 2444558 2385302 2414178 2411956 2492573 2509849 2264994 2127353 2040362 1906002 1690174
5891A690174M687r0885j13731K4347n4496P2899O6439n3423K8256n3646o3723
$$ 1690174 1694861 1603976 1490245 1514592 1460096 1532995 1599434 1546011 1574267 1520621 1456898
5880A456898J5899l9514j18300p2577q2613r315q9506m5671o0956j02517o5873
$$ 1456898 1472797 1433283 1314983 1242406 1159793 1150478 1060972 1015301 954345 851828 785955
5869G85955l2449O2657K5219j58379q5568q3852q3272j0511K6300r54q1472p3513
$$ 785955 753506 816163 841382 683003 597435 513583 430311 419800 446100 445146 363674 290161
5857B90161P2647J3581p0591r7211P585P9931j10467M9260j5500j03963k0239
$$ 290161 362808 376389 305798 208587 216172 296103 185636 234896 219396 115433 95194
5846I5194j7150r5850K6549J15041q3576J3802P0374J89778l8621q2010L7823
$$ 95194 78044 -17806 8743 123784 40208 54010 124384 314162 275541 193531 231354
5835B31354l2541j10733l2406P3389j71570k0290R6123R8263K855k4512j16589
$$ 231354 198813 88080 55674 129063 -42507 -62797 33326 131589 134444 109932 -6657
5824f657m4151J67629N2394j54878j77258L0260J41994K33112o9353j73968k4722
$$ -6657 -50808 116821 169215 14337 -162921 -132661 9333 242445 173092 -876 -25598
5813b5598k6050Qq666p2683O2597J1748m4662n6429J3335m601j16964M6345J08505
$$ -25598 -51648 -51640 -60306 -132989 -70392 -58644 -103306 -159735 -146400 -151001 -267965 -221620 -113115
5800a13115M3496m1919L8003l0778M1911l9320J1679L3101J61659O7128k05232
$$ -113115 -69619 -111538 -73535 -104313 -62402 -101722 -90043 -56942 104717 171845 -33387
5789c3387o7123p003P509J03062k3693q4865o120J26241N6924l3755k6693j5680
$$ -33387 -100510 -107513 -100004 3058 -20635 -105500 -111620 14621 71545 37790 11097 -4583
5777d583m4020J40943p620l7206j65714J32407J07610j3914J14639r4376k5177
$$ -4583 -48603 92340 84720 47514 -118200 14207 121817 107903 222542 128166 102989
5766A02989J7342o7473M9502J32190n7296m8416j9339n4008m6993j39641R2075
$$ 102989 120331 52858 102360 234550 177254 128838 109499 55491 8498 -131143 -39068
5755c9068O6744L3043J17558J31853k6163q8325k08589L6434L1345j15533J64751
$$ -39068 27676 60719 178277 310130 283967 195642 -12947 23487 54832 -60701 104050
5744A04050p7633j52575j4537J21225q0286M200J67188O3333r7768M641m9372
$$ 104050 26417 -126158 -140695 -19470 -99756 -95556 71632 134965 37197 41838 -7534
5733g534J455k5920j2321M9524p2567N1432q583J31249R7767Q76m0235j66589
$$ -7534 -6079 -31999 -44320 5204 -67363 -15931 -24514 106735 204502 205378 165143 -1446
5721a446n9248J01985L7680J13832p343n3226Q4697r918N8229j19497o1407K9026
$$ -1446 -60694 41291 78971 192803 185460 132234 216931 207013 265242 145745 84338 113364
5709A13364J0948l7265l0149O5488j0612l0969K6884n773P3163J34249O5986j63471
$$ 113364 124312 87047 56898 122386 111774 80805 107689 101916 175079 309328 375314 211843
5697B11843k5136N8265L3707J33072J36205P397J9740j04619J5155r5695r5088
$$ 211843 186707 244972 278679 411751 547956 555353 575093 470474 485629 389934 294846
5686B94846K0209n9271J48672L667l605P354j3446M0874q893J33772R3836j6037
$$ 294846 315055 255784 404456 408123 404518 411872 398426 439300 430407 564179 658015 641978
5674F41978j83972M6017K5188Q1093K08085M4535L5969j8238J9482L5521K09344
$$ 641978 458006 504023 529211 610304 818389 862924 898893 880655 900137 935658 1145002
5663A145002J9026J15379J15932O6503J49054k0060K6659j20913q8169m2168M9747
$$ 1145002 1164028 1279407 1395339 1461842 1610896 1590836 1617495 1496582 1408413 1366245 1415992
5652A415992N1266j51103j81180q7397j01235q6220m2699j31816p6512O5828J1441
$$ 1415992 1467258 1316155 1134975 1047578 946343 860123 817424 685608 609096 674924 686365
5641F86365r0657m2202N1543n1561j4738j06292j08033j16132L1723m879j44301
$$ 686365 595708 553506 605049 553488 538750 432458 324425 208293 240016 235137 90836
5630I0836R6894J02129N0078j6291j07102q8662j16799J5221J31694o3636j90376
$$ 90836 187730 289859 339937 323646 216544 127882 11083 26304 157998 94362 -96014
5619i6014N6435R8913l6645j442O1525N8949j43534j33725J8337M4808j08548
$$ -96014 -39579 59334 22689 21247 82772 141721 -1813 -135538 -117201 -72393 -180941
5608a80941P5705R6137R3198o4411j01515L4468Q8932j18383k4054m54q8819N3524
$$ -180941 -105236 -9099 84099 19688 -81827 -47359 41573 -76810 -100864 -101318 -190137 -136613
5596a36613N1164p4529L6207O3Q7424n4297O0991N12m9761J49789M6944M9228
$$ -136613 -85449 -159978 -123771 -123708 -36284 -90581 -29590 -29078 -78839 70950 117894 167122
5584A67122j28062J0984p7865o6057J062J7203J08804J3825l0527O2879M1295
$$ 167122 39060 50044 -27821 -93878 -92816 -75613 33191 47016 16489 79368 120663
5573A20663o6060q9036O946N0827r6515O2885R9961M1094k1897n2037K2895r5704
$$ 120663 54603 -34433 -27487 23340 -73175 -10290 89671 130765 108868 56831 79726 -15978
5561a5978L880n3643n9071m7908R7556J74129N7908l0064l9913J00023q7228P6052
$$ -15978 -12098 -65741 -124812 -172720 -75164 98965 156873 126809 86896 186919 99691 175743
5549A75743N632j06487m1118p8222L8639l115k6181P9103M7330n2386Q2507P4764
$$ 175743 181375 74888 33770 -44452 -5813 -8928 -35109 43994 91324 38938 121445 196209
5537A96209J6232j14799L3116O3033K4166J8944L0847O481k08770J24530j0023
$$ 196209 212441 97642 130758 193791 217957 236901 267748 274229 65459 189989 179966
5526A79966j76355L5522P0252n3265m2299O5053o3353k37k2533J442O5615R3076
$$ 179966 3611 39133 109385 56120 13821 78874 15521 15284 -7249 -5807 59808 152884
5514A52884o2102l8144O0039n729M3301l3365m1765p1277N1642O4328n2407J58730
$$ 152884 90782 52638 112677 106948 150249 116884 75119 3842 55484 119812 67405 226135
5502B26135K8960O731p3575r1156k7542J4936R8062l405J0423J70409J1732J2231
$$ 226135 255095 261826 188251 97095 69553 84489 182551 179146 189569 359978 371710 383941
5490C83941o210L5684R51J6997o6544L767p5220r6480P8191o4657J70721P5205
$$ 383941 377731 413415 414366 431363 364819 368586 293366 196886 275077 210420 381141 456346
5478D56346K124j32081J6561o060K039r7861L4942j9216j090L794L8286j00927
$$ 456346 458470 326389 342950 336890 338929 241068 276010 256794 255704 259498 297784 196857
5466A96857J7210p912J1955Q0209n2909k687k7288k5381M6914J33513j8327m8670
$$ 196857 214067 206155 218110 298319 245410 242723 215435 190054 236968 370481 352154 303484
5454C03484J0373N5345k42429O3260J8762O095O9195R7056j29245r1404L8428
$$ 303484 313857 369202 126773 190033 208795 214890 284085 381141 251896 160492 198920
5443A98920J00189J25057J6989q0991j13344q2025J61484P7576j09925N797k3256
$$ 198920 299109 424166 441155 360164 246820 164795 326279 403855 293930 299727 276471
5432B76471O3556r4756N9714K07269M6766k6053j14619k1871R5167n6890p9302
$$ 276471 340027 245271 304985 512254 559020 532967 418348 396477 491644 434754 355452
5421C55452j61800M0272j25254J5818J07397j00196Q0728R7944J7103p2848N748
$$ 355452 193652 233924 108670 124488 231885 131689 212417 310361 327464 254616 260364
5410B60364J04898m3839J7069L6003n5651R4691j39164L8146j6863J1568N358
$$ 260364 365262 321423 338492 374495 318844 413535 274371 312517 295654 307222 312580
5399C12580O6608J7118l6872Q58J5045n5385o2257O7984l1713o0257L3501Q1555
$$ 312580 379188 396306 359434 360292 375337 319952 257695 325679 293966 233709 267210 348765
5387C48765o4028N4491j8821l7414j89229L185N171M8218q376Q5849K14076p3099
$$ 348765 284737 339228 320407 282993 93764 96949 102120 150338 141962 227811 441887 368788
5375C68788L6564j34517k9596m4459j850N3394n0587N1273J5074P6374j22171
$$ 368788 405352 270835 241239 196780 194930 248324 197737 249010 264084 340458 218287
5364B18287n2547J77771m2189j55582J2151J40747L8292J8078L0656j09258j46913
$$ 218287 165740 343511 301322 145740 157891 298638 336930 355008 385664 276406 129493
5353A29493Q1509J5533M4659P2459R4732Q4566m8794p5050m3923l177K3177p0539
$$ 129493 211002 226535 271194 343653 438385 522951 474157 399107 355184 352007 375184 304645
5341C04645n0223J78183Q4113k4102P7179j71617r9385j26953n1510J52369J69005
$$ 304645 254422 432605 516718 492616 569795 398178 298793 171840 120330 272699 441704
5330D41704M2104j76363l9989m823J24780J4073J0229l1963J62065K2359o5741
$$ 441704 483808 307445 267456 262633 387413 401486 411715 379752 541817 564176 498435
5319D98435P4173k7402n8944k7986J12727Q8712j15548P0235n9139q0297m0542
$$ 498435 572608 545206 486262 458276 571003 659715 544167 614402 555263 474966 434424
5308D34424J21450r001j9939N8531p4131O8457K4466o5829J10203r880K7420P5396
$$ 434424 555874 546873 526934 585465 511334 579791 604257 538428 648631 638751 666171 741567
5296G41567m1176q761k3574N3177R2801q0899j68191n3222J23244P7017o5155
$$ 741567 700391 691630 668056 721233 814034 733135 564944 511722 634966 711983 646828
5285F46828k5769Q3284P3767n0380L0007J202N442o3754N7978k90p3513K097M9049
$$ 646828 621059 704343 778110 727730 757737 758939 764381 700627 758605 758315 684802 686899 735948
5272G35948Q1333J2004k3866J49362K6588k1804J3856N581o0464N5621J80866
$$ 735948 817281 829285 805419 954781 981369 959565 973421 979002 918538 974159 1155025
5261A155025J39403p7644n9303J57309l8555m2295J34300P5795J1972N4774J3435
$$ 1155025 1294428 1216784 1157481 1314790 1276235 1233940 1368240 1444035 1456007 1510781 1524216
5250A524216k5263n4926J32609J21215M6760J13441m4398M3367L9199q95P5314
$$ 1524216 1498953 1444027 1576636 1697851 1744611 1858052 1813654 1857021 1896220 1895325 1970639
5239A970639M5023Q2639J10335J53054K18961L4027J68905K13147J27971O0448
$$ 1970639 2015662 2098301 2208636 2361690 2580651 2614678 2783583 2996730 3124701 3185149
5229C185149J84896K63672K05103L94363L79648J73926J77008L63100M69054M76162
$$ 3185149 3370045 3633717 3838820 4233183 4612831 4786757 4963765 5326865 5795919 6272081
5219F272081L36345L86071O63489Q65389O55149J023717J242365J446530J880034
$$ 6272081 6608426 6994497 7657986 8523375 9178524 10202241 11444606 12891136 14771170
5210A4771170K320160K418930K385671K752169K904996K619104J668065R77900
$$ 14771170 17091330 19510260 21895931 24648100 27553096 30172200 31840265 32818165
5202C2818165N7311k40924M16123J509340K171144K634062L157587L647956L333150
$$ 32818165 32875476 32634552 33050675 34560015 36731159 39365221 42522808 46170764 49503914
5193D9503914J188477m02297k236671m318135l607029k569445j674719j022519
$$ 49503914 50692391 50290094 48053423 43735288 40128259 37558814 35884095 34861576
5185C4861576m11774n1139P5238l91454j447681k070615k984419l282168k502477
$$ 34861576 34449802 34398663 34473901 34082447 32634766 30564151 27579732 24297564 21795087
5176B1795087k192496j849586j431512j409818j197289j140131r30455r58112
$$ 21795087 19602591 17753005 16321493 14911675 13714386 12574255 11643800 10685688
5168A0685688q99792o80210m84346n98711m19651m78156m01798m53886l41787
$$ 10685688 9785896 9105686 8621340 8022629 7602978 7124822 6723024 6269138 5927351
5159E927351l52106l18230j41471j17165j14813k82262k02534r3556k36883k25756
$$ 5927351 5575245 5257015 5115544 4998379 4883566 4601304 4398770 4305214 4068331 3842575
5149C842575l9319o5659k79314p7649j22832p1508j49214j35160n2106q7864m3856
$$ 3842575 3803256 3737597 3458283 3380634 3257802 3186294 3037080 2901920 2849814 2761950 2718094
5138B718094j19765j76615k1201N91k36312k12347P2444M4378j20462o7662k66251
$$ 2718094 2598329 2421714 2400513 2401104 2164792 1952445 2024889 2069267 1948805 1881143 1614892
5127A614892o7856L1557j51862r7866Q9944J47277o6522o3668J3966j03880n7528
$$ 1614892 1547036 1578593 1426731 1328865 1418809 1566086 1499564 1435896 1449862 1345982 1288454
5116A288454j31960j38560K1939Q794K9073L2604j15406K4642r4662l1086K4745
$$ 1288454 1156494 1017934 1039873 1048667 1077740 1110344 994938 1019580 924918 893832 918577
5105I18577N8347M2800k7842J7864p7570j9369j54379r5297J13969r0459o2765
$$ 918577 976924 1019724 991882 1009746 932176 912807 758428 663131 777100 686641 623876
5094F23876J61730J40140L843j69337M407R2805r252l9738p5399m8550O1646P4814
$$ 623876 785606 925746 929589 760252 764659 857464 848212 808474 733075 684525 746171 820985
5082H20985M5742o7061O3000J09870r9289m7625j6118j0100j09182j8887K4364
$$ 820985 866727 799666 862666 972536 873247 825622 809504 799404 690222 671335 695699
5071F95699L8438j41219J5829j1954k1495M7586r8685l4855P9663l0778j27042
$$ 695699 734137 592918 608747 596793 575298 622884 524199 489344 569007 538229 411187
5060D11187Q3567q373m3363j78958j6142n2179J11263J25041Q221k1261j54975
$$ 411187 494754 486381 443018 264060 247918 195739 307002 432043 440264 419003 264028
5049B64028L1483Q9622j26729n7693J13710L7657n2925L6473j9044m2661N4397
$$ 264028 295511 385133 258404 200711 314421 352078 299153 335626 316582 273921 328318
5038C28318m2277l9375N9465J57594J4280j01336p9217p711j09695m4665M4744
$$ 328318 286041 246666 306131 463725 478005 376669 297452 289741 180046 135381 180125
5027A80125M2853r2023q835J04593J5897j8931R4546O894n1234q635L0210j2683
$$ 180125 222978 130955 122120 226713 242610 223679 318225 325119 273885 265250 295460 282777
5015B82777j7560m8445K1518m8448J175k3487J20000J54542l8160k1961K0052
$$ 282777 265217 216772 238290 189842 191017 167530 287530 442072 403912 381951 402003
5004D02003n1813r3494j25929O9173J46887l314q3130J47506k5098r607o0555
$$ 402003 350190 256696 130767 199940 346827 343513 260383 407889 382791 373184 312629
4993C12629M370j0804j20623L7793q7017J7296p5029K0875K0468J14315k7258
$$ 312629 316999 306195 185572 223365 136348 153644 78615 99490 119958 234273 207015
4982B07015m7750L9239J22872j26900J15052r3142L6957J46010j24536n3715O7757
$$ 207015 159265 198504 321376 194476 309528 216386 253343 399353 274817 221102 288859
4971B88859l0022n3372O3789j2276m9125k2182n9403K9819O0113n6934M6807K0984
$$ 288859 258837 205465 269254 256978 207853 185671 126268 156087 216200 159266 206073 227057
4959B27057k8403l2841K7169l4397m0101l5234K8216J15350N993M9997j08954
$$ 227057 198654 165813 192982 158585 118484 83250 111466 226816 232809 282806 173852
4948A73852J4265N1234N6554l7458o0749K3945q7448l9746K2134J8074j759k7440
$$ 173852 188117 239351 295905 258447 197698 221643 134195 94449 116583 134657 132898 105458
4936A05458M114J05107j0857r3011n9209M0584k3027K1031J73426j6717j31594
$$ 105458 109572 214679 203822 110811 51602 92186 69159 90190 263616 246899 115305
4925A15305M951K7978P3761p6688j57630J28436J2206o9502J03230J50764m7497
$$ 115305 120256 148234 221995 145307 -12323 116113 128319 58817 162047 312811 265314
4914B65314l9739N3237j13985L5159j6323Q1086O000N7159L7804r0345p3033M5837
$$ 265314 225575 278812 164827 199986 183663 264749 270749 327908 365712 275367 202334 248171
4902B48171J2916J70115L9564p9526q8949r073n2537k7685J48116m0575j7611
$$ 248171 261087 431202 470766 391240 302291 293218 240681 212996 361112 320537 302926
4891C02926q9046o8721J06208l6812M1103j5835j13220k4668n3772Q1740P1423
$$ 302926 213880 145159 251367 214555 255658 239823 126603 101935 48163 129903 201326
4880B01326N6906M9405K0875P1432K1374k6486k4197l8651k2664N2928J14996
$$ 201326 258232 307637 328512 399944 421318 394832 370635 331984 309320 362248 477244
4869D77244o7305n7029j4148j47192J21527r7139p043M6757J3428R0242l6703
$$ 477244 409939 352910 338762 191570 313097 215958 208915 255672 269100 359342 322639
4858C22639P75j05318J73993M3814j23914j61124N9630R8086k709k2656k2426
$$ 322639 323414 218096 392089 435903 311989 150865 210495 308581 305872 283216 260790
4847B60790N0380R4396k5182j03094J7576J2757j0999J4714n7631M3252m3658
$$ 260790 311170 405566 380384 277290 294866 307623 296624 311338 253707 296959 253301
4836B53301j7851j28329l4829J59593J57605P8348r35P8975q4092m9820j37479
$$ 253301 235450 107121 72292 231885 389490 467838 466903 545878 461786 411966 274487
4825B74487L6459J986K4502J3210j13488J40373N4878J7157M3284m4835n2970
$$ 274487 310946 312932 337434 350644 237156 377529 432407 449564 492848 448013 395043
4814C95043J2734L5775J29721K1954k22023r7848K3916J9501M6724J75540K747
$$ 395043 407777 443552 573273 595227 373204 275356 299272 318773 365497 541037 543784
4803E43784M0378k36p776J4565K4370M0132n9463n2611j58275N2298J38428J2770
$$ 543784 584162 583926 576150 590715 615085 655217 595754 543143 384868 437166 575594 588364
4791E88364N3610k9826k2601J05611l7198J01056r9612q6956m4823P8035K4196
$$ 588364 641974 612148 589547 695158 657960 759016 659404 572448 527625 605660 629856
4780F29856r9631J57692P3212q5216j06665l6360R9138J33163j15136K3735J1812
$$ 629856 530225 687917 761129 675913 569248 532888 632026 765189 650053 673788 685600
4769F85600Q171j3359Q2453K6606m1000R4212j50298j62668J43677L2833l3784
$$ 685600 693771 680412 762865 789471 748471 842683 692385 529717 673394 706227 672443
4758F72443N4757N0081k762r5318n840N8391m4772M6689J57294k3241K21761r521
$$ 672443 727200 777281 774519 679201 673361 731752 686980 733669 890963 867722 1089483 1079962
4746A079962m2527q9475o92r4201J37608k4737j83423L1364o4806l778Q9705k958
$$ 1079962 1037435 947960 947268 853067 990675 965938 782515 813879 749073 745295 835000 832042
4734H32042L8768M6484l7427J71386l5649P618P2436N4545j03698J84480L4280
$$ 832042 870810 917294 879867 1051253 1015604 1023222 1095658 1150203 1046505 1230985 1265265
4723A265265k15847O0989K0449J5574j06015m0781P6118J15284K9254q9332L9732
$$ 1265265 1049418 1110407 1130856 1146430 1040415 999634 1075752 1191036 1220290 1130958 1170690
4712A170690p063J1568m5848Q0604j1156P019N4880J10536O0952o8044l316N0971
$$ 1170690 1163627 1175195 1129347 1209951 1198795 1205814 1260694 1371230 1432182 1364138 1360822 1411793
4700A411793q256k9213p6856N2729J75186q3515j19695J09710p673L0937p1283
$$ 1411793 1403537 1374324 1297468 1350197 1525383 1441868 1322173 1431883 1424210 1455147 1383864
4689A383864J33536m2325K2429J84572p1615r393l5156j9675N721P0662K3612
$$ 1383864 1517400 1475075 1497504 1682076 1610461 1601068 1565912 1546237 1551958 1622620 1646232
4678A646232O6266M7641o503J10276Q9391o6023J9559K7191J01258Q4730l3506
$$ 1646232 1712498 1760139 1753636 1863912 1953303 1887280 1906839 1934030 2035288 2120018 2086512
4667B086512l2532j2358J79030Q1499Q1549J38458N7523N4689K24869L3904O3841
$$ 2086512 2053980 2041622 2220652 2302151 2383700 2522158 2579681 2634370 2859239 2893143 2956984
4656B956984J43425M9019J52705J99047K24122J08293J21366K21636L29372L88464
$$ 2956984 3100409 3149428 3302133 3501180 3725302 3833595 3954961 4176597 4505969 4894433
4646D894433M31580M32189M51035L39110N03013O86603Q61531R17733J048560
$$ 4894433 5326013 5758202 6209237 6548347 7051360 7737963 8599494 9517227 10565787
4637A0565787J345409J729418J840663K255526K454493K507579K585674J869782
$$ 10565787 11911196 13640614 15481277 17736803 20191296 22698875 25284549 27154331
4629B7154331R26960K16346m84913j547803k552977k628194k408103j992819j660872
$$ 27154331 28081291 28297637 27812724 26264921 23711944 21083750 18675647 16682828 15021956
4620A5021956j446803j166546j146433q35151r26834o79795n48584n76318l92871
$$ 15021956 13575153 12408607 11262174 10427023 9500189 8820394 8271810 7695492 7302621
4611G302621m43197l68751l13728m10907l80225k29628k85379k57999k11995l8271
$$ 7302621 6859424 6490673 6176945 5766038 5385813 5156185 4870806 4612807 4400812 4362541
4601D362541k50313j81740j43257j59959j12927r2351j5760j64139j56355J6191
$$ 4362541 4112228 3930488 3787231 3627272 3514345 3421994 3406234 3242095 3085740 3101931
4591C101931r4238p0635n9559m5462m3519j43334m00R1048j08884j60632k0273
$$ 3101931 3007693 2937058 2877499 2832037 2788518 2645184 2644784 2735832 2626948 2466316 2446043
4580B446043j57552J2464M7208j27556O169j9719n5541j4734l5580m3632l1977
$$ 2446043 2288491 2300955 2348163 2220607 2226776 2207057 2151516 2136782 2101202 2057570 2025593
4569B025593J25040M2136j61586q484r0833o3211L1067L2268o5896J4423J0404
$$ 2025593 2150633 2192769 2031183 2022699 1931866 1868655 1899722 1931990 1866094 1880517 1890921
4558A890921l7266K364j2069j9354L0764o5012n8802l4156m06k414Q465J49060
$$ 1890921 1853655 1856019 1843950 1824596 1855360 1790348 1731546 1697390 1696984 1694570 1703035 1852095
4546A852095m8757J1393Q4356k06534N6171P4577m1412l5847J17707K6258j39670
$$ 1852095 1803338 1814731 1899087 1692553 1748724 1823301 1781889 1746042 1863749 1890007 1750337
4535A750337L4321j13824J04475j5021j7820m824P0783P4516N472k5231l7780
$$ 1750337 1784658 1670834 1775309 1760288 1742468 1737644 1808427 1882943 1888415 1863184 1825404
4524A825404O1490m0722j7855N2254j80693M4815j6817p0917M4032R3925J24244
$$ 1825404 1886894 1846172 1828317 1880571 1699878 1744693 1727876 1656959 1700991 1794916 1919160
4513A919160r4221j36485P687P6000J41294k9525k7416q4403M4677R9761m0981
$$ 1919160 1824939 1688454 1696141 1772141 1913435 1883910 1856494 1772091 1816768 1916529 1875548
4502A875548r5478m8126M1069k3434O3461O5470j68503K9360j2914p2057m2896
$$ 1875548 1780070 1731944 1773013 1749579 1813040 1878510 1710007 1739367 1726453 1654396 1611500
4491A611500J15066L6950j0536J09991j37694l0771R3154K2007q4456o8963N6064
$$ 1611500 1726566 1763516 1752980 1862971 1725277 1694506 1787660 1809667 1725211 1656248 1712312
4480A712312m3914M8757m1565m8849p5659K2900J2097k1978J3736M9827o130J26241
$$ 1712312 1668398 1717155 1675590 1626741 1551082 1573982 1586079 1564101 1577837 1627664 1621534 1747775
4468A747775k2756m5310n0538j00511R304K058j9161J2419J64601O5386k1777
$$ 1747775 1725019 1679709 1629171 1528660 1537964 1540022 1520861 1533280 1697881 1763267 1741490
4457A741490n324J58236k04231r1693J32969N0931j4205L2546J9228P8540q8630
$$ 1741490 1736166 1894402 1690171 1598478 1731447 1782378 1768173 1800719 1819947 1898487 1809857
4446A809857L8694p9529K4981m8295l0693J29161N7582l1750J4556N702J17802
$$ 1809857 1848551 1769022 1794003 1745708 1715015 1844176 1901758 1870008 1884564 1890266 2008068
4435B008068J6958N9968j7570j55782q4937K7866J16831O3507P6441K6753o9583
$$ 2008068 2025026 2084994 2067424 1911642 1826705 1854571 1971402 2034909 2111350 2138103 2068520
4424B068520j6330K4926j9396k7126R6601k4728K8778n334n4105P9840n6450J06984
$$ 2068520 2052190 2077116 2057720 2030594 2127195 2102467 2131245 2125911 2071806 2151646 2095196 2202180
4412B202180O8422j4713J0445l9982k1695J62330j0121O3672J3556l6464R2835
$$ 2202180 2270602 2255889 2266334 2226352 2204657 2366987 2356866 2420538 2434094 2397630 2490465
4401B490465l8758n0495J837P9785N606r85J00861N4295j11121k286k7039O1496
$$ 2490465 2451707 2401212 2403049 2482834 2488440 2487455 2588316 2642611 2531490 2529204 2502165 2563661
4389B563661J67781M8019p6777M2763K9446k9908M0817J29070R8153j1325q2747
$$ 2563661 2731442 2779461 2702684 2745447 2774893 2744985 2785802 2914872 3013025 3001700 2918953
4378B918953J6071j1149L9351M267n341K04878L9537n3920P2668k0764j17864
$$ 2918953 2935024 2923875 2963226 2967493 2962152 3167030 3206567 3152647 3225315 3204551 3086687
4367C086687J81455K2338K2946J62514j61076m3548M8070J70513J84972l3498
$$ 3086687 3268142 3290480 3313426 3475940 3314864 3271316 3319386 3489899 3674871 3641373
4357C641373P6822O1387k837L8219K8095k9704J65049Q4797L4273Q3122Q8811
$$ 3641373 3718195 3779582 3776745 3814964 3843059 3813355 3978404 4063201 4097474 4180596 4269407
4346D269407J41445p2336j73486J42931J69102Q0693J05220O9082m3119J49413
$$ 4269407 4410852 4338516 4165030 4307961 4477063 4557756 4662976 4732058 4688939 4838352
4336D838352J52564K7907J1671K09081J28283J20583J04916J67780J61953n1778
$$ 4838352 4990916 5018823 5030494 5239575 5367858 5488441 5593357 5761137 5923090 5871312
4326E871312J11202J77814J69166L8287J42478J83770J33879K27422K1871J30297
$$ 5871312 5982514 6160328 6329494 6367781 6510259 6694029 6827908 7055330 7077201 7207498
4316G207498K59289K66249K79815L55922M17322K36187L76759L43777L75135L80125
$$ 7207498 7466787 7733036 8012851 8368773 8786095 9022282 9399041 9742818 10117953 10498078
4306A0498078M37634N86672M49566L55969M21360N90613L25724M12369M52339
$$ 10498078 10935712 11522384 11971950 12327919 12749279 13339892 13665616 14077985 14530324
4297A4530324J66167J60164R1784k20612l07204k78023m13509n34143m54697l83227
$$ 14530324 14696491 14856655 14948439 14727827 14420623 14142600 13729091 13194948 12740251 12357024
4287A2357024n21956m32626n09569n24781l80122l71105k40281k99585j92102
$$ 12357024 11835068 11402442 10892873 10368092 9987970 9616865 9376584 9076999 8884897
4278H884897k46631l08988j67504l00236k89303q7784j70780j36165k19130j42700
$$ 8884897 8638266 8329278 8161774 7861538 7572235 7484451 7313671 7177506 6958376 6815676
4268F815676j74694j19601n9086n0393j60689k38234l2008R5608j17844k38293
$$ 6815676 6640982 6521381 6462295 6411902 6251213 6012979 5980971 6076579 5958735 5720442
4258E720442j42818j17308j16719j36751p2208K7091J0412j16871j50233r7147
$$ 5720442 5577624 5460316 5343597 5206846 5134638 5161729 5172141 5055270 4905037 4807890
4248D807890j43477k2645j39348j26722P4469q0159N032o3275K971r981o2105
$$ 4807890 4664413 4641768 4502420 4375698 4450167 4370008 4375040 4311765 4314736 4304755 4242650
4237D242650j02598m5695l1876K8483Q609L8983L9190j54654k14171o7305R8941
$$ 4242650 4140052 4094357 4062481 4090964 4099573 4138556 4177746 4023092 3808921 3741616 3840557
4226C840557N1303j42484j02885j15119L7605o5287o0130q9321k9739l7101P217
$$ 3840557 3891860 3749376 3646491 3531372 3568977 3503690 3443560 3354239 3324500 3287399 3294616
4215C294616J22414j12414j25938p061n3237J20186j6309q714L2307O9430q9752
$$ 3294616 3417030 3304616 3178678 3171617 3118380 3238566 3222257 3213543 3245850 3315280 3225528
4204C225528k4757m5529J12249j04774j09585J02435o2452j31412o5728j2159
$$ 3225528 3200771 3155242 3267491 3162717 3053132 3155567 3093115 2961703 2895975 2883816
4194B883816k9691J821q8811n1327k0964J39331j09905n0222J20113q0615q3178
$$ 2883816 2854125 2855946 2767135 2715808 2694844 2834175 2724270 2674048 2794161 2713546 2630368
4183B630368M297J03705o6858j57854n3921k3774N5916j05007o3525J76891J2179
$$ 2630368 2634665 2738370 2671512 2513658 2459737 2435963 2491879 2386872 2323347 2500238 2512417
4172B512417p9685l4185l4685M4713O9696n1137J1845N2075q9724l8638n2032
$$ 2512417 2432732 2398547 2363862 2408575 2478271 2427134 2438979 2491054 2401330 2362692 2310660
4161B310660o5915l6372M8724o9602N5732K8738j6862l8440j01407k2985R956
$$ 2310660 2244745 2208373 2257097 2187495 2243227 2271965 2255103 2216663 2115256 2092271 2102227
4150B102227k4754J34584k9822K5938n3528j72734l18o0666j8895J15791j42225
$$ 2102227 2077473 2212057 2182235 2208173 2154645 1981911 1981593 1920927 1902032 2017823 1875598
4139A875598k605J12649k3830k0839J288K0936r1955l1553Q714L543N1772j4093
$$ 1875598 1872993 1985642 1961812 1940973 1942261 1963197 1871242 1839689 1848403 1851946 1903718 1889625
4127A889625O4477j3699K9802n2365k1496R6948n9675p5089J36930r1659j27521
$$ 1889625 1954102 1940403 1970205 1917840 1896344 1993292 1933617 1858528 1995458 1903799 1776278
4116A776278P2147m7011O4039M2733j12266r759J31781L284l7173j93387o4600
$$ 1776278 1848425 1801414 1865453 1908186 1795920 1786161 1917942 1921226 1884053 1690666 1626066
4105A626066O3676Q4441L9113p5278O8802N2733j30012J2372R519k5024q4405
$$ 1626066 1689742 1774183 1813296 1738018 1806820 1859553 1729541 1741913 1751432 1726408 1642003
4094A642003p1912J9369K6883L5749L7680N0167q0743J03996j01364j03646J42367
$$ 1642003 1570091 1589460 1616343 1652092 1689772 1739939 1659196 1763192 1661828 1558182 1700549
4083A700549J01904j10382L708O3859j29820J1734N1937j2030M8000M857N4505
$$ 1700549 1802453 1692071 1695779 1759638 1629818 1641552 1693489 1681459 1729459 1734316 1788821
4072A788821l634q6219r9840j08671k136Q3558M918M6846M6893J69250l2618m1159
$$ 1788821 1785187 1698968 1599128 1490457 1488321 1571879 1576797 1623643 1670536 1839786 1807168 1766009
4060A766009P9405o5682L9252p2277j60278J04094J32769o7068P8161O7609N3586
$$ 1766009 1845414 1779732 1818984 1746707 1586429 1690523 1823292 1756224 1834385 1901994 1955580
4049A955580l2472k8880o9891M0736j6629k9366J13818P6892J2665m88j01616
$$ 1955580 1923108 1894228 1824337 1865073 1848444 1819078 1932896 2009788 2022453 2021965 1920349
4038A920349M8439L6847O3469L1955L581l570Q5289J02406L235N6579P2085J20602
$$ 1920349 1968788 2005635 2069104 2101059 2104640 2101070 2186359 2288765 2292000 2348579 2420664 2541266
4026B541266k9774j0158L8387L2314m605l0632K6868M8631O9294o9077J08770
$$ 2541266 2511492 2501334 2539721 2572035 2567430 2536798 2563666 2612297 2681591 2612514 2721284
4015B721284J14175p7573q0022J34147L3317Q561l4458n7164m0195M4507R7982
$$ 2721284 2835459 2757886 2677864 2812011 2845328 2853889 2819431 2762267 2722072 2766579 2864561
4004B864561P7492J61478j1592J3086R2225J40097K1825j993J05191J49581M1043
$$ 2864561 2942053 3103531 3091939 3105025 3197250 3337347 3359172 3357179 3462370 3611951 3652994
3993C652994R1574J58975N5129M0395J42333J13374J4092K5455J09121P4003K3335
$$ 3652994 3744568 3903543 3958672 3999067 4141400 4254774 4268866 4294321 4403442 4477445 4500780
3982D500780J8063K0865q7339J29975J73590K9023l5945Q2279Q6654M1790K3565
$$ 4500780 4518843 4539708 4452369 4582344 4755934 4784957 4749012 4831291 4917945 4959735 4983300
3971D983300J04827K28402J37044J61999J50930Q9600N5649K71175L16779L04080
$$ 4983300 5088127 5316529 5453573 5615572 5766502 5856102 5911751 6182926 6499705 6803785
3961F803785K84580L47306J31702n2676k7571N5930J9774m2005o3223j26252j93448
$$ 6803785 7088365 7435671 7567373 7514697 7487126 7543056 7562830 7520825 7457602 7331350 7137902
3950G137902j06339j85731K1396r6774r4173M8084P1067j05934K8378J01223m804
$$ 7137902 7031563 6845832 6867228 6770454 6676281 6724365 6795432 6689498 6717876 6819099 6814295
3939F814295J36801J78586J30718Q0666J42539M0579Q0437J70236K6362q1264
$$ 6814295 6951096 7129682 7260400 7341066 7483605 7524184 7604621 7774857 7801219 7719955
3929G719955P1651j39467Q478j87388k14677j86333p3290j09904k81866j12794
$$ 7719955 7791606 7652139 7660617 7473229 7258552 7072219 6998929 6889025 6607159 6494365
3919F494365q6736r2880l01803k73445o3719j32r0214R5028j5926j93976l898
$$ 6494365 6407629 6314749 6012946 5739501 5675782 5675650 5585436 5680464 5664538 5470562 5466664
3908E466664J0862m4570j41157j35767l5918j80689j75504M1312k27268j44342
$$ 5466664 5477526 5432956 5291799 5156032 5120114 4939425 4763921 4805233 4577965 4433623
3898D433623j16271j34641o8594l1976j99958j44910n0948j17069j37459m678
$$ 4433623 4317352 4182711 4114117 4082141 3882183 3737273 3686325 3569256 3431797 3427119
3888C427119j55061r4372m0501k1793n119j89159p9144p1631k22831P5543K0539
$$ 3427119 3272058 3177686 3137185 3115392 3110273 2921114 2841970 2770339 2547508 2623051 2643590
3877B643590j38442l0419m7201n7121J7983j0607j19761r163q746r6920n0562
$$ 2643590 2505148 2474729 2427528 2370407 2388390 2377783 2258022 2248859 2240113 2143193 2092631
3866B092631o8842K9042n995m8122r1811j0315p0052p7322P0180j14612l1434
$$ 2092631 2023789 2052831 2046836 1998714 1906903 1896588 1826536 1749214 1819394 1704782 1673348
3855A673348j0527m5754m4741k5196o7683m0055K6070q8375K5923J00109m995
$$ 1673348 1662821 1617067 1572326 1547130 1479447 1439392 1465462 1377087 1403010 1503119 1498124
3844A498124n9617j77055Q4871Q4080j3023J19403r3721r4574j087n8678K1824
$$ 1498124 1438507 1261452 1346323 1430403 1417380 1536783 1443062 1348488 1347401 1288723 1310547
3833A310547j41380o8133N0287K3459r3200o3402o2596p6600l4102j8284M7856
$$ 1310547 1169167 1101034 1151321 1174780 1081580 1018178 955582 878982 844880 826596 874452
3822H74452J02332O3854q0451o7647m001j4403l4121p7690n5850O0486J03743
$$ 874452 976784 1040638 960187 892540 888539 874136 840015 762325 706475 766961 870704
3811H70704j08608L6718K8580L5430O3331n5315j15310p2238p6909J30395m9348
$$ 870704 762096 798814 827394 862824 926155 870840 755530 683292 606383 736778 687430
3800F87430r154k784p8504p6607j1687N4920J3104O5920P2848k8169n8009q447
$$ 687430 678276 675492 596988 520381 508694 563614 576718 642638 715486 687317 629308 620861
3788F20861J6385j26067O760L4947l1595j12516m9743Q9190p1108J30124q6794
$$ 620861 637246 511179 517939 552886 521291 408775 359032 448222 377114 507238 420444
3777D20444l6371L7980l3625m1200q8622m5357Q0805o5870L4535J7951R4541O4410
$$ 420444 384073 422053 388428 347228 258606 213249 294054 228184 262719 280670 375211 439621
3765D39621j95598P0621r1621k0266L2965m0964J02010n8615k5837K1590O5674
$$ 439621 244023 314644 223023 202757 235722 194758 296768 238153 212316 233906 299580
3754B99580m298p5211n0125m9578r1901j7419J26240K603K1893m4510R42m5137
$$ 299580 295282 220071 169946 120368 28467 11048 137288 139891 161784 117274 118216 73079
3742G3079j60388J68520O8042l0639j2540l3267N2219k2110j14064J06534M132
$$ 73079 -87309 81211 149253 118614 106074 72807 125026 102916 -11148 95386 99518
3731I9518j13949M8486l9880K64736Q0912q9846l7959j00803J20211m7844j8493
$$ 99518 -14431 34055 -5825 258911 339823 249977 212018 111215 231426 183582 165089
3720A65089j7161L6553k50564l611K12616j4880P5372k9256N0578K2090M4367
$$ 165089 147928 184481 -66083 -69694 142922 128042 203414 174158 224736 246826 291193
3709B91193m2179q1120l9418O3615j3320P7572r2266j63240J87730K7946q133
$$ 291193 249014 167894 128476 192091 178771 256343 164077 837 188567 216513 208380
3698B08380k2845M5205L1888n2951j87085l5408J06230O9216k3067j05481R930
$$ 208380 185535 230740 262628 209677 22592 -12816 93414 162630 139563 34082 44012
3687D4012M0661J10284L4227j40257p0143k3862p1781J2249j1159Q036K33528
$$ 44012 84673 194957 229184 88927 18784 -5078 -76859 -64610 -75769 -67733 165795
3676A65795j4185j53537j384j083J02873J03963p3738j4329J25504q3784j67481
$$ 165795 151610 -1927 -3311 -4394 98479 202442 128704 114375 239879 156095 -11386
3665a1386L836J6420o594N981P7116k24522k7059K24718j8477K0704L4072j0953
$$ -11386 -7550 8870 2276 8257 85373 -139149 -166208 58510 40033 60737 94809 83856
3653H3856r8711m954Q8262M5297M1466j25112j20475k7605J45504J9648N6302
$$ 83856 -14855 -19809 68453 113750 155216 30104 -90371 -117976 27528 47176 103478
3642A03478N3707r7339j06740j6759P1354m8896Q7396N6420K797j04737J7767
$$ 103478 157185 59846 -46894 -63653 7701 -41195 46201 102621 105418 681 18448
3631A8448n8245N851M4785M686k6067K4100r1973N797Q0801J0208P2082j40380
$$ 18448 -39797 -33946 10839 15525 -10542 13558 -78415 -72618 8183 18391 90473 -49907
3619d9907N842J8024m4278L1211Q5874k9618l3846k1433O155L6657k7100P8425
$$ -49907 -44065 -26041 -70319 -39108 46766 17148 -16698 -38131 -31976 4681 -22419 56006
3607E6006j527k7138j5133L2222J7253O262j01986K6589K6078j22067q0164O9884
$$ 56006 54479 27341 12208 44430 61683 67945 -34041 -7452 18626 -103441 -183605 -113721
3595a13721q3335J2562J71107n5213M7741K815j01056l1064J33193N679q1687
$$ -113721 -197056 -184494 -13387 -68600 -20859 -18044 -119100 -150164 -16971 -11292 -92979
3584i2979j43731p123P5485M1191J4285Q2707k2003L9594J081j7124M4837o83
$$ -92979 -236710 -243833 -168348 -127157 -112872 -30165 -52168 -12574 -11493 -28617 16220 15537
3572A5537r9761k9720P3772n6962k0167o1272J07064o4727K2698O3245L7780q4922
$$ 15537 -84224 -113944 -40172 -97134 -117301 -178573 -71509 -136236 -113538 -50293 -12513 -97435
3560i7435N5346M1552N162L9638m1881L9898P605n6108q3941K8362P415J1693
$$ -97435 -42089 -537 4625 44263 2382 42280 49885 -6223 -90164 -61802 -54387 -42694
3548d2694R7089Q4543r0423k8722J7371l3677P282j48064j08287L4163J19787
$$ -42694 54395 138938 48515 19793 37164 3487 10769 -137295 -245582 -211419 -91632
3537i1632K7490j61582Q7743R285J05948J01253n2526r1685J3065k0700r151O8463
$$ -91632 -64142 -225724 -137981 -128696 -22748 78505 25979 -65706 -52641 -73341 -82492 -14029
3525a4029m5201M9686J11326k6716r4611q186o0778N0240q7801j7993j4858j5033
$$ -14029 -59230 -9544 101782 75066 -19545 -27731 -88509 -38269 -126070 -144063 -158921 -173954
3513a73954L3535P7864O7629M6247j04335n2920o209O6736k0435j8907M2523N226
$$ -173954 -140419 -62555 5074 51321 -53014 -105934 -112143 -45407 -65842 -84749 -42226 -37000
3501c7000l2421r4150m5711k1439J10365L8756N5069p0585j1056L0172j00027
$$ -37000 -69421 -163571 -209282 -230721 -120356 -81600 -26531 -97116 -108172 -78000 -178027
3490a78027L1327q585O419m205J4026P9043o7672M747m5775j4296Q0324J0971
$$ -178027 -146700 -155285 -148866 -153071 -139045 -60002 -127674 -122927 -168702 -182998 -102674 -91703
3478i1703q6027j3637O7834J03081l0783n2546j35106N7623Q9529n0865R8505
$$ -91703 -177730 -191367 -123533 -20452 -51235 -103781 -238887 -181264 -91735 -142600 -44095
3467d4095k1077n646m8644o8377J08754p3734p5618O8707J5975r163J02324l1134
$$ -44095 -65172 -70818 -119462 -187839 -79085 -152819 -228437 -159730 -143755 -152918 -50594 -81728
3455h1728M2399r3372j0295J28887J8505j00982L8436J671O8500k8783J0269K0260
$$ -81728 -39329 -132701 -142996 -14109 4396 -96586 -58150 -56479 12021 -16762 -6493 13767
3443A3767q5401n6502n100J03793j6757j04051o1235M3050Q8604N9373o2066N8469
$$ 13767 -71634 -128136 -133236 -29443 -46200 -150251 -211486 -168436 -79832 -20459 -82525 -24056
3431b4056Q5494j01441L1449J21725l4104j8651M2608m8905j02225R1043l8352
$$ -24056 61438 -40003 -8554 113171 79067 60416 103024 54119 -48106 42937 4585
3420D585m9689P546r650n0989Q9657O8861j08591j03680Q1923N4208k2557k7408
$$ 4585 -45104 -37558 -47208 -98197 -8540 60321 -48270 -151950 -70027 -15819 -38376 -65784
3408f5784K5303j03031j9485J36763k3714q6307P1476k5397o5346O3499O9649
$$ -65784 -40481 -143512 -162997 -26234 -49948 -136255 -64779 -90176 -155522 -92023 -22374
3397b2374m337l478j41646J2733O9494k0606N0237K4429j13975L7760r655q1542
$$ -22374 -26711 -30189 -171835 -159102 -89608 -110214 -59977 -35548 -149523 -111763 -121418 -202960
3385b02960J06643J8803m4961j9978N1006K017K4121l0498L2875j8056m8268J8333
$$ -202960 -96317 -77514 -122475 -142453 -91447 -89430 -65309 -95807 -62932 -80988 -129256 -110923
3373a10923M723K5110l9165R6282K8828l2924r8092J4668M9253o6090K9312O447
$$ -110923 -106200 -81090 -120255 -23973 4855 -28069 -126161 -111493 -62240 -128330 -99018 -92571
$$ [...]
##END NTUPLES=NMR SPECTRUM
##END=
