##TITLE=1H_TG-2389-a1
 200.13MHz, CDCl3,
 8 sc
 
 18.8.2025
##JCAMPDX= 6.0         $$ Bruker NMR JCAMP-DX V2.0
##DATA TYPE= NMR SPECTRUM
##DATA CLASS= NTUPLES
##ORIGIN= UXNMR, Bruker Analytische Messtechnik GmbH
##OWNER= pz
$$ XWIN-NMR		Version 3.5
$$ Mon Aug 18 14:00:37 2025 Russian Standard Time (UT+4h)  she@DPX200
##.OBSERVE FREQUENCY= 200.1308
##.OBSERVE NUCLEUS= ^1H
##.ACQUISITION MODE= SIMULTANEOUS
##.ACQUISITION SCHEME= undefined
##.AVERAGES= 8
##.DIGITISER RES= 18
##SPECTROMETER/DATA SYSTEM= spect
##.PULSE SEQUENCE= zg30
##.SOLVENT NAME= CDCl3
##.SHIFT REFERENCE= (INTERNAL, CDCl3, 0, 15.51)
##AUDIT TRAIL= $$ (NUMBER, WHEN, WHO, WHERE, WHAT)
$$ ##TITLE= Audit trail, XWIN-NMR		Version 3.5
$$ ##JCAMPDX= 5.01
$$ ##ORIGIN= Bruker BioSpin GmbH
$$ ##OWNER= she
$$ F:/spectra/data/she/nmr/H-C/1/pdata/1/auditp.txt
$$ ##AUDIT TRAIL=  $$ (NUMBER, WHEN, WHO, WHERE, WHAT)
(   1,<2025-08-18 13:59:12.50 +0400>,<she>,<DPX200>,
      <created by zg, POWCHK disabled, PULCHK disabled
       configuration hash MD5:
       00 E9 B6 7A A2 85 ED C7 34 08 36 98 17 FE 4E 26
       data hash MD5: 16K
       44 4E 0C 62 DF C3 45 05 A8 62 38 C6 B8 0D 8D 84>)
(   2,<2025-08-18 13:59:14.70 +0400>,<she>,<DPX200>,
      <Start of raw data processing
       efp BC_mod = 2 LB = 0.25 FT_mod = 6 PKNL = 1 PHC0 = -1561.902 PHC1 = 14.59228 SI = 16K 
       data hash MD5: 16K
       AD 4B 09 F1 EF CD 04 C6 B4 B7 D1 00 DC 6A 9B C4>)
(   3,<2025-08-18 13:59:36.56 +0400>,<she>,<DPX200>,
      <pk PHC0 = 2.667129 PHC1 = -4.4 
       data hash MD5: 16K
       00 6D 90 05 AC 01 02 B1 37 57 25 62 F5 95 19 CA>)
(   4,<2025-08-18 13:59:40.62 +0400>,<she>,<DPX200>,
      <abs ABSG = 5 
       data hash MD5: 16K
       62 99 96 7E BF 94 94 7D C7 BE 57 AC 95 2B 7F D9>)
$$ ##END=
$$ 
$$ hash MD5
$$ AC 0F E3 07 10 0E E6 A6 8D CF E7 63 62 4B 8C EB
##$RELAX= 
##$RELAX= 
##$RELAX= 
##$RELAX= 
##$RELAX= 
##$RELAX= 
$$ Bruker specific parameters
$$ --------------------------
##$DU= <F:/spectra>
##$EXPNO= 1
##$NAME= <H-C>
##$PROCNO= 1
##$TYPE= <nmr>
##$USER= <she>
##$AMP= (0..31)
100 100 100 100 100 100 100 100 100 100 100 100 100 100 100 100 100 100 
100 100 100 100 100 100 100 100 100 100 100 100 100 100 
##$AQSEQ= 0
##$AQ_mod= 1
##$AUNM= <au_zg>
##$AUTOPOS= <>
##$BF1= 200.13
##$BF2= 200.13
##$BF3= 200.13
##$BF4= 200.13
##$BF5= 200.13
##$BF6= 200.13
##$BF7= 200.13
##$BF8= 200.13
##$BYTORDA= 1
##$CFDGTYP= 0
##$CFRGTYP= 5
##$CHEMSTR= <none>
##$CNST= (0..31)
1 1 145 1 1 1 1 1 1 1 1 1 1 1 1 1 1 1 1 1 1 1 1 1 1 1 1 1 1 1 1 1 
##$CPDPRG= <>
##$CPDPRG1= <>
##$CPDPRG2= <>
##$CPDPRG3= <>
##$CPDPRG4= <mlev>
##$CPDPRG5= <mlev>
##$CPDPRG6= <mlev>
##$CPDPRG7= <mlev>
##$CPDPRG8= <mlev>
##$CPDPRGB= <>
##$CPDPRGT= <>
##$D= (0..31)
0 0.7 0 0 0 0 0 0 0 0 0 0.03 0 0 0 0 0 0 0 0 0 0 0 0 0 0 0 0 0 0 0 0 
##$DATE= 1755511151
##$DBL= (0..7)
120 120 120 120 120 120 120 120 
##$DBP= (0..7)
150 150 150 150 150 150 150 150 
##$DBP07= 0
##$DBPNAM0= <>
##$DBPNAM1= <>
##$DBPNAM2= <>
##$DBPNAM3= <>
##$DBPNAM4= <>
$$ [...]
##$SUBNAM3= <"">
##$SUBNAM4= <"">
##$SUBNAM5= <"">
##$SUBNAM6= <"">
##$SUBNAM7= <"">
##$SUBNAM8= <"">
##$SUBNAM9= <"">
##$SW= 18.0517779522481
##$SWIBOX= (0..15)
0 0 2 0 0 0 0 0 0 0 0 0 0 0 0 0 
##$SW_h= 3612.71676300578
##$TD= 16384
##$TD0= 1
##$TE= 0
##$TE2= 300
##$TE3= 300
##$TEG= 300
##$TL= (0..7)
0 120 120 120 120 120 120 120 
##$TP= (0..7)
150 150 150 150 150 150 150 150 
##$TP07= 0
##$TPNAME0= <>
##$TPNAME1= <>
##$TPNAME2= <>
##$TPNAME3= <>
##$TPNAME4= <>
##$TPNAME5= <>
##$TPNAME6= <>
##$TPNAME7= <>
##$TPOAL= (0..7)
0.5 0.5 0.5 0.5 0.5 0.5 0.5 0.5 
##$TPOFFS= (0..7)
0 0 0 0 0 0 0 0 
##$TUNHIN= 0
##$TUNHOUT= 0
##$TUNXOUT= 0
##$USERA1= <user>
##$USERA2= <user>
##$USERA3= <user>
##$USERA4= <user>
##$USERA5= <user>
##$V9= 5
##$VALIST= <valist>
##$VCLIST= <CCCCCCCCCCCCCCC>
##$VD= 0
##$VDLIST= <DDDDDDDDDDDDDDD>
##$VPLIST= <PPPPPPPPPPPPPPP>
##$VTLIST= <TTTTTTTTTTTTTTT>
##$WBST= 1024
##$WBSW= 4
##$XGAIN= (0..3)
0 0 0 0 
##$XL= 0
##$YL= 0
##$YMAX_a= 408504
##$YMIN_a= -512017
##$ZGOPTNS= <>
##$ZL1= 120
##$ZL2= 120
##$ZL3= 120
##$ZL4= 120
##$ABSF1= 12.9918
##$ABSF2= -5.060049
##$ABSG= 5
##$ABSL= 3
##$ALPHA= 0
##$AQORDER= 0
##$ASSFAC= 0
##$ASSFACI= 0
##$ASSFACX= 0
##$ASSWID= 0
##$AUNMP= <proc_1d>
##$AZFE= 0.1
##$AZFW= 0.1
##$BCFW= 0
##$BC_mod= 2
##$BYTORDP= 0
##$COROFFS= 0
##$CY= -3
##$DATMOD= 1
##$DC= 0
##$DFILT= <>
##$DTYPP= 0
##$F1P= 0
##$F2P= 0
##$FCOR= 1
##$FTSIZE= 16384
##$FT_mod= 6
##$GAMMA= 0
##$GB= 0
##$INTBC= 1
##$INTSCL= 3.241238e-09
##$ISEN= 128
##$LB= 0.25
##$LEV0= 0
##$LPBIN= 0
##$MAXI= 10000
##$MC2= 0
##$MEAN= 0
##$ME_mod= 0
##$MI= 1.114404
##$NCOEF= 0
##$NC_proc= -6
##$NLEV= 6
##$NOISF1= 3.799351
##$NOISF2= 2.8
##$NSP= 0
##$NTH_PI= 0
##$NZP= 0
##$OFFSET= 15.51004
##$PC= 1
##$PHC0= -1559.235
##$PHC1= 10.19228
##$PH_mod= 1
##$PKNL= yes
##$PPARMOD= 0
##$PSCAL= 0
##$PSIGN= 0
##$REVERSE= no
##$SF= 200.129502342057
##$SI= 16384
##$SIGF1= 3
##$SIGF2= 2
##$SINO= 0.751879
##$SIOLD= 32768
##$SREGLST= <19F.Aceton>
##$SSB= 0
##$STSI= 16384
##$STSR= 0
##$SW_p= 3612.71676300577
##$SYMM= 0
##$S_DEV= 0
##$TDeff= 16384
##$TDoff= 0
##$TI= <>
##$TILT= no
##$TM1= 0
##$TM2= 0
##$TOPLEV= 0
##$USERP1= <user>
##$USERP2= <user>
##$USERP3= <user>
##$USERP4= <user>
##$USERP5= <user>
##$WDW= 1
##$XDIM= 16384
##$YMAX_p= 325073919
##$YMIN_p= -846364
$$ End of Bruker specific parameters
$$ ---------------------------------
##NTUPLES= NMR SPECTRUM
##VAR_NAME=  FREQUENCY,     SPECTRUM/REAL,   SPECTRUM/IMAG
##SYMBOL=    X,             R,               I
##VAR_TYPE=  INDEPENDENT,   DEPENDENT,       DEPENDENT
##VAR_FORM=  AFFN,          ASDF,            ASDF
##VAR_DIM=   16384,         16384,           16384
##UNITS=     HZ,            ARBITRARY UNITS, ARBITRARY UNITS
##FACTOR=    0.220516191357247, 1,           1
##FIRST=     3104.0166431827, 0,             0
##LAST=      -508.700119823072, 0,           0
##MIN=       -508.700119823072, -846364,     0
##MAX=       3104.0166431827, 325073919,     0
$$ Real data points
##PAGE= N=1
##DATA TABLE= (X++(R..R)), XYDATA
$$ [...]
12293g6822M0118j3613L5931N666R458O0025K1708r8058J26433m7983n8915J09883
12281A13831l4918J0204m139L8963J2684j54874M2701K8194k2120m4439J11069
12270I7156p1362j4800R1982j23007q9353k3837l6948N9011j07761J30142J00797
12259A2020j56098K952l8783R9260n4498K0983K7519J3130N0100o5859L1231m3264
12247a01307N3359K1951P5373o9651n1668L3597J1882j5031M1573o2506r562M1706
12235c0284m320N7779J0240l825m2140R9676r310n6120n139p0691Q8145N561j94150
12222a54578J15199J58582P361j48541J38651K9004j33539o3910J1192n9153J22086
12211B2354k0591p6116P903M0110J07447o0216R9764P503k6907l8223p7756j23806
$$ plain form
12293 -76822 -36704 -50317 -14386 -8720 738 60763 82471 -15587 110846 62863 3948 113831
12281 113831 78913 89117 84978 123941 136625 -18249 24452 52646 30526 -13913 97156
12270 97156 25794 10994 102976 -20031 -109384 -133221 -170169 -111158 -218919 -88777 12020
12259 12020 -144078 -141126 -179909 -80649 -135147 -114164 -86645 -73515 -23415 -89274 -58043 -101307
12247 -101307 -47948 -25997 49376 -20275 -71943 -38346 -26464 -41495 78 -62428 -71990 -30284
12235 -30284 -34604 23175 33415 29590 -12550 87126 77816 21696 16557 -54134 34011 39572 -154578
12222 -154578 -39379 119203 126564 -21977 116674 145678 12139 -51771 -40579 -99732 22354
12211 22354 1763 -74353 -66450 -26340 81107 20891 120655 128158 101251 63028 -14728 -138534
12199a38534J05792n314J24928M6959l6076q7598j52629Q4863K2174R696L7886
12188A2147j06419J4344J9983J0101J9595J29145j25480L6091J07538o4066N4228
12177A07207j91755n8658J00223n9526q7888l2856J13200K9589N8572J53111r2192
12166C9027L5179p3504k5344n0567k466m337K6784j781J0580R5606n7789R2515
12154H3903n0697m2141j0696J07916q6124o6454j692R6852N3638j20641n6764
12143i2900L1222J84639r2254j24480N637J83313q3046l1292L429m0337L2033
12132b4036Q6343m0207K1415n2063r6226M3372L5035k1650N9747O1808r9767K2620
12120c609n0761Q2521j2256M031l3392n3745R5343j0674N8937l9930k6178j37905
$$ plain form
12199 -138534 -32742 -38056 86872 133831 97755 10157 -142472 -57609 -35435 -25739 12147
12188 12147 -94272 -79928 -59945 -49844 -30249 98896 -26584 9507 117045 52979 107207
12177 107207 -84548 -143206 -42983 -102509 -190397 -223253 -110053 -80464 -21892 131219 39027
12166 39027 74206 702 -24642 -75209 -77675 -82012 -55228 -57009 -46429 49177 -8612 83903
12154 83903 33206 -8935 -19631 88285 2161 -64293 -65985 30867 84505 -36136 -92900
12143 -92900 -61678 122961 30707 -93773 -88136 95177 12131 -19161 -15732 -56069 -24036
12132 -24036 62307 22100 43515 -8548 -104774 -61402 -26367 -48017 11730 73538 -26229 -3609
12120 -3609 -54370 28151 15895 19926 -13466 -67211 28132 17458 76395 36465 10287 -127618
12108a27618K3582L8983J15246K5159j05973Q597q127j4375k4586J10142J3568
12097E4598p6499j8004R6063j26441R159j730N3057R1574L9097M513j26849j8973
12085b0435j26773R2696P1942j59653J7289J28182k3933J0788N1907k2380m3400
12074b3770K8799k8293j8590Q716J14570J9187n4624k9372k614K905N1423j52130
12062h3793M2310K8652q96j13323j6333M6601l3249R3744j49753O2115Q7688Q0008
12050D3771N1587k4375K541p6512k957P400N5599L2751j89004n5622j22514J56060
12038a21275L0039J8023J4480N3833j732o7840J65224j8938n7178n8157Q8075
12027D4554J3439K3013n1518j25057J4563P8060K4866r7926M7650N4914l0821
$$ plain form
12108 -127618 -104036 -65053 50193 75352 -30621 -22024 -30151 -44526 -69112 41030 54598
12097 54598 -21901 -39905 56158 -70283 -61124 -62854 -9797 81777 120874 125387 -1462 -20435
12085 -20435 -147208 -54512 17430 -142223 -124934 3248 -20685 -9897 42010 19630 -23770
12074 -23770 5029 -23264 -41854 -33138 81432 100619 45995 16623 14009 16914 68337 -83793
12062 -83793 -41483 -12831 -13727 -127050 -143383 -96782 -130031 -36287 -186040 -123925 -36237 43771
12050 43771 95358 70983 73524 -2988 -5945 1455 57054 89805 -99199 -154821 -277335 -121275
12038 -121275 -91236 -73213 -58733 -4900 -6632 -74472 90752 71814 14636 -43521 44554
12027 44554 57993 81006 29488 -95569 -81006 -2946 21920 -76006 -28356 26558 -4263
12016d263q0451Q3843j22366P7433J3457n5402Q1583L9157l2614J886m941j10679
12004a13357J69729p5441K1526j5266P434m5842L4857R3793j67195O338R7103
11993A3679j8067m2974m6320l2938j5905J9879J20632K4497L3893n1582k9564
11982b4770p528Q5194j4527q0739k32114l984J38411L1421Q0638n873J0870R5802
11970G2801j8720k1570k030j14662L508O9207m582N9680L5858p4027j36744J1623
11958a19658O9232k442J2277L0812l5784K809j65827j6815J14495K9275k3549
11947a05175m7805J13826r4215J3580p3551K0116P0473R2571J5172m1710l520
11936d0238p1780J41413K3593j11171K737M4080p709N6137j06012K2932k7725
$$ plain form
12016 -4263 -84714 -871 -123237 -45804 -32347 -87749 -6166 32991 377 2263 -2678 -113357
12004 -113357 56372 -19069 2457 -12809 -5375 -51217 -16360 77433 -89762 -83424 13679
11993 13679 -4388 -47362 -93682 -126620 -142525 -122646 -2014 22483 56376 4794 -24770
11982 -24770 -32298 52896 38369 -42370 -274484 -278468 -140057 -108636 -27998 -33871 -23001 72801
11970 72801 54081 32511 30481 -84181 -80673 -11466 -16048 43632 79490 5463 -131281 -119658
11958 -119658 -50426 -52868 -40591 -9779 -45563 -42754 -208581 -225396 -110901 -81626 -105175
11947 -105175 -152980 -39154 -133369 -119789 -193340 -173224 -102751 -10180 4992 -36718 -40238
11936 -40238 -112018 29395 52988 -58183 -55446 -11366 -19075 37062 -68950 -46018 -73743
11925g3743Q7720O0617J546j9479j31089J9240l6846l8642l8785K2296o000J44620
11913h545O5176j8346Q2299j22290q4043K5Q095P6303Q681o4343o077k2658J09042
11900B3319P8791k4069M0907j63340o385l5917n4710P540J58610j36651R4713
11889a7192j9866L4079J03347R8169q3860n9529L1916M099n6355k9738J6780m5684
11877b3834m5364R846O2381p6449p0391l1990L4996J13277j8618L882r2784l062
11865a38110L488J4785P7960L4824n9861l9500M569N6315k1880j08627J22294
11854e3743O1883o9243j03584P4366M0416Q7149O485j06035J2188K04691j89804
11843c5231j12903R9723l8866N4710k4154j32350J58377k3224J22785J3427q3850
$$ plain form
11925 -73743 13977 74594 76140 56661 -74428 -55188 -92034 -130676 -169461 -147165 -153165 -8545
11913 -8545 56631 38285 120584 -1706 -85749 -85724 -77629 -1326 7355 -56988 -63065 -85723 23319
11900 23319 102110 78041 118948 -44392 -50777 -86694 -141404 -133864 24746 -111905 -17192
11889 -17192 -37058 -2979 100368 198537 114677 55148 87064 91163 34808 5070 21850 -23834
11877 -23834 -69198 -59352 3029 -73420 -143811 -175801 -140805 -27528 -46146 -42264 -135048 -138110
11865 -138110 -134622 -119837 -41877 -7053 -66914 -106414 -101845 -45530 -67410 -176037 -53743
11854 -53743 8140 -61103 -164687 -90321 -49905 37244 43729 -62306 -50118 154573 -35231
11843 -35231 -148134 -48411 -87277 -32567 -56721 -189071 -30694 -53918 68867 82294 -1556
11832a556j5720M8401m1525l4293j71607j4716J96291j05846J8786L356l144L8365
11820h3208K9805J04874q2267k4125O8561M2267r2277K9328Q9591K6155L9781
11809A48485j53390j9391K3049n3036M7863J80101j157j98385j8696K5493o8842
11798h7906r2615J55202k0548p4593J7213L7887O3931J12389O9457j00919j14824
11787c5326Q3144L9390q5835j2056l4875L9208o783l725K1588o486j3514j2947
11775b8217N825M5610p320o3273l5731K4124K2543p6251j16890J21571J12514
11764D505J1281o7683o3482K0325P161K9790K0504N915J46726m2507j17534l2569
11752g7568O9735J35782j01831j05113j10919O3439J10349P5319P8522j2772p7584
$$ plain form
11832 -1556 -17276 31125 -10400 -44693 -216300 -231016 -34725 -140571 -121785 -118429 -121573 -83208
11820 -83208 -53403 51471 -30796 -54921 13640 55907 -36370 -7042 82549 108704 148485
11809 148485 -4905 -24296 -1247 -54283 -6420 173681 172524 -25861 -44557 -19064 -87906
11798 -87906 -180521 -25319 -45867 -120460 -103247 -65360 -1429 110960 180417 79498 -35326
11787 -35326 47818 87208 1373 -10683 -45558 -6350 -13133 -16858 4730 -1756 -15270 -28217
11775 -28217 -22392 23218 15898 -47375 -83106 -58982 -36439 -112690 -229580 -108009 4505
11764 4505 15786 -51897 -115379 -95054 -87893 -58103 -37599 -31684 115042 72535 -44999 -77568
11752 -77568 -7833 127949 26118 -78995 -189914 -126475 -16126 59193 137715 124943 47359
11741D7359l5915o1607M552n3876j39685M5083J29462O7669J05634N2686j50717
11730A0645m902K9709n3250m9160K1165M6713O692j25446m2274Q8816P2063j3523
11718a2752J42151o8195p9119P52p8681M0220O7188n5083j903O0464q842l0148
11706b3948J10275j6993j26846j9086o3648Q069J47752O6080n7406L9946j27135
11695f2940J391L9653P7587Q5601n2728K2071o0890l1942j29082J17689J5232
11684B1642j29769j10056O2759J22301j4157L3040J23381J0516j23288p435J69818
11673A58752q9140m3541l7796M6495M1190l5524J0524p733l8201o5794R0607j2450
11661A7389j00783j13227J12106J12102r9386J33880k8104j24617Q7617J58374
$$ plain form
11741 47359 11444 -50163 -45611 -99487 -239172 -194089 -64627 3042 108676 161362 10645
11730 10645 5743 35452 -17798 -66958 -45793 920 7612 -117834 -160108 -71292 771 -12752
11718 -12752 129399 61204 -17915 -17163 -95844 -55624 11564 -43519 -45422 15042 6200 -23948
11706 -23948 86327 69334 -57512 -76598 -140246 -132177 15575 81655 24249 64195 -62940
11695 -62940 -61549 -21896 55691 141292 88564 110635 49745 17803 -111279 6410 21642
11684 21642 -108127 -218183 -155424 -33123 -47280 -14240 109141 119657 -3631 -11066 158752
11673 158752 69612 26071 -11725 34770 75960 40436 50960 43227 5026 -60768 29839 17389
11661 17389 -83394 -196621 -84515 27587 -71799 62081 33977 -90640 -3023 155351
11651A55351j5937p5467j12011j31401L142O5841J1385j25721R0250l0493R6907
11640f8154J7133R0378N8567J0858j74243l5911J45084K8650k7866l4282r4191
11629h3977J38390J05298l0577r4245O303l4706L4312M8047o8227m8388j2468
11618d0238O5156K9818m8267j30619k3929J47733J42807j21163n9307k3660k4386
11607h6055p8346q570L4175J10051Q1117o2712M2092r9488N1626L0395n1591n2951
11595i0257j1173P3399N5733l6033j08164Q5368J01036l8731K026k6243l3124
11584b6163n7643m0870M5602M4739j5638L3959J8776l0513O0038j50M154J0086
11572D6377j6127j2909O351q5744Q823o569K7955j1481l8087R395O7341l7703
$$ plain form
11651 155351 139414 63947 -48064 -179465 -176323 -110482 -99097 -224818 -134568 -165061 -68154
11640 -68154 -51021 39357 97924 108782 -65461 -101372 43712 72362 44496 10214 -83977
11629 -83977 54413 159711 129134 34889 41192 6486 40798 88845 20618 -27770 -40238
11618 -40238 24918 54736 6469 -124150 -148079 -346 142461 21298 -38009 -61669 -86055
11607 -86055 -164401 -172971 -138796 -28745 52372 -10340 31752 -67736 -16110 14285 -37306 -90257
11595 -90257 -101430 -28031 27702 -8331 -116495 -31127 69909 31178 33204 6961 -26163
11584 -26163 -83806 -124676 -79074 -34335 -49973 -16014 2762 -27751 32287 32137 36291 46377
11572 46377 30250 17341 23692 -62052 -53229 -59798 -31843 -43324 -81411 -72016 -4675 -42378
11560d2378k4304Q7113k5045P180o6424N6532J8203O4269o5028m648J2933j5024
11548C379p981J1584r726r2175N4876J1091j6666m1772P5393o4167o7473O0520
11536h3117J10416O7006N197j16849j4742k4303Q6679O783l2197Q89j64205J8059
11524a40384R5194j5303N9694K6143K5804k7053R1123k825L211p2895M6623Q0170
11512A69502p8264r7150r6831J6126P879l6727M4322R5779j694r2551M5492n8383
11500h2500L4653J48519k034k4576j66128q9405J56047L3452l6708K8538k8952
11489b9094l3791k49K09681J3619o4581J7238j21075N2994J7520K6372m1083o8286
11477b0735J25211O0671j5911j11432J20558M2993j32636r5224P9799l6403m7357
$$ plain form
11560 -42378 -66682 20431 -4614 2566 -63858 -7326 10877 75146 10118 5470 18403 3379
11548 3379 -4602 6982 -2744 -94919 -40043 -28952 -45618 -87390 -11997 -76164 -143637 -83117
11536 -83117 27299 94305 99502 -17347 -32089 -56392 30287 37070 4873 5762 -158443 -140384
11524 -140384 -45190 -60493 -799 25344 51148 24095 115218 112393 115604 42709 89332 169502
11512 169502 91238 -5912 -102743 -86617 -78738 -115465 -71143 24636 22942 -69609 -24117 -82500
11500 -82500 -47847 100672 98638 74062 -92066 -181471 -25424 8028 -28680 -142 -29094
11489 -29094 -62885 -63134 146547 160166 95585 112823 -8252 44742 62262 88634 47551 -20735
11477 -20735 104476 165147 149236 37804 158362 201355 68719 -26505 53294 16891 -30466
11466c0466J53623N393j48004R489k328o2882l3513R7284P6940K9319J15135q3597
11454A26393p7266J8390K6233p9721j20006K1144R3949P7510l5221k7357m2932
11443a8884O7012L9160m6960l4315L2915p8916p7265j1516Q7095N0233k7890o4403
11431h3734o1783K2739J52892N5627K9678j00242k2869j6900K1982j02309k7315
11420a32234O3219N9094o0138L5633m3926J8949j9392n9015O9919l3287J08543
11409G365m5839O4707j996l8046p1137m0551k7285P4888K9386J0766l196l0818
11397g1756J14127O4104n5552N7871L4363j25268j9274N304m9456j20693J6929
11386a49301R3466j3872O5468P6028r0286n4266N9194k0907J00739o9559P0160
$$ plain form
11466 -30466 123157 128550 -19454 -9965 -12293 -75175 -108688 -11404 65536 94855 209990 126393
11454 126393 49127 67517 93750 14029 -105977 -84833 9116 86626 51405 24048 -18884
11443 -18884 48128 87288 40328 6013 38928 -39988 -117253 -128769 -41674 8559 -19331 -83734
11431 -83734 -145517 -122778 30114 85741 115419 15177 -7692 -24592 -2610 -104919 -132234
11420 -132234 -69015 -9921 -70059 -34426 -78352 -59403 -78795 -137810 -67891 -101178 7365
11409 7365 -38474 26233 24237 -13809 -84946 -125497 -152782 -77894 -48508 -37742 -40938 -71756
11397 -71756 42371 106475 50923 108794 143157 17889 -1385 3919 -45537 -166230 -149301
11386 -149301 -55835 -69707 -4239 71789 -18497 -72763 -13569 -34476 66263 -3296 66864
11375F6864r4325m3128j2175J8142N7269M0334j06515k6943O7572m3240k6004
11364a02149m3615P1282J09585k6537n3420j45029P9748N1236J00802L8115o72
11353G9346m4067L6948l9635j00465Q4523q3089p7489K629P0960Q2489M1207r1438
11341c8081M6019O4398j14N653n5813m7701O3052J8336j14589p7058M7253Q6223
11329b422L9073J7057J7243q9734l7434R5506J05914j04695J13692j41719q3654
11318g1173K4665P3298p0461k1212L9686J3966K84396j24353j5426k5310j16195
11307h119l2417j2806O2556L0531N1038r239m9854j51175M0075J973L739N3769
11295a9929O8572j22989J0669r7124m0770Q5409k215m570R2835J1122j5873M3890
$$ plain form
11375 66864 -27461 -70589 -82764 -64622 -7353 32981 -73534 -100477 -32905 -76145 -102149
11364 -102149 -145764 -74482 35103 8566 -44854 -189883 -110135 -58899 41903 80018 79346
11353 79346 35279 72227 32592 -67873 16650 -66439 -143928 -141299 -70339 12150 53357 -38081
11341 -38081 7938 72336 72222 77875 22062 -25639 37413 55749 -58840 -135898 -88645 -2422
11329 -2422 36651 53708 70951 -18783 -56217 39289 145203 40508 154200 12481 -71173
11318 -71173 -46508 26790 -43671 -64883 -25197 -11231 273165 148812 133386 108076 -8119
11307 -8119 -40536 -53342 9214 39745 90783 81544 31690 -119485 -79410 -77437 -73698 -19929
11295 -19929 48643 -74346 -63677 -160801 -201571 -116162 -118377 -122947 -30112 -18990 -34863 9027
11283I027K8667K099j39892o3446L0236P3310R6270L0564j00426j39860K5205
11272a48246o5919J9085N6151K3669K5299k5m8770J39978Q353j27185L0102j6221
11260a03729N6572N475Q5994K5920l7079j25686P7063n4416o1589O707K9932M8305
11248d6531K1881m3435J30977l0808J2698m7105n4564m8768J18686R701n6431
11237c3699j4897M2240O3587k4185P4004j42085l0599m1746O9770J22026l4423
11226D9993l0070m3558J58740n3084m985j0670j25980K2588l884J24306j706m6662
11214C5028P0354j06033j09471R823N9018J00347n8529j07057L5998L930J5655
11203e0937L7922j05274J17802Q0767j6133p0842n3353m299k3446n1883q843N9487
$$ plain form
11283 9027 37694 39793 -100099 -163545 -133309 -59999 36271 66835 -33591 -173451 -148246
11272 -148246 -214165 -195080 -138929 -115260 -89961 -89986 -138756 1222 9575 -117610 -87508 -103729
11260 -103729 -47157 -41682 44312 70232 33153 -92533 -15470 -69886 -131475 -124768 -94836 -46531
11248 -46531 -24650 -68085 62892 32084 44782 -2323 -56887 -105655 13031 22732 -33699
11237 -33699 -48596 -6356 57231 33046 107050 -35035 -65634 -107380 -37610 84416 49993
11226 49993 19923 -23635 135105 82021 77036 66366 -59614 -37026 -40910 83396 81690 35028
11214 35028 105382 -651 -110122 -100299 -41281 59066 537 -106520 -70522 -66592 -50937
11203 -50937 -13015 -118289 -487 80280 64147 -6695 -60048 -64347 -87793 -139676 -148519 -89032
11191h9032N0561O5292r2931K6396m0981j5641R1761L624M7201m4262l468L3438
11179C1958L7351l071j62027q5284Q512q214j8673Q8106M8463q3348K07104L7339
11167I8216j04204Q744N2572O1032r5305R8539o1250q5935o6653q979J18913p9356
11155f3666k7921R9774L9422K2903J08900j6228m702r5670k4517J686N6956P7838
11143A74775j38366m3036k8961L6533o927r5840L1650l5710K34157L6971L7601
11132B02847j27651m9169L3652p7882K626N2589N3234j6046R825N5292N1988N0852
11120B42157N6183j46228j34920M4799l9753j51286O8639Q2595J18582m1462j90644
11109i1338R0928P0008J8099o3868l5814j3319r4560O0906M0833J4509j22311
$$ plain form
11191 -89032 -38471 26821 -66110 -39714 -80695 -96336 -4575 -951 46250 1988 -1480 31958
11179 31958 69309 66238 -95789 -181073 -172561 -180775 -199448 -111342 -62879 -146227 60877 98216
11167 98216 -5988 2756 55328 116360 21055 119594 58344 -27591 -94244 -103223 15690 -63666
11155 -63666 -91587 8187 47609 70512 179412 163184 158482 62812 38295 39981 96937 174775
11143 174775 36409 -6627 -35588 945 -5982 -101822 -70172 -105882 128275 165246 202847
11132 202847 75196 26027 59679 -18203 -15577 37012 90246 74200 84025 139317 191305 242157
11120 242157 298340 152112 17192 61991 22238 -129048 -60409 22186 140768 99306 -91338
11109 -91338 -410 69598 87697 23829 -11985 -25304 -119864 -58958 -18125 -3616 -125927
11098a25927J72546k4302R635J8674j19989J0269o1795L6545l8049J7952O0591
11087d3850J71847p4568j5318L2876l1469L0710J8823L9746m4130j1473q2323
11076i129M4922k1118q581p2457J9422J67335L408p7456Q5101p7364j56341L2974
11064f9284R9002K1487k5848K2942j27435N5251J2764R1511N700r2122J05853
11053I9821l2141k1530M4319N1872m4730L8898o0705m2701J31690n4669r1058
11042A9066K5209k0054p9365J11042J3810k0162o3654j18763J17197J70218m6307
11031A08237n5361J63636r8920m6920j22519J50170J24777r9545p4366k7762j4164
11020G263Q1525k6140n5991l0857R9117R3871p8806r5055r9664P4322k9118P1096
$$ plain form
11098 -125927 46619 22317 31952 50626 -69363 -59094 -120889 -84344 -122393 -104441 -43850
11087 -43850 127997 53429 38111 70987 39518 70228 89051 128797 84667 73194 -9129
11076 -9129 35793 14675 6094 -66363 -46941 120394 123802 46346 131447 54083 -102258 -69284
11064 -69284 29718 51205 25357 48299 -79136 -23885 -11121 80390 86090 -6032 99821
11053 99821 67680 46150 90469 142341 97611 136509 75804 33103 164793 110124 19066
11042 19066 44275 24221 -55144 55898 69708 49546 -14108 -132871 -15674 154544 108237
11031 108237 52876 216512 117592 70672 -51847 98323 223100 123555 49189 21427 7263
11020 7263 88788 62648 6657 -24200 74917 168788 89982 -5073 -104737 -30415 -59533 11563
11008A1563M3009R1626m3530j283q673M307l7752j86936K8083L4947l3910Q7441
10996a1108O0640M8308o3841R1555p5167o6761J5872j6135l2535j3229K1372k1228
10984f2257Q1989k1903l5594k5666J02755L0825p2643M010m5526r2178R8588K6141
10972a1459R1931p2738m3881J26557N6722k2609q0408l572J504L9296j17662p4557
10960a10876L2938j2578R7407J79575j70915q8262k0640o3998P8873M0739Q9464
10949E1727N4926r542j7213r7833N6040n7688M3199K1697l1012J5862p5624M9019
10937C558p990n4535N3536K9834q4303J08802K7808n342n5194q3097L7823J03663
10925G4563L9169j21781j06041k3960J56357K0560m8761k4299R1925q6168j15896
$$ plain form
11008 11563 54572 146198 102668 101385 92712 97019 59267 -127669 -99586 -64639 -98549 -11108
10996 -11108 49532 97840 33999 125554 50387 -16374 -502 -16637 -49172 -62401 -41029 -62257
10984 -62257 19732 -2171 -37765 -63431 39324 70149 -2494 1516 -44010 -136188 -37600 -11459
10972 -11459 80472 7734 -36147 90410 147132 124523 44115 40543 42047 81343 -36319 -110876
10960 -110876 -77938 -90516 6891 186466 15551 -72711 -93351 -157349 -78476 -37737 51727
10949 51727 106653 97111 79898 -17935 38105 -19583 23616 45313 14301 30163 -45461 3558
10937 3558 -4432 -58967 -5431 24403 -59900 48902 76710 71368 16174 -66923 -29100 74563
10925 74563 113732 -8049 -114090 -138050 18307 38867 -9894 -34193 57732 -28436 -144332
10914a44332P667R065O1526l0909N9721J41038M1679j69669k0648K8114q4344
10903a01092J37154J2694j62779N9477O2741p4249M0041Q0005N811l4244Q4710
10892A10269j53840k1532J32265j01367J09008M4313L281n5976l0457j8745M4831
10881F2050j77132M4966N0869p8119M3158j9550K0391J8015R9004K0158j65947
10870h2137l5309R6974N2724j50538J0048R9095o9979M7538k6255J5211K765J87746
10858A47883J00447p4832r4793j5879k672o4053Q372j31111J0837l6688Q6279
10847f6210R270k7528m9562l6999J22242J7749L779J7074Q277q5293m7878M9307
10835h5772M9600r794Q9095N513m86p49p5965R2004k081k196k3647M3802o5244
$$ plain form
10914 -144332 -136665 -127600 -66074 -96983 -37262 103776 145455 -24214 -44862 -16748 -101092
10903 -101092 36062 48756 -114023 -54546 8195 -66054 -26013 53992 59803 25559 110269
10892 110269 -43571 -65103 67162 -34205 74803 119116 122397 66421 35964 17219 62050
10881 62050 -115082 -70116 -19247 -97366 -54208 -73758 -53367 -35352 63652 83810 -82137
10870 -82137 -117446 -20472 32252 -118286 -108238 -9143 -79122 -31584 -57839 -42628 -39863 147883
10858 147883 248330 173498 78705 62826 60154 -3899 4473 -126638 -115801 -152489 -66210
10847 -66210 -56940 -84468 -134030 -171029 -48787 -31038 -27259 -10185 -1908 -87201 -135079 -85772
10835 -85772 -36172 -45966 43129 48642 48156 47407 -28558 63446 61365 59169 35522 79324 14080
10822A4080o5139K0515l7807J98690r589q3769M1538J31268j13190k1995M3339
10811A17941K394K7548l0156j04669j21077N5356M7478O9402M1721p4935k3668
10800G335l5799R3596j452O2194l5214j17128K9079J08126o028j17140J2592J02704
10788A02865J1050j7995q2800n3367M9654J22271J02446p2842k3276p6034k8433
10777C3539m9324J22714q7606M0758j942m686O7096p6378m55L6270j32448K9132
10765b3330O7594j19415Q0640K6644J75576k8050P647l7363j91765M9416p5403
10754f7809Q547L0406O0631M8464j1768K7544K6783j61820m4023J04566K9845
10743E1366p0010J14249J6054n4563J6178n8709m1901O4620O7060k7886J9285
$$ plain form
10822 14080 -51059 -30544 -68351 130339 120750 36981 78519 209787 96597 74602 117941
10811 117941 120335 147883 117727 13058 -108019 -52663 -5185 64217 105938 31003 7335
10800 7335 -28464 65132 63680 125874 90660 -26468 2611 110737 104709 -12431 161 102865
10788 102865 113915 95920 13120 -40247 9407 131678 234124 161282 138006 61972 33539
10777 33539 -15785 106929 19323 60081 58139 53453 120549 44171 43716 79986 -52462 -23330
10765 -23330 44264 -75151 5489 32133 207709 179659 187306 149943 -41822 7594 -67809
10754 -67809 -59262 -28856 31775 80239 68471 96015 122798 -39022 -83045 21521 51366
10743 51366 -18644 95605 111659 57096 73274 14565 -27336 37284 104344 76458 95743
10732I5743m0726Q4407j62984p1463L4649O9674R9504o6850r0858r92O400Q937
10720c4559n3929P6961J50986O5750j05089j40541j1241N5806N6622Q2663L4213
10709A77642j07348j19720j37985R6651J26238j15678M1966l8200J1393k839L3254
10698c4626Q8966L5361k7443j620k0107p3447K1936k7149j4392Q660J34015K0896
10686A11050k6414k5345j34084J7180J18594N8813P1955j00029k4649K6623K9275
10675A22969n596r5724j04779J08312M6412J04958L047j32662r4972R7821k0508
10664B9278p6555J4350J22912m6134n5108O3176O6357n6738j413N2059j20335
10653h151J10330r5805M811l0759M0060M5556o1488j15706j1364J17688J07082
$$ plain form
10732 95743 55017 139424 -23560 -95023 -60374 9300 108804 41954 -48904 -49896 -43496 -34559
10720 -34559 -88488 -11527 139459 205209 100120 -40421 -51662 4144 60766 143429 177642
10709 177642 70294 -49426 -187411 -90760 35478 -80200 -38234 -76434 -65041 -67880 -34626
10698 -34626 54340 89701 62258 60638 40531 -32916 -10980 -38129 -52521 -43861 90154 111050
10686 111050 84636 59291 -74793 -57613 60981 119794 191749 91720 67071 93694 122969
10675 122969 117373 21649 -83130 25182 71594 176552 179599 46937 -48035 49786 29278
10664 29278 -47277 -32927 89985 43851 -11257 51919 118276 61538 60125 112184 -8151
10653 -8151 102179 6374 11185 -19574 20486 66042 4554 -111152 -122516 -4828 102254
10642A02254j4609M6509j7186j07008Q1962n3608L2705q7330q6858l5860L8134
10631a00895Q9734J61143o38p1708k0102j00935k2454o1541l1007L5991J81330
10620E8918l3838r133J16200l0830j14124n5692M1581N5165j83263j2739O2907
10609a04848J37719R6031q3925j4912k3208j5908j3212j1011Q3560M3079K9410
10598A22775n7989k172j3946O3031m654j25267L2306R7704o9657J33636j68927
10587F840r0411J10128Q4348L0028k6409o5666K1053m5413l0202J86064n7251
10576A23109j7280j4956R7388n2519K2550J1307P8O2479r0779j11687o3509k621
10564c6440Q7022m2257o4128m347J10619j4897M5327j4404o849K5320k2596k01289
$$ plain form
10642 102254 87645 134154 116968 9960 91922 38314 71019 -16311 -103169 -139029 -100895
10631 -100895 -11161 149982 149344 77636 57534 -43401 -65855 -127396 -158403 -122412 58918
10620 58918 25080 15947 132147 101317 -12807 -68499 -26918 28247 -155016 -167755 -104848
10609 -104848 32871 128902 44977 30065 6857 -9051 -22263 -33274 50286 93365 122775
10598 122775 64786 62614 48668 111699 107045 -18222 14084 111788 42131 175767 6840
10587 6840 -83571 26557 110905 140933 114524 48858 69911 24498 -5704 180360 123109
10576 123109 105829 90873 188261 135742 158292 169599 169677 232156 141377 29690 -33819 -36440
10564 -36440 50582 8325 -55803 -60150 50469 35572 80899 66495 59646 84966 62370 -138919
10552a38919M9045L6763j295J04536L3423r8735O5910J3331M9487l3787q8444
10541h685k1064Q561O4533M3516k0078j21800K4935J9679n113M9737L2793J36305
10529B03319j04202o3487q7110N3007N4261r3861J15037j2750j26167K3413N6894
10518A8354J04981k0342m1919M9378m4115m2148K5202L3860J127j2671k07945
10507a36238K3462J34954k1604o1312M1223O2667J61270j02090L2113k9700M7746
10496A52491j04357j50703P7511m0714O8249J19348k7883j17433j536J02123p905
10485F9191R8274J3642q8617n5996Q5498J00850N1817o3125m7060j17559J4133
10474F1048o6464m9744R0189J13605O232J20905K4646r3653j08701o8951j35223
$$ plain form
10552 -138919 -89874 -53111 -54406 50130 83553 -15182 50728 64059 113546 79759 -8685
10541 -8685 -29749 -21188 43345 86861 66783 -55017 -30082 -10403 -15516 34221 67014 203319
10529 203319 99117 35630 -51480 1527 55788 -38073 76964 64214 -61953 -38540 18354
10518 18354 123335 102993 61074 110452 66337 24189 49391 83251 84378 71707 -136238
10507 -136238 -112776 22178 574 -60738 -19515 43152 204422 102332 134445 104745 152491
10496 152491 48134 -102569 -25058 -65772 2477 121825 93942 -23491 -25027 77096 69191
10485 69191 167465 181107 92490 36494 121992 222842 274659 211534 164474 46915 61048
10474 61048 -5416 -55160 35029 148634 154866 275771 300417 206764 98063 29112 -106111
10463a06111O5727K5847J36327J30685j42545K3522n3508J19237N9264r8146j98417
10452c8118J7576M8330L6838k0839n8035r129R3357N5983N1088l4625P3457p4031
10440A41852m4462K086k4461O078p6833P0532k4445K1169m7741Q28L1695M7083
10428A03381J3184j29163j9783k5133r541K636O0301N6615j4298K881Q3988k8029
10416I7039l4451j10628l4112J04471r0595J7043K158P4179J81387l728p1814
10405A30949j54597J6040P0691J2423O248n300K8301k4941n9941K8319j081L9878
10393H6989K1156M5714j019N9525l4673L4248k1379o2995n3376K3000R19J29404
10381B27513k00225j34320J50497Q768J23448j4497Q0812j13005j29490J02986
$$ plain form
10463 -106111 -40384 -14537 121790 252475 109930 133452 79944 199181 258445 160299 -38118
10452 -38118 -20542 27788 64626 43787 -14248 -23377 69980 125963 177051 142426 215883 141852
10440 141852 97390 99476 75015 81093 4260 74792 50347 71516 23775 24603 56298 103381
10428 103381 116565 -12598 -32381 -57514 -67055 -64419 -4118 52497 38199 41080 125068 97039
10416 97039 62588 -48040 -82152 22319 -68276 -51233 -49075 25104 206491 202763 130949
10405 130949 -23648 -7608 63083 75506 81754 76454 104755 79814 19873 48192 47111 86989
10393 86989 108145 153859 152840 212365 177692 211940 190561 127566 74190 97190 98109 227513
10381 227513 27288 -107032 43465 52233 175681 161184 241996 128991 -499 102487
10371A02487L1164n1154n2211j1211n60J7684l819J5728Q3371j5721n0052M1116
10359A06822L2224r2237O1033m8399j8558M9426N4930Q010j36626l8093N8270
10348C6802J11623R1587j17932j02811q3681J8853M2798l2819L0563M6618L1383
10337G2984l3732q8279L1964Q4008L8037O0853k6627J21334K9652m8730p1360
10326A70104j02674P2433J46630j28214q5096J7696J7115M8036j83789j4780J43702
10315A01163L8768j10j2489j14486J40508n4588j38224L4756J26867P4032L8812
10304B35009j84766Q212Q4047N2083K1219r2052j2378l5506J9545l7363L1072
10293H9122K4330R0468o6896Q767M3923P94p1963J3703N0039M990j41779k7666
$$ plain form
10371 102487 133651 82497 30286 19075 18515 36199 32380 48108 131479 115758 65706 106822
10359 106822 139046 46809 107842 59443 40885 90311 145241 153251 16625 -21468 36802
10348 36802 148425 240012 122080 19269 -64412 -45559 -2761 -35580 -5017 41601 72984
10337 72984 39252 -49027 -17063 66945 104982 165835 139208 260542 290194 241464 170104
10326 170104 67430 139863 286493 158279 73183 90879 107994 156030 -27759 -42539 101163
10315 101163 139931 139821 127332 12846 153354 98766 -39458 -4702 122165 196197 235009
10304 235009 50243 58455 142502 194585 215804 123752 111374 75868 95413 58050 89122
10293 89122 113452 203920 137024 145791 189714 190508 118545 132248 182287 187277 45498 17832
10281A7832J23537q9380K591J9133j2499K6245p206l1763l0883K5388P1801l448
10269A11348P7665J3978J3031m172l83j9833K9153n9169k0715m1038o8542M7127
10257G8450q050j152M260l4259J3113k1032K449J3341J3755N1422m4955J37226
10245B04568m0165m6504J842J19485K6159j18084J6597j6317N4897p442K7834
10234B22870o9969l8765K6255K4360K0110j57334k4600M9328K2158n1467j9448
10223C498L4855L5639J6281N3669Q9857r7241M0309j4939L618O7184q9198k878
10211A40654m1458L3007k0972m3323P38j2622J49554K014j48603K5408K3561P0548
10199A78506l5919L3482k4727r4690M4120R1415P912K1456m1817J281O579l6235
$$ plain form
10281 17832 141369 51989 54580 73713 61214 87459 80253 48490 17607 42995 114796 111348
10269 111348 189013 202991 216022 211850 211467 191634 220787 161618 140903 99865 31323 78450
10257 78450 70400 69248 73508 39249 52362 31330 33779 47120 60875 112297 67342 204568
10245 204568 164403 117899 119741 239226 265385 147301 163898 147581 202478 195036 222870
10234 222870 152901 114136 140391 164751 184861 27527 2927 52255 74413 22946 3498
10223 3498 38353 73992 90273 143942 233799 136558 176867 161928 165546 232730 143532 140654
10211 140654 99196 132203 111231 67908 68646 56024 205578 207592 58989 84397 107958 178506
10199 178506 142587 176069 151342 56652 100772 192187 200099 221555 179738 181019 187598 151363
10187A51363m1010q6811M4223M9319J1367J11871l1468K8790J36590q0513p7835
10176B15886L6627o7467l1073k889M9852j15612K4J03962j8020l0497m3519O611
10164A03885P4623J16627R474K496K418O6965o3781j11055m6412J00475j4693
10153B41022r8224J06496n2914j52607N8923L2712J94826r9583Q048m1690j10059
10142H6950J5493o3075O3648R7011M0018J3161M8131m587l0246J7286q8110j55264
10130D0416Q3289K51080j24046r3423q9858J37631o9023O271L2802j06402o9523
10119g86J1275J41588M3654R1058J50653k18771j04651Q7677p3932P4103k5791
10108A76077M9472o4716k9938N561l6704q5301J77500l7525K4290Q1291O7909
$$ plain form
10187 151363 110353 23542 67765 117084 128451 240322 208854 237644 374234 293721 215886
10176 215886 252513 185046 153973 151084 200936 85324 85348 189310 171290 140793 97274 103885
10164 103885 178508 295135 304609 307105 309523 376488 312707 201652 155240 255715 241022
10153 241022 142798 249294 196380 43773 102696 135408 330234 230651 238699 197009 86950
10142 86950 102443 39368 103016 200027 240045 253206 301337 296750 266504 283790 195680 40416
10130 40416 123705 374785 250739 157316 67458 205089 136066 142337 175139 68737 -786
10119 -786 10489 152077 195731 286789 437442 218671 114020 201697 127765 201868 176077
10108 176077 225549 160833 130895 136456 99752 14451 191951 154426 178716 260007 327916
10097C27916L370j10197o0907P5362J5543K2503n4776n6398j59336o383N4994
10086E1691M0920P6517L7433K6034Q4705N0662m9956n5620K3692Q4638o6648J4253
10074C18321o8554o3601J774R5224L9338p9597q5363P6927M8469k5188K2633N1866
10062C32249L5697l3960o8196k7884M784J2034r0240Q0420J05402k1421j1408
10051C17477L7865k0623r8152K4429J54594P2526j28601Q2081R8959m7613J614
10040D94556P5791J8494M6625m8380j19190p8419J92534j71788L1972J0387r1439
10029C61143J16342r7631P4396P4953L357j19779L4976k916M961J5719Q1595j04809
10017D42307J5066J07569k8487R2288l2818P1905J03350J66140N7586m1633J4398
$$ plain form
10097 327916 331286 221089 160182 235544 251087 273590 218814 162416 3080 -3303 51691
10086 51691 92611 169128 206561 232595 317300 367962 318006 262386 286078 370716 304068 318321
10074 318321 249767 186166 187940 283164 322502 242905 157542 234469 282938 257750 280383 332249
10062 332249 367946 333986 265790 237906 242690 254724 164484 244904 350306 328885 317477
10051 317477 355342 334719 236567 260996 415590 488116 359515 441596 540555 492942 494556
10040 494556 570347 588841 635466 587086 467896 389477 582011 410223 442195 452582 361143
10029 361143 477485 379854 454250 529203 532560 412781 447757 444841 449802 465521 547116 442307
10017 442307 457373 564942 536455 628743 595925 667830 771180 937320 994906 953273 967671
10006I67671J4211R3746L0323M452N5338R5465p3356j12217j2635j287l6176L6870
9994A062405j19174j0792n7177p4240q708M4958M4219j7666k0329n1363k5917
9983G66216l6173P6026L633J00579P6597j52087m3485j3105J00950O8353J61942
9972A109446M6087n616N4053Q7425k4600R0835K5292j21138m0463k7196l9852
9961A154273J132r4373L9655m0005p0985K3324j78435J21544m1191K2950J2244
9950I50133m6277j53917M0314K9431p4751k3648O4114M7157o7107l3451J0K1292
9938G53300o0850l5969m7284K9127N2171N2870o2848p3204j0596P3329M6238q0391
9926F35893L1423J02115m6185j01124J0909L2201Q1918r7452r206k9063K3631
$$ plain form
10006 967671 981882 1075628 1105951 1110403 1165741 1261206 1187850 1075633 1062998 1061711 1025535 1062405
9994 1062405 943231 932439 875262 801022 792314 837272 881491 863825 843496 792133 766216
9983 766216 730043 806069 809702 910281 986878 834791 791306 778201 879151 947504 1109446
9972 1109446 1155533 1149917 1203970 1291395 1266795 1357630 1382922 1261784 1221321 1194125 1154273
9961 1154273 1155405 1061032 1100687 1060682 989697 1013021 834586 956130 914939 937889 950133
9950 950133 903856 749939 790253 819684 744933 721285 785399 832556 765449 731998 732008 753300
9938 753300 692450 656481 609197 638324 690495 743365 680517 607313 596717 670046 716284 635893
9926 635893 667316 769431 723246 622122 633031 665232 747150 649698 640492 611429 635060
9915F35060J195J02277j2496p1135o383R3794k0217J22805K4620K91K6944j5125
9903H81630k4504J7937J60570j57843M7624Q806O3149K2458o808p6523K9685p5994
9891H90187L4493p9231O5904K9899K1503k327K841k339m3643J0808n0981K6017
9879I03131l5461j9378J63996O771L243P9214L1994j9184o347n2318r81J02671
9867A157351l3357J01338j00719L7021o4747l4843P4584J00628O4674O926j46080
9856A162776o78J09280j4017l0295r529j05583N9798N4863L0558J2383j59268
9845A110288J61196J86191j14090j25085o183R268l7055L4989R049j74512R6254
9834A150310J67364J47910j1957j39386R7025q4825M9229M70J5896q9723O9451
$$ plain form
9915 635060 636255 738532 726036 654901 648518 742312 722095 844900 869520 869811 896755 881630
9903 881630 857126 875063 1035633 877790 925414 934220 997369 1019827 1013019 936496 966181 890187
9891 890187 924680 845449 911353 941252 962755 960428 963269 960930 917287 928095 877114 903131
9879 903131 867670 848292 1012288 1019059 1022302 1101516 1133510 1114326 1107979 1055661 1054680 1157351
9867 1157351 1123994 1225332 1124613 1161634 1096887 1062044 1136628 1237256 1301930 1308856 1162776
9856 1162776 1162098 1271378 1257361 1227066 1217537 1111954 1171752 1226615 1257173 1269556 1110288
9845 1110288 1271484 1457675 1343585 1218500 1212317 1221585 1184530 1219519 1228568 1054056 1150310
9834 1150310 1317674 1465584 1453627 1314241 1411266 1326441 1375670 1376140 1392036 1302313 1371764
9823A371764N0579P6229j17985r3138m6750K3210P1814L9991O7057m4775K8341
9812A426337N4331L5001Q0679R1032l9561l9497j26861J1917N0117Q6302n791
9801A624006o9040J8479j14459K1854Q0425m7640R8207K2677m6059m3262j9202
9790A525986J01224K05618j00707j01869K729k642m0290n802k0292J5873n3784
9779A526044M9522q6882J26979J34342O906j2403k6701L1607n6964p5961j5145
9768A601344O9291J0814j0984L1485n4121J04698N2589j24467q3687J97097K0957
9757A815016L463l2357L1792J5897P2249J00017k7771K434J15895p5905J38408
9746B159138O380r1956M0908K9386P4985J08891o8025l4447L403J9508J16584
$$ plain form
9823 1371764 1422343 1498572 1380587 1287449 1240699 1263909 1335723 1375714 1442771 1397996 1426337
9812 1426337 1480668 1515669 1596348 1687380 1647819 1608322 1481461 1493378 1543495 1629797 1624006
9801 1624006 1554966 1573445 1458986 1480840 1561265 1513625 1611832 1634509 1588450 1545188 1525986
9790 1525986 1627210 1832828 1732121 1630252 1632981 1630339 1590049 1584247 1563955 1579828 1526044
9779 1526044 1575566 1488684 1615663 1750005 1756911 1744508 1717807 1749414 1692450 1616489 1601344
9768 1601344 1670635 1681449 1670465 1701950 1647829 1752527 1805116 1680649 1596962 1794059 1815016
9757 1815016 1818479 1786122 1817914 1833811 1906060 2006077 1978306 1980740 2096635 2020730 2159138
9746 2159138 2165518 2073562 2114470 2143856 2218841 2327732 2259707 2225260 2228663 2248171 2364755
9735B364755Q3248P6158n4931O4463j7969J50865J51421Q743k542l956M1374O0683
9723B922312n0455O6512J31052Q2382J46030N2164K3322m4412p7217J97012L1441
9712C480143J89664O7057J8835J51693K1733k6689K02057J11649M7946J76431
9702D440519K01596J17049R2934N390P1425J72725J96881J00354K36035J66589
9692E801497K65513J21459K32202K06049K20910J62172K00113K49989K32610L67135
9682H059649K47254M06074M54695N10321M87138N01440N30932M42212O53073Q00726
9672A3093514R09006O85653R02370J161418J169727J333417J605560J840919J890763
9663B4592347K089968K300378K321422K676504K888034L385074L565447L958808
$$ plain form
9735 2364755 2448003 2524161 2469230 2533693 2515724 2666589 2818010 2826753 2824211 2820255 2861629 2922312
9723 2922312 2871857 2938369 3069421 3151803 3297833 3349997 3373319 3328907 3251690 3448702 3480143
9712 3480143 3669807 3736864 3755699 3907392 3929125 3902436 4104493 4216142 4264088 4440519
9702 4440519 4642115 4759164 4852098 4857488 4928913 5101638 5298519 5398873 5634908 5801497
9692 5801497 6067010 6188469 6420671 6626720 6847630 7009802 7209915 7459904 7692514 8059649
9682 8059649 8306903 8712977 9167672 9677993 10165131 10666571 11197503 11639715 12292788 13093514
9672 13093514 14002520 14688173 15590543 16751961 17921688 19255105 20860665 22701584 24592347
9663 24592347 26682315 28982693 31304115 33980619 36868653 40253727 43819174 47777982
9655D7777982M621838N595374O402212P489185R007826J0337293J0624909J0101406
9647A11958025R008019P902006O884547M747947J563637j538336l697387n286791
9639A31541667n522628o621819p900223p969001p117522n882603m745418m191811
9631H1590642l304698k710818k035921j524611j012324n05972N7542M02119J001358
9622G1957317J624810K239891L157527M211250N235216O502479Q044801R688061
9614A12661352J0207618R850405R065538P414972N953728L946207N69634j970927
9606A57698527m301014o424172p308267q451078j0058638j0103880r423877q295581
9598I3332020o967429o387105n779602n155839m823448m461501m000020l600369
$$ plain form
9655 47777982 52399820 57995194 64397406 71886591 80894417 91231710 101856619 111958025
9647 111958025 120966044 128868050 135752597 140500544 142064181 140525845 136828458 131541667
9639 131541667 126019039 119397220 111496997 103527996 96410474 90527871 85782453 81590642
9631 81590642 78285944 75575126 73539205 72014594 71002270 70496298 70553840 70955959 71957317
9622 71957317 73582127 75822018 78979545 83190795 88426011 94928490 102973291 112661352
9614 112661352 122868970 132719375 141784913 149199885 155153613 159099820 159669454 157698527
9606 157698527 153397513 146973341 139665074 131213996 121155358 111051478 101627601 93332020
9598 93332020 86364591 79977486 74197884 69042045 64218597 59757096 55757076 52156707
9590E2156707l209404l118293k933249k519815k105012k076162k001813j883974
9582C2308985j653710j448430j418452j289734j086104j045413q72353r23750
9574B2571039p50098o67002p59218p23498p00952o37338n32525o38052o45463
9565A6516893o45353n96410m99724n16913m87925m70205n06991l92472l28604
9556A2072296m32742k90670l35271l05680k34337j50537j31462l13052j25532
9547I753013k9126j08773P6052q367m7377j22785L2295j1252L6231O5045l1018
9536I603938l56433j56831k94426k14584j67150k30194j25595j71149j17730k33466
9526G536380l29508j93560j66564k59505j53585j04867j21851j49507r7946q5400
$$ plain form
9590 52156707 48947303 45829010 42895761 40375946 38270934 36194772 34192959 32308985
9582 32308985 30655275 29206845 27788393 26498659 25412555 24367142 23494789 22571039
9574 22571039 21820941 21153939 20394721 19671223 18970271 18332933 17800408 17162356 16516893
9565 16516893 15871540 15275130 14775406 14258493 13770568 13300363 12793372 12400900 12072296
9556 12072296 11639554 11348884 11013613 10707933 10473596 10323059 10191597 9878545 9753013
9547 9753013 9723887 9615114 9691166 9682799 9635422 9512637 9544932 9533680 9569911 9634956 9603938
9536 9603938 9247505 9090674 8796248 8581664 8414514 8184320 8058725 7887576 7769846 7536380
9526 7536380 7206872 7013312 6846748 6587243 6433658 6328791 6206940 6057433 5959487 5874087
9516E874087j58537j80650L2415j70832Q8539r2043j33724o3580l5227j12903
9506E047545J8695q9024o3041j37754q7310p3845Q1490j53972j69340N2382P554
9495D433380j11567j51822k2653n6933j02263M5868Q6257j9678o2986j01316m7589
9484C888698j1934L227j9102o861J07755j6888q1507o375J7655K6679j09881r6720
9472C694746n3954M6294j72915j57644M9818j16238K6289p8707j36819Q4j7771
9461C083183o0716p0468r8572L343l1198r3212j2067M4748J68624j8423n6509
9450B858733N4190r279K7944Q1883J7092m7568O893J49925K0272J9847j04437
9439C075495j3055N2176l2019l0034k9612o4087j04985l8576M2759j15814k43657
$$ plain form
9516 5874087 5715550 5534900 5567315 5396483 5485022 5392979 5259255 5195675 5160448 5047545
9506 5047545 5066240 4977216 4914175 4776421 4689111 4615266 4696756 4542784 4373444 4425826 4433380
9495 4433380 4321813 4169991 4147338 4090405 3988142 4034010 4120267 4100589 4037603 3936287 3888698
9484 3888698 3876764 3879991 3860889 3854028 3961783 3944895 3863388 3857013 3874668 3901347 3791466 3694746
9472 3694746 3640792 3687086 3514171 3356527 3406345 3290107 3316396 3237689 3100870 3100954 3083183
9461 3083183 3022467 2951999 2853427 2856770 2825572 2732360 2720293 2765041 2933665 2915242 2858733
9450 2858733 2912923 2903644 2931588 3013471 3030563 2982995 2989888 3139813 3160085 3179932 3075495
9439 3075495 3062440 3114616 3082597 3052563 3022951 2958864 2853879 2815303 2858062 2742248 2498591
9428B498591k3791J6930K0877j0082o7320m9355j7540n6550r844J86197J39023
9417B627136n7041p5599Q9851J6377J30404j22827q2154J16370m6635k0004m6294
9406B529584j47359L5612l8181J8433J13360j68707j31614J0544j42559J4138
9396B093251p0536M7979N1066K1027L7484m8681Q1773m3136j2168j21096M9347
9385B086310J44294J3021O4230j02171P1162J07480L2810r054J02158l8693m8699
9374B422848J9849j24353P5750j9462n126r0711o5396o1565m2945l4161M8021
9363B122749k5080p2827m4325m9510o637O9615J5543r9174K7768L3800m5829L7007
9351A963100J09516j9032o875J7554q153m5626J3645J42085Q6127O6038N0151
$$ plain form
9428 2498591 2474800 2491730 2512607 2502525 2435205 2385850 2368310 2311760 2301916 2488113 2627136
9417 2627136 2570095 2494496 2584347 2600724 2731128 2608301 2526147 2642517 2595882 2575878 2529584
9406 2529584 2382225 2417837 2379656 2398089 2511449 2342742 2211128 2221672 2079113 2093251
9396 2093251 2022715 2070694 2121760 2142787 2180271 2131590 2213363 2170227 2158059 2036963 2086310
9385 2086310 2230604 2243625 2307855 2205684 2276846 2384326 2417136 2408082 2510240 2471547 2422848
9374 2422848 2442697 2318344 2394094 2374632 2369506 2278795 2213399 2151834 2108889 2074728 2122749
9363 2122749 2097669 2024842 1980517 1931007 1924370 1993985 2009528 1910354 1938122 1971922 1926093 1963100
9351 1963100 2072616 2053584 2046709 2064263 2056110 2010484 2024129 2166214 2252341 2318379 2368530
9340B368530N3329p1138k0958m658j33146K9498K122N2596N3178M9176j16211
9329B262318K4569P3493l6209j60730J53329O7069l6152j8828l9259J20561j06536
9318B303625k54373J3464J84871J08955j15662j18553J03769J19657O9016K0891
9308B435660l2469l2318l7263J42617P7130l6321M431R2020J29469M7679j8916
9297B771719n7618K05655J60122J37832R8837J38975J25855P4748J32306J68433
9287C956864O0938P2487p6512l0930J8391N4349o3266J4779o381k09224J3204
9276C804699L1291m8430L2447j70337k1073O171l3892L2734K3506j2716N0501
9265C694901J8714O3160j53460M9891J48446n3455r6016J61200J29297J67646
$$ plain form
9340 2368530 2421859 2350721 2329763 2325105 2191959 2221457 2223579 2276175 2329353 2378529 2262318
9329 2262318 2286887 2360380 2324171 2163441 2316770 2383839 2347687 2328859 2289600 2410161 2303625
9318 2303625 2049252 2062716 2247587 2356542 2240880 2122327 2226096 2345753 2414769 2435660
9308 2435660 2403191 2370873 2333610 2476227 2553357 2517036 2521467 2613487 2742956 2790635 2771719
9297 2771719 2714101 2919756 3079878 3217710 3316547 3455522 3581377 3656125 3788431 3956864
9287 3956864 4017802 4090289 4013777 3982847 4001238 4055587 3992321 4007100 4000719 3791495 3804699
9276 3804699 3835990 3787560 3820007 3649670 3628597 3634768 3600876 3633610 3657116 3644400 3694901
9265 3694901 3713615 3776775 3623315 3673206 3821652 3768197 3672181 3833381 3962678 4130324
9255D130324K2822r160J08318R179O3452J35038M7835J8022P649n2813r6271P845
9243D392240Q9526r3058O580j0868o072j04134j01898j5212k2212N6183R5669
9232D286744J23596r7236q6856M7612J48607J06858L3499m9201J979J12126Q4432
9221D712160q0240o7099j0256l0703Q0571Q1158p8730j32376m273N536K01246
9210D676994o1381j21054J5069P7774q5084O7006M7695j7956P7208J00099M9175
9199D825545j32908J79648J87224mR2111P3341Q7350j4724J24514R0160k0803
9188E491454M0312J42439J65377k2979q580J00003o4966J16182J86159K2294N2900
9177F220595N218J54295J4268M2187K52240L1032J48397P504J80016J56567K62343
$$ plain form
9255 4130324 4153146 4143986 4252304 4261483 4324935 4459973 4507808 4525830 4533479 4480666 4384395 4392240
9243 4392240 4481766 4388708 4395288 4384420 4378348 4274214 4172316 4157104 4134892 4191075 4286744
9232 4286744 4410340 4313104 4226248 4273860 4422467 4529325 4562824 4513623 4515602 4627728 4712160
9221 4712160 4631920 4564821 4554565 4523862 4604433 4685591 4606861 4474485 4470212 4475748 4676994
9210 4676994 4615613 4494559 4509628 4587402 4502318 4569324 4617019 4599063 4676271 4776370 4825545
9199 4825545 4692637 4872285 5059509 5059505 5151616 5224957 5312307 5297583 5422097 5512257 5491454
9188 5491454 5531766 5674205 5839582 5816603 5808023 5908026 5843060 5959242 6145401 6167695 6220595
9177 6220595 6225813 6380108 6394376 6436563 6688803 6719835 6868232 6875736 7055752 7212319 7474662
9166G474662J16725R4960K01603J64948J13522J73374J90674J37780J24515L33549
9156I126312K80730K70759J44207L11554L89884L90605K92231M46626M31138M29443
9146A2513489M95842M96897M63130O77861Q64521P61223Q45485R56436R68947
9137A9043831Q95820J153729J234467J608248J824043J939995K101214K231599
9129C2032946K689736K950210K865462K928780K875511K946939K586710K721147
9121E4597441K687594K659828K592634K140551J661451Q57953j1631o57554j344742
9112F5183525j676125j457407r41544k27229L98664Q83106J338711J963934K406012
9103F7871647K795735L310329L781727M414240N102318O165993P403096R116629
$$ plain form
9166 7474662 7591387 7686347 7887950 8052898 8166420 8339794 8530468 8668248 8792763 9126312
9156 9126312 9407042 9677801 9822008 10133562 10523446 10914051 11206282 11652908 12084046 12513489
9146 12513489 13009331 13506228 13969358 14647219 15511740 16272963 17118448 18074884 19043831
9137 19043831 19939651 21093380 22327847 23936095 25760138 27700133 29801347 32032946
9129 32032946 34722682 37672892 40538354 43467134 46342645 49289584 51876294 54597441
9121 54597441 57285035 59944863 62537497 64678048 66339499 67197452 67185821 66528267 65183525
9112 65183525 63507400 62049993 61108449 60881220 61279884 62162990 63501701 65465635 67871647
9103 67871647 70667382 73977711 77759438 82173678 87275996 93441989 100845085 109961714
9095A09961714J0825254J2147544J3554653J5451953J7403503J8074149J7348849
9088B14767619J6326217J5045661J3696852J2737012J2488253J2264228J1984365
9081C09310207R842075N921637k98162o061018q994398j1700281j4672719j7860672
9073B65486669k0442463j9333299j6941640j3976470j1812722j0471677r170088
9066A63338310q308023p605102o692244n560933m537905l357927k266362o41901
9058A24367913J076798K838445M172191N658910P420355Q921424Q435195O278917
9050A69170148K442351r72746j441826j263374k045600m315051q402674j0406594
9042A42764634j0234539q897599p279332o550448o220902n989951o030134n691785
$$ plain form
9095 109961714 120786968 132934512 146489165 161941118 179344621 197418770 214767619
9088 214767619 231093836 246139497 259836349 272573361 285061614 297325842 309310207
9081 309310207 319152282 325073919 324775757 318714739 309720341 298020060 283347341 265486669
9073 265486669 245044206 225710907 208769267 194792797 182980075 172508398 163338310
9066 163338310 155030287 147425185 140732941 135172008 130634103 127276176 125009814 124367913
9058 124367913 125444711 128283156 132455347 138114257 145534612 154456036 162891231 169170148
9050 169170148 171612499 170639753 169197927 167934553 165888953 161573902 153171228 142764634
9042 142764634 132530095 123632496 116353164 109802716 103581814 97591863 91561729 85869944
9034H5869944m988404m444444l966395l585188l261221k709921k140256j979185
9026E8794930j621701j307616r59991n92396j27290M15095R39123J297529J836884
9017E8674567K337729K912598K874797K427523J209657l62189p82889o40352n78727
9008F8072714j374807k793318l770845l717339l278885k627672k353847j970338
9000D6185663j866398j724138j569537j326769j235859j112165r81763r86184
8992C5382850q93234q88994o63384l95294l12300l60076l44678k48933k81730
8983C0994227l33062l83274o46514p07086p59236q67214r68486q06217q76233
8974B4646905q54766n87665n00654m54464n46511m12734l44015m86711n25205
$$ plain form
9034 85869944 80881540 76437096 72470701 68885513 65624292 62914371 60774115 58794930
9026 58794930 57173229 55865613 54905622 54313226 54185936 54601031 55540154 56837683 58674567
9017 58674567 61012296 63924894 66799691 69227214 70436871 70074682 69291793 68651441 68072714
9008 68072714 66697907 63904589 60133744 56416405 53137520 50509848 48156001 46185663
9000 46185663 44319265 42595127 41025590 39698821 38462962 37350797 36369034 35382850
8992 35382850 34489616 33600622 32937238 32541944 32229644 31869568 31524890 31275957 30994227
8983 30994227 30661165 30277891 29631377 28924291 28165055 27297841 26329355 25523138 24646905
8974 24646905 23792139 23204474 22703820 22249356 21702845 21290111 20946096 20459385 19934180
8965A9934180k82860k54382k56962k52223j90032k71842k66012n8560j3712q879
8955A8078716r7256n5903Q3153j24609N5032l9715j65710O5603N4195K933N796
8944A7862235n29K3841J90405J75777K15709K50463K30045L11198K04267L54857
8934A9818268M27930L16162K59926K80921J16902J02934K38227M71487K58695
8925B2291452L83262O40245N72620O66111N05743M75301N09008L16238M08160
8916B6768140O75544O43348P61271R65706J169825J316087J398066J432945J457927
8907C6588859J702906J753445K260279K877578L656663M361264N221879N598036
8899F4020909N819292O459995P068603O680544N594769L838613J178938j31289
$$ plain form
8965 19934180 19651320 19396938 19139976 18887753 18697721 18425879 18159867 18101307 18087595 18078716
8955 18078716 17981460 17925557 18008710 17884101 17939133 17899418 17733708 17799311 17853506 17856439 17862235
8944 17862235 17861706 17885547 18075952 18251729 18467438 18717901 18947946 19259144 19463411 19818268
8934 19818268 20246198 20562360 20822286 21103207 21220109 21323043 21561270 22032757 22291452
8925 22291452 22674714 23314959 23887579 24553690 25059433 25534734 26043742 26359980 26768140
8916 26768140 27443684 28087032 28848303 29814009 30983834 32299921 33697987 35130932 36588859
8907 36588859 38291765 40045210 42305489 45183067 48839730 53200994 58422873 64020909
8899 64020909 69840201 76300196 83368799 90049343 95644112 99482725 100661663 100530374
8891A00530374l3624J618238L416683L666926K572041J112396j639049l380464
8883A07863521l535794k553030j491570m85121M26158J477903K807143M744955
8875A09254165P029557Q805770R376421J0713397J3028257J4221791J2321978
8868A84751336J0663514L795926j827937q12228P68978K446974L852787N259670
8860B08899020O259108O315480M239072K594441K123641L930543O527589Q419461
8852B49308355Q567290O638997J974568l047508p107701j1179805j4230297j5546168
8844B15377731j5507391j4737022j3120725j1410146r718453q048839o832633
8837A36002522n847051m797259m047878l153267j966172j137837r32974j239243
$$ plain form
8891 100530374 100496750 102114988 105531671 109198597 111770638 112883034 111243985 107863521
8883 107863521 104327727 101774697 100283127 99798006 100224164 101702067 104509210 109254165
8875 109254165 116283722 125089492 134465913 145179310 158207567 172429358 184751336
8868 184751336 195414850 199210776 197382839 196570611 197339589 199786563 203639350 208899020
8860 208899020 215158128 221473608 225712680 228307121 230430762 234361305 240888894 249308355
8852 249308355 257875645 264514642 266489210 263441702 256334001 245154196 230923899 215377731
8844 215377731 199870340 185133318 172012593 160602447 150883994 142835155 136002522
8837 136002522 130155471 125358212 121310334 118157067 116190895 115053058 114120084 112880841
8829A12880841k277124l548962l658061k880323j459390q00540j425818k651137
8821I4179486m562832o054454o146836n607289m685334m203339l749334l481362
8813E5688706l005086k798599k733236k467010k315802k344375k161899j881632
8805C5981067j720598j524867j308425j299058j131064j138371q99220j010821
8797B5948643r63318p89025p72421o78622o08293p18044p14360m40089n02063
8788A9762408n33536m43858l26029m07380m05750o24109n00648n69062n03193
8779A5448843l36612l60129k21950l39293l97188m56259k92134k74354l49093
8770A2421831l61237k47786j98162j98219j14710j43990j41459k82893k82574
$$ plain form
8829 112880841 110603717 107054755 103396694 100516371 99056981 98256441 96830623 94179486
8821 94179486 89616654 83562200 77415364 71808075 67122741 62919402 59170068 55688706
8813 55688706 52683620 49885021 47151785 44684775 42368973 40024598 37862699 35981067
8805 35981067 34260469 32735602 31427177 30128119 28997055 27858684 26959464 25948643
8797 25948643 24985325 24196300 23423879 22745257 22136964 21418920 20704560 20264471 19762408
8788 19762408 19228872 18785014 18458985 18051605 17645855 17021746 16521098 15952036 15448843
8779 15448843 15112231 14752102 14530152 14190859 13793671 13337412 13045278 12770924 12421831
8770 12421831 12060594 11812808 11614646 11416427 11301717 11157727 11016268 10733375 10450801
8761A0450801L7660j35873j71971k38022j02516r7315L4986n1157j48538m1220
8751I536835j37674n4971q2768M7363r4256k63263j97741j38109j26607j01060
8741H387749k19652j56679j47216j92271j44506j33586j89990r326j17186j02289
8731F975048J0516j1338j18796k11127k16461P5808K0196n0055m3207j17291n2593
8720F260700m4123r9510N2017r2996j67293j6532n2553m6670l0152p8518j18015
8709E566355r6634q3700j92545p0440j7016j74564k52860j49001j64887n8309
8699D306399n1673P5605k4638o3680n91r6516j03496r4514l6394M0132N8717o1431
8687C947920j12062J15844P2463k33201k20579L4142R316j07713n0560p9812K5950
$$ plain form
8761 10450801 10488461 10352588 10180617 9942595 9840079 9742764 9777750 9726593 9578055 9536835
8751 9536835 9399161 9344190 9261422 9308785 9214529 8951266 8753525 8615416 8488809 8387749
8741 8387749 8168097 8011418 7864202 7671931 7527425 7393839 7203849 7194523 7077337 6975048
8731 6975048 6985564 6974226 6855430 6644303 6427842 6503650 6523846 6473791 6430584 6313293 6260700
8720 6260700 6216577 6117067 6169084 6076088 5908795 5892263 5839710 5793040 5762888 5684370 5566355
8709 5566355 5469721 5386021 5193476 5123036 5106020 4931456 4678596 4529595 4364708 4306399
8699 4306399 4254726 4330331 4305693 4242013 4241422 4144906 4041410 3946896 3910502 3950634 4009351 3947920
8687 3947920 3835858 3951702 4024165 3790964 3570385 3604527 3613843 3506130 3455570 3375758 3401708
8676C401708j43690j95369n5403M221o3588j29416o9263p760k2430j6907k29874
8665B472229M8904o3077j19935l023o4291k6333j20852j05404J14417k6051j40889
8654A965695Q5291j1807k8120Q5472J3140k6558r914m5780k0040l6202j10868
8643A860309n6602P9004j039L7317l4354L2170K0283q2661q4224J04987k1466
8632A853724o0348P1909k0033j07418m3294J8963p1038m6948R6216j19949o8715
8621A503069k2865K9950j57975j06171J26486k03332K4954R8769J79856q7892
8611A384849J0781r2444p2161o1793J586j74573P0291J03858j28891k8152L0922
8600A044273j0499K3042J16404j11019k3739l8126j7324O7348M4159q6614j41929
$$ plain form
8676 3401708 3258018 3062649 3007246 3011467 2947879 2818463 2749200 2741440 2719010 2702103 2472229
8665 2472229 2521133 2458056 2338121 2335098 2270807 2244474 2123622 2018218 2132635 2106584 1965695
8654 1965695 2050986 2039179 2011059 2096531 2109671 2083113 2073199 2027419 2007379 1971177 1860309
8643 1860309 1803707 1882711 1881672 1918989 1884635 1916805 1937088 1854427 1770203 1875190 1853724
8632 1853724 1793376 1865285 1845252 1737834 1694540 1713503 1642465 1595517 1691733 1571784 1503069
8621 1503069 1480204 1510154 1352179 1246008 1372494 1169162 1194116 1292885 1472741 1384849
8611 1384849 1395630 1303186 1231025 1169232 1170818 996245 1066536 1170394 1041503 1013351 1044273
8600 1044273 1033774 1056816 1173220 1062201 1038462 1000336 983012 1050360 1094519 1007905 865976
8589H65976k1061J29306k04359q3141r699L14909J68609o3086q1074j77681j73966
8578F64733j02117K22654J6888l6321m2748k2293N7109r3505j4335J09109N0270
8567H09444o8366J3898N824j12700l3437l2375N4863l8279j12835L7959Q7992
8556F11988m0917k8063n4241K7407O5950K92J6419o8544j08760O7223o039r1853
8544C90862J2283N1978R4889q4334j53518N5388M2146J13597J00039J2503J27158
8533G62991Q6703M604q7711j45968P5276P9280P0451k0258j50879k777J2304k3518
8521F60498m7796K2083M2333m1288M5734l5525q4296l4824j13212K00246J89652
8510H03605p8447j44781k6079J20261M9368M0559L0718l8776o2308J15712l7674
$$ plain form
8589 865976 844915 974221 769862 686721 677022 991931 1160540 1097454 1016380 838699 664733
8578 664733 562616 785270 802158 765837 723089 700796 757905 664400 650065 759174 809444
8567 809444 741078 754976 760800 648100 614663 582288 637151 598872 486037 523996 611988
8556 611988 571071 543008 488767 516174 582124 582416 598835 530291 421531 488754 482715 390862
8544 390862 403145 455123 550012 465678 312160 367548 409694 523291 623330 635833 762991
8533 762991 849694 854298 766587 620619 695895 775175 845626 825368 674489 671712 684016 660498
8521 660498 612702 634785 677118 635830 681564 646039 561743 526919 413707 613953 803605
8510 803605 725158 580377 554298 674559 723927 764486 795204 756428 694120 809832 772158
8499G72158O3843k0993O3679J0111l0884J58569o0938m4857n6003K1407j12263
8488G63829j14698j28460J57812K7871j9827n3202j24618J06931M047j43211J65048
8477F41522R2277j21823R995k99L2028J08207j15032K387L3603n1875J3506N446
8465F49942r8357m5926K99O4546K5346r5034j03700N9905R7179q3542p247o4461
8453C98950J1831K9146j29218N5692k5333n1778k6026j8427Q1030m3943k7348
8442B54576O0511q456R5819l1682o1733p8996Q4839j3517k6317n5591l6297J99000
8430C82156J10031P0659k2751P9754j13701j25487M2204J86257p5447q7455J51233
8419E97453Q612K9079J45881n4366k662N8895J55208J09120J93236P7556J37385
$$ plain form
8499 772158 836001 815008 878687 888798 857914 1016483 955545 910688 854685 876092 763829
8488 763829 649131 520671 678483 706354 686527 633325 508707 615638 619685 476474 641522
8477 641522 733799 611976 621971 621672 653700 761907 646875 649262 682865 630990 644496 649942
8465 649942 551585 505659 505958 570504 595850 500816 397116 457021 554200 470658 463411 398950
8453 398950 410781 439927 310709 366401 341068 289290 263264 244837 325867 281924 254576
8442 254576 315087 306631 402450 370768 309035 230039 314878 301361 275044 219453 183156 382156
8430 382156 492187 562846 540095 619849 506148 380661 422865 609122 533675 446220 597453
8419 597453 606065 635144 781025 726659 723997 782892 938100 1047220 1240456 1318012 1455397
8408A455397K68186K63857K1834J05533N5212J16175R671j12230k0848j63757
8398A999030j58359j10332m4846j07488o8597n1671j08233N4588q4539j47126
8388A172427j93928q4171j70603j65406K2402O2564n454p8476j55284o0847O0874
8377D04098j38020p1390Q0746J40776n9724j03974P7239j8577k7807k6345o7872
8366A89150Q2767q7868j01369l1524j36032R3716K8269K3949K18885n2790l5014
8355A92139l1202m2427j2956K0495r1414M4602P1862j41608O8392J03826j45736
8344C5973m863r747n8850m741O233R8226N3401j45193p5619j2134Q6364n4108
8332h5058l162J05803j58655l4109J53250N558O32q8736l720n2688J6628Q7442
$$ plain form
8408 1455397 1723583 1987440 2009274 2114807 2170019 2286194 2295865 2183635 2162787 1999030
8398 1999030 1840671 1730339 1685493 1578005 1509408 1457737 1349504 1404092 1319553 1172427
8388 1172427 978499 894328 723725 558319 580721 643285 637831 559355 404071 343224 404098
8377 404098 266078 194688 275434 416210 356486 252512 329751 311174 283367 257022 189150
8366 189150 271917 184049 82680 51156 -84876 8840 37109 61058 279943 227153 192139
8355 192139 160937 118510 105554 126049 34635 79237 151099 9491 77883 181709 35973
8344 35973 31110 21363 -37487 -42228 -35995 62231 115632 -29561 -105180 -117314 -30950 -85058
8332 -85058 -88220 17583 -141072 -175181 -21931 -16373 -15741 -104477 -108197 -160885 -144257 -56815
8320e6815P6714k8417p4127L1166J45651n9906m5659l8862j04406N9933Q4608
8309a0120k0252n9L1073r8937J5957J8386K1053k6725m848M8748O8698m1944J3076
8296A4106j31292q6292O1730K3742p357N605Q7022m4641m3115Q5353r2768M1380
8284h6527M8186R074k7165p6314Q8733K6038M5875J0727n0774n4545J00269K4763
8272E8340j76751j0640m9501l6932J8625P501J4085P265J04364n3346o5178k8972
8260b11140Q8647J15720n2472j24929K7582J39224O0027k10817l061N8594m264
8249a16889j916J3962l0529p660l9649j1327J15257m856l5375n6467J4223L2523
8237a28703j33788k755J25679j36883K3848m4298M9143N3056O510J07277P107
$$ plain form
8320 -56815 19899 -8518 -82645 -51479 94172 34266 -11393 -50255 -154661 -94728 -10120
8309 -10120 -30372 -30431 642 -98295 -82338 -63952 -42899 -69624 -74472 -25724 42974 1030 14106
8296 14106 -117186 -203478 -141748 -118006 -125363 -119758 -32736 -77377 -120492 -35139 -127907 -86527
8284 -86527 -38341 -29267 -56432 -132746 -44013 -17975 27900 38627 -12147 -66692 33577 58340
8272 58340 -118411 -129051 -178552 -215484 -196859 -189358 -175273 -168008 -63644 -116990 -182168 -211140
8260 -211140 -122493 -6773 -59245 -184174 -156592 -17368 42659 -168158 -171219 -112625 -116889
8249 -116889 -118805 -104843 -135372 -143032 -182681 -194008 -78751 -83607 -118982 -175449 -161226 -128703
8237 -128703 -262491 -265246 -139567 -276450 -252602 -296900 -247757 -194701 -188191 -80914 -73807
8226g3807J4718j03719o3637o1614p6340J05507m5050J25267O4541L5797m7787
8215a26124j28830N2636l8754N4698J47374n60P5526r1304j60855O4586J16832
8204c4775J14232j34305l2343j5504r3700J12324p8775K06254m0121n32o258O5015
8192F1512p16063j91813L89192j09468J62299K5877J78675J8853o0727K4988N9399
8181a57276o0127J6116j03681J06575L1904l0929p7851J05695M7p1334N22L8116
8169b02223n5141m7679N3089M1837P1212Q042M4204p5364P3364p3551o0001L4852
8157a87359j41244N4009J26112O61r6427L7131L9229J639L9462o5358o1968P0360
8145a83753j4378J941J80776j43653O5897K8633r7745K4746L0759J2323j4940
$$ plain form
8226 -73807 -59089 -162808 -226445 -288059 -364399 -258892 -303942 -178675 -114134 -78337 -126124
8215 -126124 -254954 -202318 -241072 -186374 -39000 -39560 35966 -55338 -216193 -151607 -34775
8204 -34775 79457 -54848 -87191 -102695 -196395 -84071 -162846 43408 3287 2755 -3503 61512
8192 61512 -654551 -846364 -457172 -566640 -404341 -378464 -199789 -180936 -241663 -216675 -157276
8181 -157276 -217403 -201287 -304968 -198393 -166489 -197418 -275269 -169574 -169527 -240861 -240339 -202223
8169 -202223 -257364 -305043 -251954 -210117 -138905 -130863 -86659 -162023 -88659 -162210 -222211 -187359
8157 -187359 -328603 -274594 -148482 -147821 -244248 -207117 -167888 -166249 -126787 -192145 -254113 -183753
8145 -183753 -198131 -196190 -15414 -159067 -93170 -64537 -162282 -137536 -106777 -94454 -109394
8134a09394J9643J9258K8112j71214J6016m1184j27090J26755R2817q6536K5816
8123b07001J02097q3371N2759k8597l2370M9766J03198M5794j92439N8078N8847
8112g3239j38794L7660m2148r1049k8972J20417O5381l3417J65738p0796j13776
8101b02995k8378P2111l1956R6723r0500J9645R7369m4040R493l423q9634j26164
8089c21749n183R1470k7257L9018q557o107J01852O9699o660R764r2642k5811
8077a82163R5887N614J5109l7839n6986p9709K5066n6657k2636N253k8755N2922
8065b64894L6712J73915J16043m3230p6352r3747o3477j6146p661M4463K3577
8054a70797r274R0518R2093j12281O6662J44940j65609l4197O245p7244o1871
$$ plain form
8134 -109394 -89751 -70493 -42381 -213595 -197579 -238763 -365853 -239098 -146281 -232817 -207001
8123 -207001 -104904 -188275 -135516 -164113 -196483 -146717 -43519 2275 -190164 -132086 -73239
8112 -73239 -212033 -174373 -216521 -307570 -336542 -216125 -150744 -184161 -18423 -89219 -202995
8101 -202995 -231373 -159262 -191218 -94495 -184995 -165350 -67981 -112021 -102528 -105951 -195585 -321749
8089 -321749 -326932 -235462 -262719 -223701 -232258 -238365 -136513 -66814 -73474 -63710 -156352 -182163
8077 -182163 -86276 -80662 -65553 -103392 -160378 -240087 -215021 -271678 -294314 -289061 -317816 -264894
8065 -264894 -228182 -54267 61776 18546 -57806 -151553 -215030 -231176 -238837 -194374 -170797
8054 -170797 -180071 -89553 2540 -109741 -43079 101861 -63748 -97945 -91700 -168944 -230815
8043b30815p2006P0903J41241r9129Q3554N2367L1105K0041j4531j2009K8805
8032d74r0864n1271Q602n4240J11740K9428j27845R5045k6200l3264J38778k2304
8020b2869r5504j51041L6542R2997O8568O6845j3513K3143J1254O102r3259k0094
8008i0829m6288J4675m3239K9112M2004N8374j12426O8485O7572p0685k8995k7972
7996a40212K01566j24299p6776J01210L711K0073m8684L0979j20465L6467O095
7985a10335K2061M8487O3512J5084j62972l2986j23035J3791R4789J25782P4174
7974B8352j24168J33984Q5102p7958j06591o2773o6295k939R137o8038J03983
7963a48204q681J36590N1952j11082O1346R7911j02696q8966k1422L2223Q7791
$$ plain form
8043 -230815 -302821 -231918 -90677 -189806 -106252 -53885 -22780 -2739 -17270 -29279 -474
8032 -474 -91338 -142609 -134007 -188247 -76507 -47079 -174924 -79879 -106079 -139343 -565 -22869
8020 -22869 -118373 -269414 -232872 -139875 -71307 -4462 -17975 5168 16422 22524 -70735 -90829
8008 -90829 -137117 -122442 -165681 -136569 -94565 -36191 -148617 -80132 -12560 -83245 -112240 -140212
7996 -140212 61354 -62945 -139721 -38511 -34800 -14727 -63411 -32432 -152897 -116430 -110335
7985 -110335 -88274 -39787 23725 38809 -124163 -157149 -280184 -266393 -171604 -45822 28352
7974 28352 -95816 38168 123270 45312 -61279 -124052 -190347 -193286 -184149 -252187 -148204
7963 -148204 -156885 -20295 31657 -79425 -18079 79832 -22864 -111830 -133252 -101029 -13238
7952a3238P844j859j17402l330K11885J1701L5443q5272N0589J05408m2946q1545
7940G7278K2023m876M5558r3898r7754R8719J30756k971k2534j3556M7706j4342
7928A72109J95772J31717p1002j9373j0816m8981K28139K47951K091K8558M5133
7917I01298j1459O8018M9963J65236K37918K39966K45343K55743K67907J79680
7907B599613L45060K19034p4888L0819O4720j70168j33612j86906j10225k22128
7897B361319j65768j6313j43967q4470j36696N681m1382j01036j7980r2324J0752
7886A577816k90450l7087j85710l5465r9219j33071N0317j22695j47822j61973
7876D14641N351j15050O8162O9158M2261l6928r3292j27802M3866J7400r2241
$$ plain form
7952 -13238 -5394 -7253 -124655 -127985 83900 95601 131044 45772 96361 201769 158823 77278
7940 77278 99301 94425 139983 46085 -51669 47050 177806 174835 152301 138745 186451 172109
7928 172109 367881 499598 428596 409223 398407 349426 577565 825516 827607 856165 901298
7917 901298 889839 957857 1007820 1173056 1410974 1650940 1896283 2152026 2419933 2599613
7907 2599613 2944673 3163707 3088819 3119638 3184358 3014190 2880578 2693672 2583447 2361319
7897 2361319 2195551 2179238 2035271 1950801 1814105 1819786 1778404 1677368 1659388 1567064 1577816
7886 1577816 1287366 1250279 1064569 1029104 929885 796814 847131 724436 576614 414641
7876 414641 419992 304942 373104 442262 484523 447595 354303 226501 270367 287767 195526
7865A95526j65410J07500R1916j97925J48030K0285j59311J797k2152J6492l3934
7854B814L7611N7202L9173K1366j6248J20127j37361O760j62245j3850J6778j23509
7842a51382R9110N401P8217R1604l904j01403o7285L4444J7063o9733M5463J09567
7830H7162o5477j5265M1842n1477k9347L4875n9674Q1677M0715j57182k8896M5570
7818g5477j8944m1593j12664J32898J23065n5025O4586o5487P5023J4497n130
7807C5749N3824K0300o9139J2151L6942r401k17706O3680K10334o7573L659m4997
7795B7823J26949m6715l7841K1742n9736J03455m1834j85200J03407j0004o7341
7784f5295P8703Q9054j9744r8866k9236J87621r8637j56508L2227P208N4176J03463
$$ plain form
7865 195526 30116 137616 229532 31607 179637 199922 40611 42408 20256 36748 2814
7854 2814 40425 97627 136800 158166 141918 262045 124684 131444 -30801 -44651 -27873 -151382
7842 -151382 -52272 -46871 31346 122950 119046 17643 -49642 -15198 1865 -67868 -22405 87162
7830 87162 21685 6420 48262 -3215 -32562 2313 -57361 24316 65031 -92151 -121047 -75477
7818 -75477 -94421 -136014 -248678 -115780 7285 -47740 16846 -48641 26382 40879 35749
7807 35749 89573 109873 40734 52885 89827 80426 -137280 -73600 136734 69161 72820 27823
7795 27823 154772 108057 70216 91958 32222 135677 93843 -91357 12050 2046 -65295
7784 -65295 13408 102462 82718 -16148 -45384 142237 43600 -112908 -80681 -73473 -19297 84166
7772H4166j12618J48163r5413l7832R9581m1873o7698q7768J22486M9727M0752
7761A01673j26095n0950O0284n4425J19769j433m2760O1380j12557m5197O4222
7750b6089k2224P516j218m5896Q2800J7968N687k3997l9794Q1729P3449j19433
7738i502J9992P2988M163K5157o5343m097N7613p1742j0302o8022M9607L0105
7726C0617R8594M672k5996J10576n4638r7323O6468m1825L0923L6113J19611k0229
7714B57563n5276O9076r6760m5911J40931p1602N7956r6650k3588k6990M7843
7703A56592P513K7376Q9404p8589M1061J30727n714k8543N8380l2683m2737j6047
7691C06740Q1877L7689M5595J8433j46095K9976P4626k1142K01236m9814R0697
$$ plain form
7772 84166 -28452 119711 24298 -13534 86047 44174 -23524 -111292 11194 60921 101673
7761 101673 -24422 -75372 -15088 -69513 50256 48823 6063 67443 -45114 -90311 -26089
7750 -26089 -48313 -40797 -42015 -87911 -5111 12857 18544 -5453 -45247 36482 109931 -9502
7738 -9502 10490 83478 87641 112798 47455 43358 100971 29229 18927 -49095 512 30617
7726 30617 129211 133883 107887 218463 163825 66502 132970 91145 122068 158181 277792 257563
7714 257563 202287 271363 174603 128692 269623 198021 255977 159327 135739 108749 156592
7703 156592 164105 191481 280885 202296 243357 374084 368370 339827 398207 365524 322787 306740
7691 306740 388617 426306 471901 490334 344239 374215 448841 427699 628935 579121 669818
7680F69818K13853K8725p6015n7948J55118K45766R2135P3799K6163q4315J98724
7669A485823J79650q1578k1858q2241j44605J20241j36504j19585N7137j33271
7659A123209r6948j24842P4854O6597j52796n7076j16081j33027L8317J48543
7649G70750k3792j78990O1954p154j13447r6655J04243R3091j28475o5307J02422
7638E18640K3776n967n3828p0201o8150m254J724K24142k0612q7041J6616Q1251
7626E56096j33310p2273R2487k9907l4985K1538P7038P8654p8817J032J4215M0203
7614E31971m8317l9785L583L2333j39281J37192L2677j11490M3837j09010J54659
7603D88369M1920O478k8209K9425O4032j6007J2912O1857J7472j1734l3740L6727
$$ plain form
7680 669818 883671 912396 836381 778433 933551 1179317 1271452 1345251 1371414 1287099 1485823
7669 1485823 1665473 1583895 1562037 1479796 1335191 1455432 1318928 1199343 1256480 1123209
7659 1123209 1026261 901419 976273 1042870 890074 832998 716917 583890 622207 770750
7649 770750 746958 567968 629922 622768 509321 412666 516909 610000 481525 416218 518640
7638 518640 542416 536449 482621 412420 344270 340016 341740 565882 545270 458229 474845 556096
7626 556096 422786 350513 443000 413093 378108 399646 476684 555338 476521 477553 491768 531971
7614 531971 483654 443869 447452 479785 340504 477696 510373 398883 442720 333710 488369
7603 488369 530289 536767 508558 537983 602015 586008 598920 660777 678249 666515 632775 669502
7591F69502q1084p5119J16360K3077j57758L9599J245r2129J12613J97840p1970
7580F82176L2577N7001j60173m5603J3916J01595K7018J2465j4587R4308O4574
7569H65267O9321j5037j05288m7919m9102R3107O7921K0156q0723m754R4884M3661
7557I51494J6610R9151p4627k0314O0892K5554k5293l9334O1060j09195P9383
7546A025381N4735m4402J49163n307L2210l1793O4811j2072L224o4928K3728p1382
7534A123368K2868K9971l6207J6509P8744O2705Q7697j56309m8192L0490K9945
7523A241589k8043p5845j12274j03517k2366M6265l1382K3034R3767p8235o6740
7512H86253j41407K43933J08077k4047l8415J5649K973Q3047K3312m6043M7987
$$ plain form
7591 669502 588418 513299 629659 652736 494978 534577 535822 443693 556306 754146 682176
7580 682176 714753 771754 611581 565978 579894 681489 708507 720972 706385 800693 865267
7569 865267 934588 919551 814263 766344 717242 810349 878270 898426 817703 812949 907833 951494
7557 951494 968104 1067255 992628 972314 1033206 1058760 1033467 994133 1055193 945998 1025381
7546 1025381 1080116 1035714 1184877 1179570 1211780 1179987 1244798 1232726 1235950 1171022 1194750 1123368
7534 1123368 1146236 1176207 1140000 1156509 1235253 1297958 1385655 1229346 1181154 1211644 1241589
7523 1241589 1213546 1137701 1025427 921910 899544 945809 914427 937461 1031228 952993 886253
7512 886253 744846 988779 1096856 1072809 1034394 1050043 1053016 1136063 1159375 1113332 1161319
7501A161319K6559r0426j23M1581J05553K5451M9536j2221j0725M4723o5583N0202
7489A325846P7015K1002k4523k2697J0184M8593K83656j03211j55783j8814J06060
7478A547328N932K2948J56158k1650J4279Q2982Q426j29842O455k9575M5943J74096
7466A883480K7138k6669R2829l2927j1070K0756J11271J39515O247k8086N4258
7455B236742p090N9359L1124J5272J05339N565O6959J15150m9646l5469R5719
7444B639024J24176P7052m0069J77459Q8615P3805J09178M0694N5750Q5084J27474
7433C558242J46859J21093k0970Q6563J75249J41430m0409J97169O7365N2458
7423D485049K33107R0195M7887J92538K40026K01982J37075J98919K49211M9617
$$ plain form
7501 1161319 1187878 1097452 1097329 1138910 1244463 1269914 1319450 1307229 1296504 1341227 1275644 1325846
7489 1325846 1402861 1423863 1399340 1376643 1386827 1435420 1719076 1615865 1460082 1441268 1547328
7478 1547328 1553260 1576208 1732366 1710716 1724995 1807977 1816403 1686561 1693016 1663441 1709384 1883480
7466 1883480 1910618 1883949 1976778 1943851 1932781 1953537 2064808 2204323 2210570 2182484 2236742
7455 2236742 2229652 2289011 2320135 2335407 2440746 2446311 2513270 2628420 2578774 2543305 2639024
7444 2639024 2763200 2840252 2800183 2977642 3066257 3140062 3249240 3289934 3345684 3430768 3558242
7433 3558242 3705101 3826194 3805224 3891787 4067036 4208466 4168057 4365226 4432591 4485049
7423 4485049 4718156 4808351 4856238 5048776 5288802 5490784 5627859 5826778 6075989 6125606
7413F125606K07424K61521J98805P9958M27726K63708K79909L25287J20478L62074
7403H652496L12221L77460M52094N01708L28605N25739N52189M51498O20304N52000
7393A3326314O25353Q03386Q41291P93157J012847J134432J090571J160193J354620
7384B2142164J480465J727204J746243J752394K075954K611751K868275L263477
7376C9667927L583114L956045M816507N434178O189570P166904P684598Q226276
7368H6725119Q989810R868148J1241228J3256640J5584959J8253451K0836625
7361A84755980K3255958K4776929K3829795K0412133J3684424N017232k727616
7354B93004835r597616j5524656j8699512j8648295j6935948j5158823j4003370
$$ plain form
7413 6125606 6333030 6594551 6793356 6873314 7301040 7564748 7844657 8169944 8290422 8652496
7403 8652496 8964717 9342177 9794271 10295979 10624584 11150323 11702512 12154010 12774314 13326314
7393 13326314 13951667 14755053 15596344 16389501 17402348 18536780 19627351 20787544 22142164
7384 22142164 23622629 25349833 27096076 28848470 30924424 33536175 36404450 39667927
7376 39667927 43251041 47207086 52023593 57457771 63647341 70814245 78498843 86725119
7368 86725119 95714929 105583077 116824305 130080945 145665904 163919355 184755980
7361 184755980 208011938 232788867 256618662 277030795 290715219 295732451 293004835
7354 293004835 283407219 267882563 249183051 230534756 213598808 198439985 184436615
7347A84436615j2873930j1960390j1247915j0819062j0358466r865027r449305
7340A07862520q996713q421053p768322p255415o274956n513983m786690m305469
7332E4539919l726151l340542l054702k583516k330102k116357j924104j899188
7324C3565257j728571j503153j458802j413096j205781r78191j021626r46625
7316B3309412r30701q75867p14343p33960o02869o89200n31321p37417n68713
7307A6925021m97806m63664m73207l55256l04324k76446j35170j17756k54774
7298A4046618k70311k45480l61593m54138l51603l62866l65954l63929m18432
7289A0852312l87995m48575l38498j77701l31704j82095k23638m05828k68335
$$ plain form
7347 184436615 171562685 159602295 148354380 137535318 127176852 117311825 107862520
7340 107862520 98865807 90444754 82676432 75421017 69146061 63632078 58845388 54539919
7332 54539919 50813768 47473226 44418524 41835008 39504906 37388549 35464445 33565257
7324 33565257 31836686 30333533 28874731 27461635 26255854 25277663 24256037 23309412
7316 23309412 22378711 21502844 20788501 20054541 19451672 18762472 18231151 17493734 16925021
7307 16925021 16427215 15963551 15490344 15135088 14830764 14554318 14419148 14301392 14046618
7298 14046618 13776307 13530827 13169234 12715096 12363493 12000627 11634673 11270744 10852312
7289 10852312 10464317 10015742 9677244 9499543 9167839 8985744 8762106 8356278 8087943
7280H087943k42106k04557j95747k6360l17353k48636j23107j19288r8850r6280
7270F415659r327l7262j72094r1876q0179m0894j34367O4321q6161N9152K8270
7259E915242l5186k3695J86812N1306P1932J72219K63949J38900K55458K16817
7249G213754L02907K74441L33730N10114M84826L61913M73510L34457R3781N7291
7239A0440724l28265l13879k01398m59744n32609k71028l71977l54452k91295
7230G316077j14177k24456l87803m10254k96806k60508k01773l84133k06659p9661
7220D749847k07706j80111k42546k63881k75937o1315j138j46481l1101l22394
7210C017237j38618K6671l0048n2221q9238m8020n9391j86902l5608N7252p9567
$$ plain form
7280 8087943 7845837 7641280 7445533 7419173 7101820 6853184 6730077 6610789 6511939 6415659
7270 6415659 6406332 6369070 6196976 6105100 6024921 5984027 5849660 5913981 5827820 5886972 5915242
7259 5915242 5880056 5856361 6043173 6094479 6166411 6338630 6602579 6741479 6996937 7213754
7249 7213754 7516661 7791102 8124832 8634946 9119772 9481685 9955195 10289652 10383433 10440724
7239 10440724 10112459 9798580 9597182 9137438 8604829 8333801 7961824 7607372 7316077
7230 7316077 7201900 6977444 6589641 6179387 5882581 5622073 5420300 5036167 4829508 4749847
7220 4749847 4542141 4362030 4119484 3855603 3579666 3518351 3517213 3370732 3339631 3017237
7210 3017237 2878619 2905290 2875242 2823021 2733783 2685763 2626372 2439470 2403862 2461114 2381547
7199B381547L6562j6597j05224N579j55387n5012q7096r3592n1717o4704j30262
7188A664097j9656j18364m6808L5221K9711M919m7880j86028L563P3374k02783
7177A189366j27039j2854m2835k9805N0184N4338j9371l6394j45406o5056L5971
7166H51099j2986M1980j2736j1901j20549P8261q437p0302L9482L0866n3042j13987
7154F37748r161Q3567M2221J20248l2658j52837M2079l8091n7289N7017O1752
7143G54596n2897R30q926M0936J15195q9696p5052J42230r4695L183l8400q8036
7131F09368R5919k3500L4557n6141j33862k0980J31910m2339J31280m6043m3493
7120F36676j55706j17961o863O7750k126N2787j5694K5434M180P3925j2435j91846
$$ plain form
7199 2381547 2418109 2401512 2296288 2301867 2146480 2091468 2004372 1910780 1859063 1794359 1664097
7188 1664097 1644441 1526077 1479269 1514490 1544201 1549120 1501240 1315212 1318775 1392149 1189366
7177 1189366 1062327 1049473 1006638 976833 1027017 1081355 1061984 1025590 880184 815128 851099
7166 851099 838113 880093 867357 855456 734907 813168 804731 734429 773911 804777 751735 637748
7154 637748 628587 712154 754375 874623 841965 689128 731207 693116 635827 692844 754596
7143 754596 701699 702629 693703 734639 849834 760138 685086 827316 732621 735804 697404 609368
7131 609368 705287 681787 716344 660203 526341 505361 637271 594932 726212 680169 636676
7120 636676 480970 363009 356146 423896 421770 474557 458863 484297 488477 562402 549967 358121
7108C58121p1231M7289j17969n4793J93451L266p732J14778N9974p2619k7983
7097D24552n0383p8256P0452m8781M3531Q7456l4561O036J61289Q991n5363p6609
7085D58354k451l9033j05048J13882j06459M0927J31190j13297k5914k4285N5600
7074C83466K0750j42273J079N6766l4657J9612J02118K6468j5293m4229l8262
7063C35545O416k4903r1406J86516q919J01800K6108J31696Q048j03805k6280
7052E40816M5871M0021J38371M9470J86063m4923J35877L3518Q0576J26228K23489
7041A555377L8629p92M2116k8422n6018p3943J8379q8394j56216j40618O8394
7030A178492q5439k08208j63061l3781j20729j2362j2566K4403m7743n3614o5443
$$ plain form
7108 358121 286890 334179 216210 161417 354868 358134 350402 465180 525154 452535 424552
7097 424552 374169 295913 366365 317584 361115 448571 414010 420046 581335 590326 534963 458354
7085 458354 455903 416870 311822 425704 319245 360172 491362 378065 352151 327866 383466
7074 383466 404216 261943 263022 319788 285131 304743 406861 433329 418036 373807 335545
7063 335545 341961 317058 225652 412168 403249 505049 531157 662853 670901 567096 540816
7052 540816 586687 626708 765079 814549 1000612 955689 1091566 1125084 1205660 1331888 1555377
7041 1555377 1594006 1593214 1635330 1606908 1550890 1476947 1495326 1406932 1250716 1110098 1178492
7030 1178492 1093053 884845 721784 688003 567274 554912 542346 566749 519006 465392 399949
7019C99949r8295K2583J38463R121j03833j384p1003r769Q8423r5991J7875n4861
7007B41278N3105o8881P4238Q515J2643l5805O7127K4074j48980R765n6113o7792
6995A13174o2739M6726J69129j0383p4073K2703Q7893N1026j30161m6627J22144
6984B88812q4392K7480q0090m0214N9716L6647P6352N7901r7151l692j00517K6639
6972A67491n7413m814P4287k607L6186j12914R0139r2123l0607J15566K818n5191
6960A30818k4220m7834N0490J7332N5751k0151J09944M2782K1558p3214n6609
6949B06647R4691m6625m8515r951r0940L3451K3939n0539l5756O0425P5960N950
6937B18737j15291j51847O1540j4225J2488J00258q7798q3487J09038J23796K4044
$$ plain form
7019 399949 301654 324237 462700 471821 367988 366604 295601 285832 374255 278264 296139 241278
7007 241278 294383 225502 299740 308255 320898 285093 352220 376294 227314 237079 180966 113174
6995 113174 50435 97161 266290 255907 181834 204537 292430 343456 213295 166668 288812
6984 288812 204420 231900 151810 111596 171312 207959 284311 342212 245061 241369 140852 167491
6972 167491 110078 105264 179551 176944 213130 100216 190355 98232 67625 183191 186009 130818
6960 130818 106598 58764 109254 126586 182337 162186 272130 314912 336470 263256 206647
6949 206647 301338 254713 206198 196247 105307 138758 162697 112158 76402 136827 212787 218737
6937 218737 103446 -48401 13139 -1086 11402 111660 23862 -59625 49413 173209 197253
6926A97253J704r964J2370K8638J9517J4659q9901j62752k6445R2009J03949N8765
6914B39802j15559l6263l45J15811l0827N3854j5686j2164L3380m9124o6393N7483
6902A73969p4783M2235J29777n3108n5301Q4597k342j23020r1387j57423Q0078
6891d6708J66856M7468n9339J1963K0229J5123o8611n487j93642l0004R4422J38130
6879I0400l4912J3414P5971R9199m3398o0041l3262m11j5906k6490J8706k1701
6867F1569p9638q8514r5510Q5765P1067O2009j23723J2496P176n0863L3819O1699
6855d2648J54157l5620j19060O2361k0308r1727O9485Q1971N4477n6873k0240
6844C5975J0186K9350j35367M2662k5844Q657l0790n1949K8288j5841N2406J10306
$$ plain form
6926 197253 198957 188993 201363 230001 249518 264177 174276 11524 -14921 77088 181037 239802
6914 239802 124243 87980 87635 203446 172619 226473 210787 198623 232003 182879 116486 173969
6902 173969 99186 141421 271198 218090 162789 247386 245044 122024 30637 -126786 -46708
6891 -46708 120148 167616 108277 120240 140469 155592 86981 81494 -112148 -142152 -47730 90400
6879 90400 55488 68902 144873 244072 200674 140633 107371 106960 91054 64564 83270 61569
6867 61569 -18069 -106583 -202093 -116328 -45261 16748 -106975 -94479 -87303 -138166 -104347 -42648
6855 -42648 111509 75889 -43171 19190 -1118 -92845 -23360 58611 113088 56215 35975
6844 35975 46161 75511 -59856 -17194 -43038 -34381 -65171 -117120 -88832 -104673 -52267 58039
6832E8039q376J13333K9123k8169j71221j10765P0688M4136j088r4438j1504J12016
6820A774J13685O398j8707l5155M588J3012J02043K3226R127R1422j16063l2627
6808A62723R1635J6805L5021Q8866k4618j44944k9297J43427m0035R719o2965
6797B46337K430J8432q350q9665J8498O4713n4335k8570P6081m8612j64532l3920
6785a493n5544Q8003Q1910m2329Q282k3930j8100m4030m5917N9762J04467M8413
6773A59494j22042j5745n4660N7301N7781j91239j26502P4007Q6318L0787J7179
6762b7321J7782J22O3526N6388n6150M8512J16893j70873j37914j2550J21922
6751B0337j07933J05170o9235l9804J03179j22950R1619P9523J1098P330M5999
$$ plain form
6832 58039 49663 162996 192119 163950 -7271 -118036 -47348 -3212 -4300 -98738 -110242 1774
6820 1774 115459 121857 103150 67995 72583 85595 187638 210864 219991 311413 195350 162723
6808 162723 254358 271163 306184 395050 370432 225488 196191 339618 299583 309302 246337
6797 246337 248767 267199 258849 169184 187682 252395 198060 169490 245571 196959 32427 -1493
6785 -1493 -57037 30966 112876 70547 78829 54899 36799 -7231 -53148 6614 111081 159494
6773 159494 37452 21707 -32953 24348 82129 -109110 -235612 -161605 -75287 -44500 -27321
6762 -27321 -9539 -9417 54109 110497 54347 102859 219752 48879 -89035 -101585 20337
6751 20337 -87596 17574 -51661 -91465 11714 -111236 -19617 59906 71004 78334 124333
6740A24333n9656n8017J00700o6475m2380O5835J4831j374k6856N285n6940J14489
6728A13775l4089N3544j0906q600r7772M5536J54074k2737k23477r8989N1057
6717g8584J8780M1227N3769L654J222N0737K6753L2549j51643j199o0778r3638
6705a57151P2392J71074M799k9481j3389M3827O0386k07239M0440K16489q9165
6694A12982n1478p3083j9816J19427N3790M812M5034J4476m8113n9093N3114m6174
6682A05878j07565j14944j1694J21397R7824p6144m6454Q475K5410j1162J4664
6671E685K5187k9717J06616q4371n2166J11544O8302L7198P0744p8997N525q3083
6659A02467n1631N3501J59772l5499j32796m6426J2806K2314p9586Q7189N9657
$$ plain form
6740 124333 64677 6660 107360 40885 -1495 64340 79171 77797 50941 56226 -714 113775
6728 113775 79686 133230 122324 113724 15952 61488 215562 192825 -30652 -129641 -78584
6717 -78584 -59804 -18577 35192 38846 40068 90805 117558 150107 -1536 -2735 -63513 -157151
6705 -157151 -84759 86315 91114 61633 48244 92071 152457 -54782 -14342 202147 112982
6694 112982 61504 -11579 -31395 88032 141822 146634 191668 206144 158031 98938 152052 105878
6682 105878 -1687 -116631 -128325 -6928 90896 14752 -31702 -23227 2183 -8979 5685
6671 5685 30872 1155 107771 23400 -28766 82778 151080 188278 259022 180025 185550 102467
6659 102467 50836 104337 264109 228610 95814 49388 62194 84508 4922 92111 151768
6648A51768Q0721j67657P8282M9380k602R391o2672m5765l3711O5491k1212k2160
6636G9254M9875n5296l4041j348O6542m6392M6864K8265j26397J25407J47384
6625B80117m92n0260m2686p1473O9920L0596M8875k5506M9284r5165j19869N5870
6613A29211n9627K3047J1804M4955k7255p2020O6899J37568M2492j27942k2836
6602A46296j06825R8448j4662J0826P3143r1794K954J33793P9278j17497m4065
6591A69895L6446O6993M859p4334l9687O7337J18981m466j53868o1931J67438
6580B97663L6626l7727j8470j4297j06113j1397R8325J4720n5428j9882o9506
6569A14514K0259J1119n855J5376R111L7448J50343p6076J22436P0305k9744M1746
$$ plain form
6648 151768 232489 64832 143114 192494 189892 199283 136611 90846 57135 122626 101414 79254
6636 79254 129129 73833 39792 38444 104986 58594 105458 133723 7326 132733 280117
6625 280117 279625 229365 186679 115206 185126 215722 264597 239091 288375 193210 73341 129211
6613 129211 69584 92631 104435 149390 122135 50115 117014 254582 297074 169132 146296
6602 146296 39471 137919 123257 134083 207226 115432 118386 252179 331457 213960 169895
6591 169895 206341 273334 278193 203859 164172 231509 350490 346024 192156 130225 297663
6580 297663 334289 296562 278092 263795 157682 146285 244610 259330 203902 184020 114514
6569 114514 134773 145892 140037 155413 164524 201972 352315 276239 398675 468980 439236 480982
6557D80982o5451p5417n0240m0566J9608J22891J2171j5781M1137L8104j20196
6546C47242J63216r246l0646n894J26039J1264M2425j18470Q2178N5734k5000
6535F38842O8370P3970j20454N7425K9274j86507J12571L5617M1547l6326J14490
6524H28819R6443k0073j50926J17914K08511n5806R1640L6902q3526J09745P3276
6513A252919K772o8051R1374N4070j44271p5314j11472j27144J0694K08658j08067
6502I86168k2745L403l0021R5670N6547k7905n0599k7054o1698P6425p2240R9048
6490A024999q7483m7142M7046k4672l0714k6537k4083M7703J6633j3763J6931
6479H98918K810J12166j54496r7807J16345n0644R5545N7257j27121L5997j13752
$$ plain form
6557 480982 415531 340114 289874 249308 268916 391807 403978 388197 429334 467438 347242
6546 347242 510458 501212 470566 464672 590711 601975 644400 525930 608108 663842 638842
6535 638842 707212 781182 660728 718153 747427 560920 673491 709108 750655 714329 828819
6524 828819 925262 905189 754263 872177 1080688 1024882 1116522 1153424 1069898 1179643 1252919
6513 1252919 1255691 1187640 1279014 1333084 1188813 1113499 1002027 874883 885577 1094235 986168
6502 986168 963423 966826 936805 1032475 1089022 1061117 1010518 983464 921766 998191 925951 1024999
6490 1024999 937516 890374 937420 912748 882034 855497 831414 879117 895750 881987 898918
6479 898918 901728 1013894 859398 761591 877936 827292 922837 980094 852973 888970 775218
6468G75218n9453k9571l5413R4120P1986p836k8240j3206K5507q2045K7653N2745
6456G91465m2139j04776o061J30419J8276l3906k9211m5980K186K5805r74N901
6444G11005n5381r6612J37373N0026r3284j069l2526M5499R8636k9224n2734M7050
6432G28759J9722J0517J5754n6397K8425q6393R2849n5925p9263M0917Q2791N3491
6420G95247K5494L1199k1545K0852N349M5434O3362j830N1741L5364m1904l4143
6408I74620k1946L1716k8792J42930J21879j23557J0019r2411J1610J86965k0055
6397A192978N3465q3882J3552q8493j7405p4152J21549q0162J32970L174k7038
6386A146556k311q1574J42081M8835l2285j2535K1179P5225k2224m3424k247R295
$$ plain form
6468 775218 715765 686194 650781 744901 816887 809051 780811 767605 793112 711067 738720 791465
6456 791465 749326 644550 638489 768908 787184 753278 724067 678087 680273 706078 705104 711005
6444 711005 655624 559012 696385 746411 653127 652058 619532 665031 763667 734443 681709 728759
6432 728759 748481 758998 774752 718355 746780 660387 753236 697311 618048 658965 741756 795247
6420 795247 820741 851940 830395 851247 856596 902030 965392 963562 1015303 1050667 1008763 974620
6408 974620 952674 984390 955598 1098528 1220407 1096850 1106869 1014458 1026068 1213033 1192978
6397 1192978 1246443 1162561 1176113 1087620 1070215 996063 1117612 1037450 1170420 1173594 1146556
6386 1146556 1144245 1062671 1204752 1253587 1221302 1208767 1229946 1305171 1282947 1239523 1237276 1246571
6374A246571o8133j5126L1523R3684M5471m897j8614j5497L5582P1022m2168J9019
6362A378437Q7214k733q6448N8294P7600j42768m2496O253J05528R8928P8631
6351A616440P982m3471j6270O1648R520o1624p0153J69571r8115n9468K3932O5344
6339A605336n1141n3276J20657j8356P1008N8108p2861l594m9225O2366M1643
6328A710665J33901q808m4319r6319Q2926O0457q970q3623J22688P915K4907J52334
6316B053754N0359J41564J4947k4393R1433J73846j07120n8635J8320r6365L3157
6305B290867J70108m0292j01970J65769J60415n2192m3668L4725l0972P9908Q5583
6294B718281q979p9575K47492K12276K534J8642p35p3166J46394J7999R6303J39749
$$ plain form
6374 1246571 1178438 1163312 1194835 1288519 1333990 1329093 1310479 1294982 1330564 1401586 1359418 1378437
6362 1378437 1465651 1462918 1376470 1434764 1512364 1369596 1327100 1333353 1438881 1537809 1616440
6351 1616440 1624422 1580951 1564681 1626329 1635849 1574225 1504072 1673643 1575528 1516060 1539992 1605336
6339 1605336 1554195 1500919 1621576 1603220 1674228 1732336 1659475 1655881 1606656 1669022 1710665
6328 1710665 1844566 1835758 1791439 1695120 1778046 1838503 1829533 1745910 1868598 1876513 1901420 2053754
6316 2053754 2104113 2245677 2260624 2236231 2327664 2501510 2394390 2335755 2354075 2257710 2290867
6305 2290867 2460975 2420683 2318713 2484482 2644897 2592705 2549037 2583762 2552790 2632698 2718281
6294 2718281 2709302 2629727 2877219 3089495 3092029 3110671 3109936 3036770 3183164 3201163 3297466 3437215
6282C437215J2261m3380R9716J90005J9014J34597K961R0060m1480J05149O7241
6271D073359J46198M3898J66297J55213N1371J73110K28000L0037K24596K39815
6261E531894K49129K09619O6464J79599K61228K21079K98053J98964L26070L58755
6251G900854M25917M03198K73986L04678M64431M64122M92718N90663O48241P17222
6241A2686030O79586P71761Q85722R07127J017274J168633J182993J465902J738861
6232B2503889J829092J966244K265400K638914L020295L312164L654309M236758
6224D5427065N053475N810649O290583O461700O268425O028907N024577L141534
6216H9506915R13546j127339k103414k157075j447543o25836K39169Q38195J045720
$$ plain form
6282 3437215 3449476 3406096 3505812 3695817 3714831 3849428 3852389 3942449 3900969 4006118 4073359
6271 4073359 4219557 4263455 4429752 4584965 4636336 4809446 5037446 5067483 5292079 5531894
6261 5531894 5781023 5990642 6057106 6236705 6497933 6719012 7017065 7216029 7542099 7900854
6251 7900854 8326771 8729969 9003955 9308633 9773064 10237186 10729904 11320567 11968808 12686030
6241 12686030 13365616 14137377 15023099 15930226 16947500 18116133 19299126 20765028 22503889
6232 22503889 24332981 26299225 28564625 31203539 34223834 37535998 41190307 45427065
6224 45427065 50480540 56291189 62581772 69043472 75311897 81340804 86365381 89506915
6216 89506915 90420461 89293122 87189708 85032633 83585090 82959254 83198423 84036618 85082338
6207H5082338J471493K119193K790858L820459M919837O169989P161742P787292
6199A21323201Q462749Q467064P678597N901845K806224q3721k489113l913363
6191A48153483m670789n459269n952729n695723n202116m454030l765995l017530
6183A09935302k590565j992723j492606q80058r311J050033K078971K524090K723820
6174A11346953K507135J824996L4085k425692m850274o529766o954551o447825
6166H8505061n388737m664625m353066m406169m260838m085202l809660l731965
6158E3804799l428280l239783l153940k968436k961652k632824k394692k155655
6150C0869537k107857j767255j596331j469609j385138j095386j082499q81455
$$ plain form
6207 85082338 86553831 88673024 91463882 95284341 100204178 106374167 113535909 121323201
6199 121323201 129785950 138253014 145931611 151833456 154639680 154555959 152066846 148153483
6191 148153483 143482694 138023425 132070696 126374973 121172857 116718827 112952832 109935302
6183 109935302 107344737 105352014 103859408 102979350 102970039 104020072 106099043 108623133 111346953
6174 111346953 113854088 115679084 115713169 113287477 108437203 101907437 94952886 88505061
6166 88505061 83116324 78451699 74098633 69692464 65431626 61346424 57536764 53804799
6158 53804799 50376519 47136736 43982796 41014360 38052708 35419884 33025192 30869537
6150 30869537 28761680 26994425 25398094 23928485 22543347 21447961 20365462 19484007
6142A9484007q47795q12228p98853q04313o78498o21138n43566o13445l98334
6133A3365837m23410m65266l98532l63219k20648n01476l36207m23409l07721
6124I925949l97825l29706j98386r5578j79706l62850l48753j69531j53423j60992
6114G529199j05427j90274j75379j82727k17988j90540l9638j14281j10569k30515
6104E971861q4623j67655o7384j65431j16382J5897p5613j35928p7464l4885p68
6093E061625j24368m4911R738j24015k87292m7279Q9024k3980J1515p8548p1107
6082D370402m7977m1652m4852q9349m0936j06868j74818q415K2255j31968k57586
6071C448236J06051q7196o2429L8663l8921p4104j20018j01192j08029j37881
$$ plain form
6142 19484007 18636212 17823984 17025131 16220818 15542320 14921182 14377616 13764171 13365837
6133 13365837 12942427 12477161 12078629 11715410 11494762 10993286 10657079 10233670 9925949
6124 9925949 9528124 9198418 9000032 8904454 8724748 8361898 8013145 7843614 7690191 7529199
6114 7529199 7423772 7233498 7058119 6875392 6657404 6466864 6427226 6312945 6202376 5971861
6104 5971861 5887238 5719583 5652199 5486768 5370386 5386283 5310670 5174742 5097278 5062393 5061625
6093 5061625 4937257 4892346 4902084 4778069 4490777 4443498 4532522 4508542 4520057 4441509 4370402
6082 4370402 4322425 4280773 4235921 4146572 4105636 3998768 3823950 3815535 3837790 3705822 3448236
6071 3448236 3554287 3467091 3404662 3443325 3404404 3330300 3210282 3109090 3001061 2863180
6061B863180L5620J7133P3137m7559j90185k4535K6842l3602n3126p7758l2297
6050B556850R740n412n2594r9753k7588m7866K2367o1617q3590J8215r1188k09959
6038A927605k1210r708K7829m0909L1805m3691q29N126r0788j11826J5533N9233
6026A748170l900j48502n3629L6887Q3319j6n404j4473P2516q9246j63408j58867
6014A303447J8592j2461j4216n4033j06010R7931J16670M7715p0640p4823L3548
$$ plain form
6061 2863180 2898800 2915933 2989070 2941511 2751326 2726791 2753633 2720031 2666905 2589147 2556850
6050 2556850 2566590 2561178 2508584 2408831 2381243 2333377 2355744 2294127 2210537 2228752 2137564 1927605
6038 1927605 1906395 1896687 1924516 1883607 1915412 1871721 1870892 1876018 1785230 1673404 1688937 1748170
6026 1748170 1744270 1595768 1542139 1579026 1662345 1662329 1656925 1642452 1714968 1625722 1462314 1303447
6014 1303447 1322039 1309578 1295362 1241329 1135319 1233250 1349920 1397635 1326995 1252172 1285720
$$ [...]
##END NTUPLES=NMR SPECTRUM
##END=
