##TITLE=1H_TG-2389-a
 200.13MHz, CDCl3,
 8 sc
 
 18.8.2025
##JCAMPDX= 6.0         $$ Bruker NMR JCAMP-DX V2.0
##DATA TYPE= NMR SPECTRUM
##DATA CLASS= NTUPLES
##ORIGIN= UXNMR, Bruker Analytische Messtechnik GmbH
##OWNER= pz
$$ XWIN-NMR		Version 3.5
$$ Mon Aug 18 13:49:29 2025 Russian Standard Time (UT+4h)  she@DPX200
##.OBSERVE FREQUENCY= 200.1313
##.OBSERVE NUCLEUS= ^1H
##.ACQUISITION MODE= SIMULTANEOUS
##.ACQUISITION SCHEME= undefined
##.AVERAGES= 8
##.DIGITISER RES= 18
##SPECTROMETER/DATA SYSTEM= spect
##.PULSE SEQUENCE= zg30
##.SOLVENT NAME= CDCl3
##.SHIFT REFERENCE= (INTERNAL, CDCl3, 0, 15.4902)
##AUDIT TRAIL= $$ (NUMBER, WHEN, WHO, WHERE, WHAT)
$$ ##TITLE= Audit trail, XWIN-NMR		Version 3.5
$$ ##JCAMPDX= 5.01
$$ ##ORIGIN= Bruker BioSpin GmbH
$$ ##OWNER= she
$$ F:/spectra/data/she/nmr/H-C/1/pdata/1/auditp.txt
$$ ##AUDIT TRAIL=  $$ (NUMBER, WHEN, WHO, WHERE, WHAT)
(   1,<2025-08-18 13:47:23.84 +0400>,<she>,<DPX200>,
      <created by zg, POWCHK disabled, PULCHK disabled
       configuration hash MD5:
       00 E9 B6 7A A2 85 ED C7 34 08 36 98 17 FE 4E 26
       data hash MD5: 16K
       CA 33 89 D9 93 9B F3 85 F9 50 04 3E 6B F2 D7 DE>)
(   2,<2025-08-18 13:47:26.79 +0400>,<she>,<DPX200>,
      <Start of raw data processing
       efp BC_mod = 2 LB = 0.25 FT_mod = 6 PKNL = 1 PHC0 = -1561.769 PHC1 = 15.59228 SI = 16K 
       data hash MD5: 16K
       6C 3C 02 85 D1 CF 2D 5D 42 C6 24 C2 90 F2 71 DA>)
(   3,<2025-08-18 13:47:54.95 +0400>,<she>,<DPX200>,
      <pk PHC0 = -0.1327707 PHC1 = -1 
       data hash MD5: 16K
       E4 86 EC 50 F3 56 7D CC BF 3F 7B 95 F5 85 47 3F>)
(   4,<2025-08-18 13:47:59.00 +0400>,<she>,<DPX200>,
      <abs ABSG = 5 
       data hash MD5: 16K
       0B 7C EB 60 AB 01 30 DC B0 0D AE AB AB F5 02 D2>)
$$ ##END=
$$ 
$$ hash MD5
$$ 63 75 15 A4 78 83 E9 FF 2E 5C 74 D9 9D FF 1A 3B
##$RELAX= 
##$RELAX= 
##$RELAX= 
##$RELAX= 
##$RELAX= 
##$RELAX= 
$$ Bruker specific parameters
$$ --------------------------
##$DU= <F:/spectra>
##$EXPNO= 1
##$NAME= <H-C>
##$PROCNO= 1
##$TYPE= <nmr>
##$USER= <she>
##$AMP= (0..31)
100 100 100 100 100 100 100 100 100 100 100 100 100 100 100 100 100 100 
100 100 100 100 100 100 100 100 100 100 100 100 100 100 
##$AQSEQ= 0
##$AQ_mod= 1
##$AUNM= <au_zg>
##$AUTOPOS= <>
##$BF1= 200.13
##$BF2= 200.13
##$BF3= 200.13
##$BF4= 200.13
##$BF5= 200.13
##$BF6= 200.13
##$BF7= 200.13
##$BF8= 200.13
##$BYTORDA= 1
##$CFDGTYP= 0
##$CFRGTYP= 5
##$CHEMSTR= <none>
##$CNST= (0..31)
1 1 145 1 1 1 1 1 1 1 1 1 1 1 1 1 1 1 1 1 1 1 1 1 1 1 1 1 1 1 1 1 
##$CPDPRG= <>
##$CPDPRG1= <>
##$CPDPRG2= <>
##$CPDPRG3= <>
##$CPDPRG4= <mlev>
##$CPDPRG5= <mlev>
##$CPDPRG6= <mlev>
##$CPDPRG7= <mlev>
##$CPDPRG8= <mlev>
##$CPDPRGB= <>
##$CPDPRGT= <>
##$D= (0..31)
0 0.7 0 0 0 0 0 0 0 0 0 0.03 0 0 0 0 0 0 0 0 0 0 0 0 0 0 0 0 0 0 0 0 
##$DATE= 1755510443
##$DBL= (0..7)
120 120 120 120 120 120 120 120 
##$DBP= (0..7)
150 150 150 150 150 150 150 150 
##$DBP07= 0
##$DBPNAM0= <>
##$DBPNAM1= <>
##$DBPNAM2= <>
##$DBPNAM3= <>
##$DBPNAM4= <>
$$ [...]
##$SUBNAM3= <"">
##$SUBNAM4= <"">
##$SUBNAM5= <"">
##$SUBNAM6= <"">
##$SUBNAM7= <"">
##$SUBNAM8= <"">
##$SUBNAM9= <"">
##$SW= 18.0517328524113
##$SWIBOX= (0..15)
0 0 2 0 0 0 0 0 0 0 0 0 0 0 0 0 
##$SW_h= 3612.71676300578
##$TD= 16384
##$TD0= 1
##$TE= 0
##$TE2= 300
##$TE3= 300
##$TEG= 300
##$TL= (0..7)
0 120 120 120 120 120 120 120 
##$TP= (0..7)
150 150 150 150 150 150 150 150 
##$TP07= 0
##$TPNAME0= <>
##$TPNAME1= <>
##$TPNAME2= <>
##$TPNAME3= <>
##$TPNAME4= <>
##$TPNAME5= <>
##$TPNAME6= <>
##$TPNAME7= <>
##$TPOAL= (0..7)
0.5 0.5 0.5 0.5 0.5 0.5 0.5 0.5 
##$TPOFFS= (0..7)
0 0 0 0 0 0 0 0 
##$TUNHIN= 0
##$TUNHOUT= 0
##$TUNXOUT= 0
##$USERA1= <user>
##$USERA2= <user>
##$USERA3= <user>
##$USERA4= <user>
##$USERA5= <user>
##$V9= 5
##$VALIST= <valist>
##$VCLIST= <CCCCCCCCCCCCCCC>
##$VD= 0
##$VDLIST= <DDDDDDDDDDDDDDD>
##$VPLIST= <PPPPPPPPPPPPPPP>
##$VTLIST= <TTTTTTTTTTTTTTT>
##$WBST= 1024
##$WBSW= 4
##$XGAIN= (0..3)
0 0 0 0 
##$XL= 0
##$YL= 0
##$YMAX_a= 794600
##$YMIN_a= -871125
##$ZGOPTNS= <>
##$ZL1= 120
##$ZL2= 120
##$ZL3= 120
##$ZL4= 120
##$ABSF1= 15.49127
##$ABSF2= -2.560579
##$ABSG= 5
##$ABSL= 3
##$ALPHA= 0
##$AQORDER= 0
##$ASSFAC= 0
##$ASSFACI= 0
##$ASSFACX= 0
##$ASSWID= 0
##$AUNMP= <proc_1d>
##$AZFE= 0.1
##$AZFW= 0.1
##$BCFW= 0
##$BC_mod= 2
##$BYTORDP= 0
##$COROFFS= 0
##$CY= -3
##$DATMOD= 1
##$DC= 0
##$DFILT= <>
##$DTYPP= 0
##$F1P= 0
##$F2P= 0
##$FCOR= 1
##$FTSIZE= 16384
##$FT_mod= 6
##$GAMMA= 0
##$GB= 0
##$INTBC= 1
##$INTSCL= 3.241238e-09
##$ISEN= 128
##$LB= 0.25
##$LEV0= 0
##$LPBIN= 0
##$MAXI= 10000
##$MC2= 0
##$MEAN= 0
##$ME_mod= 0
##$MI= 1.114404
##$NCOEF= 0
##$NC_proc= -5
##$NLEV= 6
##$NOISF1= 3.799351
##$NOISF2= 2.8
##$NSP= 0
##$NTH_PI= 0
##$NZP= 0
##$OFFSET= 15.49017
##$PC= 1
##$PHC0= -1561.902
##$PHC1= 14.59228
##$PH_mod= 1
##$PKNL= yes
##$PPARMOD= 0
##$PSCAL= 0
##$PSIGN= 0
##$REVERSE= no
##$SF= 200.130006309939
##$SI= 16384
##$SIGF1= 3
##$SIGF2= 2
##$SINO= 0.751879
##$SIOLD= 32768
##$SREGLST= <19F.Aceton>
##$SSB= 0
##$STSI= 16384
##$STSR= 0
##$SW_p= 3612.71676300578
##$SYMM= 0
##$S_DEV= 0
##$TDeff= 16384
##$TDoff= 0
##$TI= <>
##$TILT= no
##$TM1= 0
##$TM2= 0
##$TOPLEV= 0
##$USERP1= <user>
##$USERP2= <user>
##$USERP3= <user>
##$USERP4= <user>
##$USERP5= <user>
##$WDW= 1
##$XDIM= 16384
##$YMAX_p= 441947413
##$YMIN_p= -203175
$$ End of Bruker specific parameters
$$ ---------------------------------
##NTUPLES= NMR SPECTRUM
##VAR_NAME=  FREQUENCY,     SPECTRUM/REAL,   SPECTRUM/IMAG
##SYMBOL=    X,             R,               I
##VAR_TYPE=  INDEPENDENT,   DEPENDENT,       DEPENDENT
##VAR_FORM=  AFFN,          ASDF,            ASDF
##VAR_DIM=   16384,         16384,           16384
##UNITS=     HZ,            ARBITRARY UNITS, ARBITRARY UNITS
##FACTOR=    0.220516191357247, 1,           1
##FIRST=     3100.04772480959, 0,            0
##LAST=      -512.669038196189, 0,           0
##MIN=       -512.669038196189, -203175,     0
##MAX=       3100.04772480959, 441947413,    0
$$ Real data points
##PAGE= N=1
##DATA TABLE= (X++(R..R)), XYDATA
$$ [...]
8909C7550719m8392m95278q83484j038441j000495q92943o63090m50950j36508
8900C1941138n5950n6880K11108K20432Q1523R8668K20508K76298K04132j50779
8890C2990198m57284o25348p79492p64682q58754r54237j258721j523724j560856
8881B4207100j491299j381773j267605j050816q54955o11115m99368l33626j39102
8872A6577441m3750J55164K90946M04751L52248M09672M51544L43364J08763q439
8862A9041704j52937k44563m91865m89017l55858k28778k58906k77283m98602
8853A6043895o72923n54202m59260m81340m33840l17325m60101o72959o78682
8844A1313263o99786o58446m70036n50097m80351m47225l56871j83202k39081
$$ y = [37550719, 37502327, 37007049, 36123565, 35085124, 34084629, 33191686, 32528596, 32077646, 31941138, 31885188, 31828308, 32039416, 32259848, 32341371, 32440039, 32660547, 32936845, 33140977, 32990198, 32532914, 31907566, 31128074, 30363392, 29504638, 28550401, 27291680, 25767956, 24207100, 22715801, 21334028, 20066423, 19015607, 18160652, 17549537, 17050169, 16716543, 16577441, 16533691, 16688855, 16979801, 17384552, 17736800, 18146472, 18598016, 18941380, 19050143, 19041704, 18888767, 18644204, 18152339, 17663322, 17307464, 17078686, 16819780, 16542497, 16043895, 15370972, 14816770, 14357510, 13876170, 13442330, 13125005, 12664904, 11991945, 11313263, 10613477, 9955031, 9484995, 8934898, 8454547, 8007322, 7650451, 7467249, 7228168]
8835G228168j26840j21307j16929p9647r6198r1086j59883j92957l50934k91256
8825E601131k69696k45441j36812k22606k55205k04858j11712l5017p7365j34540
8815C907879q0125l95j23149r8354o5544k2786m4540j11822n2780q0807j00677
8804C126900k4243q8738q1653j14213m4232o4512n1348m7593j70060p2033k1340
8793B346935q0672r0437j3365j5796j1372K0093q9298q4001l0258j2845j07672
8782A831312p2096O3343J4976o4885l954O2606J1360p4032p253Q216n8191p0475
8770A640927K0771K0271l1821R078l2906J1153J7021q898L0912j21654q363P2389
8758A618880l3365m3038m1627N9878N0215K8163Q1767j217k9022k9322J3844L2358
$$ y = [7228168, 7101328, 6980021, 6863092, 6783445, 6687247, 6596161, 6436278, 6243321, 5892387, 5601131, 5331435, 5085994, 4949182, 4726576, 4471371, 4266513, 4154801, 4119784, 4042419, 3907879, 3827754, 3827359, 3704210, 3605856, 3540312, 3517526, 3472986, 3361164, 3308384, 3227577, 3126900, 3102657, 3013919, 2932266, 2818053, 2773821, 2709309, 2657961, 2610368, 2440308, 2368275, 2346935, 2266263, 2175826, 2162461, 2146665, 2135293, 2155386, 2066088, 1982087, 1951829, 1938984, 1831312, 1759216, 1822559, 1837535, 1772650, 1768696, 1831302, 1842662, 1768630, 1761377, 1769593, 1711402, 1640927, 1661698, 1681969, 1650148, 1659226, 1626320, 1637473, 1654494, 1645596, 1676508, 1554854, 1546491, 1618880, 1585515, 1542477, 1500850, 1560728, 1610943, 1639106, 1720873, 1719656, 1690634, 1661312, 1675156, 1707514]
8746A707514n6779p0504k4669j6755q645m2182r3845m9585n4981n8627l4484K2146
8734A218604k7494l1834J3792r5247K1767l5369L6502J0675j7078M3759p055j6406
8722A114616L0930M7239j9322Q3J4905M9408K9117K6781m0004L3095k1413j8341
8710A247094k8774J5724l5762r15n4180j3574J4850N779o9248l1443k532k4282
8698A022737j5738q025r93k9858j6818K615J8186J678n3510J1569M1018j0739
8686I62122n2076n097K8563L700l7147n3417l6318j5202k0766J6476r671J0488
8674G91655j3877j7445p000k2989L9941l7326J8295q7059N374O2038J7223m6734
8662G02096m3811P036J4138n9818j545k8152M5248j9269k3772M1661k6511L3965
$$ y = [1707514, 1650735, 1580231, 1555562, 1538807, 1530162, 1487980, 1394135, 1344550, 1289569, 1230942, 1196458, 1218604, 1191110, 1159276, 1173068, 1077821, 1099588, 1064219, 1100721, 1111396, 1094318, 1138077, 1131022, 1114616, 1145546, 1192785, 1173463, 1173546, 1188451, 1237859, 1266976, 1293757, 1253753, 1286848, 1265435, 1247094, 1218320, 1234044, 1198282, 1197367, 1143187, 1129613, 1144463, 1150242, 1080994, 1049551, 1047019, 1022737, 1006999, 998974, 997981, 968123, 951305, 953920, 972106, 973784, 920274, 931843, 972861, 962122, 910046, 904949, 933512, 937212, 900065, 846648, 810330, 795128, 774362, 790838, 781167, 791655, 777778, 760333, 753333, 730344, 770285, 732959, 751254, 664195, 669569, 731607, 748830, 702096, 658285, 665321, 679459, 619641, 618096, 589944, 635192, 615923, 592151, 633812, 607301, 641266]
8650F41266k0630k2294l796O230M6508J9691k9886j4989r3195L6358Q1883n7245
8638E89901J4479k5518j0629o300o9400q7233P5837Q8679o42n4527r09L0640j6746
8625E27632k3737m3218R141k5261K0129j18002O2459M6233K595l0269n995j6009
8613D05698N756J2589l1115l7698m605j2544j7107J0256K0579j4458J044k271
8601C36124q293R999l6229O4474K8751l8805L4673l3793l8627M3495p3407P0215
8589C58577j1810l7365K2267K013o8389j5727K6433M9678j8558k360j941r100
8577B93718j0034K4805j5772p4224K3113P0774N51L964R958J9178l2131L0120
8565C44020j9274m1488p175J0460n947K3655J4438L2793o107p3980l1525N4876
$$ y = [641266, 620636, 598342, 594546, 600776, 647284, 666975, 637089, 622100, 528905, 565263, 647146, 589901, 604380, 578862, 568233, 561933, 492533, 405300, 481137, 569816, 569174, 514647, 513738, 544378, 527632, 503895, 460677, 469818, 444557, 464686, 346684, 409143, 455376, 457971, 427702, 421707, 405698, 411454, 424043, 392928, 355230, 350625, 338081, 320974, 331230, 351809, 337351, 338395, 336124, 327831, 337830, 301601, 366075, 394826, 356021, 390694, 356901, 318274, 361769, 288362, 358577, 346767, 309402, 331669, 333682, 265293, 249566, 275999, 325677, 307119, 304759, 302818, 293718, 283684, 308489, 292717, 218493, 241606, 312380, 312931, 316895, 326853, 346031, 313900, 344020, 324746, 283258, 276083, 286543, 280596, 304251, 318689, 351482, 345375, 271395, 239870, 294746]
8553B94746K5976j2262K1182l5857Q7590m0413n7216n3325j5854L5940Q765O924
8541B66196K3539j2058K1227M2877N9183n9301l8268L4106o311l2936M0779K2201
8529C61234K5705K3299j5735p881M8260O2491k7211L98q7065q5975K8312R4148
8517D19980P181j9065l9559q0296K1312L9326L0742j2752k1179k3233k3368l5433
8505B63656l7076K8732N5663K3577R9467O5111K3011j2798j3850K752j00988O79
8493C97936N48K4340J6810j4391l0070j1248P0502K4621J4244M6322M2743J9828
8481F02185j7635q1394r4788N8123N8602k1062L995M184L6687Q991M3499L9360
8469F40747J0831K9782M4886k4463m580j2297J5929m5162J651Q557q7803l4834
$$ y = [294746, 320722, 308460, 329642, 293785, 381375, 340962, 283746, 230421, 214567, 250507, 259272, 266196, 289735, 277677, 298904, 341781, 400964, 341663, 303395, 337501, 331190, 298254, 339033, 361234, 386939, 410238, 394503, 386622, 434882, 497373, 470162, 470560, 383495, 297520, 325832, 419980, 427161, 408096, 368537, 288241, 309553, 348879, 379621, 366869, 345690, 322457, 299089, 263656, 226580, 255312, 310975, 334552, 434019, 499130, 522141, 509343, 495493, 498245, 397257, 397936, 398484, 422824, 439634, 425243, 395173, 383925, 454427, 479048, 493292, 539614, 582357, 602185, 584550, 503156, 408368, 466491, 525093, 504031, 508026, 512210, 548897, 557888, 601387, 640747, 651578, 681360, 726246, 701783, 697203, 684906, 700835, 655673, 657324, 665881, 578078, 543244]
8457E43244k1316K2665J3860k4064o1153k4438m4290L5916J085j7048r3753m7743
8445B82965L1403J8216J6720q5651j0948k4775P728J5045l8155n2816M125L2727
8433A96584O4538n4892J6587L35k3347K2864j2087l003o0257k669O6023J2200
8421B22876R037j9347J1151j5501p1790p1014m1612N5809J3297K1245L8383L2159
8409A84693q1361j574m6866N2038L9219p8521N595P3883L5085j06270Q374Q8812
8397A73107j0594j1946j8686J6295J8448O277k0830R024J4q585m5284j02895J6192
8384B0537Q1937K9539m6056M498L5261j6288N13p4857K3930j4264k5694N6064
8372G5120L0270j3921L037N1856o5290k200L4408n9916M5641n30j7528O0934M43
$$ y = [543244, 521928, 544593, 558453, 534389, 473236, 448798, 404508, 440424, 441509, 424461, 330708, 282965, 314368, 332584, 349304, 263653, 252705, 227930, 235658, 250703, 212548, 159732, 163857, 196584, 261122, 206230, 222817, 223152, 199805, 222669, 210582, 207579, 147322, 144653, 210676, 222876, 231913, 212566, 223717, 208216, 136426, 65412, 23800, 79609, 92906, 114151, 152534, 184693, 103332, 101758, 54892, 106930, 146149, 67628, 73223, 147106, 182191, 75921, 84295, 173107, 162513, 150567, 131881, 148176, 166624, 172901, 152071, 161095, 161109, 152524, 107240, 4345, 20537, 102474, 132013, 85957, 90455, 125716, 109428, 109941, 35084, 59014, 44750, 19056, 75120, 105390, 91469, 94506, 146362, 81072, 78872, 113280, 53364, 99005, 98475, 80947, 141881, 142324]
8359A42324j1094J0759J2371l0012j9488j2463j6679M4867J0025p4634N0892m7406
8347E9462n3808K5066L3960R1329J9340k9699L396o2424m7306P2498n5073N3271
8335A10012j2855j84O5052j3563m0966n9629k0502K6885M8684J8569L3638q4779
8323G0362j8120o135K3670J496M3512l0983j2398M108j5115Q245J9435J3649q713
8310I3013o52L696o0214K0470R381J3298Q232L0160m2218m1783M0766j346k184
8297G0619N34p927J8347k2334j7199j8046m4087J0364J4128M9422l135J3808j9518
8284D4976M6765n8826l4652j6824j5619l5858O4221J6114l0328M6156N325k8220
8272C230j9110L9087j8205j8137j2027l5645J1147L3865O2385p1143M297K5747
$$ y = [142324, 131230, 141989, 154360, 124348, 104860, 92397, 75718, 120585, 130610, 55976, 106868, 59462, 5654, 30720, 64680, 156009, 175349, 145650, 149046, 86622, 39316, 111814, 56741, 110012, 97157, 96973, 162025, 148462, 107496, 47867, 27365, 54250, 102934, 121503, 155141, 70362, 52242, 46107, 69777, 71273, 114785, 83802, 71404, 75512, 60397, 68642, 88077, 101726, 93013, 92361, 96057, 35843, 56313, 65694, 78992, 87224, 117384, 75166, 33383, 74149, 72803, 70619, 71153, 63226, 81573, 59239, 42040, 23994, -20093, -9729, 4399, 53821, 50686, 64494, 44976, 91741, 32915, -1737, -18561, -34180, -70038, -5817, 10297, -20031, 26125, 31450, 3230, -15880, 23207, 5002, -13135, -25162, -60807, -49660, -15795, 46590, -24553, -20256, 5491]
8260E491L2852j090o5777N3549m2326N3734N556J399L9705l500m0086l1851l049
8247D607m0521n394O701J2794l5826J306P6528n49o7430J9997K5643j2608o789
8234b1541O4109J415j9234M320j1605l9857m9494M9603m9446k0011L6744N3790
8222a207j3672J0274J981j9075J5967L7850o3972p506M2970j02222L2318M4382
8210b1912J7485j9159m2979M5544J7893N5032o1406M918k6415L9251M9476m9681
8198H047J7206M150j4608K8810k629J81649k5132k59574Q4314r4421j230O2229
8186a1189L3493K0617p043r175k2150k183O2507j946n5749m2640L4835k7206j253
8173b9082k2026L9992O2572n7473n3139L2719O1684J9716r0921J2757l5605m052
$$ y = [5491, 38343, 37253, -28524, 25025, -17301, 36433, 41989, 43388, 83093, 79593, 39507, 7656, 4607, -35914, -41308, -34607, -21813, -57639, -56333, 20195, 19646, -47784, -27787, -2144, -14752, -21541, 42568, 43983, 24749, 29069, 17464, -22393, -71887, -22284, -71730, -91741, -54997, -1207, -14879, -4605, -2624, -21699, -5732, 32118, -31854, -39360, 3610, -98612, -66294, -21912, -4427, -23586, -66565, -21021, -3128, 51904, -9502, -4584, -30999, 8252, 57728, 8047, 25253, 29403, 14795, 43605, 40976, 222625, 197493, -62081, 22233, -72188, -73418, -11189, 22304, 42921, 35878, 26703, 4553, 2370, 64877, 62931, 7182, -35458, -623, -27829, -29082, -51108, -11116, 51456, -6017, -59156, -26437, 35247, 54963, -35958, -23201, -58806, -62858]
8161f2858m2299J3325J60267J6570o9317n7611M9401K0282j1073m9089K615p669
8149c7456K2784K2978L7089m2647J7738j0119j4886k5473L2846m0836K4523M0364
8137B6905j6600n4180m0539L3816M3294j7839m386m2018k4740J9056M0750K9024
8125g457R596o3759R03l49o0083P7639n778M8708j3903j140J1293n8168J3101
8112d9397q182l74L5949j8749J8966M5677l1440N731K8075k7275k7743L4029M2006
8099D7273o636k8837o2241K0460K8362l5490P135l8088N7982Q2889o0509L1946
8087D4246M30j1986L3506m6456k012L3900k9265N0929m2025N368J9876k573O0326
8074A14264m0412j6122N513o0752K0018K6477J1225P9026j1532k7392P823l8900
$$ y = [-62858, -105157, -91832, 68435, 85005, 15688, -41923, 7478, 27760, 16687, -32402, -29787, -37456, -14672, 8306, 45395, 2748, 20486, 10367, -4519, -29992, 2854, -37982, -13459, 26905, 10305, -43875, -84414, -50598, -7304, -25143, -29529, -71547, -96287, -77231, -36481, -7457, 2139, -61620, -60717, -61066, -121149, -43510, -49288, -580, -14483, -15623, -4330, -62498, -49397, -57579, -57953, -22004, -40753, -21787, 23890, -7550, -1819, 26256, -1019, -28762, 5267, 47273, 40637, 11800, -50441, -29981, -1619, -37109, -29974, -68062, -10080, 72809, 12300, 44246, 44676, 32690, 66196, 19740, 17728, 51628, 22363, 73292, 31267, 36635, 56511, 53938, 114264, 73852, 57730, 63243, 2491, 22509, 48986, 60211, 139237, 127705, 100313, 108136, 69236]
8062F9236R440l6618j9100l0064j8347n946Q790K8862M261L1177k4539P1334M0199
8049A28685n7182o431o4163R368M6473J8727Q074j2483N5586l2100m679o505q70
8036H2500J11369n4950n6151j4177n497j0241k7078M0575m1192J7589O0621j0628
8024I2740n5378j5116k3721J9968M7094l849o7971j0751j5315l0821P5615L9325
8012E1820j4635n2570m0231R1208L8281k7572l734K2078M1156j1259K8000J2384
8000A34926m2561o9257j505O8792K9789k6115j1251N16q6060k8178N6718m1190
7988a5376o927J9163j0662Q2615J9872m658k9073m7279J8838J3939p547l0009
7976B896k5887k3284n401K4822L8557P91k8080L5693P94L9854L2601j0752L0884
$$ y = [69236, 78676, 42058, 22958, -7106, -25453, -31399, -22609, 6253, 10514, 41691, 17152, 88486, 128685, 71503, 65072, 909, 10277, 56750, 75477, 83551, 71068, 126654, 94554, 89875, 83370, 82500, 193869, 138919, 82768, 68591, 63094, 52853, 25775, 66350, 25158, 42747, 103368, 92740, 37362, 22246, -1475, 18493, 65587, 61738, -6233, -16984, -32299, -63120, 12495, 51820, 37185, -15385, -55616, 35592, 73873, 46301, 42567, 64645, 105801, 94542, 122542, 134926, 92365, 23108, 21603, 90395, 120184, 94069, 82818, 83334, -2726, -30904, 25814, -15376, -22303, -3140, -13802, 68813, 88685, 84027, 54954, 7675, 26513, 40452, 32905, 2896, -22991, -46275, -51676, -26854, 11703, 12494, -15586, 20107, 20901, 60755, 93356, 82604, 113488]
7963A13488m8166J1262J6834l7735p940L3666k0314l2763K5651j9363M9883j1417
7951G3086l8459p680N2573l3849l7003r063j7375O8597J7549K4820l6922J4317
7939G0591M9170l2089k2776o5774L8448N7983J2839K1883K2064N037l4100k9372
7927I3904m332n4937K5443J7085l9650j8605J260L7034K0123m8005l7994M7370
7915C8696r679N3692l2612J8782k9641q57J9952p87Q2466p4057n1730L5062J6633
7902F5920j7761O8408J3863m5307L7178n9244k0598L7535N2805m3552m8680o898
7890C3669K1490K8119J4591o1374m605p229N3130m7978j5714K9113K5356L1874
7878A00442l9718j2654O071m7731N9513K3624o7680P2246J3047k058m6709l0608
$$ y = [113488, 65322, 76584, 93418, 55683, 47743, 81409, 61095, 28332, 53983, 34620, 84503, 73086, 34627, 26947, 79520, 45671, 8668, -395, -17770, 50827, 68376, 93196, 56274, 70591, 119761, 87672, 64896, -878, 37570, 95553, 108392, 130275, 152339, 157376, 123276, 93904, 89572, 34635, 60078, 77163, 37513, 18908, 20168, 57202, 77325, 29320, -8674, 38696, 29017, 82709, 50097, 68879, 39238, 38381, 58333, 57546, 140012, 65955, 14225, 49287, 65920, 48159, 116567, 130430, 85123, 122301, 63057, 42459, 79994, 132799, 89247, 40567, 33669, 55159, 83278, 97869, 36495, 31890, 24661, 77791, 29813, 14099, 43212, 68568, 100442, 60724, 48070, 54141, 6410, 65923, 89547, 21867, 94113, 107160, 105102, 58393, 27785]
7866B7785o3316K2091P4345N0010l9860l5096L2946p366N3700j7692m9438j7307
7854C0802L4890L7511k8715Q531P955N3947J0252j5855n5402L7768j3856k6152
7842H1676O1027J696N8184k6562J2675M2310p4748k2183P1119P3128j1285L266
7830B70303M3062P818o816P5026K8253o435k7484l4594m3741M593P6859M2082
7818D28926o3989l2939j0121J5462K8712k8805J4500k3486L5004m8870j7204l5367
7806B61823k2536L545K1238l7443j256m9839j5981J79828j16521m9396j1044k2492
7794A39926n0030l5571K1254O6873j3816j9473r120j7523l9812M3520O882l106
7782I0004k0668J168J0280k2177J8003M481j1125R190l4063N7341N0741M366k2595
$$ y = [27785, -35531, -13440, 60905, 110915, 71055, 35959, 68905, 61539, 115239, 97547, 48109, 30802, 65692, 103203, 74488, 83019, 90974, 144921, 155173, 139318, 83916, 121684, 107828, 81676, 142703, 144399, 202583, 176021, 188696, 231006, 156258, 134075, 205194, 278322, 267037, 270303, 313365, 321183, 314367, 389393, 417646, 411211, 383727, 349133, 305392, 309985, 386844, 428926, 364937, 331998, 321877, 337339, 366051, 337246, 351746, 328260, 363264, 314394, 297190, 261823, 239287, 242832, 264070, 226627, 225371, 175532, 159551, 339379, 222858, 173462, 162418, 139926, 89896, 54325, 75579, 142452, 128636, 109163, 100043, 82520, 42708, 86228, 93110, 90004, 69336, 70504, 80784, 58607, 76610, 81091, 69966, 79156, 45093, 102434, 153175, 157541, 134946]
7769A34946L6023p9816p0422K8504r447n361K5409N85r21m8965j3672M6841M6405
7756I0109L7807p459j9311p8683P6499p5835o625j6784q371j9060R8190l936M9215
7743A15756K6603l7571N5670J4226k2654m2454O3441Q8581n1821q6196J1661O9713
7731B04955o4187K5019M1932k5256o5843N5990O3974N5940n5922l3125L9174N780
7719B48431P7057o710m1921n3050m2493M2757N9123n2400r418K2240P8727m1330
7707B81013l5462k2432k2900q375l7341l528k9386L4281p9718M6451J0498l4324
7695I8777k7367l79J7454M965k583l6999L3824N156J8517K9961j6081m1664n6584
7682B6997L7052J3882j5137J8774J845M430n9064r95r647L6002L4973J5128p596
$$ y = [134946, 170969, 91153, 20731, 49235, 39788, 34427, 59836, 60421, 59500, 10535, -3137, 43704, 90109, 127916, 120457, 101146, 22463, 98962, 23127, 16502, -282, -8653, -27713, 70477, 66541, 115756, 142359, 104788, 160458, 174684, 152030, 109576, 173017, 261598, 209777, 123581, 135242, 204955, 140768, 165787, 207719, 182463, 116620, 172610, 236584, 292524, 236602, 203477, 242651, 248431, 325488, 318778, 276857, 223807, 181314, 224071, 283194, 230794, 221376, 243616, 322343, 281013, 245551, 223119, 200219, 191844, 154503, 150975, 121589, 155870, 76152, 122603, 133101, 98777, 71410, 71031, 88485, 93450, 90867, 53868, 87692, 92848, 111365, 141326, 125245, 83581, 26997, 64049, 77931, 62794, 81568, 83413, 87843, 28779, 27784, 18137, 54139, 89112, 104240, 96644]
7669I6644m802k1804K6452L7716L7935J3346q6769m0921P0410K2703q624l525
7657A38761k5705J2647l4472o3499O3141m236n7412J2631N9883L6813k4477K0043
7645A34118J6638l0572k637m9081J2713J8939m0907P69J11268P240J812n7399
7633A22901k7138M707j3661K5944o2705P8849O9734r348l110m5013p936R58m134
7620A30048n7484L9707M9730j4415q901L4033l2874m867r52J0257K9263r7057
7608G6488m315R2503K7O6498M5655n0449m9405J7182K0560j8524K3429K5420K2188
7595B67257l528k5222J6497m2683K1310l1629O1818J7324o0106k6124O256l2006
7583A69164L535O3386k6947q970m1944J4398M3918N100m0555K0430j180k7165
$$ y = [96644, 91842, 70038, 96490, 134206, 172141, 185487, 98718, 57797, 128207, 150910, 142286, 138761, 113056, 125703, 91231, 27732, 90873, 86637, 29225, 41856, 101739, 138552, 114075, 134118, 150756, 120184, 117547, 68466, 81179, 100118, 59211, 59980, 171248, 178488, 180300, 122901, 95763, 100470, 86809, 112753, 50048, 128897, 198631, 189283, 186173, 141160, 133224, 134182, 130048, 72564, 112271, 162001, 147586, 138685, 172718, 139844, 134977, 134025, 144282, 173545, 76488, 72173, 164676, 164703, 231201, 276856, 226407, 177002, 194184, 214744, 196220, 219649, 245069, 267257, 263729, 238507, 255004, 212321, 233631, 202002, 263820, 281144, 221038, 194914, 201170, 169164, 172699, 236085, 209138, 200168, 158224, 172622, 216540, 221640, 181085, 201515, 200335, 173170]
7571A73170K6492L9150o6830p213N2008M2442k4704M9102o3859l2032O5573O6827
7559C20126m3734K6478n5961K9421K5979n6711o128l6805k3836Q0873j6236j0129
7547B33337N0570o7318q895j6789M2842j4610k2956P512N601K4542J2298m0204
7535B05930k4119K1381K7862R5370m490p369J3693k7829K9720J5517N9218L9973
7523D44857q5846M3639p9649O0751P1029p0720r770P0013L7667l3559Q8228M8550
7511E85190j1372o237L644N7385J9666j7016j7351n0887o5218j3255N6590o9536
7499D71603m2598K2201O1023j3802K4420Q3067M283M1155m1618L9530N6332K985
7487G08581N2657o6567R752Q0126R791J6555N1695P1417M9443k1672j7622J2075
$$ y = [173170, 199662, 238812, 171982, 164769, 216777, 259219, 234515, 283617, 219758, 187726, 253299, 320126, 276392, 302870, 246909, 276330, 302309, 245598, 239470, 202665, 178829, 259702, 243466, 233337, 283907, 216589, 207694, 190905, 233747, 219137, 196181, 203693, 209294, 233836, 246134, 205930, 181811, 203192, 231054, 326424, 321934, 314565, 328258, 300429, 330149, 345666, 404884, 444857, 359011, 402650, 323001, 383752, 454781, 384061, 374291, 444304, 481971, 448412, 536640, 585190, 573818, 567581, 571225, 628610, 648276, 631260, 613909, 563022, 497804, 484549, 541139, 471603, 429005, 451206, 512229, 498427, 522847, 605914, 610197, 651352, 609734, 649264, 705596, 708581, 761238, 694671, 704423, 784549, 794340, 810895, 862590, 934007, 983450, 961778, 944156, 956231]
7475I56231m3889o0972N5520J8601l81l1338L4438M128M8708J0756l4680j8998
7463I38124N4593J8366O1385k1076l5539O1586k2701N0652J22714J9692J13300
7452A361096R0286R698J12058L5903L426L7030J74738O7336O2328J35419O9738
7441B159056J09673J46132J54908J77313J86587J57677J69152K18286L09895L11544
7431D100223K92008K33344L13451L88560M67795N13930M97503O17906O82052P35806
7421H842578R20413J037005J147226J411106J565949J772122K065848K452498
7413B1214745K840338L185562L300984L323888L259970K972872K477228J556782
7405D4132369M75906n38995j413693k176877k784421l029319k964869k705192
$$ y = [956231, 912342, 851370, 906890, 925491, 925110, 893772, 928210, 932338, 981046, 991802, 957122, 938124, 992717, 1011083, 1072468, 1051392, 1015853, 1077439, 1054738, 1105390, 1228104, 1247796, 1361096, 1451382, 1461080, 1573138, 1609041, 1612467, 1649497, 1824235, 1891571, 1953899, 2089318, 2159056, 2268729, 2414861, 2569769, 2747082, 2933669, 3091346, 3260498, 3478784, 3788679, 4100223, 4392231, 4625575, 4939026, 5327586, 5795381, 6309311, 6806814, 7424720, 8106772, 8842578, 9762991, 10799996, 11947222, 13358328, 14924277, 16696399, 18762247, 21214745, 24055083, 27240645, 30541629, 33865517, 37125487, 40098359, 42575587, 44132369, 44608275, 44069280, 42655587, 40478710, 37694289, 34664970, 31700101, 28994909]
7397B8994909k504935k343137j976382j897786j734266j574587j459591j379068
7389A4125157j313058j072103r87333q67113p89906o58592n83022o19082n56876
7380F678072l96040l87650l34719k97229k72554k80041k82717k58505k50675k56968
7370C660974k47239j42604j24323j56417j74821j46632o8708j07149j09023r7802
7360B286256j94416n8057j1050j08096p6590q3797o0582j06347L6464p7751m5426
7349A500608o7116m8440k2882r725r5840n5942K2768p3761o0525o0886m7816k4827
7337I55616M1071o323r72n1769j0079r320J263j13285L5767K0297q2569j3255
7325G66442J6305j9311m1426J9240J9895o6669o1673N8055k5554p4454k3174M4850
$$ y = [28994909, 26489974, 24146837, 22170455, 20272669, 18538403, 16963816, 15504225, 14125157, 12812099, 11739996, 10752663, 9885550, 9095644, 8437052, 7854030, 7234948, 6678072, 6282032, 5894382, 5559663, 5262434, 4989880, 4709839, 4427122, 4168617, 3917942, 3660974, 3413735, 3271131, 3146808, 2990391, 2815570, 2668938, 2600230, 2493081, 2384058, 2286256, 2091840, 2033783, 2022733, 1914637, 1838047, 1754250, 1693668, 1587321, 1623785, 1546034, 1500608, 1433492, 1385052, 1362170, 1352445, 1256605, 1200663, 1223431, 1149670, 1089145, 1028259, 980443, 955616, 996687, 990364, 989392, 937623, 927544, 918224, 919487, 806202, 841969, 862266, 779697, 766442, 782747, 763436, 722010, 741250, 761145, 694476, 632803, 690858, 665304, 590850, 567676, 612526]
7313F12526K242o6302M9663M0052m8636r245J4098m7789n0012K2950J4595o8380
7301D65762l3282J8036J2737m1762l091n5160M4886J8581j9649k8822r707m729
7289C63800K608j1336p0866j1981J0066L7302L727j331o2777j6020K3536M0879
7277C07607l3497j9276O261J6839M7474j8801k9238j5885n6214M6322l2378K1939
7265B41153L3139n9412q2837k2260N2430J2316p781k9305O6632K5488l4210Q059
7253B03412o5729j2239N8383M1019m7403m6263n0269P350O5651l7958M483p397
7241A13040m403O7101m7663n0915P9748L0605m5180J5306O109K008m4139j8242
7229A03375Q1255K693k3537p794r3308q849N6039j1539l7909q95M4205j9874R387
$$ y = [612526, 614768, 548466, 598129, 638181, 589545, 580300, 594398, 546609, 496597, 519547, 534142, 465762, 432480, 450516, 463253, 421491, 418400, 363240, 408126, 426707, 407058, 378236, 368529, 363800, 366408, 355072, 284206, 272225, 282291, 319593, 323320, 321989, 259212, 243192, 266728, 307607, 274110, 254834, 261095, 277934, 325408, 306607, 277369, 261484, 205270, 251592, 219214, 241153, 274292, 214880, 132043, 109783, 162213, 174529, 166748, 137443, 204075, 229563, 195353, 203412, 137683, 125444, 183827, 224846, 177443, 131180, 80911, 88261, 153912, 115954, 120437, 113040, 108637, 175738, 128075, 77160, 156908, 187513, 142333, 157639, 163748, 165756, 121617, 103375, 184630, 187323, 163786, 155992, 62684, 53835, 109874, 98335, 60426, 59531, 103736, 83862, 93249]
7216I3249k1383K6496j5134m0069L6122N3997k1780j3261l4633m0639J02428K8903
7204A54296J4802J9234k5369m9303k5789l4940K0178K394M8614N8188m8095N2740
7192A86950m5919k8865k0763N2052j8497J9721j4690k5958K3308L7063J1475j9850
7180A56027j4988Q1986k7560j7162J6100l058k3554K1476P968J4102l5912p5596
7168I9829L7847l3680J7624l019J4561N9673N098q1441L0788k3352p1250J4138
7156F6816O0094k3599j5353O291k1448M1618o034L458m6045J454k9184j5869N4284
7143G6483L1445L2826L147P716m5859j9209O83J6402n0540M6103M5832P353j0230
7130A42152o864n8042K522j2609J15035l178l4509n030K6300o7412K2170K3306
$$ y = [93249, 71866, 98362, 83228, 43159, 79281, 133278, 111498, 98237, 63604, 22965, 125393, 154296, 169098, 188332, 162963, 113660, 87871, 52931, 73109, 75503, 124117, 182305, 134210, 186950, 141031, 112166, 91403, 143455, 124958, 144679, 129989, 104031, 127339, 164402, 175877, 156027, 141039, 223025, 195465, 178303, 194403, 191345, 167791, 189267, 197235, 211337, 175425, 99829, 137676, 103996, 121620, 118601, 133162, 192835, 197933, 116492, 147280, 123928, 52678, 66816, 126910, 103311, 87958, 94249, 72801, 114419, 108385, 111843, 65798, 67252, 38068, 22199, 76483, 107928, 140754, 143901, 151617, 105758, 86549, 87232, 103634, 53094, 99197, 145029, 152382, 142152, 135288, 77246, 79768, 67159, 182194, 179016, 144507, 139477, 165777, 98365, 120535, 143841]
7118A43841Q875p032j6690k0610k7036J6055J8701M4235k3918N1409k4964l6082
7106A26784J7187J2092J8481R010K1967N1730j9919k2706j5669Q4825m1733K4127
7094B66176J6809K5590N4313j5626L5055K4553l1089J6770M4638l8027p0702o4541
7082B63919J0541J8147j8359j847m9336o110j8650p377K093O0268n397p2219m512
7069A71161K8533J3257L1005K7643N016j0012n8563k3054o7112R199p96q112K7429
7056A45594k3336L5882K0372N688m4458j5532j4520J7830n938N1962k7373J358
7044A47529N041k3507O2192K043n3539j2287k24J5736O074J7162j3622l1250k5847
7031I5501J0501N2859k7129o9790K0632L6187l8938M7570m5301J6887L1993o115
$$ y = [143841, 152716, 145684, 128994, 108384, 81348, 97403, 116104, 160339, 136421, 187830, 162866, 126784, 143971, 156063, 174544, 183554, 205521, 257251, 237332, 214626, 198957, 283782, 242049, 266176, 282985, 308575, 362888, 347262, 382317, 406870, 375781, 392551, 437189, 399162, 328460, 263919, 274460, 292607, 274248, 272401, 223065, 216955, 198305, 190928, 193021, 253289, 247892, 175673, 171161, 199694, 212951, 243956, 271599, 276615, 266603, 208040, 184986, 117874, 127073, 126277, 118165, 145594, 122258, 158140, 178512, 184200, 139742, 124210, 109690, 127520, 121582, 173544, 146171, 147529, 152570, 129063, 191255, 193298, 139759, 127472, 127248, 142984, 149058, 166220, 152598, 121348, 95501, 106002, 158861, 131732, 61942, 82574, 118761, 79823, 127393, 82092, 98979, 130972, 124857]
7019A24857o4688k348N0334K7906j01633J1921J4105l9551N0797K2284K0190K7681
7007A41855j7225j220R333J9924l9867j9656Q287N7958p2314P910N0102k3853
6995A21234J4962M163N2110k7787L3628P086l178o3033m9558O2240j4193J1031
6983A48705q60m2149M5404o686k0263K7542l8550K8503L0174m0516n804K8205
6971A53705k04K6279m4249p4222L5897M5023k7191L2702K5057J2006K2560j26384
6959H0979j7405N3609L7012k6461o4059M3663R1191k5182P296K216o304l0900
6947A45655O371P471P566J7414O095n7746j1470m4504K1355j9234J3063L3199
6935A25235Q5581K8861l1951k4793l936O051j2542M6398j0511n1200L3372N1140
$$ y = [124857, 60169, 57821, 108155, 136061, 34428, 46349, 60454, 20903, 71700, 93984, 114174, 141855, 124630, 123410, 132743, 152667, 112800, 93144, 101431, 159389, 87075, 94985, 145087, 121234, 136196, 140359, 192469, 164682, 198310, 205396, 202218, 139185, 89627, 151867, 137674, 148705, 147845, 105696, 151100, 144414, 124151, 151693, 113143, 141646, 171820, 131304, 125500, 153705, 153501, 179780, 135531, 61309, 97206, 142229, 115038, 147740, 172797, 184803, 207363, 80979, 63574, 117183, 154195, 127734, 63675, 107338, 198529, 173347, 180643, 182859, 176555, 145655, 152026, 159497, 167063, 184477, 190572, 132826, 121356, 76852, 98207, 78973, 92036, 125235, 210816, 239677, 207726, 182933, 178997, 185048, 172506, 218904, 208393, 157193, 190565, 241705]
6923B41705k8r7533N6288M6627m5395L0188J0454Q4047K5054m3973J6026j9195
6911C04265r112j881k6007Q5232l3719o414O689M6280N7794j0721J0539M9189
6899D72134N2262J0268M944N1138N9571J28961Q1449J85299R8126R4435N2250
6888A290837P6083J22257J32114M5492P499j5977n6001R370M9183Q1088M2019
6877A783964K0047R48k3409j3155k1899j59046j69920j12794j79574j05399j8759
6866A001004n9371q8814p1167n3867n6341l3131m5571j8966l0563k9648J012k1598
6854D92979k795p6470l1680N1689r3537N7638K9003m2476N4853m4140m9935J9547
6842C64676M9962o7721k7021K063M4852n1415J0497N6235L0039l5670j01539M0799
$$ y = [241705, 241677, 144144, 200432, 247059, 201664, 231852, 242306, 326353, 351407, 307434, 323460, 304265, 295153, 293272, 267265, 352497, 318778, 312364, 319053, 365333, 423127, 412406, 422945, 472134, 524396, 534664, 539608, 590746, 650317, 779278, 860727, 1046026, 1144152, 1238587, 1290837, 1366920, 1489177, 1621291, 1666783, 1674282, 1658305, 1602304, 1611674, 1660857, 1741945, 1783964, 1804011, 1804959, 1781550, 1768395, 1746496, 1587450, 1417530, 1304736, 1125162, 1019763, 1001004, 941633, 852819, 781652, 727785, 671444, 638313, 592742, 573776, 543213, 513565, 514577, 492979, 490184, 413714, 382034, 433723, 340186, 397824, 426827, 384351, 439204, 395064, 345129, 364676, 414638, 346917, 319896, 321959, 366811, 315396, 325893, 382128, 412167, 376497, 274958, 315757]
6830C15757L9189k5496p1826K9801m5147o7145J0091N0208N422n4733J8956p233
6818A97844K2320L359k6721n466K2476P351k1043J0112m1809P519l5449K9787
6806A70280L0414R691p1446k6066m967K5638K961M2373N2070k2871k7887O4771
6794B44961L6554r235k2870r516n2947m6178j1052K2884m9152M6232L1103J0407
6782A91191J7031P452o353l4357O7674k0429J2269k0563J4417n8787J3971K0965
6770B04481p892K578O520N5949J746k1264J9510J0272Q664l6171m3574j5267N1316
6757B36868l0729l8695l7550Q0056k21r6317o656M9934P7500n552n9833o0746
6745A08059N6497j9754p0232L9881M468k5605l0197N2508J8474K7801J4291j3847
$$ y = [315757, 354946, 329450, 257624, 287425, 242278, 175133, 185224, 235432, 240854, 186121, 205077, 197844, 220164, 223523, 196802, 191336, 213812, 221163, 200120, 210232, 168423, 175942, 140493, 170280, 200694, 210385, 138939, 112873, 107906, 133544, 136505, 178878, 230948, 208077, 180190, 244961, 281515, 272280, 249410, 239894, 186947, 140769, 129717, 152601, 103449, 149681, 180784, 191191, 208222, 215674, 209321, 174964, 242638, 222209, 234478, 213915, 228332, 169545, 183516, 204481, 196589, 199167, 205687, 261636, 263382, 242118, 261628, 271900, 280564, 244393, 200819, 185552, 236868, 206139, 167444, 129894, 209950, 209729, 113412, 106756, 156690, 234190, 228638, 168805, 108059, 164556, 144802, 74570, 114451, 118919, 93314, 63117, 115625, 134099, 161900, 176191, 162344]
6733A62344j0015N1188l3730m7337K5109j377P9701J8565l5024o0676N6110K4842
6721B29700j9168m5141k166J375J0840J0999J7545k9067m2312J8095P0353n3693
6709A67360l927N0557J8158l9352n3769k3615k4676L9609L1926q628K0337j9735
6697A54245K351J7278l1254K3370L4978j4082j9595M6713k072k9927o8938l0957
6685H2110L8160L4204J9260J3872r513K4287l4217l3236J0616p930K8479P805
6673A73897R266L8478j1971j4626J4624j4922p4086L5552R818j9145K3605j1660
6661A58830K1410k5170L7898P3898q1994R305j8270j2463N9182K1922j7045j212
6649B26291k4843j3317J9620l9825j8714K5897K0217q422q745L2906K6184j446
$$ y = [162344, 152329, 203517, 169787, 122450, 147559, 146182, 225883, 244448, 209424, 148748, 204858, 229700, 210532, 165391, 163225, 164600, 175440, 186439, 203984, 174917, 132605, 150700, 221053, 167360, 163433, 213990, 232148, 192796, 139027, 115412, 90736, 130345, 162271, 153643, 173980, 154245, 156596, 173874, 142620, 165990, 200968, 186886, 167291, 214004, 211932, 182005, 113067, 82110, 120270, 154474, 173734, 187606, 178093, 202380, 168163, 134927, 145543, 137613, 166092, 173897, 183163, 221641, 209670, 195044, 209668, 194746, 120660, 156212, 166030, 146885, 170490, 158830, 180240, 155070, 192968, 266866, 184872, 194177, 175907, 163444, 222626, 244548, 227503, 226291, 201448, 188131, 207751, 167926, 149212, 175109, 195326, 186904, 178159, 211065, 237249, 235803]
6637B35803L0006K4245Q663k9917k6586N0573n6602o9072J7040K409M0127q456
6625B18233K1532m7333K0914K9937j0948l0516L5337L1736K5126j8693m527N4820
6613C25618j2823k0836M248k2103K53l6087p110R536L095M4954k3584L4350L0215
6600C29726j3785n8286N7665o3452L7684K0592r333K7567L1400o366j7642m5046
6588B90724L0130O614r339J6964J1025J0066l8404R542l0573P452Q3121K8632
6576D15954o8789J6576o1760O7211j7341k1005O5149j6603o4596m602P467P2277
6564C89938o204k9000q894n6887L3883k6744J1046L2543j406J4905J7438k3194
6552C47424L8908l2343M9696j7818r3706L2784j0453o1368L2778R4155K4642j8055
$$ y = [235803, 265809, 290054, 298717, 268800, 242214, 292787, 236185, 167113, 184153, 186562, 226689, 218233, 239765, 192432, 213346, 243283, 232335, 201819, 237156, 268892, 294018, 275325, 270798, 325618, 312795, 291959, 296207, 274104, 274357, 238270, 231160, 240696, 243791, 288745, 265161, 299511, 329726, 315941, 257655, 315320, 251868, 289552, 310144, 300811, 328378, 359778, 353412, 335770, 290724, 320854, 327468, 318129, 335093, 346118, 356184, 317780, 327322, 296749, 304201, 387322, 415954, 347165, 363741, 301981, 369192, 351851, 330846, 395995, 379392, 314796, 310194, 317661, 389938, 383734, 354734, 345840, 288953, 322836, 296092, 307138, 339681, 338275, 353180, 370618, 347424, 386332, 353989, 403685, 385867, 292161, 324945, 314492, 253124, 285902, 380057, 404699, 386644]
6540C86644q9394J7729M5578l1187J2421r08k8216o3521J07978M3713k6941L3344
6528D07240k8696m8654k9857Q1314L1974J5996K0708o4641J705P191K5180L1772
6516D51232q286M2246m1355K6839j5999M550j6990P639n671J9658K8537J0567
6504E02967K753k5249l6228M1573l6405L9546j6584m0048R086l7646J0591k0742
6492C93614O3770L6872q0231m8077k1116K4546K5816j7187j9679l0865M365j7871
6480C13957k5696K9410K5806r699J9684l6124Q984j9677J3188m260j9598J07862
6468D03837M3657j04756J12459l1810r2192m2799L703M6228K6976N6415n0642
6457C71076o422j0439l1384j4453M7342L293K9364o95r3594P9328P0398k5055
$$ y = [386644, 297250, 314979, 360557, 329370, 341791, 340883, 312667, 249146, 357124, 400837, 373896, 407240, 378544, 329890, 300033, 381347, 413321, 429317, 450025, 385384, 387089, 394280, 419460, 451232, 442946, 485192, 443837, 470676, 454677, 459227, 442237, 449876, 444205, 463863, 492400, 502967, 505720, 480471, 444243, 485816, 449411, 488957, 472373, 432325, 441411, 403765, 414356, 393614, 457384, 494256, 414025, 365948, 344832, 369378, 395194, 378007, 358328, 327463, 331828, 313957, 288261, 317671, 343477, 333778, 353462, 317338, 326322, 306645, 319833, 315573, 295975, 403837, 447494, 342738, 455197, 423387, 331195, 288396, 292099, 338327, 365303, 421718, 371076, 364654, 354215, 322831, 308378, 355720, 359013, 388377, 387682, 294088, 373416, 443814, 418759]
6445D18759m0370J0907J6620k3366l0447K9599K0031j2611J6059J95N6088l5840
6433D25624J6627J00917l783p7545k499n0475J1347J3663n243K6172o734k3029
6421D25042J7534M7325J7967j165k4621M9094l2242J3649M0364J4066K9302K4022
6409F20337q410k7251o3205P7757m3582J0258R873M400R985k3221m1255l4579
6397D91107N6487J5634j7764m140M274o5088K6012L5493m2525K083j4844L9509
6385E26238l0103J8922k979R067M2342l7256L3108j4602K3628k0474K3782J8519
6373E90192n2369l5412J9977P1257m851l6896L5552L8901l2047K0260L4487N557
6361F54608k4386k487J7657j575K0928L5621n0509o5345J22207K2335m314J046
$$ y = [418759, 378389, 389296, 405916, 382550, 352103, 381702, 401733, 389122, 405181, 405376, 461464, 425624, 442251, 543168, 539385, 461840, 459341, 408866, 420213, 433876, 428633, 454805, 448071, 425042, 442576, 489901, 507868, 506703, 482082, 531176, 498934, 512583, 552947, 567013, 596315, 620337, 611927, 584676, 521471, 599228, 555646, 565904, 575777, 580177, 590162, 566941, 525686, 491107, 547594, 563228, 545464, 541324, 545598, 480510, 506522, 542015, 499490, 501573, 486729, 526238, 496135, 515057, 512078, 521145, 563487, 526231, 559339, 544737, 568365, 547891, 571673, 590192, 537823, 502411, 522388, 593645, 588794, 551898, 587450, 626351, 594304, 614564, 649051, 654608, 630222, 627735, 645392, 643817, 664745, 700366, 649857, 584512, 706719, 729054, 724740, 725786]
6349G25786k3701j7865P3651K2693K2491l0972M353J9030k430k1200N2675L8122
6337H62633J2098l3330N2447O6362K4378K0506m0670l7610M1709L6660P3760L0089
6325A109032Q103K394J7747Q3203L557N6123J8986j3521J14243R2216j5639L8555
6313A514999N8414L446j5970M9580J44114Q9812O4815J12001Q2128J13895R4062
6302B311296Q4534Q1307J94448J62298J93872J24076J61008K82079M04927L29824
6292D329669L49485M96652N04948N68063O94886P83160Q14428Q94688R63575R70343
6282A1369897Q72965P51347P23537M66557K11751n9097l38592l06037k89241j93167
6272A3209920j42726N0516J31385K50708M70308N68076P91283R80537J121312
$$ y = [725786, 702085, 684220, 757871, 780564, 803055, 772083, 776436, 795466, 793036, 771836, 824511, 862633, 874731, 841401, 893848, 960210, 984588, 1005094, 964424, 926814, 968523, 1005183, 1078943, 1109032, 1117135, 1119529, 1137276, 1220479, 1224036, 1280159, 1299145, 1285624, 1399867, 1492083, 1476444, 1514999, 1573413, 1576859, 1560889, 1610469, 1754583, 1844395, 1909210, 2021211, 2103339, 2217234, 2311296, 2395830, 2477137, 2671585, 2833883, 3027755, 3151831, 3312839, 3594918, 3999845, 4329669, 4679154, 5175806, 5680754, 6248817, 6943703, 7726863, 8541291, 9435979, 10399554, 11369897, 12242862, 12994209, 13717746, 14184303, 14396054, 14336957, 13998365, 13692328, 13403087, 13209920, 13067194, 13117710, 13249095, 13499803, 13970111, 14538187, 15329470, 16310007, 17431319]
6263A7431319J205337J230315J254013J202011J094014P85377M63442J9854l72415
6254B4313267n73156p70518q73091r94888j086178j015152p66911o50895n87030
6245A6995448m55809k98399o3977L886K17508L23993L35871L81625L08825K58940
6235A8007911K47853L7231k68021n64372r60486j062053j013969r11732r20038
6226A2592324q86209q21258p02653n70972n51401n86757n47125m36228m74734
6217G014987n18342m38479l95085l10797k38162l36865k34924j86579k45024k17157
6207C893573j16038k32641k12830j27664j80684r7323q9157p9920j46814o9555
6197B540947j37913l6808l7107q8113p6264o8169n7579p7665m8381n1670o1422
$$ y = [17431319, 18636656, 19866971, 21120984, 22322995, 23417009, 24202386, 24665828, 24685682, 24313267, 23740111, 22969593, 22096502, 21101614, 20015436, 19000284, 18233373, 17582478, 16995448, 16539639, 16241240, 16177263, 16181149, 16398657, 16722650, 17058521, 17440146, 17748971, 18007911, 18255764, 18292995, 18024974, 17460602, 16500116, 15438063, 14424094, 13512362, 12592324, 11706115, 10884857, 10182204, 9611232, 9059831, 8473074, 7925949, 7489721, 7014987, 6496645, 6058166, 5663081, 5352284, 5114122, 4777257, 4542333, 4355754, 4110730, 3893573, 3777535, 3544894, 3332064, 3204400, 3023716, 2926393, 2837236, 2757316, 2610502, 2540947, 2403034, 2366226, 2329119, 2241006, 2164742, 2096573, 2038994, 1961329, 1912948, 1861278, 1799856]
6186A799856m419q5831k1178j9744p9576p1840M4179m2481m0603M302N7358q3458
6174A456565o1178N230m0846K0080j6408n4570l7670J991m7073m1921j6122r308
6162A158770l5425l8073j3443K9642m9798J5597m8907l932N7456J0133j7230L5955
6150A100745k3589r4653m2063n737J5286Q8746m9153o8471j06764J8752N5758
6139H88857j9636m9037J8666L7344j030m0492j0987l0647K3013J2622l3908k2942
6127G71823J3446m0699J3316J4610j0363m8222m339L7060l7114O0765k9826l447
6115G37010P3080p1884m3362n4155k4773R7970M6157k9891N773l0402J8508M905
6103G28936p3071j4995M2589j5464k0651M4685O0733l1890l1442p9030L57K2682
$$ y = [1799856, 1795437, 1709606, 1688428, 1668684, 1589108, 1517268, 1561447, 1518966, 1478363, 1482665, 1540023, 1456565, 1395387, 1400617, 1359771, 1379851, 1363443, 1308873, 1271203, 1273194, 1226121, 1184200, 1168078, 1158770, 1123345, 1085272, 1071829, 1101471, 1051673, 1067270, 1018363, 1014431, 1071887, 1082020, 1064790, 1100745, 1077156, 982503, 940440, 934703, 949989, 1038735, 989582, 921111, 814347, 833099, 888857, 869221, 820184, 838850, 876194, 875164, 834672, 823685, 793038, 816051, 828673, 794765, 771823, 785269, 744570, 757886, 772496, 762133, 713911, 709572, 746632, 709518, 770283, 740457, 737010, 810090, 738206, 694844, 640689, 615916, 713886, 760043, 730152, 735925, 705523, 724031, 728936, 655865, 640870, 683459, 667995, 647344, 692029, 752762, 720872, 689430, 610400, 610757, 633439]
6091F33439j5025O8886P0829k4773k627K3059l6034o2785J5787L5767n2979K6442
6079F79986j1639P0389m7977j3773K5575P0988p463j4605j2814O0812M0626n1391
6067G88714m5428m3508j3618L5286L0069K8079j9108J652q200M844l2681o656
6055G19445l1280O1711j5418j1328J15264L2522n2566j8791J3056l4181N2987
6044H31421l2902k0610o463J0319L2189N389Q5319L814N56N524m7722M114Q0496
6031I51444K0775l5515k5150k47n342M3437N6108k2013r3l2791M9663l6824K172
6018I65624J6614M8939L6477M6003q820j691J1511k4975J4427j2912M5804P0273
6006A207274L2447j4258L2430K6029k9230k9487J09093M8300o4196L7566R0001
$$ y = [633439, 618414, 687300, 758129, 733356, 730729, 753788, 717754, 654969, 670756, 706523, 653544, 679986, 668347, 738736, 690759, 676986, 702561, 773549, 766086, 751481, 738667, 799479, 840105, 788714, 743286, 699778, 686160, 721446, 751515, 779594, 760486, 762138, 753938, 758782, 726101, 719445, 688165, 749876, 734458, 723130, 838394, 870916, 818350, 799559, 812615, 778434, 831421, 798519, 777909, 771446, 781765, 813954, 819343, 904662, 908476, 909032, 914556, 866834, 870948, 951444, 972219, 936704, 911554, 911307, 905965, 949402, 1005510, 983497, 983404, 950613, 1000276, 963452, 965624, 982238, 1031177, 1067654, 1113657, 1104837, 1103146, 1114657, 1089682, 1104109, 1091197, 1137001, 1207274, 1239721, 1225463, 1257893, 1283922, 1254692, 1225205, 1334298, 1382598, 1318402, 1355968, 1445969]
5995A445969K8679Q3935L8258L2805N3847N7744J02023J36863J30200L9519J43408
5984B293250J64610L1606Q0431N1401K1269l4396k9360n8828j1760o1807l6128
5973B410288J7444J44851J89m7880J10059Q3664J34908L5306J67852J09156K00585
5962C366422J35759J65484O3976L2279J7718k4436m1791q9505j41503j99295j34141
5951C150967n5686p925l5657q2416l3765M002J6745K4169q484J41996N9479M8796
5939C222221M456R3681O1785k9135l8844r0675r8906q9609j45371j61198p7350
5928B651055n4673l1230j14116m0546q9904j6049m30r7887j2243M4731k2100j00487
5916B116121M0337m6289k4626M113n7643P2098J2403O442M905n6430L2248K3420
$$ y = [1445969, 1474648, 1558583, 1596841, 1629646, 1683493, 1741237, 1843260, 1980123, 2110323, 2149842, 2293250, 2457860, 2489466, 2569897, 2621298, 2642567, 2608171, 2578811, 2519983, 2508223, 2446416, 2410288, 2427732, 2572583, 2572772, 2524892, 2634951, 2718615, 2853523, 2888829, 3056681, 3165837, 3366422, 3502181, 3667665, 3731641, 3763920, 3781638, 3757202, 3715411, 3625906, 3484403, 3285108, 3150967, 3095281, 3087356, 3051699, 2969283, 2935518, 2939520, 2956265, 2980434, 2971950, 3113946, 3173425, 3222221, 3226677, 3320358, 3382143, 3353008, 3314164, 3223489, 3124583, 3034974, 2889603, 2728405, 2651055, 2596382, 2565152, 2451036, 2410490, 2320586, 2304537, 2304107, 2206220, 2193977, 2238708, 2216608, 2116121, 2156458, 2110169, 2085543, 2089656, 2032013, 2104111, 2116514, 2122956, 2127861, 2071431, 2103679, 2127099]
5904B127099k3777q8958m142J1507J9642M5188p3411k4735k7300O8482j1356K3410
5892B041649J8473K0019m8231M7176L4723J9382M5056K4511j9686L1042k4231
5881B189883R925j7506j0035M2310m2993J7683n8551M5281O7241n7795K6309N0572
5869B262324L6185o922n0913O1341J3862P8014P9681l6137k0734R2692O9075Q034
5857B586502J568K2270O661P8182K1981k3470K0878J5676N7560O7634J6170M5697
5845B917309J6759J14332Q158j5769k716N6106L6220p8682Q0710L2137j6102J09257
5833C257719M9075L4093K4924J9719k894O1043Q5407l5138P4436O8670O3835K5335
5821C726224j7537P2502L3931O6569K2803N3143L2232K4628j94N8393J22795P3820
$$ y = [2127099, 2103322, 2014364, 2010222, 2021729, 2041371, 2086559, 2013148, 1988413, 1961113, 2029595, 2018239, 2041649, 2060122, 2080141, 2031910, 2079086, 2113809, 2133191, 2178247, 2202758, 2183072, 2214114, 2189883, 2199808, 2182302, 2172267, 2214577, 2171584, 2189267, 2130716, 2175997, 2243238, 2185443, 2211752, 2262324, 2298509, 2291587, 2240674, 2302015, 2315877, 2393891, 2473572, 2437435, 2416701, 2509393, 2578468, 2586502, 2588070, 2610340, 2617001, 2695183, 2717164, 2693694, 2714572, 2730248, 2787808, 2855442, 2871612, 2917309, 2934068, 3048400, 3056558, 3040789, 3038073, 3094179, 3130399, 3051717, 3132427, 3164564, 3148462, 3257719, 3306794, 3340887, 3365811, 3385530, 3382636, 3443679, 3529086, 3493948, 3568384, 3637054, 3700889, 3726224, 3708687, 3781189, 3815120, 3881689, 3904492, 3957635, 3989867, 4014495, 4014301, 4072694, 4195489, 4269309]
5809D269309P50m4509l484O120m5669L739M604P640O5645M8381Q1488L5810J6331
5796D446155O9307M063O5171M7046Q5094M3679N6953N4748L1056l8891n8435J6944
5784D822890r286N516K9089k717m613p205L7232N9279l8732P0252J10046J00845
5772E172596P3472M933O9881R6804Q157R7239J56626k8472k2428R7868J05529
5761E832205J14072L5721O9298J02481M2905R3078J07222J81150K04050J55991
5751F938173J80638J90585K38317J91837R1156R3208K19906J06299J94125J29671
5741H573915J33881J51642K07264J11053J44868J88276J72849J31600K36879K59512
5731A0311739K42906J84156K90425L21256L46506L84806L50484L09745L91964
$$ y = [4269309, 4270059, 4225550, 4222066, 4228186, 4182517, 4186256, 4190860, 4198500, 4264145, 4312526, 4394014, 4429824, 4446155, 4515462, 4519525, 4584696, 4631742, 4716836, 4760515, 4817468, 4872216, 4903272, 4864381, 4805946, 4822890, 4813604, 4819120, 4848209, 4845492, 4840879, 4833674, 4870906, 4930185, 4891453, 4961705, 5071751, 5172596, 5246068, 5251001, 5320882, 5417686, 5425843, 5523082, 5679708, 5651236, 5628808, 5726676, 5832205, 5946277, 5981998, 6051296, 6153777, 6196682, 6289760, 6396982, 6578132, 6782182, 6938173, 7118811, 7309396, 7547713, 7739550, 7830706, 7923914, 8143820, 8250119, 8444244, 8573915, 8707796, 8859438, 9066702, 9177755, 9322623, 9510899, 9683748, 9815348, 10052227, 10311739, 10554645, 10738801, 11029226, 11350482, 11696988, 12081794, 12432278, 12742023, 13133987]
5722A3133987L90989M36893M07878L09566L21075L95179M40673K76224L14621
5713A6427085K90303K73916L01725K77171L10997L53347M32156M87016N74398
5704A9728114O71977O03313O64381P66826Q61544Q42566R79030J049387J035696
5695B7202834J127932J158374J317449J429426J536738J656176J775351J986726
5687C9191006K200210K390951K469271K665288K772413K863245L076501L235792
5679F0864677L266714L347769L506839M122689M795517N735324O699720P892050
5671A00231299R478470J1471134J3859203J6261960J8022647J8833385J8433571
5664B06591669J7242741J5485079J3056993Q259799J877806l476122p166817p718596
$$ y = [13133987, 13524976, 13961869, 14369747, 14679313, 15000388, 15395567, 15836240, 16112464, 16427085, 16717388, 16991304, 17293029, 17570200, 17881197, 18234544, 18666700, 19153716, 19728114, 20400091, 21003404, 21667785, 22434611, 23296155, 24138721, 25117751, 26167138, 27202834, 28330766, 29489140, 30806589, 32236015, 33772753, 35428929, 37204280, 39191006, 41391216, 43782167, 46251438, 48916726, 51689139, 54552384, 57628885, 60864677, 64131391, 67479160, 70985999, 75108688, 79904205, 85639529, 92339249, 100231299, 109709769, 121180903, 135040106, 151302066, 169324713, 188158098, 206591669, 223834410, 239319489, 252376482, 260636281, 262514087, 259037965, 251871148, 244152552]
5656B44152552o271598m623594l174014j551947J57956K718487N952700R589996
5648B46950538J3704123J8464603K2568917K4965141K5712640K4925214K3539355
5641D00830531K1256090J5815066M045726p539278j4176255j6442351j6646496
5634C87143033j6864452j9333535k1388426j8818034j4832315j1931592r344353
5627B74630326n826829k564691J063652N203673R702565J3392184J4709493J3262863
5619C23573236J0596770Q194669N710199M95774r390128k0025949k5589367k5222206
5611B68342998k3183558k1724303j9703470j7112301j4885346j3331850j2030436
5604A46371734j1054610j0333656r712631r035871q123372p057821o135647n521363
$$ y = [244152552, 237880954, 233257360, 230083346, 228531399, 228689355, 231407842, 237360542, 246950538, 260654661, 279119264, 301688181, 326653322, 352365962, 377291176, 400830531, 422086621, 437901687, 441947413, 434408135, 420231880, 403789529, 387143033, 370278581, 350945046, 329556620, 310738586, 295906271, 283974679, 274630326, 268803497, 266238806, 267302458, 272506131, 282208696, 295600880, 310310373, 323573236, 334170006, 342364675, 348074874, 348570648, 339180520, 319154571, 293565204, 268342998, 245159440, 223435137, 203731667, 186619366, 171734020, 158402170, 146371734, 135317124, 124983468, 115270837, 106234966, 98111594, 91053773, 84918126, 79396763]
5596G9396763n032764m561140m135221l681480l230254k942595k601395k361499
5588E0850415k163938k046816j868312j682101j686220j611621j582748j504442
5580C6704217j360255j303615j175484j042872j006792r77561r25696q93538q11726
5571B7206678p88514p66331o79061o64347n53302n63686n02775m56160m51605
5562B1780897m23219m19209m70041m40845l80904l30557m03678l40121k62121
5553A8310202l71674l34018k96274k46779l47701j78922k18909k94630j78820
5544A5842475j34764r3721j41713j98924p0247l7167l4351K7901m2164M97o4308
5533A5053514j16103j37824j69609l26504k90798l00760l16732j73169k47608
$$ y = [79396763, 74363999, 69802859, 65667638, 61986158, 58755904, 55813309, 53211914, 50850415, 48686477, 46639661, 44771349, 43089248, 41403028, 39791407, 38208659, 36704217, 35343962, 34040347, 32864863, 31821991, 30815199, 29837638, 28911942, 28018404, 27206678, 26418164, 25651833, 24972772, 24308425, 23755123, 23191437, 22688662, 22232502, 21780897, 21357678, 20938469, 20468428, 20027583, 19646679, 19316122, 18912444, 18572323, 18310202, 17938528, 17604510, 17308236, 17061457, 16713756, 16534834, 16315925, 16021295, 15842475, 15707711, 15613990, 15472277, 15273353, 15203106, 15165939, 15131588, 15159489, 15117325, 15117822, 15053514, 14937411, 14799587, 14629978, 14303474, 14012676, 13711916, 13395184, 13222015, 12974407]
5524A2974407j86947j97463j70605j33729j04077j10481j10171j12801j39988
5515A1708145p0610r1164o9300m5718K7891L3915O6307R6952O8063L7114J03403
5504A1864998J07963J35518Q012K0226k5819l3212m085p8623r6275o0036o0429
5493A1778238j6074J2305o1090N9899l7773L4202L1472O4162O3550O1352J28752
5482A2118995J51055J07428J60713J14864J28933K26109J53512K27638K40233
5473A3629480K36964L05350L48269K80312L43124L01221L61894L91428M16159
5464A6614201M47708L83795M66346N74818N66663O35415O43897P29666P67766
5455B1830275Q42549Q55402R18927J052500J171187J229610J313658J426937J546272
$$ y = [12974407, 12787460, 12589997, 12419392, 12285663, 12181586, 12071105, 11960934, 11848133, 11708145, 11637535, 11546371, 11477071, 11431353, 11459244, 11493159, 11559466, 11656418, 11724481, 11761595, 11864998, 11972961, 12108479, 12116491, 12136717, 12110898, 12077686, 12073601, 11994978, 11898703, 11838667, 11778238, 11762164, 11774469, 11713379, 11773278, 11735505, 11769707, 11801179, 11865341, 11928891, 11990243, 12118995, 12270050, 12377478, 12538191, 12653055, 12781988, 13008097, 13161609, 13389247, 13629480, 13866444, 14171794, 14520063, 14800375, 15143499, 15444720, 15806614, 16198042, 16614201, 17061909, 17445704, 17912050, 18486868, 19053531, 19688946, 20332843, 21062509, 21830275, 22672824, 23528226, 24447153, 25499653, 26670840, 27900450, 29214108, 30641045, 32187317]
5446C2187317J730873J826038K018259K178362K323999K492187K747376K949687
5438E0454098L358809L653520M047096M590395N097532N619357O348883P138365
5430I0308055Q079047R196273J0296184J1673239J3172302J4711612J6331287
5423A73767999J7574613J8389352J8513475J7744782J6102278J3687469J0365969
5416B86145937O367867K181452j521053m125175n427680n751608n144376l757257
5408B68968107j895956J60341K463248M757921P115661R304578J1315366J3158490
5400C15347756J4452396J5052835J4728987J3193134J0583981P580825M100602
5393C95040516m5876m631889r226652j3042313j5317893j6119022j5704831j4688155
$$ y = [32187317, 33918190, 35744228, 37762487, 39940849, 42264848, 44757035, 47504411, 50454098, 53812907, 57466427, 61513523, 66103918, 71201450, 76820807, 83169690, 90308055, 98387102, 107583375, 117879559, 129552798, 142725100, 157436712, 173767999, 191342612, 209731964, 228245439, 245990221, 262092499, 275779968, 286145937, 292513804, 294695256, 293174203, 289049028, 283621348, 277869740, 272725364, 268968107, 267072151, 267232492, 269695740, 274453661, 281569322, 290873900, 302189266, 315347756, 329800152, 344852987, 359581974, 372775108, 383359089, 390939914, 395040516, 394994640, 390362751, 381136099, 368093786, 352775893, 336656871, 320952040, 306263885]
5385C06263885j3195663j1441703r359445p376879n404841l547179j905775l93341
5377B53639059O62526J245792J272327Q97685l72071k292464m733862p410575
5369B42908417r765409j1818840j3101381j3466225j3130452j2485198j1685494
5362A57455418j0804002j0037263r250856q501050p961575p316847o735960o270359
5354I0577506n729770n268680m714725m348798l979814l551614l332732l027346
5346E6624027k706515k469603k313353k040490j896816j770828j654220j417374
5338D0354828j326694j309499j204215j078778j024591r85139r26674r89077r09086
5329C0601075r14577q65995q11115o98292o22589o58837n95005m48931n22332
$$ y = [306263885, 293068222, 281626519, 272267074, 264890195, 259485354, 255938175, 254032400, 253639059, 254301585, 255547377, 256819704, 257717389, 257345318, 255052854, 250318992, 242908417, 233143008, 221324168, 208222787, 194756562, 181626110, 169140912, 157455418, 146651416, 136614153, 127363297, 118862247, 110900672, 103583825, 96847865, 90577506, 84847736, 79579056, 74864331, 70515533, 66535719, 62984105, 59651373, 56624027, 53917512, 51447909, 49134556, 47094066, 45197250, 43426422, 41772202, 40354828, 39028134, 37718635, 36514420, 35435642, 34411051, 33425912, 32499238, 31510161, 30601075, 29686498, 28820503, 28009388, 27311096, 26688507, 26029670, 25434665, 24985734, 24463402]
5320B4463402n02214n54793n30113m69029n25189m44058n07155m57763m82006
5311A9991082m24965l88042l62196l77286m17168l98795l87485l53572l30391
5302A6551182l50850k28558j37047q9207j14246m4092J05263K27567K49719K81706
5292A6451437K95358K78632K71670J50539j946j34870l54816o07274n99304o58299
5282A5091127o25409n88759o26295n20986m51952m51310l91241l31412k56445
5273A0847318k88472k65183k44138j66932j02297p4562Q4615L5600J24113J25196
5263A0075258K49728L77835M35860M36221M04743L83021L44465J96196k1262k13572
5253A2668493l86296m45127o09462o55784n65511n67905n68331m69157l84822
$$ y = [24463402, 23961188, 23406395, 22876282, 22407253, 21882064, 21438006, 20930851, 20473088, 19991082, 19566117, 19178075, 18815879, 18438593, 18021425, 17622630, 17235145, 16881573, 16551182, 16200332, 15971774, 15834727, 15745520, 15631274, 15587182, 15692445, 15920012, 16169731, 16451437, 16746795, 17025427, 17297097, 17447636, 17445690, 17310820, 16956004, 16348730, 15749426, 15091127, 14465718, 13876959, 13250664, 12729678, 12277726, 11826416, 11435175, 11103763, 10847318, 10558846, 10293663, 10049525, 9882593, 9780296, 9705734, 9790349, 9825949, 9950062, 10075258, 10324986, 10702821, 11138681, 11574902, 11979645, 12362666, 12707131, 12903327, 12882065, 12668493, 12282197, 11837070, 11227608, 10571824, 10006313, 9438408, 8870077, 8400920, 8016098]
5244H016098l41378l68412k14127k98851k20519k13217j56186j36898k14276o5849
5234E786385j03430p0194j5070m586N1126J15432K9571R1450J23879M2544P4014
5223F121121Q781l6466j41068p7330n8423j94496k47465j10031m2445n7689j17742
5212E046747r7542j31896j07808r1153j06245j40289j42956n2721o7659p9115
5202D029363j15809q2777l3284n9629m0414J8774r302k4199k318n745P3788M764
5190C753212m2186P2648J13691N8071M2303P5134R7900J21621Q9326K0053J10737
5179D512510Q8422l940l772j3334P436r7558m4921k119m5442p7898p1981J9997
5167D267400n1739p3784K0920k4350k4792K6644R3108K6733m991O8454N1695P0968
$$ y = [8016098, 7674720, 7306308, 7092181, 6793330, 6572811, 6359594, 6203408, 6066510, 5852234, 5786385, 5682955, 5612761, 5597691, 5593105, 5644231, 5759663, 5789234, 5880684, 6004563, 6047107, 6121121, 6129902, 6093436, 5952368, 5875038, 5816615, 5622119, 5374654, 5264623, 5222178, 5164489, 5046747, 4949205, 4817309, 4709501, 4618348, 4512103, 4371814, 4228858, 4176137, 4108478, 4029363, 3913554, 3830777, 3797493, 3737864, 3697450, 3716224, 3706922, 3682723, 3680405, 3674660, 3748448, 3753212, 3711026, 3783674, 3897365, 3955436, 3997739, 4072873, 4170773, 4292394, 4381720, 4401773, 4512510, 4600932, 4596992, 4593220, 4579886, 4587322, 4489764, 4444843, 4442724, 4397282, 4319384, 4247403, 4267400, 4215661, 4141877, 4162797, 4138447, 4113655, 4140299, 4233407, 4260140, 4255149, 4323603, 4375298, 4446266]
5155D446266R6619J45422Q9075J06914J52709J79607K39702J82050K42713K52926
5145F134003L00520L12836K89119L42311K86235L38243N11198M57751N47838P86816
5135A0306870P98281J002375J068451J054724J120132J066585R25265P31275M16515
5126A8490473J57411j16028m11477m96943n27570m12856l51568j35907r7964J53381
5116A6250952L30613L92720N45270P64551Q56703R59446J041728J059335P82229
5107B2983547P27078N51292K31472K8382l01775n12644q25025j013658j055134
5098B0813535r15209q42683p36140n74620m20136l33312k66036j96019k3273P6376
5088A6582483J07426K26633J63455J22998N463j58932k99179n42202p19249q43694
$$ y = [4446266, 4542885, 4688307, 4777382, 4884296, 5037005, 5216612, 5456314, 5638364, 5881077, 6134003, 6434523, 6747359, 7036478, 7378789, 7665024, 8003267, 8514465, 8972216, 9520054, 10306870, 11105151, 12107526, 13175977, 14230701, 15350833, 16417418, 17342683, 18073958, 18490473, 18647884, 18531856, 18120379, 17623436, 17095866, 16683010, 16331442, 16195535, 16097571, 16250952, 16581565, 16974285, 17519555, 18284106, 19140809, 20100255, 21141983, 22201318, 22983547, 23710625, 24261917, 24493389, 24521771, 24219996, 23707352, 22882327, 21868669, 20813535, 19898326, 19055643, 18319503, 17744883, 17324747, 16991435, 16725399, 16529380, 16506107, 16582483, 16689909, 16916542, 17079997, 17202995, 17208458, 17049526, 16750347, 16208145, 15488896, 14645202]
5078A4645202q38438p05511o92548p09453n96683n35548n63455m13007m60465
5069I130094m57459m42159m95514l98277l36690k70603l92447k78628k75918k51072
5059E531327j60204j80489k16872j36815j58457j58017j17388k742j3199j22426
5049D264718m9346j45774j89378l5155j32676j97535j58662j56030j28086j17636
5039B954440r8353p7959j26559j11547m8527n8311p7127l5049l8136j14414n1866
5028B116592m7103j04106n2897j9537J238l0819m8093r3274m0058M55j5305m6779
5016A620314k7799n1497p2085n0732m5012J1842K5125n9175J8289r9558j3836
5005A255876k1203n1631O3589L502p685m6772P3779l9393l0686O3709l2161p2940
$$ y = [14645202, 13806764, 13101253, 12408705, 11699252, 11102569, 10567021, 10003566, 9590559, 9130094, 8672635, 8230476, 7734962, 7336685, 6999995, 6729392, 6336945, 6058317, 5782399, 5531327, 5371123, 5190634, 4973762, 4836947, 4678490, 4520473, 4403085, 4400343, 4387144, 4264718, 4215372, 4069598, 3880220, 3845065, 3712389, 3514854, 3356192, 3200162, 3072076, 2954440, 2856087, 2778128, 2651569, 2540022, 2491495, 2433184, 2356057, 2321008, 2282872, 2168458, 2116592, 2069489, 1965383, 1912486, 1892949, 1894187, 1863368, 1815275, 1722001, 1681943, 1682398, 1667093, 1620314, 1592515, 1541018, 1468933, 1418201, 1373189, 1385031, 1410156, 1350981, 1369270, 1269712, 1255876, 1234673, 1183042, 1246631, 1250133, 1242448, 1195676, 1269455, 1230062, 1199376, 1263085, 1230924, 1157984]
4993A157984o25j0012R4965J4640q1835l5833n6074l8608l1726K8187k7277k8102
4981I85684J7859m8932O4497m262m3190l8317q224j1301l0762J0130N7442k2508
4969I28116l2713L1821j9493n713k0215N8101n6326n6836R6182K3400j9049K8500
4957I55775L7897n0945m3747n3433m7175m4987J1812L2213l8454r3605o5204O1346
4945F61493o1084l513M0387J0937M8722J160O032o5470Q552j8q868L8834J9784
4932F96948l2088K9143K7194o8227l1938L403L5710j3957k2758k0154M5190P8658
4920G27124J1710M350M8371Q4070K2073l9962p6221p448O2949l5560R395k228
4908H08623k4708Q2048r417Q5711M9754L1903O2372K7753L2303K1418O2348R1985
$$ y = [1157984, 1157359, 1147347, 1242312, 1256952, 1175117, 1139284, 1083210, 1044602, 1012876, 1041063, 1013786, 985684, 1003543, 954611, 1019108, 1014846, 971656, 933339, 925115, 913814, 883052, 893182, 950624, 928116, 895403, 927224, 907731, 902018, 881803, 939904, 883578, 826742, 922924, 946324, 927275, 955775, 993672, 942727, 898980, 845547, 798372, 753385, 765197, 797410, 758956, 665351, 600147, 661493, 600409, 596896, 637283, 648220, 696942, 698102, 704134, 638664, 647216, 647198, 638330, 677164, 696948, 664860, 694003, 721197, 652970, 621032, 624435, 660145, 646188, 623430, 603276, 648466, 727124, 738834, 743184, 791555, 875625, 897698, 857736, 781515, 774067, 837016, 801456, 810851, 808623, 783915, 865963, 856546, 942257, 992011, 1023914, 1086286, 1114039, 1146342, 1167760, 1230108, 1322093]
4896A322093J37207P5923O5228J88227J36560J39252J45052J15663J80450K12460
4886B718115J55843J43438J87406J26006R3290J19347K13779J42501K07725K96563
4876D404013K60097L89712M37889L86289M04766N53409O18760Q43424J076377
4867I374736J295470J468836J448233J356970J208722R84550O97058Q7202q14655
4858A7107122j279249j429404j433893j278936j199363j007283p69810p04768
4850H004416n95272n52544n31020n39107m35898l83913l67412m19813k40246k20331
4840C718860k23073j72162j83162k39601p9055N63l6275o7086m308r4399j5602
4829B604700N7937k1193J060o6214j00576p4750j7397n0976k7987o2110p2745
$$ y = [1322093, 1459300, 1535223, 1600451, 1788678, 1925238, 2064490, 2209542, 2325205, 2505655, 2718115, 2873958, 3017396, 3204802, 3330808, 3424098, 3543445, 3757224, 3899725, 4107450, 4404013, 4664110, 5053822, 5491711, 5878000, 6282766, 6836175, 7454935, 8298359, 9374736, 10670206, 12139042, 13587275, 14944245, 16152967, 17137517, 17834575, 17921777, 17107122, 15827873, 14398469, 12964576, 11685640, 10486277, 9478994, 8709184, 8004416, 7409144, 6856600, 6325580, 5786473, 5350575, 4966662, 4599250, 4179437, 3939191, 3718860, 3495787, 3323625, 3140463, 2900862, 2821807, 2822370, 2786095, 2719009, 2714701, 2620302, 2604700, 2662637, 2641444, 2642504, 2576290, 2475714, 2400964, 2383567, 2332591, 2304604, 2242494, 2169749]
4818B169749m0454m7448j24964j13504k7914n8488j5111r7233r4419J1734M841
4807A566789q2186j6798n2704m3446O369j19789p1414q0237p9208n5288L008j3541
4795I61555k8137l8323k2806j4076J0131l9612J7920j3147J000l4457J1280m578
4783H06750l1985n1762m1962j6542K8320k2152M4790r15m3007j6920k5803k2439
4771F06373q295K5452r387O0009j1875n1576m3066K6099J3063m5060m720N2666
4759F09683j5134p5063l3162j2808L6085m184K4383l8753j0682n782J1838L859
4747D90280k8570n0335R660J5593O492m8818j1557J4436m2654L7708R266k0701
4735C80800K482m200l431L1599J42L9046n7035p9566J9281K9296L2017L8852k0318
$$ y = [2169749, 2129295, 2081847, 1956883, 1843379, 1815465, 1756977, 1741866, 1644633, 1550214, 1561948, 1566789, 1484603, 1467805, 1415101, 1371655, 1378024, 1258235, 1186821, 1106584, 1027376, 972088, 975096, 961555, 933418, 895095, 872289, 858213, 868344, 828732, 846652, 833505, 834505, 800048, 811328, 806750, 774765, 723003, 681041, 664499, 692819, 670667, 715457, 714542, 671535, 654615, 628812, 606373, 598078, 623530, 614143, 674152, 662277, 610701, 567635, 593734, 606797, 561737, 557017, 609683, 594549, 519486, 486324, 473516, 509601, 505417, 529800, 491047, 480365, 474583, 486421, 490280, 461710, 411375, 421035, 436628, 443120, 394302, 382745, 397181, 354527, 392235, 401501, 380800, 383282, 379082, 375651, 407250, 407392, 446438, 389403, 309837, 329118, 358414, 390431, 429283, 408965]
4722D08965m4059O0993k5927m2306l794r717r164N2511K2309m6o910n5897l4614
4709C12344J6064k0651J4228N1555L4065O0895o2394j2345K1919J8912m374m0289
4697C89929n9382j8447N8542J4011n0850J2337r486O1890j0482M3803k4319L7994
4685D45540n1320m4643j7139J946m8096m0226Q711O6543J4934k6007K7404k3950
4673C13697N8828k1247r137P116L8352j272R886j3461k014l0053M5475K6188r3693
4660C28665L9189j045m2728l6579Q1664J8608K0836K3103l9883K4778J3978l2182
4648C98404O403O797J5498M0814n6442n2568q334O9572L4671J4635m3334j0759
4636D15357N9837l3127p236O5636j8063k8871K3809N0910Q980M6151k5008k1709
$$ y = [408965, 364906, 425899, 399972, 357666, 353872, 344155, 334991, 387502, 409811, 409765, 402855, 346958, 312344, 328408, 307757, 321985, 373540, 407605, 468500, 406106, 393761, 415680, 434592, 430218, 389929, 330547, 312100, 370642, 384653, 333803, 346140, 336654, 398544, 388062, 431865, 407546, 445540, 394220, 349577, 332438, 334384, 286288, 246062, 254773, 321316, 336250, 310243, 337647, 313697, 372525, 351278, 342141, 349257, 387609, 386337, 396223, 382762, 380748, 350695, 396170, 422358, 328665, 367854, 366809, 324081, 287502, 369166, 387774, 408610, 431713, 391830, 416608, 430586, 398404, 404807, 411604, 427102, 467916, 411474, 358906, 350572, 420144, 454815, 469450, 426116, 415357, 475194, 442067, 434831, 500467, 482404, 453533, 477342, 528252, 537232, 583383, 558375, 536666]
4624E36666L1902j4053K3701l6934K1902M216o7556m3497j7581J558n7337K210
4612C85197M5358L3615J4238K447n354o5733K5342K7174L900q598n83R9541K4417
4599E80961n7374M3566j7794k8682L849m1464M307N4024j4486N937K3641l7620
4587E18865N3417l7610n8961j5814j7811k8094K5104m1129k3484j7815j4058m9332
4575B93278N841M7139M698p423N9614J3513n5989j9290Q1646o4596J2149n126
4563C65454k4947J1543j2316k2037j2463N9020k3201n0606r136O0203K2567m5153
4551C18928R856N729K2816N7548J0098k0061j2109k3584n9374m8882L116l1617
4539B32464M7211L884j6393J7062j6974L1218l9024K7447N2775k4398l7563j1189
$$ y = [536666, 568568, 554515, 578216, 541282, 563184, 567400, 499844, 456347, 438766, 440324, 382987, 385197, 430555, 464170, 478408, 480855, 475501, 409768, 435110, 462284, 466184, 457586, 457003, 556544, 580961, 523587, 567153, 549359, 520677, 524526, 483062, 487369, 541393, 526907, 532844, 556485, 518865, 572282, 534672, 475711, 459897, 442086, 413992, 439096, 397967, 374483, 356668, 342610, 293278, 299119, 346258, 350956, 343533, 403147, 416660, 360671, 341381, 423027, 358431, 370580, 365454, 340507, 352050, 339734, 317697, 305234, 364254, 341053, 290447, 281311, 341514, 364081, 318928, 328784, 334513, 357329, 414877, 424975, 404914, 392805, 369221, 309847, 260965, 264081, 232464, 279675, 283559, 267166, 284228, 267254, 298472, 259448, 286895, 339670, 315272, 277709, 266520]
4527B66520J4316K5736k5927j0792n502N321J1910J5389L695J9371N526J8027
4515C43590K566N8036m6175l6618l8756j435q915N5641L1398k3831n024k8607
4503C01870p170m0442j1776N7889K2389m9637l1075l867l6920k8548P9959M7402
4491C00074Q043l4793j5963j7291j1623l0031K8534N0785l3162o007j6013m1109
4479A81444O126K9480N846M4461n014j231m4556j32n1811N498Q1522L4931o2057
4466B24507m6110k7561P6941K0724J558L3142m8428j8474N2520k279P173p964
4454B65749J4407L1136n9412k2092M1405L2302L0283n9393K1904K70l1362K6337
4442B91534K5573J2092k9845l385n2597L0263M3508J5577M0267n8430n5290P4754
$$ y = [266520, 280836, 306572, 280645, 269853, 264351, 269672, 281582, 296971, 300666, 320037, 325563, 343590, 346156, 404192, 358017, 321399, 282643, 281208, 272293, 327934, 359332, 335501, 330477, 301870, 294700, 254258, 242482, 300371, 322760, 273123, 242048, 238181, 201261, 172713, 252672, 300074, 308117, 273324, 257361, 240070, 228447, 198416, 226950, 277735, 244573, 238566, 222553, 181444, 187570, 217050, 222896, 267357, 262343, 261112, 216556, 216424, 164613, 170111, 251633, 286564, 224507, 178397, 150836, 227777, 248501, 250059, 283201, 234773, 216299, 268819, 266540, 273713, 265749, 280156, 311292, 251880, 229788, 271193, 303495, 333778, 274385, 296289, 296559, 265197, 291534, 317107, 329199, 299354, 295969, 243372, 273635, 317143, 332720, 372987, 314557, 259267, 334021]
4430C34021L3447p134J8552L2619j1061K1099o751k0132K6418M0800l2221k1447
4418D08210K2196Q3362j0887o2475J5694k3740l7677J3027J47617O2456l6304
4407E81479l7837p0970J8275j7112l5225N8025N5661m8282J24374M9768N4993
4396G33149K9988k4729M619r03l2262K5467O9037J01309L3038N6897L3930o599
4384A022941J1103K7058l9407N5050J07300O842K1131O8862R2523R5298M639p961
4372A465379l5225J6979l994j5882J0480o321k3392n7892o5271m1974j23627o4201
4360A055059o8951k4272m3747o1134k6743l9244n4301q0952J788j9959L0349m4421
4348F23472m5033j32692J5731Q2161l4348j8048M0778o5007p311k934j461k878
$$ y = [334021, 367468, 360334, 378886, 411505, 400444, 421543, 414792, 394660, 421078, 461878, 429657, 408210, 430406, 513768, 502881, 440406, 456100, 432360, 394683, 407710, 555327, 617783, 581479, 543642, 472672, 490947, 473835, 438610, 496635, 552296, 504014, 628388, 678156, 733149, 763137, 738408, 743027, 742124, 709862, 735329, 804366, 905675, 938713, 995610, 1029540, 1022941, 1034044, 1061102, 1021695, 1076745, 1184045, 1190887, 1212018, 1280880, 1373403, 1468701, 1473340, 1465379, 1430154, 1447133, 1443139, 1427257, 1437737, 1431416, 1408024, 1350132, 1284861, 1242887, 1119260, 1055059, 986108, 961836, 918089, 856955, 830212, 790968, 736667, 655715, 657503, 637544, 667893, 623472, 578439, 445747, 461478, 543639, 509291, 491243, 532021, 467014, 459703, 456769, 455308, 452430]
4336D52430l8541K858O1712k3230m7990K4470r821l2629K1973L5281l6023p5050
4324C35440J076l7514K73L3174K8331m9200N2373O6264N2730J3893m5980j1109
4312D39751M7197m41j4392M6956J8173K5997K1084k398k1108l5035j6169j0928
4300D98687m7885j1271R604l3921n5186n389n0042R5914k1193l2249j2309n7327
4288B77433O9521m8292M1298L6604L028n7352K0059J2678k3430m8577K3828l1068
4276B75730K2505J08525r766m3453O009q1051l0716K7509K5600P827l9491o575
4264B62653k2658J1808q93Q471m2445l629p9110k0070J3351K4457L9032P812k4797
4251A73982N8651K8854L6971l4015l8136j3542K1515Q2541L8964r9636k7944J4244
$$ y = [452430, 413889, 416747, 478459, 455229, 407239, 431709, 421888, 389259, 411232, 446513, 410490, 335440, 336516, 299002, 299275, 332449, 360780, 311580, 363953, 430217, 482947, 496840, 450860, 439751, 486948, 486507, 472115, 519071, 537244, 563241, 584325, 581927, 560819, 525784, 509615, 498687, 450802, 439531, 449135, 415214, 360028, 354639, 304597, 400511, 379318, 347069, 334760, 277433, 346954, 298662, 339960, 376564, 379592, 322240, 342299, 354977, 331547, 282970, 306798, 275730, 298235, 406760, 396994, 353541, 359550, 278499, 247783, 275292, 300892, 308719, 269228, 262653, 239995, 251803, 250910, 259381, 216936, 213307, 134197, 114127, 127478, 151935, 190967, 198779, 173982, 232633, 261487, 298458, 264443, 226307, 212765, 234280, 316821, 355785, 256149, 228205, 242449]
4239B42449r522j7122l3527L2534M9379m667J2976m0520P854j916m573M1012P9
4226B74436k1705q0729N5695J5640q9225K8300P8965L5452m0234n6153l012k0532
4214A76898K4951N0311j3515J9294J969P668j1114k4188L2038l5850K3280M8004
4202B99746k9376m315k4712l8707K1145L739O1152J912j6133n8557l925L382P859
4189B23210l3328J9462K7312L0183L7190n5040p4269J8874k3836P4036n625L9095
4177B77264K9556m5365j8403l2779N2j1934R7950O783Q324J2469M333l2255M7976
4164C43971M1353j9357j8502j3812l7553Q2800j9800J7778j07332n606R463L8043
4152C11446M4811l7197k7447L9046O8340n3626q5667K1555M0364j9263J9420k2046
$$ y = [242449, 232927, 215805, 182278, 214812, 264191, 259524, 272500, 231980, 239834, 237918, 233345, 274357, 274436, 252731, 172002, 227697, 243337, 154112, 182412, 261377, 296829, 256595, 200442, 197430, 176898, 201849, 252160, 238645, 257939, 259908, 267576, 256462, 232274, 264312, 228462, 251742, 299746, 270370, 266055, 241343, 202636, 223781, 227520, 288672, 290584, 274451, 215894, 211969, 215351, 223210, 189882, 209344, 236656, 266839, 304029, 248989, 174720, 193594, 169758, 243794, 238169, 277264, 306820, 261455, 243052, 210273, 210325, 198391, 296341, 303124, 311448, 323917, 328250, 295995, 343971, 385324, 365967, 347465, 333653, 296100, 378900, 359100, 376878, 269546, 263940, 273403, 311446, 356257, 319060, 291613, 330659, 398999, 345373, 259706, 281261, 321625, 302362, 321782, 299736]
4140B99736M9418J1697K3959m1446L1305l9352Q873N0820q276J269J253R837m3112
4127C55981k2974P1128m5213j4296L6912l8945n6573L2263M3072M2473N6271p4791
4115C85308m3086L9814K2720j3989M2662l3966l5980m139J7512p3495P1357O6566
4103D41284l3846k3921J7338P5808o622n1801j1400M967J3953k6627M5421O7309
4091E11863o6684J6466K4452L1246K522o9040L2371K4486j6465P5406K065N1962
4079F20650j4107k2018j0674J7796J10542O0851k422p601J9405j9094N9608o903
4067H06033N8674R4766l2666L429N159J14635M7520N3729N812O9859J31158J4565
4055A372673Q6387R6231J17121J33628J48274J74596J92312K47245J89784J85703
$$ y = [299736, 349154, 360851, 384810, 343364, 374669, 335317, 344190, 395010, 386734, 388003, 389256, 399093, 355981, 333007, 404135, 358922, 344626, 381538, 342593, 286020, 318283, 361355, 403828, 460099, 385308, 342222, 382036, 404756, 390767, 433429, 399463, 363483, 359344, 376856, 303361, 374718, 441284, 407438, 383517, 400855, 476663, 470041, 418240, 406840, 411807, 425760, 399133, 444554, 511863, 445179, 461645, 486097, 517343, 519865, 450825, 483196, 507682, 491217, 566623, 568688, 620650, 606543, 584525, 573851, 591647, 702189, 763040, 760618, 753017, 772422, 753328, 812936, 806033, 864707, 959473, 926807, 930236, 935395, 1050030, 1097550, 1151279, 1157091, 1226950, 1358108, 1372673, 1459060, 1555291, 1672412, 1806040, 1954314, 2128910, 2321222, 2568467, 2758251, 2943954]
4045B943954J67231M5869J08081J12279K16577J16255K02090K59321K69958L32098
4035D773713L94508M30228L84805L17650K32357J73264L27837N61445P92576J055691
4025I444074J332393J226161J31299q44986j039624q60917p48061n92496m74677
4016G573166l98673l44597j42384r6894m0167n2066j1042K5257n1317j72968j12929
4005F175386j12447j24389k51357l47327l38920l46909l33151k35219k02621k05512
3995C677534j69741j57695j52913j51555j88889j24825j13962o2618j61219j17091
3985B277026p1212j29776q5817m3834m6685k1767n0004l6259o1634m5798j9332
3974A664908r0548k3604j2137m4514l2890m0935n0109N92j5810J2097q5409j2053
$$ y = [2943954, 3111185, 3157054, 3265135, 3377414, 3593991, 3710246, 3912336, 4171657, 4441615, 4773713, 5168221, 5598449, 5983254, 6300904, 6533261, 6706525, 7034362, 7595807, 8388383, 9444074, 10776467, 12002628, 12133927, 11288941, 10249317, 9388400, 8640339, 8047843, 7573166, 7174493, 6829896, 6687512, 6590618, 6550451, 6498385, 6487343, 6512600, 6461283, 6288315, 6175386, 6062939, 5938550, 5687193, 5339866, 5000946, 4654037, 4320886, 4085667, 3883046, 3677534, 3507793, 3350098, 3197185, 3045630, 2856741, 2731916, 2617954, 2555336, 2394117, 2277026, 2205814, 2076038, 1990221, 1946387, 1899702, 1877935, 1827931, 1791672, 1730038, 1684240, 1664908, 1574360, 1550756, 1538619, 1494105, 1461215, 1420280, 1370171, 1370763, 1354953, 1367050, 1281641, 1269588]
3962A269588l2640m946j422j5305n8375K4495q4252j7905J2756L5306j4051J8102
3950A131351j5336n4301K9696o2981p4298N2201L5592l1098l2042r695m1839m7191
3938H80059O62J9135L2278K2069o3519m6133k0697J0889j3606M9929l2935n9423
3926G78708j349M0431M0095Q498j9416m6330k8989P6405l4787n0884M2615M8208
3914H53205L2262J1728m6311o0200N0185M9761L9610o8925P075m8995r4464N9071
3902G84002N6147j1322N0006l875q4033K2633O8054M0351k4275o9670K5654K8817
3890H82489R328k5957J5065P4852m4070L0420K8468r2348K6277J0724R767m8381
3878H76634l5889J8889P6476k4934n9338K0963N824m647Q5245r502L1685j7313
$$ y = [1269588, 1236948, 1232002, 1230580, 1215275, 1156900, 1181395, 1097143, 1079238, 1091994, 1127300, 1113249, 1131351, 1116015, 1061714, 1091410, 1028429, 954131, 1006332, 1041924, 1010826, 978784, 969089, 927250, 880059, 880721, 899856, 932134, 954203, 890684, 844551, 823854, 834743, 821137, 871066, 838131, 778708, 777359, 817790, 857885, 866383, 846967, 800637, 771648, 848053, 813266, 762382, 804997, 853205, 885467, 897195, 850884, 790684, 840869, 890630, 930240, 861315, 868390, 819395, 724931, 784002, 840149, 828827, 878833, 874958, 790925, 813558, 881612, 921963, 897688, 828018, 853672, 882489, 891817, 865860, 880925, 955777, 911707, 942127, 970595, 878247, 904524, 915248, 925015, 876634, 840745, 859634, 936110, 911176, 851838, 872801, 878625, 873978, 959223, 949721, 981406, 964093]
3866I64093o7593j6701L76K0758n0614N2659J9749J177K8945m374N3817r8564
3854I03728n6141K7159J1581K8642k0330j63J8435N0105k0705N82N7780m7382
3842I53291l4714M2089P6665j105K0416K4277L7763j0415M6178p59K481J8899
3830A175066p391K3401M6336k5801k3435K2480J1521J0288k6465J2649l9791n4504
3818A124354K4034n3007M8190K1850P683L9053m5033L4914N0847P8263o3294j6786
3806A251068K6525N5451j735q6699j7049J07555N7972K6554j1432P8075P906l8254
3794A455937m4163J6415m587l3970O7477j4808o5841M138j8980L1446M8064J5475
3782A456603L2466K997R590l7224j8560L8275M2399M3424k3717M449K0195k3917
$$ y = [964093, 896500, 879799, 880175, 900933, 850319, 902978, 922727, 923904, 952849, 948475, 1002292, 903728, 847587, 874746, 886327, 914969, 894639, 894476, 912911, 963016, 942311, 942893, 1000673, 953291, 918577, 960666, 1037331, 1036226, 1056642, 1080919, 1118682, 1108267, 1154445, 1153686, 1156167, 1175066, 1167675, 1191076, 1237412, 1211611, 1188176, 1210656, 1222177, 1232465, 1206000, 1218649, 1178858, 1124354, 1148388, 1095381, 1143571, 1165421, 1173104, 1212157, 1167124, 1202038, 1252885, 1331148, 1267854, 1251068, 1277593, 1333044, 1331309, 1244610, 1227561, 1335116, 1393088, 1419642, 1408210, 1486285, 1494191, 1455937, 1411774, 1428189, 1423602, 1389632, 1457109, 1442301, 1376460, 1380598, 1361618, 1393064, 1441128, 1456603, 1489069, 1492066, 1501656, 1464432, 1445872, 1484147, 1526546, 1569970, 1546253, 1550702, 1570897, 1546980]
3770A546980M2854O7469M659M0643Q698M200L3097l3997K7167l9676J0168M4172
3758A756434j6407J954o7977K0694P4330j6276l1450n6262L5912N9915K0384m4562
3746A736689L5618P3116K5328l6741Q1534j6106R918K6807j9346N059o071k8124
3734A887681p2572N5275k5439r089L3176k5606j8307n921k4972l9759K8280k3062
3722A759685l1508q865k669K4404J2638j1933L0836l6220L2194L6723q660K7349
3710A823974j267K8329m9151k7300m1865L3572L4013m3762k4385K6038q6127N1964
3698A724033k6534M0213L4713k6845r5885l0085Q863j4728N6506J5281j9586l3246
3686A632700j0056l9199l266j4994j9315O0850M828k2137n597o622k4063q272
$$ y = [1546980, 1589834, 1657303, 1661962, 1702605, 1711303, 1715503, 1748600, 1714603, 1741770, 1702094, 1712262, 1756434, 1740027, 1741981, 1674004, 1694698, 1769028, 1752752, 1721302, 1665040, 1700952, 1760867, 1781251, 1736689, 1772307, 1845423, 1870751, 1834010, 1915544, 1899438, 1909356, 1936163, 1916817, 1921876, 1915805, 1887681, 1815109, 1870384, 1844945, 1835856, 1869032, 1843426, 1825119, 1819198, 1794226, 1754467, 1782747, 1759685, 1728177, 1719312, 1716643, 1741047, 1753685, 1741752, 1772588, 1736368, 1768562, 1805285, 1796625, 1823974, 1822707, 1851036, 1801885, 1774585, 1732720, 1766292, 1800305, 1756543, 1732158, 1758196, 1672069, 1724033, 1697499, 1737712, 1772425, 1745580, 1649695, 1619610, 1628473, 1613745, 1670251, 1685532, 1665946, 1632700, 1622644, 1583445, 1580179, 1565185, 1545870, 1606720, 1611548, 1589411, 1583814, 1577192, 1553129, 1544857]
3674A544857L5624j3246o5598l0533k7997n6171Q412K3355k7265j4908M0284J5234
3662A432048L4452o2087j1723N155o3776j2150P0959j4092k795m4565n545Q356
3650A334237k6639J0881l4005n8646Q722L4408J788M831r939O3516j9751j738
3638A307665l1613J1388O769J2600m620o9085j5389O8283J1924r451J390K4202
3626A314063l7288K3962N2413j6169J8184M0108K5715l9305K39P5796L4036p8400
3614A413354j528L5589M445Q67J8151k8474J407l0992R3J6074M1262j782N9690
3601A528156J7601j9479k5375L0643K4297M0049k6910M1895J2300P6754n67m5844
3589A653520L9222L3805P1379N938j5589M2273M0611k282q087M2027L7709J4819
$$ y = [1544857, 1580481, 1567235, 1501637, 1471104, 1443107, 1386936, 1395348, 1418703, 1391438, 1376530, 1416814, 1432048, 1466500, 1404413, 1392690, 1397845, 1334069, 1321919, 1392878, 1378786, 1375991, 1331426, 1325881, 1334237, 1307598, 1318479, 1284474, 1225828, 1234550, 1268958, 1270746, 1275577, 1265638, 1329154, 1309403, 1307665, 1276052, 1287440, 1294209, 1306809, 1302189, 1233104, 1217715, 1285998, 1297922, 1288471, 1289861, 1314063, 1276775, 1300737, 1353150, 1336981, 1355165, 1395273, 1420988, 1381683, 1381922, 1457718, 1491754, 1413354, 1411826, 1447415, 1451860, 1452727, 1470878, 1442404, 1443811, 1412819, 1412912, 1428986, 1470248, 1468466, 1528156, 1545757, 1526278, 1500903, 1531546, 1555843, 1595892, 1568982, 1610877, 1623177, 1699931, 1699364, 1653520, 1692742, 1726547, 1797926, 1803864, 1788275, 1830548, 1871159, 1868877, 1860790, 1902817, 1940526, 1955345]
3577A955345O8727m7597Q343o2954R502M3893n032j921n8044M1697J9763N5479
3565B027201p0515Q0177Q4908j7799J1260K1966Q0488P215P9748K9904K1503L9203
3553B395259M6842O0645K7J8739K3641J0871P98O2621J5323P5143J5000j10150
3541B614759o6266L9827O982O4769M5775q889k3646m580N8681p9286L9367K5931
3529B713424L3178M1480Q4189P1863O5345K0364L7593J7851O8546P6306L0181
3518C260320Q9100P6569L5540J9280L1010M0k3840O7748Q780L2085O646L2087
3506C635365L9713M0295n2410n6010J26517Q3325K6102K7665K872J16113Q0611
3495D070158J14327Q8139K8330J30979M7767J14388J53844J48837R5013N8761
$$ y = [1955345, 2024072, 1976475, 1984818, 1921864, 1931366, 1975259, 1970227, 1968306, 1910262, 1951959, 1971722, 2027201, 1956686, 2036863, 2121771, 2103972, 2115232, 2137198, 2217686, 2224901, 2304649, 2334553, 2356056, 2395259, 2442101, 2502746, 2502773, 2521512, 2545153, 2556024, 2556822, 2619443, 2634766, 2709909, 2724909, 2614759, 2548493, 2588320, 2595302, 2660071, 2705846, 2696957, 2673311, 2668731, 2727412, 2648126, 2687493, 2713424, 2746602, 2788082, 2872271, 2944134, 3009479, 3029843, 3067436, 3085287, 3153833, 3230139, 3260320, 3349420, 3425989, 3461529, 3480809, 3511819, 3511859, 3488019, 3555767, 3564547, 3596632, 3603278, 3635365, 3675078, 3715373, 3662963, 3606953, 3733470, 3816795, 3842897, 3870562, 3873434, 3989547, 4070158, 4184485, 4272624, 4300954, 4431933, 4479700, 4594088, 4747932, 4896769, 4991782, 5050543]
3485E050543J26715J87815K20465J67977J68745J27880J78871K44018J90115J21830
3475F784974J69439K27396K13144K23109K60375K08935L31883K67363L26655K72439
3465I285712K17173J78618K06468R8829P3442n3427j00902r9589k04496j18519
3455I483309j13461q7793q4238j25199j56877j03046m1833Q7542J1553J01455
3445H971412J45176J23892K21912K77148L42933M41247M78728N11865M38001L09257
3435A2261571K19493o8826l09640m17445m79454m69555n54723n34092m57276m10225
3425H779828l49000k10488j19752j28306r3018p959n968J9126J16688K22702K15451
3414H439304L03492M46059N57996N61536P88167R43861R75286J034979J098643
$$ y = [5050543, 5177258, 5365073, 5585538, 5753515, 5922260, 6050140, 6229011, 6473029, 6663144, 6784974, 6954413, 7181809, 7394953, 7618062, 7878437, 8087372, 8419255, 8686618, 9013273, 9285712, 9502885, 9681503, 9887971, 9986800, 10060242, 10006815, 9905913, 9806324, 9601828, 9483309, 9369848, 9282055, 9197817, 9072618, 8915741, 8812695, 8770862, 8858404, 8869957, 8971412, 9116588, 9240480, 9462392, 9739540, 10082473, 10523720, 11002448, 11514313, 11952314, 12261571, 12481064, 12412238, 12102598, 11685153, 11205699, 10736144, 10181421, 9647329, 9190053, 8779828, 8430828, 8220340, 8100588, 7972282, 7879264, 7871305, 7865337, 7884463, 8001151, 8223853, 8439304, 8742796, 9188855, 9746851, 10308387, 11096554, 12040415, 13015701, 14050680, 15149323]
3405A5149323Q67384P82940N39869P7010n58442p71112r46823j124659j044119
3396A2971371j003689q46299o94062o72628n52834m83658m71787l73649l53807
3387G518958k57292k14919j29766o2033j39061O5589N2823O6104J27070K55807
3377G283280L32976L45903L87994M03262L72703K18756K63008K725k66641l89707
3367H954259m07468n26345n74101n12394m22254m51939l95941k37584l10434k52329
3357D863470k29953k67643l02923j46786j06897j73240j16116p5306j14662p5522
3347C254422j06359j08528p0609j02501k0296l0594o1782j36909l8483N683o6230
3336B517814p2153m2936r0292j3876J9877p7794l4833j8168j02228o3259J3690
$$ y = [15149323, 16016707, 16799647, 17339516, 17416526, 16858084, 16086972, 15140149, 14015490, 12971371, 11967682, 11121383, 10427321, 9754693, 9201859, 8718201, 8246414, 7872765, 7518958, 7261666, 7046747, 6916981, 6854948, 6715887, 6781476, 6834299, 6900403, 7027473, 7283280, 7616256, 7962159, 8350153, 8753415, 9126118, 9344874, 9607882, 9610607, 9343966, 8954259, 8546791, 8020446, 7446345, 6933951, 6511697, 6059758, 5663817, 5426233, 5115799, 4863470, 4633517, 4365874, 4062951, 3916165, 3809268, 3636028, 3519912, 3444606, 3329944, 3254422, 3148063, 3039535, 2968926, 2866425, 2846129, 2815535, 2753753, 2616844, 2578361, 2584044, 2517814, 2445661, 2402725, 2312433, 2298557, 2318434, 2240640, 2205807, 2187639, 2085411, 2022152, 2035842]
3325B035842K782M30k2120n8136l6771m2675l9661n2648O6104j0956k7351o0191
3313A754649L1144L396k1492L6948R140p4632P740k8169l2893J043j7049l9987
3301A629838k9973n0093l01J6263p1585J6210K0892k9492l0173j6243k8999O003
3289A432347R538O767J5265n829J9951n5239p152O249n917k3702k9521L7915n2766
3276A347906p4538L2122M7536O4091J6734j0107k4635q5563K2015K8150n9370
3265A304341n7203N8382J8151L0562n059k5262M5982p7947k7910j6780p56L054
3253A249555K7470j2365Q958l3874l4526M9469J4578P3076K4347q711m9119k1572
3241A287286M7065l7754L5374k4255j2689O1611J9151m752J1145K4867k1396l1441
$$ y = [2035842, 2038624, 2039054, 2016934, 1958798, 1922027, 1879352, 1839691, 1787043, 1853147, 1842191, 1814840, 1754649, 1785793, 1789189, 1767697, 1804645, 1813785, 1739153, 1746893, 1718724, 1685831, 1686874, 1669825, 1629838, 1599865, 1549772, 1549471, 1565734, 1494149, 1510359, 1531251, 1501759, 1471586, 1455343, 1426344, 1432347, 1441885, 1448652, 1463917, 1458088, 1478039, 1422800, 1415648, 1421897, 1415980, 1392278, 1362757, 1400672, 1347906, 1273368, 1305490, 1353026, 1417117, 1433851, 1423744, 1399109, 1313546, 1335561, 1363711, 1304341, 1247138, 1305520, 1323671, 1354233, 1349174, 1323912, 1369894, 1291947, 1264037, 1247257, 1246501, 1249555, 1277025, 1264660, 1273618, 1239744, 1205218, 1254687, 1269265, 1342341, 1366688, 1357977, 1308858, 1287286, 1334351, 1296597, 1331971, 1307716, 1295027, 1356638, 1375789, 1371037, 1382182, 1407049, 1385653, 1354212]
3229A354212L4545L9247M0839R069L813J10497K4453k3189P824P6531J6798O2266
3217A756905m0112N4020Q1343M8730J04405Q6620R0263J21955J12048J09033P1839
3206B597049J90544J38156J13263O5314K7402M3090M1288l6953l1344R345K9846
3195C187000j4833J5442P4682R5348R7758J11809J18147M7462l6460L8148p2954
3184C661549j00364j22232n620k2064P2820Q7315N4977J31261P2652J96816J47464
3173D174574J96441J66935J20074J15113J19781L4923k1477o7106p6129n8410
3163D704719o3511K1327K5283O5909O0586R7067J39829N5379N0269o8614r4386
3152D993857m4815j06545r7538r0522j54084k5912j9493L919k1205j3411J4181
$$ y = [1354212, 1388757, 1428004, 1468843, 1477912, 1481725, 1592222, 1616675, 1593486, 1601310, 1677841, 1694639, 1756905, 1716793, 1770813, 1852156, 1900886, 2005291, 2091911, 2182174, 2304129, 2416177, 2525210, 2597049, 2787593, 2925749, 3039012, 3104326, 3131728, 3174818, 3216106, 3179153, 3147809, 3157154, 3187000, 3172167, 3187609, 3262291, 3357639, 3455397, 3567206, 3685353, 3732815, 3696355, 3734503, 3661549, 3561185, 3438953, 3433333, 3411269, 3484089, 3571404, 3626381, 3757642, 3830294, 4027110, 4174574, 4371015, 4537950, 4658024, 4773137, 4892918, 4927841, 4906364, 4839258, 4763129, 4704719, 4641208, 4662535, 4687818, 4753727, 4814313, 4911380, 5051209, 5106588, 5156857, 5088243, 4993857, 4949042, 4842497, 4744959, 4654437, 4500353, 4474441, 4454948, 4458867, 4437662, 4424251, 4438432]
3141D438432O9793M6938O5994Q7780J7473j6915P5147O677k3590K8810L5954P6496
3129D908989O9241N9625P9677J28867L2598L7983N5536O8933l4248j05099m9140
3118E252962j47290r0545j03623j08997r4378q8885n2891k6675m2661k5263k5417
3107D446337j9762k7308K1582L2046K5018J5127N5415k9162L0082J270l6210l978
3095D510457N599o4206J6913m4133j60297j24289n3398m4855j22398j57550j15074
3084C646769k7964j6970m2730j03911n1286j3766l4752k7592o2994q999J860j41337
3072C116328p8890l6698l3765r5953p4483o7525j2989o4443p8635p6594p9990
3061B416363m5446o7027n7547n6168k8772j7031r3606m6031q545o3674j03538
$$ y = [4438432, 4508225, 4555163, 4621157, 4708937, 4726410, 4709495, 4784642, 4791319, 4767729, 4796539, 4832493, 4908989, 4978230, 5037855, 5117532, 5246399, 5278997, 5316980, 5372516, 5441449, 5407201, 5302102, 5252962, 5105672, 5015127, 4911504, 4802507, 4708129, 4619244, 4566353, 4539678, 4497017, 4471754, 4446337, 4426575, 4399267, 4420849, 4452895, 4477913, 4493040, 4548455, 4519293, 4549375, 4550645, 4514435, 4510457, 4516056, 4451850, 4468763, 4424630, 4264333, 4140044, 4086646, 4041791, 3919393, 3761843, 3646769, 3618805, 3601835, 3559105, 3455194, 3403908, 3390142, 3355390, 3327798, 3264804, 3255805, 3257665, 3116328, 3037438, 3000740, 2966975, 2871022, 2796539, 2729014, 2716025, 2651582, 2572947, 2496353, 2416363, 2370917, 2303890, 2246343, 2190175, 2161403, 2144372, 2050766, 2004735, 1996190, 1932516, 1828978]
3050A828978l9563p118j3466l7359J8283O072q0405o2334l9253m2960l5661n2895
3038A442319m965M6452n2775l9801K6203r826l1090q8374k2137M7848l1347o7499
3026A215008k1013j2765n2854j8375N664M274L5898m7524j8814r1356N7382l9189
3014A016336q770j55n9956m5111N4416k9591n93j0995o0317O1027m9462k6387
3002H40442O30k4238J3865j5817k5271J4052l1011m2130o811P812K0295l6741
2990G15077J888N4726n5395j8205j7835K210k2374n3146p2002Q5500n3906R193
2978E75731n6959J632O4462M7385o1794p2888K115j8610O392l8194L9348L5440
2966E24060k9577p172r407K9602l4557o586k9142l412j8562O6492M0344p0065
$$ y = [1828978, 1789415, 1782297, 1768831, 1731472, 1749755, 1755827, 1675422, 1613088, 1573835, 1530875, 1495214, 1442319, 1437354, 1483806, 1431031, 1391230, 1417433, 1407607, 1376517, 1288143, 1266006, 1313854, 1282507, 1215008, 1193995, 1181230, 1128376, 1110001, 1115665, 1119939, 1155837, 1108313, 1089499, 998143, 1055525, 1016336, 1007566, 1007411, 947455, 902344, 956760, 927169, 926576, 915581, 855264, 916291, 866829, 840442, 841072, 816834, 830699, 814882, 789611, 803663, 772652, 730522, 723711, 731523, 751818, 715077, 716965, 771691, 716296, 698091, 680256, 682466, 660092, 606946, 534944, 620444, 566538, 575731, 518772, 520404, 584866, 632251, 570457, 497569, 499684, 481074, 487466, 449272, 488620, 524060, 494483, 487311, 477904, 507506, 472949, 466363, 437221, 433809, 415247, 481739, 522083, 452018]
2954D52018n7704O0642j6919J7345N7296r849r9228q4614L1044M8023l1357o215
2942C60482J2887m7599N8006k2022O2623N7471k3301m9976j4752J3884P233m423
2930D10513M5704o3099o917k1791k4356L9025O701j02736r308J714l1569K6019
2918B69900K2300l7523k3240L6359J2590j1368R227J9171m7506l6773j6884J4006
2906B10259K3457m5097K1780j0205P985L4898n213P620l6691k9300O5171m5953
2894A98711n606l0013K5884P497J8405j2766j3107L3746j0135Q124j7224J8998
2882B22514j956o6011l4743M5853J9130K1585n0273O2028J1554N372O7888j0998
2870B91943M9971J2933j5808l550J0601r545J45M8650p9792k1603L2187n1221
$$ y = [452018, 394314, 454956, 438037, 455382, 512678, 502829, 403601, 318987, 350031, 398054, 366697, 360482, 373369, 325770, 383776, 361754, 424377, 481848, 458547, 408571, 393819, 407703, 414936, 410513, 456217, 393118, 386201, 364410, 340054, 379079, 385780, 283044, 273736, 275450, 243881, 269900, 292200, 254677, 231437, 267796, 280386, 269018, 278245, 297416, 249910, 213137, 196253, 210259, 233716, 188619, 210399, 200194, 208179, 243077, 237864, 245484, 208793, 179493, 244664, 198711, 193105, 163092, 188976, 196473, 214878, 202112, 189005, 222751, 212616, 220740, 203516, 222514, 220558, 154547, 119804, 165657, 184787, 206372, 156099, 218127, 229681, 235053, 302941, 291943, 341914, 354847, 339039, 335489, 346090, 336545, 336690, 385340, 305548, 283945, 316132, 264911]
2858B64911k0807l6568L415o817K7106j2495J3616o326q851P093k6327r245m6667
2845A42038J2165O540K8522k1931K8660p592J0604Q349m9313n2025O49J1071l4768
2832H2969k5511O7837o3084j1267P4084q889m988K9989J7368P5017m193o2085
2820A67247m5490l241J3199n1658J4500q5N0232M1567o1698J846l618N639L1292
2807A59732o8648m1072K7290N2900l8220M8625J0383q6147M0837M1237o2753k3049
2795F1115M8232k0713P486k7885m2056L0534L8203L2343m5020j4888j9269K1900
2783F9982m704q9288M2193Q0957J0551o3691j9547L4567j7767l4491n497R407
2771A2672j3230L9306N0181k0321l883j2774o4076l3969K7329Q3767K2596j2900
$$ y = [264911, 244104, 207536, 210951, 204134, 231240, 218745, 232361, 226035, 217184, 224277, 197950, 188705, 142038, 154203, 160743, 189265, 167334, 195994, 188402, 199006, 207355, 158042, 106017, 106666, 117737, 82969, 57458, 125295, 62211, 50944, 125028, 116139, 111151, 141140, 158508, 233525, 229332, 167247, 121757, 118516, 131715, 80057, 94557, 94472, 144704, 186271, 124573, 126419, 122801, 128440, 159732, 91084, 50012, 77302, 130202, 91982, 140607, 150990, 64843, 105680, 146917, 84164, 61115, 109347, 88634, 96120, 68235, 26179, 56713, 94916, 127259, 82239, 67351, 48082, 69982, 65278, -24010, 18183, 99140, 109691, 46000, 26453, 61020, 43253, 8762, 3265, 12672, -558, 38748, 88929, 68608, 64725, 51951, -12125, -46094, -18765, 65002, 87598, 74698]
2759G4698l3599J152J8072l7700k021k6738L8298k0098O7262K9584%q6258m5348
2746b2696L0243L4945m8594O7325M2060j13025k3556P4936P644l0548L8240l3942
2734B3032M6868J1573k1999K9449N211R94L579n9035J3026L7150k4749j8524m2611
2721C964n5760j1705R819R9965L5617m575m6922k9778j5461M6038L40M0986k6970
2708D5558m4612O1315m1658Q967L4433p0502O745M079m9378m981j274m276Q017
2695d7567N1765O8871M871L3207J9255q2634o0521N772L7678M7623o3707L6991
2683E1604m4663j7603J9804j0205j3860N5530l5158k0786L805j4326m0111P7993
2671A2024K8831p3011j2362R627j821k9239K8191M2275J8332J0794k4009o4836
$$ y = [74698, 41099, 42251, 60323, 22623, 20602, -6136, 32162, 12064, 79326, 108910, 108910, 22652, -22696, 7547, 42492, -6102, 61223, 103283, -9742, -33298, 41638, 49282, 18734, 56974, 23032, 69900, 81473, 59474, 88923, 94134, 95128, 98707, 39672, 52698, 89848, 65099, 46575, 3964, -51796, -63501, -53682, 46283, 81900, 77325, 30403, 625, -14836, 31202, 31542, 72528, 45558, 946, 62261, 20603, 29570, 64003, -6499, 246, 4325, -45053, -50034, -51308, -55584, -47567, 4198, 73069, 77940, 111147, 130402, 47768, -12753, -6981, 30697, 78320, 14613, 51604, 6941, -10662, 9142, -1063, -14923, 40607, 5449, -15337, -11532, -25858, -65969, 12024, 40855, -32156, -44518, -34891, -36712, -65951, -37760, 4515, 22847, 33641, 9632, -55204]
2659e5204m337L2230L6981p5881K4466K5666N5541k4763l3919J5669j8559J0131
2647a1979l6841j0985j8112J2530J3115L5551R750m7868L3470N1032m2595n7939
2635g0871L3012L0635J9215n3695p592L3233j6154N478N5543n344R537l3983l5935
2622c6921J2174N8216j0294n3271j9429O6692j5969j1251l03N0883l5144p86j3916
2609i319J9450M3363l8566m0162L364k5313R742M0403k7051L3467J2148m2059
2597b0533q8495L7378J36536J6013M0531k6341n3506Q6764j0565o1252o60l5906
2585A9964j9806O4763L393j0015J2223o4405j318K2942j1381O287J1177k2252
2573A1572N8165p2492p3409Q3535Q44l6621k7927J1111k81l3093J5573L3104m2247
$$ y = [-55204, -59541, -27311, 9670, -66211, -41745, -16079, 39462, 14699, -19220, -3551, -22110, -11979, -48820, -59805, -77917, -65387, -52272, -16721, -6971, -54839, -21369, 29663, -12932, -70871, -37859, -7224, 11991, -41704, -49296, -16063, -32217, -26739, 28804, 23460, 32997, -986, -36921, -24747, 33469, 23175, -30096, -49525, 17167, 1198, -10053, -10356, 40527, 5383, 4597, -9319, 10131, 53494, 14928, -25234, -21870, -47183, -37441, 2962, -24089, 9378, 21526, -20533, -109028, -71650, 64886, 80899, 121430, 95089, 41583, 128347, 117782, 56530, 55870, 19964, 158, 64921, 68314, 58299, 70522, 6117, 4799, 27741, 16360, 22647, 33824, 11572, 69737, -2755, -76164, 7371, 8215, -28406, -56333, -45222, -45503, -78596, -63023, -29919, -72166]
2560g2166J3893N5495m7343O352k1244J6221O3419K9138K5833K589j6438q7743
2548c1994m788L1310L6258j7738J8043n3831k9253K2227n4781M7677M7682l0490
2536a9678K5229l9637L9674l7798o3382j5755O1466K7102M5965q476k7254k8622
2524d1166k2120l102K0126L1292n291K0004N504P385q460L2722k1801l5105k7884
2511d7896K086O0690J3733k5867m9552j3779N1879L2533k0890K9725L8660l4417
2499C6905q427l430k806n694k255l0083K7966M7070P048K842k1136l6295p508
$$ y = [-72166, -58273, -2778, -50121, -43769, -65013, -48792, 14627, 43765, 69598, 72187, 55749, -31994, -36782, -5472, 30786, 13048, 31091, -22740, -51993, -29766, -84547, -36870, 10812, -19678, 5551, -34086, 5588, -32210, -95592, -111347, -49881, -22779, 23186, 14710, -12544, -41166, -63286, -66388, -46262, -14970, -20261, -257, 5247, 12632, 4172, 36894, 15093, -20012, -47896, -45810, 14880, 28613, 2746, -46806, -60585, -8706, 23827, 2937, 32662, 71322, 36905, 28478, 25048, 22242, 16548, 14293, -15790, 12176, 59246, 66294, 69136, 48000, 11705, 4197]
$$ [...]
##END NTUPLES=NMR SPECTRUM
##END=
