##TITLE=1H_TG-2389-3
 200.13MHz, CDCl3,
 8 sc
 
 15.8.2025
##JCAMPDX= 6.0         $$ Bruker NMR JCAMP-DX V2.0
##DATA TYPE= NMR SPECTRUM
##DATA CLASS= NTUPLES
##ORIGIN= UXNMR, Bruker Analytische Messtechnik GmbH
##OWNER= pz
$$ XWIN-NMR		Version 3.5
$$ Fri Aug 15 14:48:17 2025 Russian Standard Time (UT+4h)  she@DPX200
##.OBSERVE FREQUENCY= 200.1313
##.OBSERVE NUCLEUS= ^1H
##.ACQUISITION MODE= SIMULTANEOUS
##.ACQUISITION SCHEME= undefined
##.AVERAGES= 8
##.DIGITISER RES= 18
##SPECTROMETER/DATA SYSTEM= spect
##.PULSE SEQUENCE= zg30
##.SOLVENT NAME= CDCl3
##.SHIFT REFERENCE= (INTERNAL, CDCl3, 0, 15.4913)
##AUDIT TRAIL= $$ (NUMBER, WHEN, WHO, WHERE, WHAT)
$$ ##TITLE= Audit trail, XWIN-NMR		Version 3.5
$$ ##JCAMPDX= 5.01
$$ ##ORIGIN= Bruker BioSpin GmbH
$$ ##OWNER= she
$$ F:/spectra/data/she/nmr/H-C/1/pdata/1/auditp.txt
$$ ##AUDIT TRAIL=  $$ (NUMBER, WHEN, WHO, WHERE, WHAT)
(   1,<2025-08-15 14:47:02.12 +0400>,<she>,<DPX200>,
      <created by zg, POWCHK disabled, PULCHK disabled
       configuration hash MD5:
       00 E9 B6 7A A2 85 ED C7 34 08 36 98 17 FE 4E 26
       data hash MD5: 16K
       F7 7F 5D 89 74 18 5D 4A AB 76 F9 E5 4F A8 E7 C6>)
(   2,<2025-08-15 14:47:04.50 +0400>,<she>,<DPX200>,
      <Start of raw data processing
       efp BC_mod = 2 LB = 0.25 FT_mod = 6 PKNL = 1 PHC0 = -1718.704 PHC1 = 11.79228 SI = 16K 
       data hash MD5: 16K
       B7 DB AD F4 0D C5 6E 59 EB A1 49 56 5B C5 0F D4>)
(   3,<2025-08-15 14:47:26.96 +0400>,<she>,<DPX200>,
      <pk PHC0 = 156.935 PHC1 = 3.799999 
       data hash MD5: 16K
       0C 71 2E D7 7E CE E1 8B E5 D9 E7 BD 34 FC 15 D8>)
(   4,<2025-08-15 14:47:30.78 +0400>,<she>,<DPX200>,
      <abs ABSG = 5 
       data hash MD5: 16K
       B9 C1 42 89 98 13 96 BC 87 F4 4F C8 5D A8 E0 95>)
$$ ##END=
$$ 
$$ hash MD5
$$ 1F 9E 60 35 08 9F 7C 9F B0 31 CD B4 A8 CD 17 BC
##$RELAX= 
##$RELAX= 
##$RELAX= 
##$RELAX= 
##$RELAX= 
##$RELAX= 
$$ Bruker specific parameters
$$ --------------------------
##$DU= <F:/spectra>
##$EXPNO= 1
##$NAME= <H-C>
##$PROCNO= 1
##$TYPE= <nmr>
##$USER= <she>
##$AMP= (0..31)
100 100 100 100 100 100 100 100 100 100 100 100 100 100 100 100 100 100 
100 100 100 100 100 100 100 100 100 100 100 100 100 100 
##$AQSEQ= 0
##$AQ_mod= 1
##$AUNM= <au_zg>
##$AUTOPOS= <>
##$BF1= 200.13
##$BF2= 200.13
##$BF3= 200.13
##$BF4= 200.13
##$BF5= 200.13
##$BF6= 200.13
##$BF7= 200.13
##$BF8= 200.13
##$BYTORDA= 1
##$CFDGTYP= 0
##$CFRGTYP= 5
##$CHEMSTR= <none>
##$CNST= (0..31)
1 1 145 1 1 1 1 1 1 1 1 1 1 1 1 1 1 1 1 1 1 1 1 1 1 1 1 1 1 1 1 1 
##$CPDPRG= <>
##$CPDPRG1= <>
##$CPDPRG2= <>
##$CPDPRG3= <>
##$CPDPRG4= <mlev>
##$CPDPRG5= <mlev>
##$CPDPRG6= <mlev>
##$CPDPRG7= <mlev>
##$CPDPRG8= <mlev>
##$CPDPRGB= <>
##$CPDPRGT= <>
##$D= (0..31)
0 0.7 0 0 0 0 0 0 0 0 0 0.03 0 0 0 0 0 0 0 0 0 0 0 0 0 0 0 0 0 0 0 0 
##$DATE= 1755254821
##$DBL= (0..7)
120 120 120 120 120 120 120 120 
##$DBP= (0..7)
150 150 150 150 150 150 150 150 
##$DBP07= 0
##$DBPNAM0= <>
##$DBPNAM1= <>
##$DBPNAM2= <>
##$DBPNAM3= <>
##$DBPNAM4= <>
$$ [...]
##$SUBNAM3= <"">
##$SUBNAM4= <"">
##$SUBNAM5= <"">
##$SUBNAM6= <"">
##$SUBNAM7= <"">
##$SUBNAM8= <"">
##$SUBNAM9= <"">
##$SW= 18.0517328524113
##$SWIBOX= (0..15)
0 0 2 0 0 0 0 0 0 0 0 0 0 0 0 0 
##$SW_h= 3612.71676300578
##$TD= 16384
##$TD0= 1
##$TE= 0
##$TE2= 300
##$TE3= 300
##$TEG= 300
##$TL= (0..7)
0 120 120 120 120 120 120 120 
##$TP= (0..7)
150 150 150 150 150 150 150 150 
##$TP07= 0
##$TPNAME0= <>
##$TPNAME1= <>
##$TPNAME2= <>
##$TPNAME3= <>
##$TPNAME4= <>
##$TPNAME5= <>
##$TPNAME6= <>
##$TPNAME7= <>
##$TPOAL= (0..7)
0.5 0.5 0.5 0.5 0.5 0.5 0.5 0.5 
##$TPOFFS= (0..7)
0 0 0 0 0 0 0 0 
##$TUNHIN= 0
##$TUNHOUT= 0
##$TUNXOUT= 0
##$USERA1= <user>
##$USERA2= <user>
##$USERA3= <user>
##$USERA4= <user>
##$USERA5= <user>
##$V9= 5
##$VALIST= <valist>
##$VCLIST= <CCCCCCCCCCCCCCC>
##$VD= 0
##$VDLIST= <DDDDDDDDDDDDDDD>
##$VPLIST= <PPPPPPPPPPPPPPP>
##$VTLIST= <TTTTTTTTTTTTTTT>
##$WBST= 1024
##$WBSW= 4
##$XGAIN= (0..3)
0 0 0 0 
##$XL= 0
##$YL= 0
##$YMAX_a= 163934
##$YMIN_a= -227599
##$ZGOPTNS= <>
##$ZL1= 120
##$ZL2= 120
##$ZL3= 120
##$ZL4= 120
##$ABSF1= 15.58933
##$ABSF2= -2.462522
##$ABSG= 5
##$ABSL= 3
##$ALPHA= 0
##$AQORDER= 0
##$ASSFAC= 0
##$ASSFACI= 0
##$ASSFACX= 0
##$ASSWID= 0
##$AUNMP= <proc_1d>
##$AZFE= 0.1
##$AZFW= 0.1
##$BCFW= 0
##$BC_mod= 2
##$BYTORDP= 0
##$COROFFS= 0
##$CY= -3
##$DATMOD= 1
##$DC= 0
##$DFILT= <>
##$DTYPP= 0
##$F1P= 0
##$F2P= 0
##$FCOR= 1
##$FTSIZE= 16384
##$FT_mod= 6
##$GAMMA= 0
##$GB= 0
##$INTBC= 1
##$INTSCL= 3.241238e-09
##$ISEN= 128
##$LB= 0.25
##$LEV0= 0
##$LPBIN= 0
##$MAXI= 10000
##$MC2= 0
##$MEAN= 0
##$ME_mod= 0
##$MI= 1.114404
##$NCOEF= 0
##$NC_proc= -7
##$NLEV= 6
##$NOISF1= 3.799351
##$NOISF2= 2.8
##$NSP= 0
##$NTH_PI= 0
##$NZP= 0
##$OFFSET= 15.49127
##$PC= 1
##$PHC0= -1561.769
##$PHC1= 15.59228
##$PH_mod= 1
##$PKNL= yes
##$PPARMOD= 0
##$PSCAL= 0
##$PSIGN= 0
##$REVERSE= no
##$SF= 200.130006089877
##$SI= 16384
##$SIGF1= 3
##$SIGF2= 2
##$SINO= 0.751879
##$SIOLD= 32768
##$SREGLST= <19F.Aceton>
##$SSB= 0
##$STSI= 16384
##$STSR= 0
##$SW_p= 3612.71676300578
##$SYMM= 0
##$S_DEV= 0
##$TDeff= 16384
##$TDoff= 0
##$TI= <>
##$TILT= no
##$TM1= 0
##$TM2= 0
##$TOPLEV= 0
##$USERP1= <user>
##$USERP2= <user>
##$USERP3= <user>
##$USERP4= <user>
##$USERP5= <user>
##$WDW= 1
##$XDIM= 16384
##$YMAX_p= 361930931
##$YMIN_p= -2174211
$$ End of Bruker specific parameters
$$ ---------------------------------
##NTUPLES= NMR SPECTRUM
##VAR_NAME=  FREQUENCY,     SPECTRUM/REAL,   SPECTRUM/IMAG
##SYMBOL=    X,             R,               I
##VAR_TYPE=  INDEPENDENT,   DEPENDENT,       DEPENDENT
##VAR_FORM=  AFFN,          ASDF,            ASDF
##VAR_DIM=   16384,         16384,           16384
##UNITS=     HZ,            ARBITRARY UNITS, ARBITRARY UNITS
##FACTOR=    0.220516191357247, 1,           1
##FIRST=     3100.26797250994, 0,            0
##LAST=      -512.448790495837, 0,           0
##MIN=       -512.448790495837, -2174211,    0
##MAX=       3100.26797250994, 361930931,    0
$$ Real data points
##PAGE= N=1
##DATA TABLE= (X++(R..R)), XYDATA
$$ [...]
8254 -69528 -161992 -176163 -202551 -566113 -507091 -244659 -38051 -107315 -107492 -81731 -327117
8243 -327117 -536152 -429115 -182744 -200951 -389489 -245048 -275698 -244688 -414498 -392437
8233 -392437 -442476 -518596 -149855 44044 -124401 -501121 -221816 -191253 -170951 -325259
8223 -325259 -330665 -160026 -205977 -434442 -380123 -211058 -548663 -290122 -36608 112808
8213 112808 -127416 -35227 -102403 -115477 -122367 -125593 -18823 -229134 -400836 -303497 -249761
8202 -249761 -136919 -70977 81232 63468 67235 23913 -38276 40631 -130359 -737355 -2174211
8191 -2174211 -1214847 -667832 -687955 -794303 -590809 -239416 -295474 -346093 -281062 -287081 -299612
8180 -299612 -186525 -259159 -207927 -10535 -188851 -327907 -311679 -559498 -301518 -365478
8170 -365478 -271452 -157793 -271864 -344704 -509676 -372708 -397834 -646140 -410121 -213644
8160 -213644 -161138 -276508 -245201 -16814 -182235 -195402 -221334 -500392 -432541 -298856 -212646
8149 -212646 -270520 -17443 -41372 -55840 -22534 -82617 12098 211526 39367 67581 -88162
8138 -88162 -192864 -94732 2912 -59681 -14690 2081 -20519 -151855 -207735 -190526 -39505
8127 -39505 -10912 -294208 -225652 -135042 61702 211684 129313 -63110 -86118 96586 -130082
8116 -130082 -93050 -145037 -482379 -690364 -693293 -488957 -587457 -277820 -234812 -176929 -93881
8105 -93881 -377081 -385848 -326471 -346945 -377552 -476163 -129732 -96123 -382058 -192173 -167613
8094 -167613 -319820 -221917 -385835 -405078 -388781 -233916 -273774 -317594 -101997 -246715 -276715
8083 -276715 -266481 -298240 -197099 -257647 -110872 -122396 -127408 -215557 -251356 -265448 -275861
8072 -275861 -155229 -343014 -253637 -389767 -414881 -516077 -501891 -368344 -218900 -217844 -114533
8061 -114533 -168149 -271249 -323499 -290096 -236580 -371806 -349520 -523302 -381753 -168482 -55101
8050 -55101 -392734 -511878 -319022 -311002 -271312 -164908 -272315 -450745 -321994 -306784 -459658
8039 -459658 -267999 -169444 -75423 35871 -75682 -196465 -143913 -184061 -261507 -376078 -522972
8028 -522972 -501049 -596856 -525839 -597744 -576520 -413112 -432980 -415597 -424810 -328056 -326700 -310066
8016 -310066 -246169 -368253 -342741 -388468 -396156 -402371 -381740 -70664 -146475 25181 8771
8005 8771 -350896 -449614 -636906 -577591 -276867 -400144 -421073 -552052 -416730 -239486 -250225
7994 -250225 -387133 -528655 -206297 -27681 -221263 -301532 -280566 -98121 -118256 -397563
7984 -397563 -288528 -128938 40677 59065 80531 -58149 -443674 -479879 -456508 -470415 -322829
7973 -322829 -259635 -151150 -157973 -297623 -475348 -491097 -414563 -451000 -372714 -355133 -482596
7962 -482596 -480346 -334882 -446502 -401134 -283501 -116339 -265805 -291310 -111404 -59751 224
7951 224 -180568 -192970 -182963 -220415 -309260 -241922 -66721 116018 -158946 -133273 -441007
7940 -441007 -436599 -321280 -207824 -567320 -563159 -241177 -99548 -123122 -370010 -317539 -284479
7929 -284479 -302647 -151533 -74839 -248100 -352323 -725342 -493469 -366115 -450314 -474281
7919 -474281 -461551 -525598 -531518 -330794 -537011 -353562 -370239 -514742 -320975 -211957 -410667
7908 -410667 -326981 -232964 -331182 -426975 -439016 -232973 -209976 -144766 -588450 -496205 -312471
7897 -312471 -539484 -560286 -424841 -314911 -210893 -333234 -333869 -292901 -505196 -400935 -359420
7886 -359420 -234547 -381695 -266349 -161773 -554633 -447257 -148004 -228581 -307773 -150534
7876 -150534 -100665 -15710 -198821 -196365 -212098 -356813 -489557 -646049 -259580 -11232 15652
7865 15652 -256439 -501312 -346124 -413970 -355725 -168946 -214267 -428969 -473659 -515075 -554049
7854 -554049 -457747 -384859 -277508 -127998 -31720 -176140 -54744 -248308 -309182 -407590 -517365
7843 -517365 -108780 -366998 -426450 -15550 25420 -21530 -262534 -257774 -225426 -320217 -214539
7832 -214539 -334103 -168983 -264262 -270626 -341037 -228600 -190358 -447991 -431016 -241114 -284847
7821 -284847 -241350 -352451 -373203 -251041 -241169 -89024 -124877 -208197 -251791 -434962 -512081
7810 -512081 -314436 -256398 -445316 -367619 -340721 -464680 -581255 -451970 -558204 -463264
7800 -463264 1095 -330443 -209300 -49211 -49834 -44152 -79431 6335 -213763 -206983 -240351
7789 -240351 -258694 -145270 -54671 -109269 -275866 -382780 -464630 -386452 -116765 -29226 -185985
7778 -185985 -178660 -176126 -281513 -433334 -519357 -352340 -376099 -258868 -191955 -203238 -239654
7767 -239654 -54667 -205457 -413556 -407140 -483832 -374050 -107625 76855 380801 309895
7757 309895 121908 -22420 -234198 -22795 -156896 -161666 -202996 -23609 -200357 -103350
7747 -103350 -109878 -104139 -79257 -146797 -120415 -131702 -119047 427478 421918 195371 96742 -193764
7735 -193764 -195757 -210916 -386073 -271269 51471 33940 -72608 171916 -2507 45205 -39607
7724 -39607 -159507 -7522 -411561 -390724 -302865 -185358 -297257 -64065 -77593 -168153 -291603
7713 -291603 -101821 146576 36220 -17175 -106266 -126848 -253803 -186448 -337635 -215344
7703 -215344 -195754 -181028 -68359 -167763 -303618 -171118 -231256 -426366 -151715 60415
7693 60415 89051 31391 24482 -37298 75118 250428 -14051 21378 19567 3402 -139080
7682 -139080 -188782 -58996 -1915 -41694 -34794 -132219 -208154 133457 127136 145104 206120 108389
7670 108389 17804 -233873 -245559 46824 18364 18458 56647 8667 -96949 -130191 -199359 -125617
7658 -125617 136838 80090 154725 121752 -54218 56301 119597 134481 160263 100170 -63932
7647 -63932 -204466 -41917 143654 203561 -15938 -415047 -339550 -92444 -42356 -182160
7637 -182160 60144 -125729 -100778 -67913 -101523 -72691 -49177 -302316 -209821 -143265 -29893
7626 -29893 -151262 -130716 -129294 -153867 -40930 5361 -110223 -29545 137938 -26093 20907
7615 20907 -203975 -435966 -85042 233628 -81884 -323120 -67888 41176 -133087 -683
7605 -683 -197178 -96423 -106499 -315517 -276612 -224143 -339295 -207663 -103251 -186022 -259793
7594 -259793 -343618 -310525 -218514 -104563 -49230 56329 1323 207932 119472 -67387 -48269
7583 -48269 -16816 -102943 43839 -57730 -119079 38850 -94115 124854 147942 -6664 142571
7572 142571 373118 193975 285261 193521 134446 282647 3222 128053 321172 327960 114263
7561 114263 -387422 -137417 88923 18959 -45393 62612 -108106 85307 85466 229773 380796
7550 380796 277721 32800 98247 268134 377066 178460 259220 257496 141530 -4147
7540 -4147 -18787 -3321 77094 -91949 -291183 -145851 -206017 162041 173416 170229 187920
7529 187920 228483 13521 213162 199912 -34444 176241 360383 480287 285525 308784
7519 308784 515934 474796 383795 172450 199896 314660 291046 328600 227660 317579 -638
7508 -638 184075 583201 288165 64102 399356 416527 438002 515658 232640 173936 421142
7497 421142 623375 359774 694940 898742 783057 445764 440083 837116 1047354 835691
7487 835691 839294 669165 910333 968676 918713 946289 1048727 916560 848058 1029072 1106586
7476 1106586 1079106 1315248 1066008 1032648 972973 1082549 1412729 1319690 1375832 1674221
7466 1674221 1936393 1796579 1921262 2202653 2477245 2456913 2791510 3113811 3196969 3272243
7456 3272243 3405564 3817249 4102189 4292004 4828015 5211300 5420001 6024814 6382660 6596970
7446 6596970 7459003 8096122 9054653 9991562 11054826 12216355 13473510 14541382 15241417
7437 15241417 15321142 15178546 14894135 14372969 13552677 12639180 12092747 11495857 11006288 10664473
7427 10664473 10373777 9917768 9470796 9293587 8947575 8608221 8033710 7457691 7213553
7418 7213553 6976268 6649703 6551733 6510102 6295429 6158377 5871665 5975902 5791860 5549089
7408 5549089 5700356 5813898 5876677 5779833 5582572 5658272 6137321 6469059 6472249 6831077
7398 6831077 7238728 7761151 8204102 8561832 9124288 9957142 10856210 11815401 12810493 13983515
7388 13983515 15512087 17112658 19061913 21838103 24948537 28130069 31721806 35291963
7380 35291963 38362988 40503703 41709372 41473416 40303441 38465217 36177042 33576351
7372 33576351 31171841 28997537 27049900 25285679 23804888 22553637 20940994 19733781
7364 19733781 18484046 17076700 15775921 14500996 13144873 12345842 11511635 10758960 10402314
7355 10402314 9526360 9033793 8738591 8116620 7629014 7175409 6760177 6592031 6413959
7346 6413959 6283564 6068883 5904079 5556122 5496955 5094843 4791288 4772160 4616853 4483201
7336 4483201 4249384 3972776 3778837 3789241 3717196 3878461 3735143 3833163 3938763 3781765
7326 3781765 3609863 3561198 3661976 3988373 3960486 4028465 4273732 4409540 4650945 5089147
7316 5089147 5215850 5432252 5802139 5734524 5522095 5473599 5732184 5388096 5183342 5045601
7306 5045601 4603557 4469550 4407418 4356227 4082227 3716925 3730652 3739067 3392036 3158963
7296 3158963 3335958 3225484 3147363 3209782 3533289 3549839 3640433 3583200 3780267 4301194
7286 4301194 4095871 4247011 4577087 4766871 4992095 4914842 4795304 4890833 4790256 4878182
7276 4878182 4626526 4359639 4325197 4013208 3808613 3543419 3396482 3226013 2760838 2652720
7266 2652720 2565304 2463941 2421714 2150479 2098527 2118538 1938996 2084339 2175641 2209054 2272160
7255 2272160 2133155 2214375 2128499 2023618 2206859 2201914 2305170 2322085 2184012 2135563 2217061
7244 2217061 2196058 2134230 1821487 1778132 1456464 1414153 1525446 1303786 1247717 958250
7234 958250 1109873 1069949 978715 1217570 1224069 1130877 1228884 1094879 961574 870900 786346
7223 786346 742083 867982 801115 950961 1085842 1112139 953249 846205 749821 593642
7213 593642 754765 650138 941909 1214263 1007640 785365 742997 761482 642726 669197
7203 669197 748497 715182 366737 732148 796575 731468 1002577 996831 780675 618081 867934
7192 867934 996026 909630 871346 866766 734151 870253 943491 794992 690194 772423 727793
7181 727793 760558 795096 629721 633920 793144 769834 768725 775336 564868 741367 769799
7170 769799 541717 612679 597646 432203 447468 663083 270800 52586 411190 761126
7160 761126 652302 649072 667007 635654 625636 421560 478369 314325 233002 409131 490381
7149 490381 408524 433126 504351 491067 366495 369507 417011 478746 395038 286480 643471
7138 643471 747353 443313 369754 543375 580618 586596 769139 735616 806458 836936 883526
7127 883526 1192208 1157685 1146152 1274207 1197527 1430418 1634866 1688053 1623601 1483479 1246418
7116 1246418 782442 692234 925961 1083530 859055 743499 736536 900609 604262 640773
7106 640773 655290 725142 500651 378412 544382 438731 382554 517196 506604 460288 412964
7095 412964 695223 341374 378960 517052 331944 -46244 -98419 429005 389531 265025
7085 265025 212839 539963 402798 455306 621372 709702 501358 638154 767516 619393
7075 619393 731149 1125684 1012270 1056414 1215468 1360990 1242517 955452 1030366 963856
7065 963856 908093 887513 774900 1097222 1165233 1109792 1328762 1446495 1280759 1245350 1136951
7054 1136951 1021433 1105322 1297547 1115814 1164508 1218237 1295063 1647766 1903860 1970810
7044 1970810 2410113 2384274 2414442 2537657 2494655 2362531 2470125 2403740 2048760 1945728
7034 1945728 1914947 1756681 1637143 1442699 1577353 1712470 1540463 1724753 1464211 1683119
7024 1683119 1804213 1654504 1518782 1454541 1409386 1708632 1678573 1752366 1784615 1800579 2059690
7013 2059690 2396173 2472919 2380354 2049478 2156780 2187820 2131870 2099184 1989019 2294685
7003 2294685 2258509 1889048 1786695 1578696 1249858 1357529 1467977 1099204 888115 868595
6993 868595 851946 954366 868994 742556 450346 602344 884566 1055115 1127847 955499
6983 955499 857957 913328 1157367 1083840 686093 749960 973893 845631 664813 526746
6973 526746 789744 751380 463443 654870 689706 558995 301586 139156 337519 349473
6963 349473 370390 346155 331712 576631 813526 517024 197599 146430 174521 169338 443517
6952 443517 351835 271074 -41085 -175513 -65106 -210900 -194819 -49922 58891 111560
6942 111560 176957 388021 291064 -51795 41049 219463 180346 114718 147769 70823 -65602
6931 -65602 -99682 -113923 -193192 -12696 -349235 -380187 53615 81830 -24464 103855 -43752
6920 -43752 -193753 -176322 -443260 -453255 -123599 -52292 -90172 -133255 -258399 -257007 -176375
6909 -176375 -314332 -334696 -212974 -145431 -362523 -121827 159225 139784 -141745 -112648
6899 -112648 170431 228311 342801 226083 52780 442722 425092 449865 518036 349688
6889 349688 239176 286286 152505 239545 336177 295432 391438 431046 510438 521996 617501
6878 617501 531574 349675 303071 276163 2270 -89047 -92253 88162 153489 239090 242564
6867 242564 271278 202744 92929 240890 132259 124346 251255 511127 435027 113681 25694
6856 25694 131927 376091 274377 418914 559550 705721 870087 788804 758773 628145
6846 628145 485143 279590 189648 74166 184547 381025 164987 167394 385720 340791
6836 340791 174534 250971 235363 465875 549153 390891 441795 380232 346153 425778 645758
6825 645758 796459 657159 547996 966586 909687 831717 916720 1037016 1204356 960183
6815 960183 638287 414422 484357 581924 550573 212556 331076 377837 540284 395780
6805 395780 576663 679628 366001 303971 353641 315333 335766 504456 507465 882049 601566
6794 601566 591141 727112 497771 484184 741020 519529 215825 363179 311184 170155
6784 170155 265591 383739 391426 213827 191704 242013 333967 280566 293498 387245 406202
6773 406202 557841 271131 220416 311561 514826 396867 244811 233235 252400 295661 474620
6762 474620 285719 263211 78158 62750 84955 -125054 133531 217900 46506 109064 -3544
6751 -3544 -30792 8088 94623 -19878 -182539 -257312 -92044 -41205 -53961 190211 114313
6740 114313 67584 125146 -145709 -343840 -231123 -113350 -37838 -28623 74694 -54714 162005
6729 162005 104036 45096 83592 -40055 -106997 -143891 -267832 -246563 17398 -142514 -93307
6718 -93307 -198575 -443475 -291521 -58404 -182400 -167719 46777 -40164 55077 -111889
6708 -111889 27830 8198 -240507 -214882 -80269 -196524 -179022 -289488 -261869 -236419 143573
6697 143573 -2025 92131 162171 136324 128726 1274 223191 126207 -40104 -8493 -282264
6686 -282264 -398653 -328884 -127900 329696 137076 -119298 43090 210347 70210 65718
6676 65718 -40181 -256244 4127 -106512 -33280 108571 66412 257556 213492 341069
6666 341069 310006 72103 -9830 -7024 12477 98383 100222 153101 145744 -212632 -249480 -39172
6654 -39172 -149755 -49499 94145 -198759 22260 10282 65030 146688 -7655 -33984 -46982
6643 -46982 -241 23297 189368 147169 -8108 9008 153522 94635 -29562 -117951 -41219
6632 -41219 187531 171781 202919 347418 59605 53753 -150741 47455 -80196 -110847 3545
6621 3545 238276 230601 491501 353336 81942 52099 -459 116347 169245 209851 376129
6610 376129 368836 168784 22141 67722 -58426 -171438 -2357 285178 667052 433033
6600 433033 7708 111475 -13274 -81338 -49461 111291 204141 3502 118078 146164
6590 146164 150990 71060 -16508 -145495 -13445 266039 309096 457386 588607 467396 634713
6579 634713 901374 557368 683865 691142 355197 287196 300302 584048 488629 487159 335292
6568 335292 193069 304680 180732 138742 244297 200619 262445 264199 373220 460033 459632
6557 459632 235515 165341 332624 393408 251657 122004 54089 335747 360225 442645 374396
6546 374396 397608 275045 427121 713896 378896 227495 184365 180499 242630 274893 255895
6535 255895 28600 -5598 250074 390530 356958 741117 415381 432685 624853 342314
6525 342314 149874 142974 228403 55778 198921 47685 41841 378899 742159 714104 560503
6514 560503 317030 381599 382066 285839 358446 372059 318824 84505 90820 455363 778685
6503 778685 578991 525304 814368 774421 581493 400422 292667 219115 317153 452722
6493 452722 462564 627638 926158 1057836 914728 672208 709058 645965 935896 987911 966445
6482 966445 990633 1187080 1336315 1541503 1521045 1495984 1502223 1342193 1581589 1599314 1762714
6471 1762714 1569190 1734172 1640990 1298937 1166954 1254229 1437592 1281725 1213785 1317147
6461 1317147 1262328 1186059 1018126 830623 1112938 1125156 978858 870827 897002 1112094
6451 1112094 1012911 963564 1070155 1128618 1095037 1046212 1098883 969176 771704 941714 1116826
6440 1116826 1133904 963373 915323 1001486 1071865 1014381 775543 768518 877678 762095 492853
6429 492853 473747 595291 751323 899610 665128 679582 713115 556763 683323 597446
6419 597446 646190 841623 510875 499153 466566 533718 698011 318384 392804 393186 514372
6408 514372 391530 440527 518998 588050 542384 348281 223993 215023 538770 613980 336814
6397 336814 433221 746065 687772 641776 511682 599535 544706 606257 643975 497039 481783
6386 481783 505531 709153 691142 708974 779708 775756 674257 559416 484944 599918 647256
6375 647256 465295 611767 570478 722694 743706 804258 1034299 951146 1118454 958949
6365 958949 1015254 860336 724289 809975 1016820 969801 1002874 1034544 1012824 1083568 855877
6354 855877 998988 1116355 1028122 891915 963754 937103 1002849 983102 856350 828306 682570
6343 682570 767102 917451 962994 938030 1276915 1401215 1363147 1369849 1368514 1387744 1397026 1600460
6331 1600460 1707192 1835820 2096739 2388095 2391933 2369091 2414776 2880927 3212918 3845181
6321 3845181 4223030 4330266 4300904 4092858 4296168 4141346 3920663 3768587 3971585 3993242
6311 3993242 3964376 4030040 4027444 4299379 4439890 4535981 4827626 5193681 5412856 5860133
6301 5860133 6507917 6967085 7174115 7427109 7362194 7490092 7358908 6956145 6555315 6181912
6291 6181912 5897374 5709391 5382564 5292886 5256899 5197199 5357104 5403969 5244313 5105720
6281 5105720 4843302 4730115 5238905 5668699 5785799 6008155 5756133 5694513 5761319 5472615
6271 5472615 5191936 4980539 4626143 4085427 4120978 3886546 3570093 3601543 3644025 3327967
6261 3327967 3068641 2970164 2687468 2664854 2743885 2701070 2616039 2465002 2523868 2423630 2384165
6250 2384165 2388010 2153813 2210941 2266746 2367084 2296530 2136733 2481784 2363516 2260172
6240 2260172 2251491 2316466 2191900 2108580 2363856 2416646 2092671 1932846 2117902 2324852
6230 2324852 2298921 2000363 2090270 1964876 2077178 2346328 1996058 2043915 2231970 2122812
6220 2122812 2132332 2193170 1961433 1959465 2075772 1946280 1998369 2113720 2195229 1987157 1731200
6209 1731200 1926218 1899669 1958862 2144459 2024257 1854714 1731955 1615332 1414264 1392825
6199 1392825 1539197 1612666 1657886 1480104 1314536 1550350 1531692 1149786 1405489 1342604
6189 1342604 1219419 1062762 1003295 1258589 1308276 1113118 1085088 1387600 1387363 1290217 1239021
6178 1239021 1344203 1174923 795890 861482 1203365 921627 1016765 868117 555885 463905
6168 463905 598856 962783 891315 966389 817698 758927 974808 896180 785465 729912 755492
6157 755492 992232 839996 872913 743392 767431 1016844 1015062 739274 671310 922039 666510
6146 666510 624432 747194 709655 658155 658039 638414 1067719 1033593 739137 674677 798678
6135 798678 776575 518000 950146 847553 758756 890611 587865 674040 799858 678150
6125 678150 785426 828377 887809 877099 699866 748135 680019 751564 820959 863759 785324
6114 785324 748337 638958 602000 837141 961971 771540 1016142 845059 886814 888534 873350
6103 873350 841985 693005 973238 943695 776689 973533 1019479 944934 868524 735135 821365
6092 821365 799683 842330 890354 842126 746664 795265 966549 984817 854856 889547 802965
6081 802965 1036510 917077 1011632 969470 762572 500898 936078 1236672 1054847 860039
6071 860039 896221 875628 989276 1045729 878375 824294 634664 887744 983749 791539 893076
6060 893076 916842 890290 883455 850123 864125 825488 989786 1038669 866044 907648 1094352
6049 1094352 931270 900378 707983 884330 881319 869812 794689 1018019 1112600 939585 922836
6038 922836 916897 961071 1021575 947981 927109 1183562 1027490 1013949 1266101 1046663 1246389
6027 1246389 1092207 1068117 1160765 1204294 1225695 1148953 1217804 1461867 1519538 1409851 1423306
6016 1423306 1413861 1317664 1118191 1448410 1412060 1347745 1540683 1370736 1531835 1825093
6006 1825093 1636288 1400851 1572635 1977089 2140367 2317044 2016433 1944294 1871579 1457369
5996 1457369 1505902 1686449 1561764 1591134 1695849 1900935 1390405 1318417 1887644 1920113
5986 1920113 1691832 1749700 1975226 2224376 2050340 1749777 1871095 1892662 2098650 2358990
5976 2358990 2525468 2893133 2810415 2384075 2103262 1871022 1991867 2229287 2341253 2300048
5966 2300048 1976653 2003199 2111287 2192009 1951619 1916847 2059184 2003150 2043166 2343834
5956 2343834 2202626 2103358 2013318 1885138 2022225 2164157 2066597 2394306 2558773 2323455
5946 2323455 2362874 2419720 2305915 2387697 2440575 2442021 2315322 1892636 2059774 2361846 2523754
5935 2523754 2453100 2475514 2740813 2744214 2647238 2778867 2919362 2966885 3040324 3097332 3177160
5924 3177160 3558992 3808473 4153682 4199018 4308295 4399754 5264813 5503039 5741925 6330626
5914 6330626 6913089 7439505 8338426 9249909 9984233 10503477 11140563 11728923 12170579 12545422
5904 12545422 12605830 12452929 12026869 11745102 11593987 11451122 11621250 11716818 11859638 12331683
5894 12331683 12600990 12959572 13506615 14585628 15690103 16963354 18187322 19676198 20748966
5885 20748966 21488635 22182855 22248629 22030099 21656209 21032744 20027381 19210479 18499355
5876 18499355 17691910 16630032 16024825 15833564 15646287 14887167 14423634 14413623 14314250 14668941
5866 14668941 14991220 15149042 15567386 15986664 16316611 16332689 16312403 16130767 15523495 14949101
5856 14949101 13861771 13039939 12360003 11719466 11204780 10689767 9979929 9309391 8641170
5847 8641170 8254498 7905420 7610670 7296875 6839837 6445322 6188490 5833750 5721689 5725716
5837 5725716 5429665 4877917 4731740 4633571 4714803 4584685 4357136 4356392 4019401 3936927 4060775
5826 4060775 4212963 4082999 3745981 3557639 3651967 3801819 3761939 3574954 3435750 3324726
5816 3324726 3296853 3289484 3271760 3044375 3057069 3087401 3054780 3074485 2845609 2858026 2638524
5805 2638524 2767804 2693921 2863763 2735158 2697994 2455699 2302881 2395649 2510442 2643441
5795 2643441 2467221 2325386 2293818 2276988 2320967 2434406 2526634 2330318 2225478 2324448
5785 2324448 2062320 2153368 1925343 1868829 2091474 2127603 1997318 1960206 2174571 2096762
5775 2096762 2099476 2134252 1968704 2039173 1940937 2098246 1966349 1888907 1849465 1997125 1935254
5764 1935254 2168129 2292922 2391051 2322126 2349771 2441330 2492728 2637705 2575079 2642723 2755294
5753 2755294 2803906 2671377 2489679 2622937 2886673 2912924 2759757 2921093 3187080 3027908
5743 3027908 2879146 2943533 3214785 3374537 3717580 3962435 4177838 4635920 4428881 4285486
5733 4285486 4590867 5088228 5196784 5506754 5856711 6237687 6583604 6748115 6750879 6913775
5723 6913775 6987040 6667879 6581677 6453609 6268770 6063250 6268268 6698854 6830487 6848194
5713 6848194 6815302 6800792 7102042 7315292 7792802 8118506 8893070 9671842 9989013 10444455
5703 10444455 10831183 10783367 10693876 10417379 10056705 9646424 9286302 8728785 8535699 8403087
5693 8403087 8081383 8015096 7894263 7806956 7504244 7349301 7270482 7291980 7668364 7870675
5683 7870675 7873638 7820859 7622530 7701654 7793514 7936075 7963000 7604185 7256599 7156538 7258019
5672 7258019 7364846 7598669 7484615 7171836 6937937 6450146 5999685 5773457 5613031 5441102
5662 5441102 5319869 5164497 4847750 4676209 4753746 4650302 4743378 4759444 4665058 4540764
5652 4540764 4405764 4388998 4218779 3995230 4008277 4299663 4137316 3972709 4000458 4287116
5642 4287116 4046431 3990726 4259898 4240046 4117697 4025931 3973394 3781836 3812326 3923024
5632 3923024 3743380 3310783 3348750 3470891 3553537 3531387 3551448 3703251 3422819 3440687
5622 3440687 3305802 2980292 3070532 3354752 3250417 2989930 3254731 3070401 3123990 3487787
5612 3487787 3529867 3274291 3098196 3252514 3125851 3060750 3063884 3081477 3100376 3190883 3212924
5601 3212924 3067324 3064958 2909693 2752667 3026892 3055470 2841115 2778658 2847861 2753038 2959065
5590 2959065 2819284 2939509 2990567 3086066 3132003 3084468 3157316 3111906 3248853 3073017 3114813
5579 3114813 3001986 2882636 2679856 2813279 2775692 2697884 2622755 2914392 2884705 2882875 2763325
5568 2763325 2524886 2545659 2609558 2621546 2485113 2319795 2111333 1999446 2228207 2404253
5558 2404253 2146507 2081620 2373148 2611957 2625997 2677849 2501415 2346403 2334205 2562542
5548 2562542 2461835 2549085 2548012 2505592 2591995 2408003 2430886 2339901 2602489 2456040 2614843
5537 2614843 2836704 2644759 2491945 2286964 2216757 2239171 2157831 1979815 2106767 2202086
5527 2202086 2133593 2287930 2241158 2277258 2309605 2242362 2373171 2304472 2216573 2276279 2349041
5516 2349041 2207626 2297569 2285880 2288907 2561338 2581165 2460664 2373310 2092643 2268474 2439522
5505 2439522 2136874 2245306 2228537 2173617 2250330 2311797 2434243 2261788 2260137 2495310 2413181
5494 2413181 2239251 2393603 2721702 2787887 2651015 2694993 2717221 2691973 2779653 2724504 2736221
5483 2736221 2707589 2666832 2780861 2814757 2859901 2801462 2795574 2950622 2949136 3187081 3329882
5472 3329882 3441487 3571420 3550883 3833001 3799269 3900844 4329654 4342913 4506872 4830737
5462 4830737 4945420 5382317 5760096 5656996 5781881 5823544 5609750 5768051 5863360 6142397
5452 6142397 6400521 6795741 6889231 7245549 7860490 8674592 9336410 9754264 10191470 10380734
5442 10380734 10428560 10937133 11174816 11363327 12288960 12871819 13426509 14452339 15569545
5433 15569545 16565504 17665283 18574363 19264705 19970003 20306973 20378873 20572312 20940919
5424 20940919 20941033 20813158 20815736 20536788 20397696 20435321 20434285 20675300 21032810 21361178 22081874
5413 22081874 22901807 23549899 24737258 25932020 26691428 27275138 27665441 27718823 27366116
5404 27366116 27201237 26713673 25976414 25198240 24403187 23521207 22477733 21481582 20539036
5395 20539036 19599798 19051225 18524347 18119109 17978561 17631887 17431549 17336129 17277572 17656309
5385 17656309 17523584 17056005 16668805 15987213 15322234 14487013 13831132 12958744 12333198
5376 12333198 11685350 11068371 10516557 10018586 9599133 9059734 8642197 8300413 7715001
5367 7715001 7379968 7077048 6709533 6299043 5893297 5802934 5711180 5410018 4966909 4794148
5357 4794148 4614580 4608656 4480174 4371690 4252629 4060426 3866043 3813190 3598826 3559088
5347 3559088 3645215 3582773 3535320 3307815 2969445 2974394 3050287 2896544 2791795 2999237 3077765
5336 3077765 2879905 2609078 2509113 2583731 2493824 2438934 2484708 2424917 2575234 2252981 2305547
5325 2305547 2450924 2386042 2485665 2389545 2524103 2423249 2377022 2581934 2287444 2272321
5315 2272321 2222091 2402440 2288769 2647641 2418029 2342952 2089606 1903398 2164279 2220899
5305 2220899 2107419 1978112 2081464 2139641 2265562 2114267 1800145 1604734 1888414 1811605
5295 1811605 1657280 1767307 1686222 1767322 1741904 1706292 1883361 1540149 1446028 1840457
5285 1840457 1869494 1862457 1936520 1602072 1773069 1645077 1871663 1787682 1855234 1693794 1715882
5274 1715882 1730540 1741227 1684421 1526328 1511373 1696796 1800754 1726371 1618848 1595397 1475591
5263 1475591 1529211 1463732 1545094 1508678 1511260 1396832 1459862 1602899 1455916 1581738 1351958
5252 1351958 1181165 1382167 1295935 1253343 1353672 1265634 1371189 1302436 1156870 1274731
5242 1274731 1261058 1146161 1017774 1052539 1223005 1178041 1117366 1104796 1351306 1270270 1347607
5231 1347607 1227294 1066621 1134050 930689 1016093 1205722 1365137 1295317 1586791 1670770
5221 1670770 1601005 1606205 1390266 1350721 1359472 1320606 1205717 1249629 1421587 1282969 1369814
5210 1369814 1499601 1574440 1560690 1279751 1122068 1335691 1556707 1647353 1566585 1399353
5200 1399353 1468015 1528610 1741041 1667441 1604980 1614606 1570910 1430504 1719021 1761597 1852925
5189 1852925 1904116 2138992 1868543 1655004 1598731 1706563 2086807 2254994 2342888 2426079
5179 2426079 2387819 2338222 2511794 2656661 2700721 2798481 3020023 3130685 3143694 3314452
5169 3314452 3624271 3889468 4180770 4208429 4421304 4834829 5318032 5679588 5969313 6625285
5159 6625285 6998000 7494122 8369163 9317477 10515498 12005781 14363135 17363054 20939808
5150 20939808 24312302 27360435 30064874 31081120 29829211 27190175 24563820 22619042
5142 22619042 21133420 20034454 19051682 18364547 17676462 17041269 16250118 15761218 15457138
5133 15457138 15152089 14700382 14425999 14200286 14081812 14497552 14687916 15211616 15999955
5124 15999955 16307363 16617290 17666023 18443641 20011011 21712799 24016186 26532309 30783854
5115 30783854 35661306 40325435 45215304 49543818 52054440 50523798 46264402 41451587
5107 41451587 36850052 33495203 30627828 28507084 26969218 25704352 24380155 22962890
5099 22962890 21932500 20713783 19348166 18031552 16608278 15205268 13924914 12564728
5091 12564728 11671276 10804478 10018636 9601727 9218574 8534189 8158206 7663768 7285698
5082 7285698 6999950 6840984 6491360 6154131 5674678 5459933 5643077 5736378 5458171 5313364
5072 5313364 5127258 5329211 5305667 5404663 5244852 5239179 4978648 4568336 4379716 4279563
5062 4279563 3947368 4264201 4750695 4478018 4458682 4493806 4548529 4662163 4813268 4862591
5052 4862591 4970458 5269283 5631625 6047189 6651066 7644793 8936923 10255084 11397350
5043 11397350 12483155 13332631 13127484 12203840 11133362 9929787 8918925 8218965 7444647
5034 7444647 7114867 7142144 6717469 6457426 6357600 6148345 5966385 5664703 5342632 4938028
5024 4938028 4960060 4886892 4684915 4533273 4441182 4465295 4195080 4184416 4045208 4004416 4410210
5013 4410210 4600594 4701842 5177780 5552217 6312152 6925394 7667528 8513417 8649610 8582626
5003 8582626 8350219 7957431 7229828 6431677 5878208 5409504 4956960 5013732 4982212 4592389
4993 4592389 4113654 4158673 3990548 3719131 3551107 3351125 2951430 2975388 3043889 3034178
4983 3034178 2843825 2405868 2246514 1994983 1861461 2246311 2351156 2037442 1983531 2224267
4973 2224267 1979174 1991807 1588941 1567525 1729362 1663690 1917986 1860689 1687889 1678617 1733818
4962 1733818 1737771 1765058 1602490 1640004 1790898 1836828 1962215 1969749 2020686 2082773 2209439
4951 2209439 2223388 2058260 2334826 2647808 2974586 3327505 3853244 4298825 4891274 5736319
4941 5736319 6589245 6823100 6990339 7357088 7162062 6517797 5725334 5449638 5207108 4602286
4931 4602286 4401319 4120540 3899251 3679968 3569238 3351881 2984815 2539451 2561727 2548511
4921 2548511 2243610 2007374 1904081 2238455 1925152 1688301 1844979 1667217 1650567 1805484
4911 1805484 1559120 1097902 1179320 1368054 1279560 1302146 1277689 1538131 1468560 1464588 1392063
4900 1392063 1321600 1213474 1398146 1403887 1237878 1191936 1019845 910140 964083 1018181 967744
4889 967744 858352 909575 1081924 823225 802928 1070075 1081719 1055206 1074754 1080703 1113177
4878 1113177 1012493 1282231 1008367 863667 820447 1137489 1135535 654733 796332 829233
4868 829233 839801 799675 904013 727594 765594 837938 775264 963344 836376 909237 1134477
4857 1134477 1058974 828133 954035 928683 773440 505699 696102 876101 959331 888045
4847 888045 985976 992878 938516 902903 766286 782280 751075 770650 864511 741121 810092
4836 810092 860445 760910 867606 972638 863722 867799 827527 737182 826245 730044 682021
4825 682021 683650 712789 651282 414983 387704 624808 712819 658665 722981 678355 584987
4814 584987 736136 615086 629285 769167 674810 521311 865479 779125 740720 452480
4804 452480 648042 717863 808966 811433 817711 727507 626781 715687 728003 812936 1136242
4793 1136242 1160061 1180760 1131057 639211 760993 618363 621506 702812 804431 944944 978027
4782 978027 707160 750411 711646 558548 289851 424790 385362 578416 450677 305572
4772 305572 353614 489877 582606 295127 391471 450365 582220 338786 286545 395674 507489
4761 507489 482373 566963 408758 370507 402792 472581 680215 458947 558391 627918 499869
4750 499869 428198 383110 444795 478857 485534 599314 550842 522599 409609 605986 727249
4739 727249 573250 602912 416428 463314 378937 525612 536243 484880 802151 710882 588723
4728 588723 550451 546627 392091 361754 457496 693210 683303 730220 628780 555927 475075
4717 475075 554985 587463 609160 763643 702603 683510 626992 629708 513157 692588 740677
4706 740677 726930 946239 1018600 573497 854037 1067416 1101917 1100847 1211511 1142415 1358771
4695 1358771 1367884 1450495 1789288 1827698 1551784 1405866 1305616 1258384 1107606 1039385 1037632
4684 1037632 1005736 1191972 1330648 1228471 1146982 1128237 683374 697138 624821 681293 770976
4673 770976 964332 1022927 873564 657645 706254 753442 737702 595184 773626 653772
4663 653772 706463 586245 616293 729831 636888 601317 584639 783033 432476 295325 350023
4652 350023 546142 458537 769507 1058594 839539 760113 895119 835005 769967 859760 829756
4641 829756 433591 400067 849082 655625 581608 647395 594041 662681 724801 614611 815867
4630 815867 828899 705093 614121 479879 416331 603045 573288 518749 420463 336721 494329
4619 494329 667112 779323 834604 873625 705927 487790 529851 317398 415308 700083
4609 700083 703066 560941 816123 907427 494039 638368 743785 820314 907242 894583 965006
4598 965006 948010 542390 685154 825018 827479 824302 541659 483318 517894 670876 795962
4587 795962 760639 813058 804639 810008 807962 662394 581402 926320 978431 1026978 862737 655113
4575 655113 692958 624512 605183 598705 756233 1023287 841173 894014 1007503 814052 773217
4564 773217 763668 789478 888982 780192 793845 933170 838083 733186 730385 864113 980569
4553 980569 1023239 1188523 1182567 1121750 1007526 1045927 952728 1084366 1182697 974841 910529
4542 910529 867987 1046794 821175 1050597 756369 734531 940046 1035859 1278424 977172
4532 977172 871742 1053285 1053770 1080298 965733 1027626 941514 1167710 1378538 1132074 1046333
4521 1046333 1022409 1354121 1397921 1221913 1212072 1171531 967286 1084093 1170426 1099723 1004593
4510 1004593 1103325 1214131 1016068 1202361 1283714 1363019 1261643 1074965 1024352 1313706
4500 1313706 1125115 1081426 1474398 1340224 1441337 1507971 1499633 1255413 1214046 1158927 1217307
4489 1217307 1166491 1240990 1254274 1261574 1425203 1336655 1137071 1322779 1401333 1594588 1341750
4478 1341750 1211296 1555928 1554646 1310592 1293264 1633421 1584969 1507295 1319744 1357062 1482344
4467 1482344 1542960 1527727 1595183 1414893 1310934 1463295 1546790 1550771 1416375 1589966 1511733
4456 1511733 1685427 2039955 1839759 1879362 1984370 1794458 1799165 1824846 1832153 1645777 1829424
4445 1829424 2114875 2104570 1963425 1813596 1982459 2056347 2170397 2276794 2154545 2100441
4435 2100441 2407647 2496699 2407804 2158844 2214770 2176763 2535872 2446801 2330750 2544502
4425 2544502 2517214 2610048 2538734 2505060 2623644 2397760 2383655 2502254 2652420 2921076
4415 2921076 3129168 3146585 2879030 2961585 3006417 2553729 2467954 2875510 2872554 3228502 3305588
4404 3305588 3351254 3707449 3689320 3467571 3463570 3673837 3806534 3848388 4006085 4012882 3931801
4393 3931801 3854635 3789798 4008506 4208387 4251265 4311781 4470706 4213559 4589913 4905169
4383 4905169 4750494 4890096 5014209 5388503 5431161 5566416 5434400 5390298 5699640 5907301
4373 5907301 5957111 6185238 6372033 6476915 6605482 6736160 6911159 7124527 7309792 7446519
4363 7446519 7398683 7361414 7654259 7992523 8253994 8413004 8638677 8960539 8994976 9191497
4353 9191497 9196482 9509654 9698932 9931701 10276351 10474861 10866131 11211864 11200530 11343653
4343 11343653 11761636 11926536 12179031 12584116 13042546 13307519 13257131 13594875 13890668 13921981
4333 13921981 14235988 14709740 14646916 14638954 14959802 15153418 15549416 15843349 15871770 15904815
4323 15904815 15953930 15945814 16156402 16235062 16549840 16731400 16730910 16872064 17051071 17067918 17193779
4312 17193779 17094106 16909293 16958774 17029632 16924363 17032744 16842958 16840137 16742431 17009153
4302 17009153 16919235 17012152 16970647 16803273 16722651 16657857 16591875 16586027 16111208 15766308 15423568
4291 15423568 15296490 15083979 14649656 14365112 14319916 14313816 13980413 13840134 13739524 13456984
4281 13456984 12957455 12584208 12202078 12083461 11998814 11810138 11607647 11416018 11438943 11074746
4271 11074746 10626847 10590343 10241727 10149958 9877543 9642965 9328285 9059168 8858558 8849037
4261 8849037 8839548 8680415 8410716 8354585 8050094 7623182 7423143 7748559 7589132 7578768
4251 7578768 7347374 7376649 7306901 7073441 6934159 6423836 6278578 6212225 6236750 6371104
4241 6371104 6305738 6029914 5832478 5786810 5798944 5827568 5986843 5972846 5614086 5413670
4231 5413670 5423367 5506286 5154320 4914699 4833819 4854498 4831357 4887375 5137618 5106847 4966284
4220 4966284 4833967 4946040 4873448 4653850 4800354 4990667 4975118 5062481 4685350 4714637
4210 4714637 4725443 4716003 4688357 4659016 4563320 4678313 4793485 4727179 4951373 5276570 5454606
4199 5454606 5681629 6056301 6196315 6458735 6518861 6866221 7239388 7848205 8333479 9173492
4189 9173492 9929544 10762681 11671891 12691127 13402102 14306173 15248975 15807695 16421992
4180 16421992 16963112 17539099 18113620 18905217 19107869 19005962 18777579 18445463 18321259
4171 18321259 18169939 18001150 17444991 16574052 15957561 15477404 15047165 14440667 13820543
4162 13820543 13201993 12798462 12193997 12075986 11760421 11395597 11486032 11755563 11396927 11555366
4152 11555366 11879377 11954405 12392476 13143754 14228874 15235260 16449577 18092212 19640822
4143 19640822 21202153 23022523 25013232 26695479 28049805 29270175 30556334 31855310
4135 31855310 32721753 32861146 32097384 31241872 30506964 30271282 29344434 27559149 25947437
4126 25947437 24141146 22775163 21386566 19985781 18807986 17350057 16070105 14836620
4118 14836620 13747931 12923920 12321701 11551958 10768752 9968713 9496628 9116634 8485709
4109 8485709 8121322 7907891 7648510 7205241 6817774 6680784 6698841 6544251 6225191 6000970
4099 6000970 5769022 5531015 5339909 5025676 4937160 4898774 4999932 4808722 4901694 4682178
4089 4682178 4402120 4223337 4325168 4583605 4451914 4297884 4137340 3998069 3871721 3875866
4079 3875866 3962939 3819119 3689910 3640659 3516210 3563877 3687287 3744229 3545065 3384131
4069 3384131 3420941 3743776 3708570 3553511 3308883 3252750 3236705 3294513 3432946 3361068 3167419
4058 3167419 3177931 3483355 3403035 3287963 3083383 3044077 3252579 3616124 3550342 3222223
4048 3222223 3464592 3305688 3061199 3042737 2980767 2877985 2645554 2680735 2805091 2792712
4038 2792712 3041526 3165337 3140685 2975901 2926662 3044662 2984040 2711789 2726600 2918270
4028 2918270 2701436 2583600 2702664 2655655 2852357 2862854 2934042 2652927 2573553 2699559
4018 2699559 2670095 2564777 2743104 2511047 2764461 2663456 2674297 2661703 2705007 2842511
4008 2842511 2773594 3017622 3002260 2922493 2635640 2747747 2982544 3063927 3009447 2781777
3998 2781777 2952439 3002900 2831059 2877983 2626358 2730865 2979776 3035493 3176212 3211712
3988 3211712 3151226 3034889 2985675 3012500 3106830 3398496 3314000 3423637 3321793 3269589 3278900
3977 3278900 3328860 3183925 3000941 2850095 3034072 2934944 2903708 3111917 3263733 3360369
3967 3360369 3247631 3248446 3297796 3363585 3150304 3057963 3186641 3195922 3007078 2822411 2834899
3956 2834899 2743135 2854389 3190000 3270664 3141029 2984422 3064593 3265629 3224642 3225247 3053839
3945 3053839 3096753 3262845 3177222 3276772 3328898 3558648 3545342 3502397 3909085 3671420 3496384
3934 3496384 3570978 3725349 3527125 3541525 3698169 3561113 3596121 3678060 3715929 3860272
3924 3860272 3975879 3724953 3581017 3639728 3784053 3776747 3725627 3738309 3769831 3813487 3691947
3913 3691947 3797258 3982635 3989326 3797083 3689827 3862932 4159864 4181423 4031027 4179090
3903 4179090 4215721 4082980 4417707 4475398 4304640 4267392 4142076 4161621 4299828 4470481
3893 4470481 4458134 4646726 4937069 5091741 5265147 5473144 5323886 5275588 5547196 5589940
3883 5589940 6098256 6588072 6653773 6893474 6828868 7098324 7684328 8405401 8918531 9851216
3873 9851216 10163340 10719412 11472279 12350820 13168096 14090126 15173061 16399050 17496507
3864 17496507 17976451 18733616 19835043 21068259 22388747 23684175 24781068 25932515
3856 25932515 26409981 26767001 26812908 26709961 26843924 26929328 26653895 26290120 25311243 24083827
3846 24083827 23368428 23109295 22689770 22404545 21799447 21462879 21275083 20851695 20740556
3837 20740556 20982100 21272145 21569799 21832986 22283956 22639681 23036808 23522539 24486642
3828 24486642 25497216 26491869 27112232 27375017 27895218 28333358 28221178 27804310 27685130
3819 27685130 27187014 26862431 26235226 24931896 23587146 22418441 21269774 20314644 19201118
3810 19201118 18070715 17027108 16391308 15562587 14727438 14255339 13819458 13177318 12516511
3801 12516511 12216228 11811183 11376066 10784522 10279019 10459423 10322078 10217195 9971339
3792 9971339 9793251 9725801 9543073 9497332 9570071 9385419 9354709 9281708 9056283 9103088 9111843
3781 9111843 9306159 9480051 9467906 9351474 9401320 9455185 9493016 9433146 9406748 9519715 9683795
3770 9683795 9472876 9301975 9427333 9525813 9542867 9204643 9425304 9636296 9648519 9432888
3760 9432888 9723236 9634229 9589851 9387027 9766644 9669572 9015138 8875134 8924265 9117819
3750 9117819 9126930 9203062 9286544 9198543 8882646 8875694 9001465 9193379 9016367 9219690 9340498
3739 9340498 9120482 9202637 9161453 9377751 9329506 9237518 9281637 9470915 9443582 9239520 9311116
3728 9311116 9461492 9779114 9798527 9957771 9805683 9847321 9906300 9969650 10047100 10128184 10240527
3717 10240527 10565745 10726920 10991952 10996871 10808397 10415229 10577445 10877151 11173387 10854680
3707 10854680 11068265 11409231 11803085 11960493 11745132 11844494 11887075 11831146 11881448 12035185
3697 12035185 12366247 12487164 12316360 12534189 12858064 13222983 13382048 13338451 13473375 13538116
3687 13538116 13904485 13960546 14041909 14328311 14433835 14899876 14913532 14884789 15319844 15364936
3677 15364936 15472114 15786980 16373665 16628465 16954957 17284160 17603963 17927466 18191173
3668 18191173 18297883 18662723 18855161 19049229 19680814 19952296 20498655 20789789 20949452
3659 20949452 21326972 21559530 22088873 22534984 22921490 23542956 23984017 24351947 24942601
3650 24942601 25444201 25831166 26447277 26674008 27397479 28027901 28679135 29440899 30107566
3641 30107566 30710798 31718773 32361411 33306462 34363466 35610505 37355259 39199487 40886701
3632 40886701 42641207 43930917 44471057 44329767 43663172 42626178 42413366 42167970 42025999
3623 42025999 42169677 42502950 42921062 43136072 43292019 43337443 43154751 43270230 43272709 43388854
3613 43388854 43824140 44054842 44070780 44461600 44973727 45379922 46407381 47636986 48778375
3604 48778375 50057061 50748041 51023362 50384556 49061012 47583057 46406097 45669990 45143821
3595 45143821 44559466 44110804 43578825 42968098 42492339 42081106 41886732 41232810 40780856
3586 40780856 40544018 40026289 39830501 39843356 39321421 39066212 39138849 38973964 38686328 38605152
3576 38605152 38512754 38263010 38202775 38230792 37661895 37449123 37525946 37464793 37650277 37848768
3566 37848768 37626104 37466595 37497026 37781293 37853070 38192967 38354687 38301957 38296766 38493905
3556 38493905 38239870 38147059 38231679 38557402 38716112 38720815 38641986 38903340 39265257 39389274
3546 39389274 39209595 39447566 39883122 39926528 40067394 40255032 40608760 40660407 40928688 41288227
3536 41288227 41613115 41810443 42243728 42729113 43201076 43713665 44258122 44786400 45494862
3527 45494862 46398328 47455587 48695713 49710680 50782115 51886899 53492647 54866644
3519 54866644 56621303 58516205 60539418 62745194 65110458 67507361 70255136 73421482
3511 73421482 76675942 80398880 84213523 88375226 93139079 98294920 104014217 110261838
3503 110261838 116927702 124179865 131924012 140093269 148320698 156696624 164747009 172506892
3495 172506892 179593620 185843713 191302611 195954597 199957284 203366991 206364504 209400236
3487 209400236 212006945 214566415 216681966 218531664 219741824 220311539 220127245 218575340
3479 218575340 216375922 213102871 209654432 205659003 201400969 197218023 193180082 189609274
3471 189609274 186364730 183767026 181510098 179466217 177803335 176309270 174883592 173650981
3463 173650981 172476639 170974846 169450585 167795246 166040657 163812331 161642899 159892728
3455 159892728 158039170 156314325 154581588 152702751 150821211 149340196 147419362 145122806
3447 145122806 142930498 140519190 138111316 135691823 133193161 130587163 127968240 125486556
3439 125486556 123609297 122210568 121026780 120370427 119694335 118736406 117348029 115687901
3431 115687901 113243978 110126951 106805403 104191406 101730788 99829351 98178202 96694085
3423 96694085 95213275 93564975 91900671 90541232 89243638 88066568 86768900 85722369
3415 85722369 84848713 83969496 83286792 82529025 82048957 81686669 81529662 81833510 82040620
3406 82040620 82271898 81680010 80320187 78302277 76030199 74020309 72283952 70588113
3398 70588113 69310211 68159100 66916761 65957439 64674335 63508081 62431980 61553815
3390 61553815 60739689 59862266 59257720 58676961 57787424 57212616 56746469 56141290 55475967
3381 55475967 54826547 53916100 53204373 52577308 51880691 50831598 49910576 49249460 48503302
3372 48503302 47700071 47397003 46743781 45976167 45277449 44764375 44351982 43975953 43303977
3363 43303977 43229137 42735299 42207587 41916497 41780539 41762992 41610193 41642976 41424677 41844449
3353 41844449 41970874 42080576 42620787 43072873 43489086 44198518 45000611 46112217 47149121
3344 47149121 48163597 49649455 51336105 53096413 54896818 56845156 59455244 62253943
3336 62253943 65241163 68728559 72346102 76230982 80613736 85564353 90335132 94918352
3328 94918352 99545294 103518025 106725065 109138483 110791158 111613226 111313035 110290304
3320 110290304 108452632 105920430 102800391 99633517 96060633 92237564 88438432 84692352
3312 84692352 80938422 77121440 73295729 69412832 65856882 62764838 59593584 56448179
3304 56448179 53523573 50765059 48363932 46065270 43950795 41978451 40078346 38178258
3296 38178258 36534643 35159551 33605517 32079011 30933624 30010998 29034964 28333587 27475627
3287 27475627 26471229 26123755 25370657 24607959 23889552 23359267 22924221 22360301 21827492
3278 21827492 21425073 20867637 20444102 20125809 19981050 19716614 19526209 19446731 18989869 18637966
3268 18637966 18824327 18632451 18492702 18323067 18063361 17939650 17701852 17567697 17258697
3259 17258697 17129264 16786358 16488063 16249658 16048670 15686358 15452650 15099260 14704931
3250 14704931 14629593 14588098 14412582 14533534 14031135 13614741 13424462 13376797 13102396 12848174
3240 12848174 12814620 12812650 12717027 12762429 12927416 12565584 12374560 12236106 12191770 12142749 11889158
3229 11889158 11670330 11773234 11747672 11773208 11729484 11572520 11371759 11232098 11309771 11575164
3219 11575164 11357900 11381473 11430181 11386735 11094401 11223020 11362217 11325994 11477386 11492799
3209 11492799 11489427 11371228 11576265 11470463 11476514 11653205 11430280 11378051 11406361 11204464
3199 11204464 11391540 11497053 11677036 12101625 12143311 11819062 11705078 11915562 11927167 12035043
3189 12035043 12025310 12018319 11936760 11947300 11918864 12142439 12216954 12218756 12362397 12498024 12552524
3178 12552524 12485925 12879170 13422108 13302503 13312879 13530744 13932936 14206526 14397996 14688395
3168 14688395 15089147 15223555 15133415 15452838 15856940 16241955 16663224 17082249 17322271 17846552
3158 17846552 18365609 18649969 19305851 20284486 20743224 21205317 21874978 22500397 23262072
3149 23262072 23942387 24495238 25246926 26002815 27219409 28313509 29140064 29942230 31056257
3140 31056257 32267230 33549204 35173132 36477141 37799893 39625342 41155814 43094846
3132 43094846 45135138 47097282 49071714 52032315 55335115 58391823 61639760 65696545
3124 65696545 70049871 74567798 79003554 83435198 88174189 93324497 99054591 104585412
3116 104585412 110549063 117191512 124613387 133285017 143303331 154965393 168388500 183629188
3108 183629188 201235698 221153159 243198642 267045230 291671733 315141472 335923973
3101 335923973 351661243 360705322 361930931 355527757 343769686 328374064 311735256
3094 311735256 294769724 278319275 262945851 248397236 234243311 220696433 207628741
3087 207628741 194949604 182567136 170636109 159450833 148385084 138053178 128977575
3080 128977575 120662401 113036427 105962199 99528429 93528509 87979372 82844000 78139026
3072 78139026 74194561 70073726 66145306 62637232 59645697 56868121 54376267 51949335
3064 51949335 49346287 47173083 45208221 43288773 41495876 39765271 38410397 36932632
3056 36932632 35432809 33753704 32682722 31508575 30437909 29265581 28069359 26958801
3048 26958801 25845377 25040445 24402913 23668915 22858721 22154187 21880742 21285369 20666869
3039 20666869 20121828 19618374 19114676 18604672 17943800 17588315 17080607 16746741 16243449
3030 16243449 15830810 15632243 15166794 15069811 14732786 14694238 14264278 13762623 13476649 13037155
3020 13037155 12631172 12484554 12205832 12071553 11928172 11713737 11534871 11263911 11069279
3011 11069279 10888918 10769371 10530415 10467849 10553199 10246106 10082799 9928400 9659222 9240869
3001 9240869 9034014 9192812 9061105 8940276 8978489 8797449 8756276 8650053 8482716 8415394
2991 8415394 8043570 7691260 7675367 7687208 7773592 7801858 7533829 7263893 7039200 6708178
2981 6708178 6536707 6580389 6496947 6382776 6294343 6032855 6205123 6164042 6270947 6156525
2971 6156525 6086975 5934702 5803025 5623942 5812209 5802434 5415174 5252798 5214080 5057373
2961 5057373 5038178 5179598 4996728 4703499 4731538 4303803 4442146 4331295 4136802 4311669
2951 4311669 4204023 4125378 4006704 4133595 4159171 3825089 3767262 3935581 3953156 3741608
2941 3741608 3476218 3494035 3557911 3875217 3691647 3419711 3433603 3561615 3506185 3502155 3389448
2930 3389448 3487061 3390733 2962392 2894655 3085736 3102298 3432628 3282732 3068678 3058892 3057752
2919 3057752 2770979 2795724 2923501 2885874 2751229 2642347 2865031 2687339 2947051 3023333
2909 3023333 2762562 2621938 2601723 2820244 2727021 2395465 2272973 2369874 2287445 2264357
2899 2264357 2233816 2365292 2331154 2390074 2019339 2117133 2284759 2081284 2266866 2460524
2889 2460524 2497933 2326575 2458934 2435074 2221230 2109820 2182453 2063604 1878592 1979932
2879 1979932 1953225 1927423 1953045 2002310 1911905 2067819 2169236 2200924 2146638 2239796 1859913
2868 1859913 1767316 1703025 1662928 1791995 1969434 2122045 2086692 2046394 2126955 2262020 1955184
2857 1955184 1747112 1925199 1989001 1907207 2115414 1888067 1821608 1459969 1753636 2018057
2847 2018057 1935269 1890246 1798133 1874621 1637233 1742069 1839995 1831109 1895116 1549904 1666849
2836 1666849 2009883 2068003 2086251 2032950 1840467 1862102 2058372 2154404 2233130 2261110 2242934
2825 2242934 2371197 2294583 2269857 2239082 2564090 2583427 2809450 2881346 3021546 3139367
2815 3139367 2995809 2956186 2813777 2674721 2719462 2643249 2517842 2211186 2140389 2248706
2805 2248706 2255720 2265253 2137448 2041121 1939386 1948938 2004213 1797361 1579780 1711602 1657853
2794 1657853 1540293 1215242 1135306 1557067 1644517 1306302 1345817 1243161 1237854 1179918 1133536
2783 1133536 1235482 1062354 1136415 1079700 814280 994642 1332617 1125254 750276 740121
2773 740121 908508 1193704 1075578 848101 860852 1094883 1078035 800750 672143 684009
2763 684009 803894 923247 773554 667005 808870 995231 954905 720622 637088 729578
2753 729578 863518 1004479 897007 922336 876330 819547 709640 663345 773025 813200 569876
2742 569876 531963 679474 677823 562718 693416 606519 639456 631033 548387 485293 492127 718227
2730 718227 750270 699911 490417 635151 531468 520496 685320 565597 660137 595995 537968
2719 537968 587185 524048 712393 779451 638287 716076 799267 743679 774551 481082 401343
2708 401343 561569 814186 771104 642404 779312 858790 584908 539806 763419 494808
2698 494808 425714 638861 510147 542844 686685 729636 741266 460141 289468 573949
2688 573949 454941 374307 424584 485554 677199 437245 331457 297901 286947 290563 337967
2677 337967 457986 305174 229736 399436 523293 620111 354045 519869 435677 550499
2667 550499 557224 380754 331886 523222 625590 691243 454721 364680 383365 501673 457197
2656 457197 463284 587697 245683 464994 312581 425157 487744 517807 496109 434362 189268
2645 189268 49573 264108 421119 513447 537859 423316 401038 454668 500499 463780 595634
2634 595634 682377 519116 306941 443481 316914 271666 362479 332489 150215 346546
2624 346546 315963 220621 232299 372699 258840 329047 363513 251130 328800 271595 373388
2613 373388 510203 651257 573289 389078 250795 252012 302821 515470 664321 453333
2603 453333 268055 218865 294800 278230 198482 265469 456776 497378 630705 784061 672425
2592 672425 515573 313883 429629 558712 669024 458627 262181 343103 296980 227276
2582 227276 195197 42758 -3304 -32956 281349 130654 118002 279889 307725 57132 104155
2571 104155 186995 163048 -18122 75023 91101 113976 192286 -59660 188116 503737 490509
2560 490509 387395 345202 599656 402059 95019 138761 401350 549823 264547 232586
2550 232586 -101781 75222 310591 396761 324378 322717 431782 339559 107501 201301 231653
2539 231653 148150 307317 201528 -18298 90167 206289 371829 355994 317965 202574
2529 202574 407720 351401 74354 210998 152407 306882 482649 459709 38910 -47546
2519 -47546 -115335 147877 201619 278890 168565 125618 320519 228908 133535 272836 337171
2508 337171 69801 -167753 -148753 -148550 -70796 -29631 14608 77348 -164870 -82668 172127
2497 172127 164836 43045 -17237 -98392 -304344 100862 144206 201795 120537 294872 225346
2486 225346 242777 509445 216058 -18164 54391 212391 184561 135856 218197 335202 448044
2475 448044 484195 404426 410867 205405 287571 218536 324803 141234 276564 360806 337404
2464 337404 288274 168018 -65310 171345 91775 113191 174187 330138 158479 48167
2454 48167 255262 422205 366281 213254 121820 178757 162076 92548 119245 146021 99809
2443 99809 115292 397759 476569 558218 310954 468825 533933 404129 398160 246540 196589
2432 196589 154495 178858 260280 291105 92198 43164 3901 212153 460077 341308 19899
2421 19899 -194918 239515 420719 504108 454080 370891 531236 522825 432607 408728 197294
2410 197294 307651 107780 46074 250673 440251 532738 139291 91910 195227 241051
2400 241051 285050 439825 315691 250914 444093 598294 674989 487741 445516 515821 561317
2389 561317 468156 292422 390648 368021 382598 244157 318572 300739 71854 291868 667591
2378 667591 485982 332268 473982 505707 484022 556305 353765 508899 560118 436956
2368 436956 605686 493536 565900 785971 774708 767904 901266 1181541 1229544 1326431 1360882
2357 1360882 1214609 1260888 1362558 1579285 1589674 1548392 1761671 2076898 2271439 2740637
2347 2740637 2968651 3623499 4141639 4616429 4935585 5546829 5727536 6093953 6280636 6691104
2337 6691104 7310416 8330686 9429853 10882271 12920792 15561642 19626771 24576629
2329 24576629 29266098 34309252 39757842 43480093 42642081 36899202 31299879 27406977
2321 27406977 23979710 21761202 20203299 18858287 17677186 16513446 15594641 14637320
2313 14637320 13806939 12757844 11453437 10408910 9383050 8635785 7819407 7208296 6788777
2304 6788777 6201973 5871113 5539107 5057087 4637042 4671174 4121537 3734871 3693766 3443736
2294 3443736 3159356 3056796 3078923 3102575 2888319 2705532 2770044 2736129 2455364 2571689
2284 2571689 2433229 2370491 2497453 2258440 2123454 1812729 1640231 1830190 1534341 1394197
2274 1394197 1455138 1633044 1288384 1089906 852553 791951 1016190 1137014 1098734 1238941
2264 1238941 1005893 980501 1052541 1086911 971052 981373 1008573 871244 900099 650100 565010
2253 565010 580076 645803 904099 965724 915572 908887 455185 198091 519867 548050 466758
2242 466758 564095 749372 920649 745583 670521 503691 483354 593442 595535 503600 685532
2231 685532 389765 596957 705256 722217 655635 637587 545748 511763 546603 640071 679214
2220 679214 335525 351499 446244 621064 583263 526881 652058 379676 185990 254019 94918
2209 94918 181573 254135 440898 374389 238322 157684 119489 220875 362146 412701 354398
2198 354398 -78201 207495 234280 165664 352362 364304 463399 229630 4080 110990
2188 110990 190581 170063 200927 236885 284900 354336 539070 441090 299496 282550 237284
2177 237284 53884 57706 -166896 -161321 64581 108584 14162 114132 42926 137132 97607
2166 97607 35939 -36135 154336 76026 -131618 77353 90356 260808 273047 143930 149253
2155 149253 -58496 -69792 9353 -102816 -224713 -143295 249512 317456 330728 344165 129689
2144 129689 47539 -209966 -179710 33156 -155349 -89964 -144755 -98478 -65172 -56736 -89586
2133 -89586 -128568 37433 175646 177999 248851 210226 228610 180170 162111 28190 -31255
2122 -31255 25998 23964 150488 30946 23189 -76652 6096 53589 -21313 10300 -54973 -211339
2110 -211339 -79435 -214430 -74524 122437 26229 -236652 4751 50739 -54289 866
2100 866 -121709 -82836 -165852 -69982 -36571 -40144 -2697 68065 143389 -123638 -33091 -130501
2088 -130501 -11588 252338 176617 209954 255016 343627 357402 105594 -196178 69584 -133
2077 -133 53165 86731 180558 127444 220179 264995 151299 -26207 28886 187933 185611 99344
2065 99344 51930 122471 -52667 -157382 -39186 -5344 58628 104296 148962 287124 242786
2054 242786 406623 145467 243840 399578 254039 138457 -83325 70416 140750 53416
2044 53416 -143852 -11556 -119983 -3936 -70152 -197288 -116250 124591 224486 -10439
2034 -10439 18973 23134 -5403 -85284 87443 -84644 -175439 -174880 -137237 -97819 -22711 -62469
2022 -62469 -243448 -156676 -259874 -283916 -171274 -238175 -458546 -476695 -62169 143430 255298
2011 255298 408995 207526 -49841 80102 -58564 -189068 -306938 -314540 -182988 -62222
2001 -62222 -97684 46109 -215555 -401975 -99967 8515 197637 115846 178690 24539
1991 24539 -111241 -96043 -117993 -362814 -197382 -262149 -61566 15356 -105122 -193409 -244899
1980 -244899 -338397 -157815 -101727 132412 -136918 -388594 -322819 -433028 -128311 -205447
1970 -205447 -127320 -12119 -144506 -236334 -98273 41665 91487 55430 -140630 -130659 -354592
1959 -354592 -386315 -202276 -43434 -83466 -81215 123939 17705 -113682 -201601 -141927 -135271
1948 -135271 -41528 -133910 -221019 -50729 -43556 160439 -19900 -137189 20717 -84882 -56202
1937 -56202 -154817 27041 -57023 -40732 -32753 -361805 -487049 -213299 -366001 -257731 -154574
1926 -154574 -3070 -21597 -196254 -356303 -197413 -274812 -399323 -290527 43678 153928
1916 153928 188094 -149697 -395890 -55069 30768 15384 -131300 -149216 -54781 -125620 -62686
1905 -62686 22351 36054 -189349 -241803 -318639 -237029 31366 -120342 -142982 -119106 -238465
1894 -238465 -199174 -173641 -241009 -70984 115719 103107 -66531 -75956 -169155 -99250 -3211
1883 -3211 148679 18667 40260 -146899 -52298 67263 128871 51081 -191052 65446 -102085
1872 -102085 41789 68893 106232 76321 57001 -85346 -175075 -51802 6576 37951 -197588
1861 -197588 -133348 -164469 -136128 8465 96648 70762 14949 -67978 -77681 52835 -80801
1850 -80801 -75526 213692 232784 126359 32605 -115712 -201527 -106363 163879 247110 35433
1839 35433 -134349 -140018 -189526 -11567 61727 123789 192261 108127 -85962 -115926 40516
1828 40516 3357 -454 36269 28379 -49150 141503 18137 54029 -59319 -215835 96975
1817 96975 77867 -120659 -255990 -440175 -375392 -207832 88364 -205473 -227813 -45759
1807 -45759 -108975 -215675 74900 100144 -122320 34823 -88351 -275282 -242230 -323545 -373818
1796 -373818 -23962 -210637 -383309 -322207 -292123 -72174 -31209 -201537 -276723 -226838 -189568
1785 -189568 -105440 -198414 -92379 -123832 -149864 -274701 -455912 -382467 -217871 -168608 -26771
1774 -26771 -129363 -283077 -26505 -75674 -427523 -358361 -102980 -393438 -546240 -282971
1764 -282971 41957 8775 -216038 -540101 -491887 -206476 -207997 -125921 -122836 -244283 -397976
1753 -397976 -427129 -159221 -146686 -401920 -265942 -104287 204731 3228 -78889 -129232
1743 -129232 -231108 82774 142848 -73334 110291 67025 15737 219660 46909 -7472
1733 -7472 -120902 -108689 -119843 -309329 -491949 -316930 -404668 -436247 29133 4832 -212504
1722 -212504 -268318 -307269 -240307 -313959 28446 -8615 -208015 -95074 2543 -174509 -160431
1711 -160431 -144308 -56588 -15525 -143710 6933 74326 93726 4048 -47994 -252863 -375610
1700 -375610 -48549 -104103 -116906 -47708 17128 -74141 -126044 -100117 -140958 -285907 -193900
1689 -193900 -198682 -151643 14923 14877 -159259 -81179 191029 107345 -126628 -58066 -315154
1678 -315154 -212402 -262747 118503 -33793 -171724 -14898 -64337 187218 242878 21786
1668 21786 -12994 -79039 64516 -21923 -213876 -190661 -160259 20604 -123837 -325244 -277159
1657 -277159 -146158 -184791 -205819 -168740 1396 -69734 285979 67756 -84478 122902
1647 122902 240333 54313 29725 92781 271772 378806 249906 143372 255537 211976
1637 211976 44268 -52150 -94962 -77343 227024 288476 109839 -46406 -24797 -19340 -68157
1626 -68157 -334163 -333691 -231326 -280095 93093 -6422 -297813 -313835 -203736 30489 -22839
1615 -22839 87936 64389 9450 27009 82738 45844 -46346 104785 94934 27858 -2067 22658
1603 22658 -114752 -61654 -88246 -237594 -55354 -196341 -433171 -468204 -312560 -252489 -200980
1592 -200980 -494252 -492351 -356234 11290 -95227 -38664 45722 -149031 -154209 -214139 -331844
1581 -331844 -277817 -205920 -142018 -157055 -79193 -35646 -121531 74691 119171 136466 -330586
1570 -330586 -472857 -451558 -397157 -210665 -182791 -145051 -271410 -357152 -71142 224058 -16463
1559 -16463 -328530 -287187 -165932 -187756 34552 160299 14286 -165970 -313429 -425138
1549 -425138 -281801 -77128 -221117 -112480 -16157 -51866 -24255 -21782 -72411 212678 32475
1538 32475 25978 143937 -118479 -50930 -175449 -330313 -340432 -356741 -135695 -43556 -90077
1527 -90077 -129909 -216052 -218206 -15160 261675 137947 -118800 -6146 106218 164310 218085
1516 218085 32066 -36238 99773 114026 -124661 -188117 -105506 -151942 -86708 -120544 -113534
1505 -113534 -178740 -253333 -386408 -301121 -248499 -174418 -212091 -206635 -229152 -142494 -186120 -121719
1493 -121719 -82298 120195 -115405 -191259 -88459 -327801 -521482 -406336 -121740 88310
1483 88310 58988 -183521 105190 -65834 -310254 -210349 -475636 -542813 -138638 75182
1473 75182 -244355 -126622 -275558 -34289 -40298 -107169 -136660 -191125 -92988 -274939 -126508
1462 -126508 129405 236485 -11441 -203436 -193569 -312531 -199859 48061 -82696 1586
1452 1586 -12850 155505 49974 -83126 72326 -96707 -270039 -163961 -279166 -187832
1442 -187832 -175526 -159188 57665 -184989 -378163 -207657 -90411 -342119 -505184 -143130
1432 -143130 -227936 -189914 -155201 -111056 -26839 -217242 -276279 -29184 -190525 -115687 -195046
1421 -195046 68949 -102545 -90760 -137041 -220272 -63762 -40404 -230766 -176872 -111506 -264150
1410 -264150 -96504 -71693 -55354 -347025 -345616 -100810 85870 -88115 48578 256524
1400 256524 113454 -252628 -313690 -340208 -147654 -148027 -102881 78624 -74222 -259347 -364630
1389 -364630 -259348 -157474 -228043 -152440 2513 -4430 -289773 -37380 173053 -209900
1379 -209900 -448814 -287273 -126550 -129996 -189725 -305301 -190212 29269 -64163 115387
1369 115387 -41556 -73175 -94505 -126483 -116514 -196996 -236186 -268577 138548 55230 -125083
1358 -125083 -128386 105545 15892 -120489 -283869 -55719 -99662 -157717 79939 238189 -160998
1347 -160998 -96319 -3812 -256441 -147719 56508 -61760 -152719 -305272 -293968 -137854
1337 -137854 -94752 -79566 -192333 -324574 -390950 -403326 -195661 126814 8986 -136318
1327 -136318 -16202 73828 -65800 63512 70760 -6497 69336 55996 -384880 -197143 -106201
1316 -106201 -224570 -169763 25118 1961 30150 -23829 26376 1988 123501 40672 -333163
1305 -333163 -411607 -128805 76843 21503 -116641 -307068 -51804 17595 -61281 -4842 -91076
1294 -91076 -285171 77899 246356 236518 117694 16715 -37566 -32046 -207277 -440174 -477980
1283 -477980 -355902 -297545 -372746 -355739 -117145 151689 86502 -45378 -132546 -62429 -183864
1272 -183864 -97670 -226047 -415712 -285345 -186308 3743 -115060 -178428 -193457 -91719
1262 -91719 -180124 -100850 -55114 74895 55777 -7930 -90203 -159364 -238075 -237791 -120347 -204824
1250 -204824 -47561 -101727 53154 -40324 -140532 -163379 -145572 -215229 -145317 99140 -38934
1239 -38934 -220288 -42499 -232461 -194716 -40554 208814 151506 -35099 -207695 -108446
1229 -108446 -73122 -107723 -169434 -106874 -220719 -241043 -117556 -291722 -246641 -211154 -224052
1218 -224052 -248165 -304541 -229055 -191027 -249170 -333650 -29484 21768 6235 85733 233719
1207 233719 271114 113932 -50549 -12295 170755 98739 -42044 158664 520976 329334
1197 329334 22858 116804 -8356 -332225 -187169 -79003 49917 50975 -41114 -136072 -126356
1186 -126356 -111198 -17439 -56827 -28893 -59573 -12818 109021 26797 -324874 -369307 -386750
1175 -386750 -265393 -26045 -104897 -12023 39881 1472 -43751 -5718 47071 66907 -83778
1164 -83778 -277556 -58401 20344 -180413 -243381 -82767 -107771 -110681 101391 150073 -412802
1153 -412802 -417097 -147451 -176596 -239870 -176908 154266 8608 -284838 15173 -66651 17286
1142 17286 -113607 169497 42468 43604 44394 179817 -30857 -17696 28764 -74131 -49204
1131 -49204 -233242 -176115 -324961 -339421 -182183 100568 150700 -200981 -213288 -9776 179497
1120 179497 27222 -25319 -60765 -206459 -175345 -437676 -245469 -266648 -86672 168600
1110 168600 294763 187404 33034 141168 252941 160181 133495 230079 156025 127204 270828
1099 270828 147727 -106678 -265622 -153141 -145331 -350888 -335138 -146705 -72342 64470
1089 64470 100947 -73509 -274427 -284942 -108068 58460 46721 -98629 -184035 22480 -113625
1078 -113625 -60693 45192 70902 -133873 -296727 -380698 -339000 -55631 -53756 -373984 -341309
1067 -341309 -15170 174469 135429 178535 -138140 -234656 -59946 22285 24787 -49341 -93913
1056 -93913 -232493 -74781 38024 30127 -55673 73765 -58632 -114010 -204874 -531058 -623056
1045 -623056 -605827 -144396 -104931 75880 10374 -99149 -309703 -87936 -173928 -83435 -64860
1034 -64860 22018 29664 26537 12345 -275413 -269336 -25656 -43684 -77896 -48291 -272386 13435
1022 13435 118572 -17306 -161837 150729 96654 -47111 58078 22661 5575 -74326 -74320
1011 -74320 88243 155612 46062 59878 83548 91419 90652 157923 125270 -116527 -53106 -12667
999 -12667 -5278 40771 12225 40270 216343 33439 60614 -95870 15483 158145 250292
988 250292 120395 -58376 197631 23949 54269 33288 113508 -53132 -54269 -39507 -147355
977 -147355 197082 60730 86672 122163 209217 104698 57044 -120000 -41934 -62711 259673
966 259673 369199 262369 321368 205543 91555 66320 -71043 -70259 -4475 -79564 -100507
955 -100507 76342 26649 -39853 -76893 5650 153698 46658 -16561 87550 136937 203543
944 203543 121147 16093 117201 -33980 -284528 -253409 -51981 131460 82161 93673 18530
933 18530 -329434 -425075 -277965 -285288 -141231 -156242 -359 115930 9894 -91055 55129
922 55129 168031 105644 137404 -76140 138524 25673 -38935 -80419 -135765 32661 107487
911 107487 -31872 58996 173823 72712 -97499 -88951 -124341 -152870 -49906 -44025 -113682
900 -113682 -176043 14286 -22610 -36139 200771 204266 17654 16353 62924 -124637 84710
889 84710 74723 -32172 16007 -15479 -282205 -280829 -269293 -288167 -125390 27070 -109564
878 -109564 -221072 -180315 -138269 54660 148429 33281 36749 13008 -69641 -271 35445
867 35445 -14531 -20164 47149 -139220 -242496 -50256 -108526 -97876 23380 -74310 -92463
856 -92463 150735 208113 64005 230336 267160 161807 -173871 -5705 228128 -59318
846 -59318 -10222 207429 41974 -328363 -311306 -246592 -208265 -144904 -52494 90108 271466
835 271466 51267 157726 107705 -186890 28509 130515 32532 27254 124025 62128 9800
824 9800 52025 42015 207059 19038 -53817 -4818 -121420 -53641 -82496 8402 291070
813 291070 257872 3817 -6941 49238 200614 -56742 119274 122475 -4724 -179244 -159179
802 -159179 -115466 -293352 -60669 -49703 -115544 -65671 114511 49731 -101994 -135869 -45508
791 -45508 -19150 108792 52289 110343 211844 179369 19545 -171410 -50457 55345 120132
780 120132 405546 264879 257404 -8953 208017 -85432 -337817 -28648 -98226 -148545 -124092
769 -124092 -159650 -135055 33683 -3365 -225070 -207032 -92923 286258 290095 23135 168701
758 168701 12199 494554 367408 154642 77323 124560 41914 298539 204815 351426 429761
747 429761 168379 143523 124152 154606 -69975 181908 261981 295671 328472 229959 161514
736 161514 -78669 -50942 -31782 106748 37797 161574 43829 -62093 -174634 -71387
726 -71387 -107586 8370 287010 188065 191696 237538 14624 -94384 19669 -74734 -57280
715 -57280 57830 260359 41625 -5587 14105 103954 117251 -5386 -165681 -132659 -169864
704 -169864 -130475 -11246 108110 173700 237425 56453 -36946 42558 -33771 121965 5171
693 5171 168122 517438 231032 176900 24232 154965 309144 318411 416854 362400 127830
682 127830 -209809 51080 246111 285679 167845 165953 -6037 113305 97071 437895 284888
671 284888 420137 637001 232951 993 114606 176547 -33014 -97050 120565 247636
661 247636 341781 258425 383291 158544 280636 231971 -181013 69832 -23565 -14199 -25201
650 -25201 -127936 25050 394539 155274 145037 276130 288009 -224865 -12246 331090
640 331090 275358 241646 210687 214982 213367 85630 126417 111631 -75748 87371 379443
629 379443 132091 23858 250313 323959 205123 194066 281250 322059 47284 197260 87013
618 87013 37109 -47570 55928 36928 7304 15098 -71553 34915 64383 244635 54527
607 54527 -53515 4385 136875 171325 352263 170856 10594 217694 -83408 69384
597 69384 157220 -11279 9281 80602 63708 -97183 214132 233946 80285 154157 276967
586 276967 319682 178101 -9239 -224038 -223466 23792 83915 125034 235384 50389 225933
575 225933 98106 70950 182625 -110522 -99432 -186824 170985 367146 224306 198743 -93611
564 -93611 -334781 -118096 -88639 -211855 -98118 8025 32033 -138339 27873 85686 85611
553 85611 64932 163711 123567 155678 238113 75228 133096 189710 189178 311159 217812 218520
541 218520 190953 101768 293867 336906 156898 -2822 -92759 -153204 -22606 -53421 109498
530 109498 273775 275212 330772 150231 -10251 218959 31471 -59736 -103285 4081 182857
519 182857 201127 -49421 44528 -495 187604 155094 122824 -43649 -201357 -200179 -38178
508 -38178 -61169 -17385 3318 89798 33526 -124349 -108656 -152600 -57248 166747 265788 26753
496 26753 -230239 -85027 -68965 -23273 79986 307529 8030 38112 -276594 -393033 -113940
485 -113940 -245309 -119840 -132416 -10935 -173673 -88179 -202814 -30063 44372 89503 80724
474 80724 247504 212541 17099 1018 1350 -30369 320683 518522 250236 126734 266914
463 266914 361142 79308 12178 89532 25595 -49525 -40509 -23582 178757 135411 55154 63976
451 63976 153322 165099 -9505 152841 182000 455692 154465 134675 389113 408531 363803
440 363803 358672 132285 -70378 143251 341157 96151 31028 -59652 144000 144250 64508
429 64508 120718 19476 253772 203464 210819 -7406 -66771 -34887 -86261 19410 -55359
418 -55359 114488 -27113 -245592 -151143 -86043 -179755 -134771 140690 75709 44379 -96885
407 -96885 -60290 3497 -124228 30101 -7950 -43092 138750 289728 170100 120125 190975
396 190975 366563 323252 359561 333241 284673 107915 252907 248782 266363 165534 48380
385 48380 -95357 -56147 90101 -238727 -289997 41247 140290 -190246 -271158 -40156 372624
374 372624 292941 7915 -135448 -3842 168291 237894 121332 -18616 -171029 203561
364 203561 183149 -173219 2318 171893 70112 186997 219307 -2390 -101438 -252554
354 -252554 -189173 4118 132262 -27136 -170825 -56908 50162 64642 -170174 -13168
344 -13168 42405 61750 76797 14014 151156 217947 -61888 -131799 -140469 -171360 55333 -15319
332 -15319 -127340 218514 255053 228239 67665 33476 180689 -109855 -290561 -244939 -83402
321 -83402 137560 24384 -54971 58336 192913 288578 73390 307662 71377 215525
311 215525 327290 124805 318387 298146 377363 149101 458752 339459 241118 195796 49354
300 49354 173060 134857 -52567 202649 223835 8933 103702 83818 130663 113142 149046
289 149046 356590 170199 187170 202102 206179 143516 -203171 -105748 5357 -45593 179067
278 179067 306752 141442 104296 -54951 71540 -11577 -169332 108058 299629 107890
268 107890 -51379 23339 206077 133044 -74388 -139912 46280 59778 -95141 -32171 -71904
257 -71904 -171079 225795 -96413 12902 186767 4932 154821 75508 63795 222735 247321
246 247321 58593 68338 299187 239848 -59221 21224 13453 -21605 100302 -64623 -168752
235 -168752 69479 -107844 -2588 143865 -685 -75171 27209 -26420 -18711 -40949 176704
224 176704 236368 195940 142882 131935 233967 64018 -18867 7913 341315 97419 -130201
213 -130201 -68182 70598 -60060 -65605 24031 111364 137781 211406 70146 49205 77200
202 77200 -143045 132477 185593 30988 173252 -13843 201790 199407 -1996 47512 196606
191 196606 166499 -185741 -57676 -11590 -35207 -5721 19316 151694 299567 260876 137406
180 137406 -22129 -92042 175225 222459 70511 228449 137484 26063 28586 -143854 -180181
169 -180181 -196225 -365271 -329329 -94582 196617 107266 -9254 186248 -73049 -130729 -66989
158 -66989 173043 222094 175636 244943 242375 111593 3536 63722 170096 150627 266256
147 266256 351115 229510 212579 82780 182256 53937 194097 215763 5249 -157262 -154615
136 -154615 -105966 36980 76234 117136 168719 71906 -76910 -16758 196594 64240 -18597
125 -18597 70867 142027 46209 202780 377686 406388 349184 325369 218765 -45070 23575
114 23575 215745 87538 12653 -55759 -83156 88713 19813 159356 -61293 -111603 -142405
103 -142405 -55815 -50027 -50089 49098 13600 -10589 186088 -17960 -108463 71436 118954 180682
91 180682 304578 147969 166286 215040 215554 226924 58573 83585 49888 7211 10464 56795
79 56795 -44304 84455 -25061 18608 -4886 -70420 -7144 -90317 -46286 29888 -8803 60496
67 60496 -135104 18892 1495 -73949 -8447 -33185 -66740 39854 1553 -49414 -105151 71560
55 71560 67279 3487 123622 271524 291018 160014 217357 101557 -16396 65715 200928
44 200928 223199 239208 106116 -45883 -79221 79675 166025 337954 291335 204075 193891
33 193891 175901 73499 170660 149661 131143 327904 165358 172827 126193 -22929 45369
22 45369 13449 4189 34933 122997 69530 69447 46662 7373 28826 -36794 119069 -13425 -13618
9 -13618 -74017 -43345 49361 40200 12454 20093 -12327 107834 124079
0 124079
$$ Imaginary data points
##PAGE= N=2
##DATA TABLE= (X++(I..I)), XYDATA
16383 -1862081 -1728170 -1809103 -1866177 -1752431 -1833516 -1806724 -1697212 -1702121 -1639615 -1453229 -1469832
16372 -1469832 -1422230 -1353156 -1347750 -1385978 -1407404 -1563557 -1241319 -1127908 -1180589 -1129709 -1054899
16361 -1054899 -1196051 -1215529 -1100164 -870287 -821148 -965664 -931082 -1058133 -909860 -751015
16351 -751015 -743322 -735928 -802548 -790517 -699967 -695128 -851166 -929211 -774831 -721017 -573405
16340 -573405 -535347 -641122 -406066 -503051 -525620 -432992 -431732 -354909 -461392 -587580 -530571
16329 -530571 -556382 -576526 -592620 -422405 -233921 -221908 -159850 -375502 -282209 -347880 -362925
16318 -362925 -180833 -27451 -116726 -68548 8751 208101 288069 271155 28969 7355 65979
16307 65979 38125 148921 134318 104454 286555 265157 392168 341858 585335 671083 380877
16296 380877 448918 401690 384845 477917 346324 334857 431423 551290 432388 552285 714944
16285 714944 794681 800816 807818 718165 738270 908453 939933 923966 805919 721935 745409
16274 745409 842682 621010 899870 997306 871439 852477 997533 1016344 974380 1095392
16264 1095392 1162223 1024073 1071307 1028496 1167448 1259043 1259498 1294494 1234501 1310876 1390732
16253 1390732 1275297 1188797 1202171 1272130 1396689 1468602 1423931 1534715 1423483 1393209
16243 1393209 1679504 1468675 1494690 1550214 1482524 1560696 1586770 1656639 1525404 1693929
16233 1693929 1601731 1508075 1468929 1583041 1716780 1910377 1959105 1972021 1917900 1812102
16223 1812102 1742677 1592974 1697144 1435245 1450400 1634503 1711143 1649745 1706914 1843335
16213 1843335 1601696 1494450 1824985 1841495 1857399 1960861 1625146 1548564 1647586 1765311
16203 1765311 1941975 1934019 1920716 2102847 1964940 1966043 2069139 1858454 1865459 2108322 1961961
16192 1961961 1994782 1908634 2154195 2067936 1950684 1802208 1920060 1889228 1757464 1785390
16182 1785390 1855648 2024931 1995064 1926590 2003729 2213035 2165000 2099284 1906263 2181460
16172 2181460 2176829 2050174 2018971 2022368 2166689 2132746 1968525 2263826 2241855 2288370 2307422
16161 2307422 2414211 2536136 2614450 2342686 2519425 2261015 2187124 2359710 2335217 2211837
16151 2211837 2096882 2280895 2376258 2453137 2451804 2488829 2351341 2298443 2144116 2075308 2440500
16140 2440500 2795653 2710368 2412550 2441309 2621906 2261473 2246665 2161322 2113439 2324204
16130 2324204 2438021 2331544 2165575 2366041 2405182 2376990 2355919 2315307 2232991 2405840
16120 2405840 2547122 2534891 2565757 2469902 2257652 2346044 2493778 2364598 2408450 2249112
16110 2249112 2236495 2483050 2355761 2528008 2424901 2344004 2183065 2676470 2709781 2357968
16100 2357968 2438815 2643650 2459827 2387032 2398605 2555783 2623412 2604753 2704106 2671620 2603314
16089 2603314 2406094 2349318 2361014 2325498 2441264 2579186 2402276 2373579 2404012 2429402
16079 2429402 2387799 2547017 2429989 2518922 2570375 2727290 2389217 2467266 2619543 2588848
16069 2588848 2685917 2951044 2819846 2726184 2623873 2655573 2449230 2601481 2745875 2747480
16059 2747480 2837475 2764106 2662911 2650028 2637433 2880535 2921585 2678350 2740936 2663890 2521166
16048 2521166 2608029 2774788 2892857 2838294 2732390 2566153 2662552 2693338 2469664 2564400
16038 2564400 2382889 2425558 2605191 2537235 2523462 2506089 2413249 2601909 2733693 2597442
16028 2597442 2514853 2601779 2426451 2476165 2596922 2626123 2710362 2536758 2613015 2640671 2485839
16017 2485839 2610626 2922096 2743588 2561320 2671097 2773223 2699599 2593259 2532304 2387050
16007 2387050 2304093 2199450 2339919 2483322 2577478 2245541 2251459 2442244 2634361 2578678
15997 2578678 2406024 2264103 2631393 2447501 2363830 2459893 2445003 2693669 2416179 2585584
15987 2585584 2720668 2781364 2663083 2633835 2729403 2557025 2553844 2603131 2514323 2594993 2912229
15976 2912229 2804291 2617662 2657510 2990900 2824982 2653989 2579270 2798819 2742204 2504089
15966 2504089 2695636 2734816 2594986 2546186 2845783 2737722 2487743 2574070 2663650 2537942
15956 2537942 2693360 2582663 2539467 2506342 2403920 2709234 2785662 2440152 2356100 2754614
15946 2754614 2848421 2681215 2632047 2537051 2259335 2234138 2489279 2366865 2532572 2663443
15936 2663443 2925949 3003661 2771256 2589308 2820251 2822805 2663797 2543464 2581532 2660683
15926 2660683 2491263 2578226 2619671 2519335 2477324 2303623 2421226 2718402 2625210 2729474
15916 2729474 2872276 2937764 2873145 2880200 2645899 2590536 2601576 2656178 2454747 2471287 2427812
15905 2427812 2177379 2287207 2406129 2674212 2746550 2731512 2332803 2393391 2663370 2472976
15895 2472976 2371824 2396974 2433809 2561699 2801025 2685176 2673112 2655280 2619816 2614160 2731208
15884 2731208 2744766 2585455 2550471 2686582 2707501 2714898 2653680 2490580 2404116 2353683 2218775
15873 2218775 2276075 2409279 2646686 2749539 2706130 2604852 2816996 2871113 2679173 2651498
15863 2651498 2725171 2646895 2641595 2667996 2727950 2748537 2805180 2854410 2912587 2793499 2551296
15852 2551296 2591433 2579849 2494241 2486463 2727796 2805175 2752509 2420260 2311987 2317666 2419992
15841 2419992 2609232 2549348 2403938 2736548 2727742 2666046 2714196 2895165 2691222 2696977 2662342
15830 2662342 2868763 2862521 2893659 2756141 2664726 2691428 2567381 2509612 2598388 2648885 2480704
15819 2480704 2451196 2484895 2528947 2567879 2824373 2745506 2618984 2436543 2605579 2598265 2521957
15808 2521957 2473255 2646946 2710561 2528626 2616840 2682004 2710351 2435032 2580699 2978093
15798 2978093 2879014 2614874 2481896 2701437 2773797 2799078 2611913 2689291 2657459 2463165
15788 2463165 2557941 2614141 2796973 2933882 2928042 2762183 2679540 2608849 2798052 2709568 2612489
15777 2612489 2780414 2957472 2771740 2644451 2849409 2860331 2715618 2433349 2372293 2607820
15767 2607820 2677455 2684957 2926479 2639646 2652156 2765752 2685592 2651262 2732364 2793541 2613605
15756 2613605 2929082 3028331 2786596 2426927 2354684 2533150 2557316 2720325 2777952 3004045
15746 3004045 2764386 2561017 2595927 2677374 2841472 2732299 2677593 2740191 2671293 2545475
15736 2545475 2503995 2536433 2734223 3051598 2772183 2649838 2686632 2547959 2517795 2755394
15726 2755394 2924051 2727088 2370856 2270615 2626396 2834794 2692549 2671914 2537176 2663069
15716 2663069 2826900 2860944 2828199 2508519 2595678 2467258 2308234 2557958 2574834 2552834
15706 2552834 2454398 2658452 2829615 2774900 2789317 2625136 2479931 2537716 2664296 2414696
15696 2414696 2523063 2505116 2550723 2512141 2654521 2937930 2915254 2663476 2425331 2572675
15686 2572675 2664534 2623051 2316736 2408685 2478369 2375548 2535805 2650523 2620377 2426206
15676 2426206 2551838 2796322 2769019 2962742 2815298 2596089 2769345 2757708 2684262 2757189
15666 2757189 2583402 2716609 2574825 2363781 2536544 2503544 2529851 2895941 2939548 2716585
15656 2716585 2730906 2555829 2605275 2823807 2957807 2879220 2743208 2459437 2597613 2758422
15646 2758422 2800629 2565395 2535229 2488052 2455365 2600177 2857417 2511618 2453667 2522918
15636 2522918 2598825 2584843 2609548 2730188 2825956 2711698 2720000 2397170 2372514 2647041 3038407
15625 3038407 2759739 2423976 2665988 2775260 2808438 2916779 2848672 2395975 2636547 2593265
15615 2593265 2580307 2730476 2874529 2713217 2732531 2577975 2533719 2426236 2426620 2338697 2562268
15604 2562268 2529636 2653976 2679579 2696878 2944360 2739261 2692382 2723838 2606993 2965178
15594 2965178 2684689 2787443 2695338 2627390 2681095 2733722 2891068 2882205 2853089 2711549 2633597
15583 2633597 2605215 2659813 2542198 2620603 2625793 2445807 2446912 2657810 2717804 2769293 2784732
15572 2784732 2892574 2999538 2854745 2647070 2530581 2251266 2249549 2458088 2678336 2729588
15562 2729588 2431126 2564673 2758586 2434697 2416839 2512228 2469290 2615212 2651361 2628771
15552 2628771 2551043 2781999 2695975 2806272 2891887 2710508 2539246 2407694 2586163 2596564
15542 2596564 2601544 2689762 2711857 2715047 2854065 2598378 2693990 2546125 2736539 2587552 2549553
15531 2549553 2714274 2776856 2803554 2848541 2639174 2501781 2599439 2790863 2619901 2640201
15521 2640201 2669269 2767399 2685224 2846587 2837437 2822636 2686762 2818349 2588561 2650865 2799442
15510 2799442 2667421 2707139 2566114 2710057 2571116 2824080 2830256 2797787 2797528 2717969 2647797
15499 2647797 2801704 2794876 2764944 2692884 2606921 2653978 2749902 2651676 2777961 2736513 2686220
15488 2686220 2678705 2893396 2596550 2492787 2681206 2726907 2820737 3068964 2856908 2635157
15478 2635157 2469250 2454539 2644620 2699534 2598633 2662878 2896782 2967506 2683651 2599900
15468 2599900 2704945 2642913 2667212 2595340 2689791 2674643 2539283 2592826 2474229 2368538
15458 2368538 2741508 2946497 2680210 3072428 3148508 3138448 3055174 2807806 3171455 3145626
15448 3145626 2767384 2767451 3156589 3050478 2629307 2665969 2744493 2583516 2550096 2620477 2725627
15437 2725627 2763224 2701876 2657838 2570278 2453579 2545630 2743006 2814624 2640438 2770747
15427 2770747 2923501 2670137 2684568 2696717 2532628 2710404 2523785 2323871 2615773 2736141
15417 2736141 2644567 2687447 2621706 2689712 2849356 2603902 2571696 2565253 2608250 2678867 2477611
15406 2477611 2368874 2247968 2292749 2347711 2567124 2337421 2544658 2811165 2726517 2530229
15396 2530229 2484785 2773256 2685691 2755884 2713739 2841237 3016992 2741793 2618158 2585371
15386 2585371 2698244 2760287 2675529 2946641 3046297 2972981 2948965 2745482 2783567 2609824
15376 2609824 2587241 2505044 2664173 2827503 2764421 2599538 2594183 2837540 2570120 2612180
15366 2612180 2740929 2872380 2633395 2731875 2951343 2872958 3066940 2906451 2910639 2668494
15356 2668494 2460388 2536728 2739544 2591732 2651473 2817213 2603025 2511258 2882499 2990880
15346 2990880 2604589 2445902 2509969 2770062 2612729 2696425 2714446 2711331 2518135 2653448
15336 2653448 2653877 2711508 2700631 2537110 2701053 2511603 2702471 2735935 2517273 2557953 2367550
15325 2367550 2539591 2584162 2530096 2433508 2579829 2593563 2418261 2631623 2783541 2785153
15315 2785153 2969207 3129905 2879846 2879666 2902378 3003939 3137248 3114803 2735527 2612322
15305 2612322 2763591 2903779 2954645 2901586 2715936 2602164 2866132 2683021 2644308 2562250
15295 2562250 2633934 2791499 2690591 2755482 2716197 2770876 2961540 3002528 2848536 2795705
15285 2795705 2764965 2496231 2477233 2661010 2562210 2836701 3077985 2784659 2636658 2827931
15275 2827931 2795070 2937942 2727422 2718613 2776770 2619474 2607406 2683537 2955394 2801343
15265 2801343 2799166 2840790 2805557 2792728 2793053 2726803 2682966 2892065 2833055 2743606 2640085
15254 2640085 2792945 2601799 2666673 2745001 2648888 3062083 3261557 3097036 2883644 2816046
15244 2816046 2592859 2680846 2515985 2397042 2386039 2393598 2596956 2517448 2476044 2870861
15234 2870861 3057007 2943268 2901182 2966742 3091331 2831973 2947812 2819320 2424271 2597185
15224 2597185 2779143 2784867 2894124 2897742 2824480 3023185 2902560 2891632 2681057 2622399 2748454
15213 2748454 2546074 2453347 2564630 2821766 2984790 3062235 2741603 2698072 2787413 2809146
15203 2809146 2905840 2927222 2839665 2910613 2811805 2622507 2703167 2891098 3005708 2915600 2791042
15192 2791042 2622465 2663631 2771570 2737442 2258909 2285752 2507249 2862673 2890002 2876577
15182 2876577 2802739 2671600 2577559 2568204 2654749 2443668 2451489 2705033 2692982 2694329 2706595
15171 2706595 2608802 2780556 2827589 2997958 2769829 2780194 2866375 2674178 2634783 2574763
15161 2574763 2838674 2930223 2880635 2778046 2837054 2758493 2886603 2843685 2768139 2776186 2667988
15150 2667988 2761042 2712722 2774859 2957783 3027061 3192382 3008783 2827795 3013589 2859560
15140 2859560 2932839 2783181 2895915 2887550 2879372 2868719 2747605 2907817 2902324 2673196 2569410
15129 2569410 2534301 2474869 2457564 2649236 2709331 2678908 2710899 2676321 2771136 2822264 2768330
15118 2768330 2918235 2777529 2805183 3003975 2944731 2878385 2972846 2922488 2735535 2709986
15108 2709986 2867390 2879036 2859593 2844185 2699148 2799782 2772013 2831554 3004237 3006526 2764263
15097 2764263 2716759 2602527 2426201 2539613 2605742 2796971 3056301 2998557 2842601 2751552
15087 2751552 3150633 2948773 2604932 2776481 2898409 2921133 2916451 2872664 2796934 2705219
15077 2705219 2614134 2782436 2894714 3018815 2916921 2603224 2552564 2725525 2586535 2667149
15067 2667149 2628993 2760711 2734818 2894353 2858387 2783820 2692784 2854767 2876977 3062483
15057 3062483 3165285 3103740 2860579 2520793 2859249 2823780 2886675 2817485 2983851 2852083
15047 2852083 2767028 2783433 2823251 2991033 2749043 2666296 2803156 2766795 2683949 2482300
15037 2482300 2649701 2840125 2787812 2758771 2768092 2638932 2685920 2814447 2767337 2852441 2722960
15026 2722960 2583601 2678356 2742310 3121122 3100536 2862553 2759498 2775644 2794406 2867333
15016 2867333 2822515 2646032 2726158 3012411 2863805 2974325 2807542 2927069 3065069 2666607
15006 2666607 2640301 2752682 2671470 2754417 2861926 2876877 2810757 2618680 2736393 2754216
14996 2754216 2772805 2821545 2981965 2885552 3004562 2836152 2787654 2894856 2796989 2731090
14986 2731090 2616324 2826848 3037173 2997153 2889359 2825797 2698166 2871685 2851571 3024243
14976 3024243 3046574 2776623 2725433 2813735 3232634 3099046 2856847 2795528 2899430 2670490
14966 2670490 2589886 3243433 3425792 3252526 3234813 3140006 3042352 3077389 3058069 2982118 2932162
14955 2932162 2861074 2612793 2537702 2814676 2852858 2941496 2873072 2583307 2825306 2957889
14945 2957889 3116969 2922674 2577244 2605663 2772599 2813549 2802224 2943815 3037207 3019023
14935 3019023 3156162 3261694 3096084 3028572 2964028 3076544 3199773 3198557 3027821 2925021
14925 2925021 2917173 2965347 2977563 3187896 2959044 2849308 2546824 2609410 2701014 2443778
14915 2443778 2734226 2728621 2675404 2867547 2886631 2969611 3161003 3098483 3030846 2973286 2751550
14904 2751550 2754329 2922006 3003885 2996295 3043058 2703968 2757359 2861241 3006206 2979689 3004988
14893 3004988 2966091 2728324 2862114 2905781 2913066 2982975 2942940 2887157 2890479 3077757 3183924
14882 3183924 3114091 3044755 3260898 3198746 3056720 3144347 3186637 3226098 2951482 2970613 3024109
14871 3024109 3270330 3345000 3134016 2969934 2930529 2951324 2832603 2825665 2860766 2701784
14861 2701784 2872586 2745799 2931444 2938160 2927374 2803622 2914389 2865946 3111933 3185349
14851 3185349 3132525 3053156 3093018 2954983 2765750 3098575 3156174 3273249 3260481 3134556
14841 3134556 3096086 3198973 3025706 3034915 3106063 3015174 2911842 2913734 2829231 2892921 2936010
14830 2936010 3033741 2947049 2896200 2888884 2924020 3074034 3072629 3053893 2832737 2905748 2915152
14819 2915152 2660819 2741708 3024971 3204593 2942027 2941727 2986059 2799164 2880924 3006664
14809 3006664 3043049 3021326 2843128 2759868 2894151 3129640 2998785 2916577 2879778 2813429
14799 2813429 2904736 2735284 3032098 3050090 2975130 3172509 2887057 2892464 3034080 2923028
14789 2923028 2879097 3033007 3363284 3215683 2763658 2551917 2829807 2712439 2796442 2864177
14779 2864177 2835839 3067974 2936505 2831202 3044353 2882421 2804084 2777707 2830992 3165456
14769 3165456 3298018 2963019 2739921 2982244 2954038 3073709 2980409 3062913 2869298 2881459
14759 2881459 2853990 2885583 2957504 2909714 3190742 3314554 3139685 2871181 2786507 2870136
14749 2870136 2843312 2765718 2717515 3182924 3232505 3019002 2892885 2949689 3006492 2945339 2829278
14738 2829278 2794123 3197999 3100301 3024378 3332486 3537857 3318395 3039357 3021151 2840943
14728 2840943 2925062 2964264 3102475 3175642 3037433 2726028 2653984 2959060 2966716 2936987 2940248
14717 2940248 3074369 2770648 2725747 2704896 2675749 2567389 2469204 2706176 2923120 2727649
14707 2727649 2777233 2856262 2883659 2860572 2842971 2920937 2978041 3127675 3024791 2846436 3135139
14696 3135139 3125365 2930897 2980278 2957687 2915911 2966689 3085319 2893746 2855116 2880899 2966416
14685 2966416 2748565 2685746 2815249 2796564 2863550 3016832 2947905 2937408 2900060 2849259 2998121
14674 2998121 2877164 2958479 2806648 2749919 2874538 2983731 3049549 2901065 2901435 2962918 3042526
14663 3042526 2911090 2924751 2861410 2885057 2934297 2976792 3151237 3144262 2975499 3041827 3067173
14652 3067173 3185273 3270733 3240559 3099851 3051704 2918404 3115408 3130797 3162432 3148256
14642 3148256 2923272 2839173 3174673 3055160 3019740 3034453 2863052 3059550 3156357 3327250
14632 3327250 3111447 2932071 3092518 3221085 2956968 3140604 2985950 2659365 2909541
14623 2909541 3313331 3053381 3179932 3233330 3156735 3017702 2986177 3074079 2910687 2771668
14613 2771668 2913517 2834863 3061168 3134901 3138929 2825193 2942753 3018712 3116748 2825554
14603 2825554 2979679 3083385 3025844 3117328 3040856 3051797 3062212 3292539 3026947 3158837
14593 3158837 2951832 3016987 3039329 2814740 2784893 3082844 2850447 2867709 2771933 2582083
14583 2582083 2700630 2841077 3069911 3131187 3165961 2979541 3105520 3251376 2994813 2886969
14573 2886969 2952583 3237506 2975676 3014573 3054490 2997015 3022238 3068611 2931134 3000715 3147468
14562 3147468 3110232 3215376 3144258 3052151 3005150 2960982 3323824 3398736 3024504 2932500 3224342
14551 3224342 3158355 3129741 3057887 3124870 3091736 2995068 3160204 2914906 2802624 3019541
14541 3019541 3001660 2943068 3028655 3134434 2975784 2987527 3091106 2875694 2976039 2889040
14531 2889040 2906344 2962565 3183815 3031271 2955474 2978722 3224244 3298858 3279485 3216601 2888955
14520 2888955 2868012 3081422 3146767 2972504 3012544 3154822 3095293 2795624 2801585 2754783 2747052
14509 2747052 2710183 2789275 2992648 3111033 3202100 2977773 2932028 2866746 2994230 3079453
14499 3079453 3254516 3141476 3100919 3221638 3106002 3040763 2965179 2992728 3002231 2946000 2845216
14488 2845216 3045268 3183242 2908376 2897884 3182187 3185518 3151561 3319723 3152405 2863309
14478 2863309 2677837 2691809 2857290 3030472 3051366 2928280 3083268 3100225 3109267 3015477
14468 3015477 3280297 3313451 3268369 3355725 3282376 3161730 3053299 2977918 3085911 3050332
14458 3050332 3064636 3146938 3202192 3204855 3067013 2967875 2960553 3216355 3470576 3379041 3230381
14447 3230381 3047524 3182340 3214441 3028427 3162574 2931509 2837969 3016799 3129034 2702144
14437 2702144 2921782 3096038 2942502 2930409 2921361 2831850 2913403 3079063 3277968 3282551 3368077
14426 3368077 3168788 2976175 3049163 2925220 2695703 2893740 2975203 2967405 3046368 2847873
14416 2847873 2784495 2868943 2962885 3024149 3150145 3007417 2864692 2807937 3111108 2995249
14406 2995249 2901755 2835283 2761946 2953140 2885156 2960031 2861557 2957571 3209720 3110013 2847277
14395 2847277 2971711 3006936 2919182 2733825 2838869 3213946 3029313 2923054 2999326 3060961
14385 3060961 2936774 3021155 2868439 2978406 3098158 3369302 3334516 3505785 3430218 3023574
14375 3023574 2940294 3176989 3337577 3244653 3257149 3017401 3023592 3033603 3008737 3062753 3083932
14364 3083932 3056964 3028468 2912942 2906232 3235861 2999914 2970215 2959880 3064720 2977213 3051043
14353 3051043 3199708 2993346 2627213 2510713 2883805 2855663 2948419 3075786 3223872 3117581
14343 3117581 3365421 3140404 2890838 2710407 2650883 2974130 3017524 3068857 2971978 2992328
14333 2992328 3583561 3547518 3380816 3120273 2959624 3066108 3009942 3158612 3219856 3062310
14323 3062310 3276408 3113122 3011425 3344172 3138264 3227044 2967874 2954967 2898465 2829473
14313 2829473 2956663 2913025 2928602 2967183 2774196 2927121 2904425 2753526 2872290 3043431
14303 3043431 3218603 3033625 2697160 2558532 2739676 2974504 3087417 3145229 3026051 2783221
14293 2783221 2959788 3157321 3239432 3215707 3215749 2986385 2802346 2998745 3018449 2703346 2909404
14282 2909404 3100186 3188891 2852425 2648347 2923503 3116265 3008864 3040413 3201733 3198825
14272 3198825 3040977 3182281 2968228 2906008 2889258 3034507 3084913 3044952 3046372 3116255 2861042
14261 2861042 2836172 3113648 3071575 3337860 3208408 3331815 3286279 3287551 3043398 2928834
14251 2928834 2663917 2869740 3069629 3034768 2980799 3020924 2863008 2940992 2918910 3041929
14241 3041929 3115284 3055942 3115096 3133385 3034564 2939009 3136828 3121912 3004278 2835296 3074151
14230 3074151 3065807 3217088 3482816 3317366 3069894 2960181 3025107 3072277 3159245 3159175 2957811
14219 2957811 3059917 3422435 3386194 3342235 3210810 3078289 3265015 3139699 3028118 2949808
14209 2949808 2798440 3006019 3115251 2898016 2827937 2978558 3170891 3240362 3397010 3235767
14199 3235767 3451355 3444417 3393141 3063898 3201203 3130854 3135912 3158907 3048733 2966041 2960722
14188 2960722 3256854 3193142 3155038 3033271 3124083 2980192 3196618 3170768 3157254 2990864
14178 2990864 3028838 3250470 2846110 2916344 3147272 3065012 2902290 2922685 3022354 3062751
$$ [...]
##END NTUPLES=NMR SPECTRUM
##END=
