##TITLE=1H_TG-2389-2
 200.13MHz, CDCl3,
 8 sc
 
 15.8.2025
##JCAMPDX= 6.0         $$ Bruker NMR JCAMP-DX V2.0
##DATA TYPE= NMR SPECTRUM
##DATA CLASS= NTUPLES
##ORIGIN= UXNMR, Bruker Analytische Messtechnik GmbH
##OWNER= pz
$$ XWIN-NMR		Version 3.5
$$ Fri Aug 15 14:29:17 2025 Russian Standard Time (UT+4h)  she@DPX200
##.OBSERVE FREQUENCY= 200.1313
##.OBSERVE NUCLEUS= ^1H
##.ACQUISITION MODE= SIMULTANEOUS
##.ACQUISITION SCHEME= undefined
##.AVERAGES= 8
##.DIGITISER RES= 18
##SPECTROMETER/DATA SYSTEM= spect
##.PULSE SEQUENCE= zg30
##.SOLVENT NAME= CDCl3
##.SHIFT REFERENCE= (INTERNAL, CDCl3, 0, 15.4252)
##AUDIT TRAIL= $$ (NUMBER, WHEN, WHO, WHERE, WHAT)
$$ ##TITLE= Audit trail, XWIN-NMR		Version 3.5
$$ ##JCAMPDX= 5.01
$$ ##ORIGIN= Bruker BioSpin GmbH
$$ ##OWNER= she
$$ F:/spectra/data/she/nmr/H-C/1/pdata/1/auditp.txt
$$ ##AUDIT TRAIL=  $$ (NUMBER, WHEN, WHO, WHERE, WHAT)
(   1,<2025-08-15 14:27:52.06 +0400>,<she>,<DPX200>,
      <created by zg, POWCHK disabled, PULCHK disabled
       configuration hash MD5:
       00 E9 B6 7A A2 85 ED C7 34 08 36 98 17 FE 4E 26
       data hash MD5: 16K
       7B F8 05 54 EF 12 F1 4C 4A F4 EB 6D 26 67 85 14>)
(   2,<2025-08-15 14:27:55.01 +0400>,<she>,<DPX200>,
      <Start of raw data processing
       efp BC_mod = 2 LB = 0.25 FT_mod = 6 PKNL = 1 PHC0 = -1562.455 PHC1 = 13.59228 SI = 16K 
       data hash MD5: 16K
       1B EB 1F E5 EE A1 BE 50 95 FC 89 D0 47 9C 45 6A>)
(   3,<2025-08-15 14:28:23.23 +0400>,<she>,<DPX200>,
      <pk PHC0 = 5.232517 PHC1 = -8.599999 
       data hash MD5: 16K
       7C AD EA EB D7 AF 4F 78 0E 6F 6A EF 71 F2 0B E9>)
(   4,<2025-08-15 14:28:26.92 +0400>,<she>,<DPX200>,
      <abs ABSG = 5 
       data hash MD5: 16K
       AF 1D A4 04 95 4C FE 4E BC B8 67 B2 EC 18 51 7D>)
$$ ##END=
$$ 
$$ hash MD5
$$ B4 F7 F2 81 3E A0 AE 7E AE 55 8B DC 12 D0 B5 0E
##$RELAX= 
##$RELAX= 
##$RELAX= 
##$RELAX= 
##$RELAX= 
##$RELAX= 
$$ Bruker specific parameters
$$ --------------------------
##$DU= <F:/spectra>
##$EXPNO= 1
##$NAME= <H-C>
##$PROCNO= 1
##$TYPE= <nmr>
##$USER= <she>
##$AMP= (0..31)
100 100 100 100 100 100 100 100 100 100 100 100 100 100 100 100 100 100 
100 100 100 100 100 100 100 100 100 100 100 100 100 100 
##$AQSEQ= 0
##$AQ_mod= 1
##$AUNM= <au_zg>
##$AUTOPOS= <>
##$BF1= 200.13
##$BF2= 200.13
##$BF3= 200.13
##$BF4= 200.13
##$BF5= 200.13
##$BF6= 200.13
##$BF7= 200.13
##$BF8= 200.13
##$BYTORDA= 1
##$CFDGTYP= 0
##$CFRGTYP= 5
##$CHEMSTR= <none>
##$CNST= (0..31)
1 1 145 1 1 1 1 1 1 1 1 1 1 1 1 1 1 1 1 1 1 1 1 1 1 1 1 1 1 1 1 1 
##$CPDPRG= <>
##$CPDPRG1= <>
##$CPDPRG2= <>
##$CPDPRG3= <>
##$CPDPRG4= <mlev>
##$CPDPRG5= <mlev>
##$CPDPRG6= <mlev>
##$CPDPRG7= <mlev>
##$CPDPRG8= <mlev>
##$CPDPRGB= <>
##$CPDPRGT= <>
##$D= (0..31)
0 0.7 0 0 0 0 0 0 0 0 0 0.03 0 0 0 0 0 0 0 0 0 0 0 0 0 0 0 0 0 0 0 0 
##$DATE= 1755253671
##$DBL= (0..7)
120 120 120 120 120 120 120 120 
##$DBP= (0..7)
150 150 150 150 150 150 150 150 
##$DBP07= 0
##$DBPNAM0= <>
##$DBPNAM1= <>
##$DBPNAM2= <>
##$DBPNAM3= <>
##$DBPNAM4= <>
$$ [...]
##$SUBNAM3= <"">
##$SUBNAM4= <"">
##$SUBNAM5= <"">
##$SUBNAM6= <"">
##$SUBNAM7= <"">
##$SUBNAM8= <"">
##$SUBNAM9= <"">
##$SW= 18.0517328524113
##$SWIBOX= (0..15)
0 0 2 0 0 0 0 0 0 0 0 0 0 0 0 0 
##$SW_h= 3612.71676300578
##$TD= 16384
##$TD0= 1
##$TE= 0
##$TE2= 300
##$TE3= 300
##$TEG= 300
##$TL= (0..7)
0 120 120 120 120 120 120 120 
##$TP= (0..7)
150 150 150 150 150 150 150 150 
##$TP07= 0
##$TPNAME0= <>
##$TPNAME1= <>
##$TPNAME2= <>
##$TPNAME3= <>
##$TPNAME4= <>
##$TPNAME5= <>
##$TPNAME6= <>
##$TPNAME7= <>
##$TPOAL= (0..7)
0.5 0.5 0.5 0.5 0.5 0.5 0.5 0.5 
##$TPOFFS= (0..7)
0 0 0 0 0 0 0 0 
##$TUNHIN= 0
##$TUNHOUT= 0
##$TUNXOUT= 0
##$USERA1= <user>
##$USERA2= <user>
##$USERA3= <user>
##$USERA4= <user>
##$USERA5= <user>
##$V9= 5
##$VALIST= <valist>
##$VCLIST= <CCCCCCCCCCCCCCC>
##$VD= 0
##$VDLIST= <DDDDDDDDDDDDDDD>
##$VPLIST= <PPPPPPPPPPPPPPP>
##$VTLIST= <TTTTTTTTTTTTTTT>
##$WBST= 1024
##$WBSW= 4
##$XGAIN= (0..3)
0 0 0 0 
##$XL= 0
##$YL= 0
##$YMAX_a= 949257
##$YMIN_a= -1045380
##$ZGOPTNS= <>
##$ZL1= 120
##$ZL2= 120
##$ZL3= 120
##$ZL4= 120
##$ABSF1= 15.48246
##$ABSF2= -2.569389
##$ABSG= 5
##$ABSL= 3
##$ALPHA= 0
##$AQORDER= 0
##$ASSFAC= 0
##$ASSFACI= 0
##$ASSFACX= 0
##$ASSWID= 0
##$AUNMP= <proc_1d>
##$AZFE= 0.1
##$AZFW= 0.1
##$BCFW= 0
##$BC_mod= 2
##$BYTORDP= 0
##$COROFFS= 0
##$CY= -3
##$DATMOD= 1
##$DC= 0
##$DFILT= <>
##$DTYPP= 0
##$F1P= 0
##$F2P= 0
##$FCOR= 1
##$FTSIZE= 16384
##$FT_mod= 6
##$GAMMA= 0
##$GB= 0
##$INTBC= 1
##$INTSCL= 3.241238e-09
##$ISEN= 128
##$LB= 0.25
##$LEV0= 0
##$LPBIN= 0
##$MAXI= 10000
##$MC2= 0
##$MEAN= 0
##$ME_mod= 0
##$MI= 1.114404
##$NCOEF= 0
##$NC_proc= -5
##$NLEV= 6
##$NOISF1= 3.799351
##$NOISF2= 2.8
##$NSP= 0
##$NTH_PI= 0
##$NZP= 0
##$OFFSET= 15.42516
##$PC= 1
##$PHC0= -1557.222
##$PHC1= 4.992281
##$PH_mod= 1
##$PKNL= yes
##$PPARMOD= 0
##$PSCAL= 0
##$PSIGN= 0
##$REVERSE= no
##$SF= 200.130019319543
##$SI= 16384
##$SIGF1= 3
##$SIGF2= 2
##$SINO= 0.751879
##$SIOLD= 32768
##$SREGLST= <19F.Aceton>
##$SSB= 0
##$STSI= 16384
##$STSR= 0
##$SW_p= 3612.71676300578
##$SYMM= 0
##$S_DEV= 0
##$TDeff= 16384
##$TDoff= 0
##$TI= <>
##$TILT= no
##$TM1= 0
##$TM2= 0
##$TOPLEV= 0
##$USERP1= <user>
##$USERP2= <user>
##$USERP3= <user>
##$USERP4= <user>
##$USERP5= <user>
##$WDW= 1
##$XDIM= 16384
##$YMAX_p= 363312670
##$YMIN_p= -485458
$$ End of Bruker specific parameters
$$ ---------------------------------
##NTUPLES= NMR SPECTRUM
##VAR_NAME=  FREQUENCY,     SPECTRUM/REAL,   SPECTRUM/IMAG
##SYMBOL=    X,             R,               I
##VAR_TYPE=  INDEPENDENT,   DEPENDENT,       DEPENDENT
##VAR_FORM=  AFFN,          ASDF,            ASDF
##VAR_DIM=   16384,         16384,           16384
##UNITS=     HZ,            ARBITRARY UNITS, ARBITRARY UNITS
##FACTOR=    0.220516191357247, 1,           1
##FIRST=     3087.0376504641, 0,             0
##LAST=      -525.679112541684, 0,           0
##MIN=       -525.679112541684, -485458,     0
##MAX=       3087.0376504641, 363312670,     0
$$ Real data points
##PAGE= N=1
##DATA TABLE= (X++(R..R)), XYDATA
$$ [...]
$$ plain form
12407 151328 93961 64836 97055 39803 79949 67876 60062 56553 -7443 73265 63480 53221
12395 53221 93197 56829 68233 72798 39638 63132 145961 85662 71112 20103 -35010 -12274
12383 -12274 -43225 1583 30304 59870 53555 28526 22753 40485 1786 82480 45986 -15935
12371 -15935 -21545 49893 -7278 -50473 -2177 -149046 -54897 -5458 -87756 -30253 35642 33051
12359 33051 73158 116267 36152 32139 58453 114027 78351 15400 18459 60944 98322 71181
12347 71181 41754 38726 73586 98538 21106 40514 56047 74854 38938 968 100453 20953
12335 20953 31332 3424 -34535 14005 83580 52721 32730 77943 63831 16627 -23476 12849
12323 12849 26061 -18348 64157 70314 65658 13599 8938 -47729 -24486 708 4139 25992
$$ packed form
12407A51328n7367k9125L2219n7252M0146j2073p814l509o3996Q0708r785j0259
12395E3221L9976l6368J1404M565l3160K3494Q2829o0299j4550n1009n5113K2736
12383a2274l0951M4808K8721K9566o315k5029n773J7732l8699Q0694l6494o1921
12371a5935n610P1438n7171m3195M8296j46869R4149M9439q2298N7503O5895k591
12359C3051M0107M3109q0115m013K6314N5574l5676o2951L059M2485L7378k7141
12347G1181k9427l028L4860K4952p7432J9408J5533J8807l5916l7970R9485p9500
12335B0953J0379k7908l7959M8540O9575l0859j9991M5213j4112m7204m0103L6325
12323A2849J3212m4409Q2505O157m656n2059m661n6667K3243K5194L431K1853
$$ plain form
12311 25992 -9412 47126 -52160 -25475 9893 93365 63705 70438 76556 41043 39914 32551
12299 32551 77778 110095 33451 9958 12198 -33489 -7553 71567 72101 64233 47255 18373
12287 18373 48846 -5413 6810 23468 15785 39613 311 -46693 29418 33738 61759 78378
12275 78378 84286 103459 139390 132135 67459 78690 39468 -5319 42994 60979 35162 56110
12263 56110 25604 -2771 28143 43721 44491 66917 59300 3 -13699 19745 47720 -41715
12251 -41715 -19339 -3196 -52233 -21426 834 -69836 -27573 -8858 -63562 59876 27588
12240 27588 5758 1296 12307 45291 -34225 66411 62830 17411 30540 8431 -70395 -26936
12228 -26936 24021 42067 60457 21339 56224 58828 50286 1548 -24324 -18266 27888 27830 -7631
$$ packed form
12311B5992l5404N6538r9286K6685L5368Q3472k9660O733O118l5513j129p363
12299C2551M5227L2317p6644k3493K240m5687K5936P9120N34p868j6978k8882
12287A8373L0473n4259J2223J6658p683K3828l9302m7004P6111M320K8021J6619
12275G8378N908J9173L5931p255o4676J1231l9222m4787M8313J7985k5817K0948
12263E6110l0506k8375L0914J5578P70K2426p617n9297j3702L3444K7975q9435
12251d1715K2376J6143m9037L0807K2260p0670M2263J8715n4704J23438l2288
12240B7588k1830m462J1011L2984p9516J00636l581m5419J3129k2109p8826M3459
12228b6936N0957J8046J8390l9118L4885K604q542m8738k5872O058M6154n8l5461
$$ plain form
12215 -7631 -29812 3217 -14314 -93888 -102516 -56346 -32187 5967 -59101 -63268 -23719 52776
12203 52776 65400 60712 35474 -47511 -49358 -84759 43381 52900 -26917 -35106 -35537 -111598 -99544
12190 -99544 58754 -4722 -29571 38830 69609 -4827 -37709 -31944 -70238 -110770 -51276 64851
12178 64851 86251 55809 57557 67714 100225 22691 -43413 -29061 7812 11052 -5258 -14304
12166 -14304 27568 86475 71460 35699 9549 -9351 -4561 44746 12120 11196 61303 123546
12154 123546 46378 71165 145755 68038 -53417 -77531 -65621 -22252 32563 48409 81785
12143 81785 613 -8788 16956 52560 128131 87470 31896 -17646 -47800 -64870 -36781 -111402
12131 -111402 -63931 -46470 -44636 34593 35814 61602 29209 -705 -61431 1605 34777 13711
$$ packed form
12215g631k2181L3029j7531p9574q628M6170K4159L8154o5068m167L9549P6495
12203E2776J2624m688k5238q2985j847l5401J28140R519p9817q189m31p6061J2054
12190i9544J58298o3476k4849O8401L0779p4436l2882N765l8294m0532N9494J16127
12178F4851K1400l0442J748J0157L2511p7534o6104J4352L6873L240j6310r046
12166a4304M1872N8907j5015l5761k6150j8900M790M9307l2626r24N0107O2243
12154A23546p7168K4787P4590p7717j21455k4114J1910M3369N4815J5846L3376
12143H1785q1172r401K5744L5604P5571m0661n5574m9542l0154j7070K8089p4621
12131a11402M7471J7461J834P9229J221K5788l2393k9914o0726O3036L3172k1066
$$ plain form
12119 13711 5691 -52822 -60818 -9468 5119 -40003 17178 10614 -774 26439 -4209 82716
12107 82716 74038 49893 82991 83555 44376 43634 57825 10243 -10952 -48648 13408 -15070 -33391
12094 -33391 -67015 -42848 6874 -37625 19415 26647 68637 56532 -7837 -49908 -91519 -57915
12082 -57915 4035 40934 10356 35738 39966 63454 45548 30170 73590 30932 41 -31752
12070 -31752 4047 19236 45794 -19196 -108628 -67994 -35525 -53061 -96242 -125739 -50447 22179
12058 22179 78595 26264 -37064 -63538 -75563 60389 52999 1377 -13092 18599 13301 -24642
12046 -24642 -69462 6019 89577 94053 15647 -37401 -35616 -23942 -30123 -10540 7949 93208
12034 93208 103702 4638 -27653 -38966 -42460 -51393 -2648 -25946 -1453 -62444 -64353 -9918
$$ packed form
12119A3711q020n8513p996N1350J4587m5122N7181o564j1388K7213l0648Q6925
12107H2716q678k4145L3098N64l9179p42J4191m7582k1195l7696O2056k8478j8321
12094c3391l3624K4167M9722m4499N7040P232M1990j2105o4369m2071m1611L3604
12082e7915O1950L6899l0578K5382M228K3488j7906j5378M3420m2658l0891l1793
12070c1752L5799J5189K6558o4990q9432M0634L2469j7536m3181k9497P5292P2626
12058B2179N6416n2331o3328k6474j2025J35952p390n1622j4469L1691n298l7943
12046b4642m4820P5481Q3558M476p8406n3048J785J1674o181J9583J8489Q5259
12034I3208J0494r9064l2291j1313l494q933M8745k3298K4493o0991j909N4435
$$ plain form
12022 -9918 -31548 -26449 63385 -50148 57759 30406 47667 126882 66342 62141 34345 -16561
12010 -16561 -34440 -25087 -65514 -45962 2413 59205 -19048 -81286 -53872 -1096 4456 -49285
11998 -49285 -153795 -131472 -57547 25620 89682 61724 -33262 57726 58564 -22846 -60311 -49295
11986 -49295 -12612 53454 -9849 -58365 -11241 -68630 -82039 -71107 -1260 23323 -36623 -32682
11974 -32682 -20916 -16825 -24834 12424 7517 -59746 -96736 -65190 -54638 -17163 -1029 14388
11962 14388 51156 27180 32348 47846 -19033 -42748 -28326 -43226 -52845 -141382 -80629 -78667
11950 -78667 50828 48221 25770 58860 23624 44957 23757 26774 8917 -913 19303 39544
11938 39544 48947 20657 -3172 -2090 -42112 -15071 39236 16240 -30755 20174 -29553 8312
$$ packed form
12022i918k1630N099Q9834j13533J07907k7353J7261P9215o0540m201k7796n0906
12010a6561j7879R353m0427J9552M8375N6792p8253o2238K7414N2776N552n3741
11998d9285j04510K2323P3925Q3167O4062k7958r4986R0988Q38q1410l7465J1016
11986d9295L6683O6066o3303m8516M7124n7389j3409J0932O9847K4583n9946L941
11974c2682J1766M091q009L7258m907o7263l6990L1546J0552L7475J6134J5417
11962A4388L6768k3976N168J5498o6879k3715J4422j4900r619q8537O0753J962
11950g8667J29495k607k2451L3090l5236K1333k1200L017j7857r830K0216K0241
11938C9544R403k8290k3829J082m0022K7041N4307k2996m6995N0929m9727L7865
$$ plain form
11926 8312 71918 42539 73225 62419 36066 59493 29027 57876 13385 -26322 -64564 -71084
11914 -71084 -65990 -30803 -48714 -50119 40240 20721 52797 107780 67361 46878 53007 18547
11902 18547 26447 7592 28614 26554 -2878 -6148 62410 -20444 -54364 -6772 -2019 -9875 56224
11889 56224 46922 38831 32345 -4322 3823 28522 -6656 -28146 -19952 -27433 36329 533 21157
11876 21157 61133 -26793 -68528 5136 21865 28583 18735 -21693 -28343 -50831 18029 20645
11864 20645 5769 32662 -35558 1249 23620 -24298 -23320 3608 86832 71731 74843 -2857
11852 -2857 17977 19732 8226 37998 -88709 -30691 -90663 -116208 -34907 -13182 -36480 -26369
11840 -26369 -9120 3509 50136 49959 7702 39191 2685 96728 69642 48349 -19309 -78417
$$ packed form
11926H312O3606k9379L0686j0806k6353K3427l0466K8849m4491l9707l8242o520
11914g1084N094L5187j7911j405R0359j9519L2076N4983m0419k0483O129l4460
11902A8547P900j8855K1022k060k9432l270O8558q2854l3920M7592M753p856O6099
11889E6224r302q091o486l6667Q145K4699l5178k1490Q194p481O3762l5796K0624
11876B1157L9976q7926m1735P3664J6729O718r848m0428o650k2488O8860K616
11864B0645j4876K6893o8220L6807K2371m7918R78K6928Q3224j5101L112p7700
11852b857K0834J755j1506K9772j26707N8018n9972k5545Q1301K1725k3298J0111
11840b6369J7249J2629M6627j77m2257L1489l6506R4043k7086k1293o7658n9108
$$ plain form
11828 -78417 -60725 -38476 5414 4848 39704 22185 93778 82123 1127 -23253 -47039 -15792
11816 -15792 -23617 37638 129179 145173 103214 50224 51038 -11227 -22339 -45413 -41660 -59342
11804 -59342 -41524 -21450 40653 -21966 27724 14007 23105 121 -50033 -17959 34963 43598
11792 43598 -49370 -32621 -37910 11862 22584 63191 113490 79245 46414 15048 23770 47349
11780 47349 95812 32680 -21727 -27083 -31886 33645 80490 76774 80652 53666 -23038 -51770
11768 -51770 -99706 -140003 -149639 -114647 -57198 3927 4957 -10833 51161 53840 58753 43964
11756 43964 38084 -417 12134 35434 1529 -16692 -23353 18150 -21427 1357 113 26 3310
11743 3310 58923 18036 12775 30148 -35418 -83531 -80773 -18979 4349 3318 6662 28054 18104
$$ packed form
11828g8417J7692K2249M3890n66L4856j7519P1593j1655q0996k4380k3786L1247
11816a5792p825O1255R1541J5994m1959n2990Q14o2265j1112k3074L753j7682
11804e9342J7818K0074O2103o2619M9690j3717R098k2984n0154L2074N2922Q635
11792D3598r2968J6749n289M9772J0722M0607N0299l4245l2831l1366Q722K3579
11780D7349M8463o3132n4407n356m803O5531M6845l716L878k6986p6704k8732
11768e1770m7936m0297r636L4992N7449O1125J030j5790O1994K679M913j4789
11756D3964n880l8501J2551K3300l3905j8221o661M1503l9577K2784j244q7L284
11743C310N5613m0887n261J7373o5566m8113K758O1794K3328j031L344K1392r950
$$ plain form
11730 18104 6484 -61951 -81776 -39886 -13300 5264 -23436 41246 66057 20403 -19061 13544
11718 13544 21162 59991 41360 -14532 -37420 -548 9419 -30144 -30128 -100836 -104554 -40333 6814
11705 6814 -42315 -73512 -33982 58939 64456 71237 86582 39973 33680 -5817 -56416 -32245
11693 -32245 -19006 -71184 -104904 -76073 -142968 -174869 -141218 -73962 -2559 -92000 -102153 -29106
11681 -29106 -39586 -36296 3062 -74022 -30645 18324 -62451 -78177 -8717 -32104 -21474 -27815
11669 -27815 -45773 -1066 17778 54124 -846 -319 70373 51558 -5584 431 28481 -40155
11657 -40155 -8973 104625 112538 153704 97150 51795 -28556 -89372 -75192 -16199 -22839 46014
11645 46014 -13237 -2154 52458 90129 23385 18804 59167 41507 110663 33681 -50829 -19473
$$ packed form
11730A8104j1620o8435j9825M1890K6586J8564k8700O4682K4811m5654l9464L2605
11718A3544P618L8829j8631n5892k2888L6872R967l9563J6p0708l718O4221M7147
11705F814m9129l1197L9530R2921N517O781J5345m6609o293l9497n0599K4171
11693c2245J3239n2178l3720K8831o6895l1901L3651O7256P1403q9441j0153P3047
11681b9106j0480L290L9358p7084M3377M8969q0775j5726O9460k3387J0630o341
11669b7815j7958M4707J8844L6346n4970N27P0692j8815n7142O015K8050o8636
11657d0155L1182J13598P913M1166n6554m5355q0351o0816J4180N8993o640O8853
11645D6014n9251J1083N4612L7671o6744m581M0363j7660O9156p6982q4510L1356
$$ plain form
11633 -19473 -75971 -156800 -152627 -118999 -35160 4745 -16542 -36911 -19028 -13505 -20404 18767
11621 18767 -69319 -160823 -123522 -75119 -53889 -100623 -19547 -14766 17994 -36421 -113542 -142381
11609 -142381 -103056 -31400 14374 -36560 -62279 -59789 -34696 -31443 -68445 -125408 -93549 -59339
11597 -59339 33652 11255 -26298 -10501 1334 25061 5382 -84744 -101389 -3726 29102 -46499
11585 -46499 -60949 14867 9745 -47903 -61864 -25314 -75975 -70108 -48485 23492 10974 -12331
11573 -12331 -39590 -91104 -94513 -82840 -103912 -49650 -113812 -152445 -39303 -55616 -64271 -50907
11561 -50907 -119104 -69562 -75482 -43528 -65470 7159 47474 -23766 -44419 15276 73751 10130
11549 10130 56481 73324 84683 75558 24356 47353 43900 20141 40923 49362 1424 -14525
$$ packed form
11633a9473n6498q0829M173L3628Q3839L9905k1287k0369J7883N523o899L9171
11621A8767q8086r1504L7301M8403K1230m6734Q1076M781L2760n4415p7121k8839
11609a42381L9325P1656M5774n0934k5719K490K5093L253l7002n6963L1859L4210
11597e9339R2991k2397l7553J5797J1835K3727j9679r0126j6645R7663L2828p5601
11585d6499j4450P5816n122n7648j3961L6550n0661N867K1623P1977j2518k3305
11573a2331k7259n1514l409J1673k1072N4262o4162l8633J13142j6313q655J3364
11561e0907o8197M9542n920L1954k1942P2629M0315p1240k0653N9695N8475o3621
11549A0130M6351J6843J1359r125n1202K2997l453k3759K0782Q439m7938j5949
$$ plain form
11537 -14525 47911 31353 -20425 -115667 -38696 -22089 -16381 -60553 4324 88673 29072 -23369
11525 -23369 -66804 -34448 -33833 589 -946 5395 30956 30814 58426 67467 52286 -33119 -170349
11512 -170349 -84367 38168 -4675 -75702 -5897 54193 45022 75233 81663 41412 29788 -20308
11500 -20308 -5962 49390 48821 41318 111015 41221 14551 47660 21976 -38110 -25562 26404
11488 26404 -9468 6307 -5811 -33025 -74630 -92579 -27235 9268 55010 56519 41537 -34226
11476 -34226 -38456 -21505 -83216 -95128 -43219 -17180 10463 9345 5475 5172 -15725 -1747 7783
11463 7783 35287 -50924 -4109 21239 1591 30084 73351 -2998 -88754 -173374 -110347 -78783
11451 -78783 -25107 6241 41787 30044 92382 80725 -15820 -15009 56250 47672 30470 8258
$$ packed form
11537a4525O2436j6558n1778r5242P6971J6607N708m4172O4877Q4349n9601n2441
11525b3369m3435L2356O15L4422j535O341K5561j42K7612R041j5181q5405j37230
11512a70349Q5982J22535m2843p1027O9805O0090r171L0211O430m0251j1624n0096
11500b0308J4346N5352n69p503O9697o9794k6670L3109k5684o0086J2548N1966
11488B6404l5872J5775j2118k7214m1605j7949O5344L6503M5742J509j4982p5763
11476c4226m230J6951o1711j1912N1909K6039K7643j118l870l03k0897J3978R530
11463G783K7504q6211M6815K5348j9648K8493M3267p6349q5756q4620O3027L1564
11451g8783N3676L1348L5546j1743O2338j1657r6545Q11P1259q578j7202k2212
$$ plain form
11439 8258 12250 32361 3445 30253 23677 2306 -9758 23165 -56405 -40339 -8698 -57945
11427 -57945 -32629 52159 -34757 -24750 14867 36553 -20044 -64003 19229 -53929 -129821 -40584
11415 -40584 -30802 -104381 -122061 32020 18105 -19094 -10353 -16190 41185 42575 145 -31979
11403 -31979 11369 -45271 -4574 26726 -31912 -49276 -31421 17867 86202 57259 61390 38122
11391 38122 1259 2559 -20908 45279 17505 68266 82245 27915 57898 -43343 -47663 38795
11379 38795 -40505 -44585 -13545 3904 -39499 -85989 -79273 2186 59851 44018 84026 132770
11367 132770 70786 33605 11159 -13301 -21043 -78460 -128003 -114231 -68964 -72235 -18362 -86337
11355 -86337 -107641 -57628 -46748 -11959 -64253 -32679 -4587 -27309 5198 26281 -38585 -1337
$$ packed form
11439H258L992K0111k8916K6808o576k1371j2064L2923p9570J6066L1641m9247
11427e7945K5316Q4788q6916J0007L9617K1686n6597m3959Q3232p3158p5892Q9237
11415d0584R782p3579j7680J54081j3915l7199Q741n837N7375J390m2430l2124
11403c1979M3348n6640M0697L1300n8638j7364J7855M9288O8335k8943M131k3268
11391C8122l6863J300k3467O6187k7774N0761J3979n4330K9983j01241m320Q6458
11379C8795p9300m080L1040J7449m3403m6490O716Q1459N7665j5833M0008M8744
11367A32770o1984l7181k2446k4460p742n7417m9543J3772M5267l271N3873o7975
11355h6337k1304N0013J0880L4789n2294L1574K8092k2722L2507K1083o4866L7248
$$ plain form
11343 -1337 -16485 -29950 -19856 -8603 67753 42152 61187 28612 -97503 -90663 -47386 -39381
11331 -39381 -36981 -70787 -83146 -54888 -12708 10953 -70259 -81432 34550 50043 38747 55081
11319 55081 90064 16843 -40321 -50907 -17067 -56409 -59681 -38840 2208 -9607 -41233 15570
11307 15570 31276 48019 110585 79919 37585 -16462 -35086 -81429 -8008 45539 87250 17783
11295 17783 -86071 -36128 -35914 -34658 21870 17520 -14086 -9834 -84855 -55442 -104582 -131320
11283 -131320 -132175 -85909 -48632 -69323 -63805 -13993 -63235 -60226 22396 -8223 18135 85952
11271 85952 -4010 -36125 -56076 -20728 4883 3558 -41925 -21169 -212 -89232 14984 47483
11259 47483 -15943 -48850 -111700 -108328 -80342 -36088 -83923 -40396 -15077 -34504 -29860 -41912
$$ packed form
11343a337j5148j3465J0094J1253P6356k5601J9035l2575j26115O840M3277Q005
11331c9381K400l3806j2359K8258M2180K3661q1212j1173J15982J5493j1296J6334
11319E5081L4983p3221n7164j0586L3840l9342l272K0841M1048j1815l1626N6803
11307A5570J5706J6743O2566l0666m2334n4047j8624m6343P3421N3547M1711o9467
11295A7783j03854M9943K14J256N6528m350l1606M252p5021K9413m9140k6738
11283a31320q55M6266L7277k0691N518M9812m9242L009Q2622l0619K6358O7817
11271H5952q9962l2115j9951L5348K5611j325m5483K0756K0957q9020J04216L2499
11259D7483o3426l2907o2850L372K7986M4254m7835M3527K5319j9427M644j2052
$$ plain form
11247 -41912 -63402 -146964 -102219 -63760 -52917 -15309 -13674 44485 20480 -25052 -38134 -62967
11235 -62967 -38909 8041 -7289 17492 11791 -17559 17593 75218 99860 -22977 9267 -15670
11223 -15670 -82118 -54888 -21461 -12163 -21676 -84289 -76628 -12816 -8707 2567 -46420 -31111
11211 -31111 4011 -18237 -9307 -66225 -100908 -8272 12627 -78102 -17110 -35548 -55814 4943
11199 4943 -27351 -67208 40204 7982 -47861 -66492 -86452 -118066 -77337 -45128 -115088 -129304
11187 -129304 -90835 -94084 -48071 -116985 -129450 31092 89109 42918 29840 -44118 -11442
11176 -11442 6212 -53639 -69460 -33269 9654 51977 109454 77646 58524 56238 3615 -35669
11164 -35669 -28787 3111 10891 -70511 -68268 -63460 -25876 -42719 -81252 -105496 -40107 -69954
$$ packed form
11247d1912k1490q3562M4745L8459J0843L7608J635N8159k4005m5532j3082k4833
11235f2967K4058M6950j5330K4781n701k9350L5152N7625K4642j22837L2244k4937
11223a5670o6448K7230L3427R298r513o2613P661O3812M109J1274m8987J5309
11211c1111L5122k2248Q930n6918l4683R2636K0899r0729O0992j8438k0266O0757
11199D943l2294l9857J07412l2222n5843j8631j9960l1614M0729L2209o9960j4216
11187a29304L8469l249M6013o8914j2465J60542N8017m6191j3078p3958L2676
11176a1442J7654n9851j5821L6191M2923M2323N7477l1808j9122k286n2623l9284
11164c5669O882L1898P780q1402K243M808L7584j6843l8533k4244O5389k9847
$$ plain form
11152 -69954 -17572 41007 -10593 -42379 57713 45876 11677 -10666 -39934 -67985 -57967
11141 -57967 40613 15911 -14684 47642 43800 -35142 -63942 -44097 -16266 25319 32015 -24436
11129 -24436 -44870 101244 68792 32743 15571 -84677 -29384 -21811 68179 96804 84820
11118 84820 83107 25134 -1930 73714 60453 -5116 -43967 -64773 45743 34928 -18252 68449
11106 68449 5862 -50707 74594 15500 -11113 50165 91486 3537 -16895 -66308 -2695
11095 -2695 -19796 17231 -64579 -51249 -486 -25042 -40621 -61819 5828 20908 34294 40543
11083 40543 71168 41974 14073 -37196 -73170 -40520 72613 -4017 46944 88488 78738 39536
11071 39536 64081 84175 59587 107978 113321 36729 60758 142063 52161 32216 -20506 -48645
$$ packed form
11152f9954N2382N8579n1600l1786J00092j1837l4199k2343k9268k8051J0018
11141e7967R8580k4702l0595O2326l842p8942k8800J9845K7831M1585O696n6451
11129b4436k0434J46114l2452l6049j7172j00248N5293P573Q9990K8625j1984
11118H4820j713n7973k7064P5644j3261o5569l8851k0806J10516j0815n3180Q6701
11106F8449o2587n6569J25301n9094k6613O1278M1321q7949k0432m9413O3613
11095b695j7101L7027q1810J3330N0763k4556j5579k1198O7647J5080J3386O249
11083D0543L0625k9194k7901n1269l5974L2650J13133p6630N0961M1544r750l9202
11071C9536K4545K0094k4588M8391N343p6592K4029Q1305q9902j9945n2722k8139
$$ plain form
11059 -48645 25592 9417 34455 61230 108750 125034 142818 135417 84097 10427 -8494 37035
11047 37035 37278 172 -13407 22997 68786 461 -47708 -106057 -55887 -47553 25029 67761
11035 67761 51128 30966 42049 41197 76270 137716 120030 112461 160446 152762 91935 87294 194658
11022 194658 163688 101451 117400 165043 175503 134233 98240 78832 20773 11830 79587 40914
11010 40914 57346 52471 71090 30304 42976 43125 34544 90363 46181 61738 79741 101635
10998 101635 117457 96283 45056 -39564 -18722 -44314 -63207 -29085 34527 76250 89789
10987 89789 18467 -61982 -102418 -102755 -90271 -86038 -56768 5487 -32215 -64370 -87722 -79595
10975 -79595 -92550 -48174 -14932 -50934 36496 16028 -85043 -121831 -87941 -109421 -79882
$$ packed form
11059d8645P4237j6175K5038K6775M7520J6284J7784p401n1320p3670j8921M5529
11047C7035K43l7106j3579L6404M5789o8325m8169n8349N0170Q334P2582M2732
11035F7761j6633k0162J1083q52L5073O1446j7686p569M7985p684o0827m641J07364
11022A94658l0970o2237J5949M7643J0460m1270l5993j9408n8059q943O7757l8673
11010D0914J6432m875J8619m0786J2672J49q581N5819m4182J5557J8003K1894
10998A01635J5822k1174n1227q4620K0842k5592j8893L4122O3612M1723J3539
10987H9789p1322q0449m0436l37J2484M233K9270O2255l7702l2155k3352Q127
10975g9595j2955M4376L3242l6002Q7430k0468j01071l6788L3890k1480K9539
$$ plain form
10964 -79882 -100725 -139053 -120276 -46130 -68789 -76719 -38184 62482 101829 3789 47525 5722
10952 5722 -111746 -68411 -72080 -49710 -50782 -39954 39670 -42274 -82882 -51026 -14126 825
10940 825 -99490 -89721 -20570 -1304 -43126 -63193 19743 -5487 -59467 -77325 -14798 -32495
10928 -32495 26021 -4160 29078 -10283 10392 -10207 -69245 -82987 -50806 -54787 25720 9193
10916 9193 -51829 -34748 -80897 -76727 39617 65297 33392 -5918 -91522 -99594 -104287 -19816
10904 -19816 66787 -1837 -38369 -91658 -90716 -50365 12203 -23394 -49024 -28540 -4080 42106
10892 42106 -19269 -64089 -90132 -33915 -7034 6311 -5575 -28729 -13744 -41406 -96733 2073
10880 2073 16788 -12804 -18395 -4395 -61171 -66735 -80718 -93131 -120474 -89537 -12789 -63148
$$ packed form
10964g9882k0843l8328J8777P4146k2659p930L8535J00666L9347r8040M3736m1803
10952E722j17468M3335l669K2370j072J0828P9624q1944m0608L1856L6900J4951
10940H25j00315R769O9151J9266m1822k0067Q2936k5230n3980j7858O2527j7697
10928c2495N8516l0181L3238l9361K0675k0599n9038j3742L2181l981Q0507j6527
10916I193o1022J7081m6149M170J16344K5680l1905l9310q5604q072m693Q4471
10904a9816Q6603o8624l6532n3289R42M0351O2568l5597k5630K0484K4460M6186
10892D2106o1375m4820k6043N6217K6881J3345j1886k3154J4985k7662n5327R8806
10880B073J4715k9592n591J4000n6776n564j3983j2413k7343L0937P6748n0359
$$ plain form
10868 -63148 -53972 -17563 -88735 -148200 -169579 -99790 -103339 -39324 1213 -87551 -71878 -109300
10856 -109300 -116692 -3046 21528 44171 -51176 -106082 -89995 -71935 -55549 -77791 -66898
10845 -66898 -10416 -29703 -69605 -26945 -24907 -22834 -48267 2279 -17100 -15476 -103981 -114556
10833 -114556 -101072 -115850 -70229 23947 57126 -1694 18596 36981 5028 -24844 9224
10822 9224 -47296 -90212 -106467 -90349 -73228 -14504 -20537 -25448 -22996 -73503 -97303 -62959
10810 -62959 -58017 -78619 -73199 -50389 -97981 -110201 -65260 -84225 -150414 -125991 -202988 -159740
10798 -159740 -164860 -96963 -69436 -70946 -100531 -181214 -119098 -95494 -5477 -15746 -60650 2687
10786 2687 34752 25811 -13884 23627 -22563 19224 7811 -24777 -65423 -87161 -77808 -110520
$$ packed form
10868f3148R176L6409p1172n9465k1379O9789l549O4015M0537q8764J5673l7422
10856a09300p392J13646K4574K2643r5347n4906J6087J8060J6386k2242J0893
10845f6898N6482j9287l9902M2660K038K073k5433N0546j9379J624q8505j0575
10833a14556J3484j4778M5621R4176L3179n8820K0290J8385l1953k9872L4068
10822I224n6520m2916j6255J6118J7121N8724o033m911K452n0507k3800L4344
10810f2959M942k0602N420K2810m7592j2220M4941j8965o6189K4423p6997M3248
10798a59740n120O7897K7527j510k9585q0683O2116K3604R0017j0269m4904O3337
10786B687L2065q941l9695L7511m6190M1787j1413l2588m0646k1738R353l2712
$$ plain form
10774 -110520 -78236 -55283 -42616 -67451 -78280 -53225 -64091 -54796 -15154 -13909 40479 24101
10762 24101 7166 7990 2279 -24606 -9521 -52288 -33911 -33227 14001 -103902 -117760 -75267
10750 -75267 -71835 -69635 -91294 -24793 4049 -25513 -33883 -48681 -15489 11344 24054 19077
10738 19077 -16725 30124 16179 -24987 -17472 -89900 -41776 15283 -48737 -43136 14315 88386
10726 88386 -27449 -52732 34703 35169 5531 -49562 41413 34688 12559 -50287 -15033 25218
10714 25218 48614 77681 -8373 -52980 -46719 -77748 -92915 -49457 -49916 -43188 -16932 -63084
10702 -63084 -75760 -68421 -33667 -35343 -45862 -87432 -75283 -37984 -13637 -36391 -11008 33141
10690 33141 42229 -11702 -11275 -88892 -93886 -36367 -12922 -25568 -12308 -18989 37188 17808 35824
$$ packed form
10774a10520L2284K2953J2667k4835j0829K5055j0866R295L9642J245N4388j6378
10762B4101j6935Q24n711k6885J5085m2767J8377O84M7228j17903j3858M2493
10750g5267L432K200k1659O6501K8842k9562q370j4798L3192K6833J2710m977
10738A9077l5802M6849j3945m1166P515p2428M8124N7059o4020N601N7451P4071
10726H8386j15835k5283Q7435M66k9638n5093R0975o725k2129o2846L5254M0251
10714B5218K3396K9067q6054m4607O261l1029j5167M3458m59O728K6256m6152
10702f3084j2676P339L4754j676j0519m1570J2149L7299K4347k2754K5383M4149
10690C3141R088n3931M27p7617m994N7519K3445j2646J3260o681N6177j9380J8016
$$ plain form
10677 35824 17889 -20790 -62573 7627 29275 64919 56783 -14618 -20149 68115 85402 -53353
10665 -53353 -85870 -113440 -77805 -88425 -72169 -99534 -66615 -42626 -28092 -69676 -88489 -81942
10653 -81942 -77957 -156134 -55989 -66443 -55372 -45917 -2572 -40181 -24751 -99773 -100457 -127172
10641 -127172 -108346 -80853 -119432 -137422 -23133 -27003 -57100 -44711 -46680 -112789 -27109 -55127
10629 -55127 -76361 -52365 -34754 -40138 -54030 -33624 -101587 -76067 -70893 -48845 -80684 -70666
10617 -70666 -34276 -18225 -46705 -6010 697 21274 3841 -18039 -41440 -99324 -80964 -51269
10605 -51269 -6792 50857 26353 -19485 -43649 -8745 36049 -20714 8156 -5892 -20385 -97510
10593 -97510 -125361 -43907 -4588 -26045 -86280 -83203 -56342 -84054 -149313 -112501 -60127 -73351
$$ packed form
10677C5824j7935l8679m1783P0200K1648L5644q136p1401n531Q8264J7287j38755
10665e3353l2517k7570L5635j0620J6256k7365L2919K3989J4534m1584j8813O547
10653h1942L985p8177J00145j0454J1071R455M3345l7609J5430p5022o84k6715
10641a27172J8826K7493l8579j7990J14289l870l0097J2389j969o6109Q5680k8018
10629e5127k1234K3996J7611n384j3892K0406o7963K5520N174K2048l1839J0018
10617g0666L6390J6051k8480M0695O707K0577j7433k1880k3401n7884J8360K9695
10605e1269M4477N7649k4504m5838k4164L4904M4794n6763K8870j4048j4493p7125
10593i7510k7851Q1454L9319k1457o0235L077K6861k7712o5259L6812N2374j3224
$$ plain form
10581 -73351 -79240 -80820 -44273 74475 91908 78338 -50237 -55255 -71669 -87515 -35566 -9554
10569 -9554 -4079 -57031 -93014 -86848 -90916 -67760 -71257 -112978 -72673 -30797 -58197 -153244 -127891
10556 -127891 -55732 -19405 -34800 11420 25473 -11853 42900 16808 -29011 -138655 -147911
10545 -147911 -49300 -65875 -3928 30691 -40161 -71540 -99785 -92117 -80884 -104229 -87098 -19690
10533 -19690 -35363 17937 38351 50826 34004 9174 -19489 -60118 -178398 -200687 -123644
10522 -123644 -147292 -67332 49327 -25405 1113 -74231 -123621 -95078 -95743 -33919 30680 -24067
10510 -24067 9655 -60929 -65682 -51212 -79571 -66764 -101689 -139650 -32632 -24795 -69938 -103831
10498 -103831 -94934 -85594 -80719 -55472 -47086 -126913 -88163 -19603 -15834 2467 30917 59812
$$ packed form
10581g3351n889j580L6547J18748J7433j3570j28575n018j6414j5846N1949K6012
10569i554N475n2952l5983O166m068K3156l497m1721M0305M1876k7400r5047K5353
10556a27891P2159L6327j5395M6220J4053l7326N4753k6092m5819j09644r256
10545a47911R8611j6575O1947L4619p0852l1379k8245P668J1233k3345J7131O7408
10533a9690j5673N3300K0414J2475j6822k4830k8663m0629j18280k2289P7043
10522a23644k3648P9960J16659p4732K6518p5344m9390K8543o65O1824O4599n4747
10510b4067L3722p0584m753J4470k8359J2807l4925l7961J07018P837m5143l3893
10498a03831Q897R340M875K5247Q386p9827L8750O8560L769J8301K8450K8895
$$ plain form
10486 59812 -80006 -20774 -29880 -25090 -97841 -111730 -101039 -76594 -985 60529 33942 25687
10474 25687 41368 25534 24940 -5748 19691 -7109 -71701 -94555 -68596 -96863 -96632 -92659 -94314
10461 -94314 -52170 -27091 8919 -61929 -95561 -133923 -118122 -59574 -20915 -16287 -26740 -62253
10449 -62253 -79211 -70825 -41038 -59020 -116732 -79497 -114183 -68207 -1096 -18536 3150 -26072
10437 -26072 4698 -32193 -37324 -97287 -58758 -39383 -21287 -95554 -155446 -142343 -43661 -25970
10425 -25970 -23450 25867 130791 108439 31671 15686 -11514 -39117 -5179 -60414 -94923 -113047
10413 -113047 -104172 -80856 -135380 -8612 -10420 -25755 -30251 -146128 -142917 -89302 -17917 -47585
10401 -47585 -66924 -40574 -35835 -20095 -33218 -24120 -26255 -21284 -16014 58436 102868 54376 -20221
$$ packed form
10486E9812j39818N9232r106M790p2751j3889J0691K4445P5609O1514k6587q255
10474B5687J5681j5834n94l0688K5439k6800o4592k2854K5959k8267K31L973j655
10461i4314M2144K5079L6010p0848l3632l8362J5801N8548L8659M628j0453l5513
10449f2253j6958Q386K9787j7982n7712L7235l4686M5976O7111j7440K1686k9222
10437b6072L0770l6891n131n9963L8529J9375J8096p4267n9892J3103R8682J7691
10425b5970K520M9317J04924k2352p6768j5985k7200k7603L3938n5235l4509j8124
10413a13047Q875K3316n4524J26768j808j5335m496j15877L211N3615P1385k9668
10401d7585j9339K6350M739J5740j3123R098k135M971N270P4450M4432m8492p4597
$$ plain form
10388 -20221 44099 61136 30464 -6412 54347 36731 16674 534 -58118 -30271 34188 50286
10376 50286 -1567 -38841 -15652 -51617 -60507 -20623 8841 5471 9597 38359 -2722 -30577
10364 -30577 -78583 -109751 -150609 -147485 -75162 -39318 37188 -59919 -69844 -41884 -82064 -125591
10352 -125591 -82102 -56681 -11536 13213 -69179 -52882 13869 47271 65449 -13820 33825
10341 33825 -10870 35139 42524 115918 145194 -8537 -105422 -67797 -42316 -79418 -92663 -60346
10329 -60346 -9476 -47932 -84687 -41304 23052 -48106 -86213 -65613 -33750 -28648 6729 -33601
10317 -33601 -11309 -66568 -18588 -118534 -65995 -17076 -130554 -96480 -51373 -58357 -38714 -94363
10305 -94363 -87001 -43540 -43360 -17701 -5345 -11719 -23020 24961 53930 -27749 -85624 -61038
$$ packed form
10388b0221O4320J7037l0672l6876O0759j7616k0057j6140n8652K7847O4459J6098
10376E0286n1853l7274K3189l5965q890L9884K9464l370M126K8762m1081k7855
10364c0577m8006l1168m0858L124P2323L5844P6506r7107r925K7960m0180m3527
10352a25591M3489K5421M5145K4749q2392J6297O6751L3402J8178p9269M7645
10341C3825m4695M6009P385P3394K9276j53731r6885L7625K5481l7102j3245L2317
10329f0346N0870l8456l6755M3383O4356p1158l8107K0600L1863N102L5377m0330
10317c3601K2292n5259M7980r9946N2539M8919j13478L4074M5107o984J9643n5649
10305i4363P362M3461J80K5659J2356o374j1301M7981K8969q1679n7875K4586
$$ plain form
10293 -61038 -28524 -47742 69228 59450 31330 27310 -6521 15969 -36004 -16336 -10587 -5217
10281 -5217 -47605 20258 11573 -87393 -56753 17660 -63352 1927 20994 10828 37203 37754
10269 37754 55975 -32069 -25101 4789 -23795 -44514 33934 110479 34105 9631 37765 13901
10257 13901 32495 25227 -49431 -49691 -21343 -44438 -4255 18937 102005 76251 13719 -46430
10245 -46430 -56483 31087 101311 93808 35885 48887 66203 68184 -41667 -108342 -33490 -12658
10233 -12658 -4854 -35034 -27629 -3991 54411 147313 75534 -10612 -79880 -16416 -27198 49802
10221 49802 44550 75922 41260 138424 100629 39722 67862 37373 5109 111308 87488 151613
10209 151613 194159 142346 180571 123706 115053 79100 145685 158417 176020 163329 144406 190760
$$ packed form
10293f1038L2514j9218J16970r778k8120m020l3831K2490n1973J9668N749N370
10281e217m2388O7863q685r8966L0640P4413q1012O5279J9067j0166K6375N51
10269C7754J8221q8044O968K9890k8584k0719P8448P6545p6374k4474K8134k3864
10257A3901J8594p268p4658k60K8348k3095M0183K3192Q3068k5754o2532o0149
10245d6430j0053Q7570P0224p503n7923J3002J7316J981j09851o6675P4852K0832
10233a2658P804l0180P405K3638N8402R2902p1779q6146o9268O3464j0782P7000
10221D9802n252L1372l4662R7164l7795o0907K8140l0489l2264J06199k3820O4125
10209A51613M2546n1813L8225n6865q653l5953O6585J2732J7603j2691j8923M6354
$$ plain form
10197 190760 205673 206221 221259 273494 263093 240656 232344 210014 231905 249207 294445 254702
10185 254702 233134 226084 249766 229653 324149 335987 375954 396954 401353 365929 331565 299641
10173 299641 320915 363869 423530 431693 421116 375488 442056 472729 439282 453895 550074 558891
10161 558891 553066 454823 451731 567109 627552 717433 769751 683547 722214 691275 704943 719046
10149 719046 683739 678335 708418 709058 738639 797163 865992 876928 833639 763307 790164 805802
10137 805802 858390 1002907 962328 996455 947384 896447 1012862 1108724 1092608 1070515 1032668
10126 1032668 1025270 1033230 1037569 1112046 1118730 1113535 1205265 1093456 1113287 1094881 1019993 939696
10114 939696 874318 840694 873720 845405 793969 738499 770938 863231 853186 780793 749142
$$ packed form
10197A90760J4913N48J5038N2235j0401k2437q312k2330K1891J7302M5238l9743
10185B54702k1568p050K3682k0113R4496J1838L9967K1000M399l5424l4364l1924
10173B99641K1274M2954N9661Q163j0577m5628O6568L0673l3447J4613R6179Q817
10161E58891n825r8243l092J15378O0443Q9881N2318q6204L8667l0939J3668J4103
10149G19046l5307n404L0083O40K9581N8524O8829J0936m3289p0332K6857J5638
10137H05802N2588J44517m0579L4127m9071n0937J16415R5862j6116k2093l7847
10126A032668p398P960M339P4477O684n195R1730j11809J9831j8406p4888q0297
10114I39696o5378l3624L3026k8315n1436n5470L2439R2293j0045p2393l1651
$$ plain form
10103 749142 697285 722288 638604 617962 660104 584731 580680 571636 607517 635101 622084 666170
10091 666170 619303 608039 572897 545154 446051 406883 500349 633752 692381 620607 556620
10080 556620 536023 582958 520010 551033 578377 514416 590759 667598 646408 616985 631045
10069 631045 592548 631140 615373 677581 674236 720367 766988 716235 705567 753513 776897 797457
10057 797457 792461 835394 829185 838174 901146 949008 1095416 1165182 1136207 1169992 1181240 1122754
10045 1122754 1120088 1041511 947777 942665 918700 892381 865208 830241 879706 892956 824323 780828
10033 780828 792434 771428 744530 749316 731672 769897 746969 759597 826486 685119 679630 854541
10021 854541 955368 952439 987013 1052977 1164306 1210661 1273201 1246843 1227101 1246300 1253863
$$ packed form
10103G49142n1857K5003q3684k0642M2142p5373m051r044L5881K7584j3017M4086
10091F66170m6867j1264l5142k7743r9103l9168R3466J33403N8629p1774o3987
10080E56620k0597M6935o2948L1023K7344o3961P6343P6839k1190k9423J4060
10069F31045l8497L8592j5767O2208l345M6131M6621n0753j0668M7946K3384K0560
10057G97457m996M2933o209Q989O2972M7862J46408O9766k8975L3785J1248n8486
10045A122754k666p8577r3734n112k3965k6319k7173l4967M9465J3250o8633m3495
10033G80828J1606k1006k6898M786j7644L8225k2928J2628O6889j41367n489J74911
10021H54541J00827k929L4574O5964J11329M6355O2540k6358j9742J9199P563
$$ plain form
10010 1253863 1192619 1220621 1261532 1179330 1023216 875207 924707 926136 851636 851172 854486 741379
9998 741379 694033 753879 734120 705842 672186 575071 528916 591958 607129 551890 518699 621279
9986 621279 642241 665945 591123 609107 599263 592610 623463 674815 585333 606510 615256 592939
9974 592939 627280 605549 615239 677797 566680 506529 506613 482710 500822 576082 586031 557901
9962 557901 542144 555277 716515 658644 626721 636248 614410 622204 663786 618346 574348 605520
9950 605520 597686 631989 667844 583054 607548 667050 605446 680044 691981 694132 648761 643356
9938 643356 691518 685406 730950 762455 821150 795329 805886 813542 809019 916905 948623 935756
9926 935756 940861 947866 967002 855199 804038 870533 905644 821404 867770 840763 818157 747062
$$ packed form
10010A253863o1244K8002M0911q2202j56114j48009M9500J429p4500m64L314j13107
9998G41379m7346N9846j9759k8278l3656r7115m6155O3042J5171n5239l3191J02580
9986F21279K0962K3704p4822J7984r844o653L0853N1352q9482K1177Q746k2317
9974E92939L4341k1731R690O2558j11117o0151Q4k3903J8112P5260R949k8130
9962E57901j5757J3133J61238n7871l1923R527k1838P794M1582m5440m3998L1172
9950F05520p834L4303L5855q4790K4494N9502o1604P4598J1937K151m5371n405
9938F43356M8162o112M5544L1505N8695k5821J0557P656m523J07886L1718j2867
9926I35756N105P005J9136j11803n1161O6495L5111q4240M6366k7007k2606p1095
$$ plain form
9914 747062 715421 711606 744606 778483 737527 801192 775503 817202 833303 757435 817645 765925
9902 765925 838830 848932 860388 911524 832710 763809 826828 828198 875545 899632 882693 891395
9890 891395 847639 859705 948777 949527 991897 989086 998269 1024431 1031468 1050500 1004541 1006806 1038531
9877 1038531 1053605 1097240 1158753 1156847 1045602 1118730 1115863 1093922 1048609 1034640 1103053 1112310
9865 1112310 1135891 1169662 1139247 1078719 1196719 1215696 1235601 1223204 1220122 1262055 1224749
9854 1224749 1312542 1318115 1290195 1271280 1227837 1249671 1266905 1261992 1249552 1377332 1363000 1435762
9842 1435762 1442886 1397512 1357922 1401656 1428382 1384129 1419362 1369774 1374029 1448020 1392085 1381022
9830 1381022 1398009 1513047 1510261 1500045 1486907 1516414 1522497 1512701 1586613 1654090 1626182 1632632
$$ packed form
9914G47062l1641l815L3000L3877m0956O3665k5689M1699J6101p5868O0210n1720
9902G65925P2905J0102J1456N1136p8814o8901O3019J370M7347K4087j6939Q702
9890H91395m3756J2066Q9072P50M2370k811R183K6162P037J9032m5959K265L1725
9877A038531J5074M3635O1513j906j11245P3128k867k1941m5313j3969O8413R257
9865A112310K3581L3771l0415o0528J18000J8977J9905j2397l082M1933l7306
9854A224749Q7793N573k7920j8915m3443K1834J7234m913j2440J27780j4332P2762
9842A435762P124m5374l9590M3734K6726m4253L5233m9588M255P3991n5935j1063
9830A381022J6987J15038k786j0216j3138K9507O083r796P3912O7477k7908O450
$$ plain form
9818 1632632 1698463 1766365 1731141 1785075 1797011 1803868 1848060 1806773 1775311 1874237 1917257 1900921
9806 1900921 1960998 2050822 2049107 2038503 2049740 1978795 2046326 2073994 2089434 2072264 2062542 2077571
9794 2077571 2172953 2197885 2190114 2197715 2308344 2360279 2296315 2378290 2436232 2418269 2474031 2539666
9782 2539666 2491508 2484724 2504701 2552758 2634264 2721431 2746893 2728927 2828199 2902318 2982905 3002012
9770 3002012 3053715 2998491 3024722 3225072 3241690 3289245 3361533 3415498 3452598 3566839 3602254
9759 3602254 3640101 3783795 3908315 3945668 4023428 4104443 4206462 4375970 4485054 4584121
9749 4584121 4728159 4803016 4871066 5028025 5158647 5367359 5486393 5616628 5746256 5928148
9739 5928148 6080209 6318098 6495102 6663804 6940994 7212734 7441010 7748470 8070360 8405276
$$ packed form
9818A632632O5831O7902l5224N3934J1936O857M4192m1287l1462R8926M3020j6336
9806A900921O0077Q9824j715j0604J1237p0945O7531K7668J5440j7170r722J5029
9794B077571R5382K4932p771P601J10629N1935o3964Q1975N7942j7963N5762O5635
9782B539666m8158o784J9977M8057Q1506Q7167K5462j7966R9272P4119Q0587J9107
9770C002012N1703n5224K6231K00350J6618M7555P2288N3965L7100J14241L5415
9759C602254L7847J43694J24520L7353P7760Q1015J02019J69508J09084R9067
9749D584121J44038P4857O8050J56959J30622K08712J19034J30235J29628J81892
9739E928148J52061K37889J77004J68702K77190K71740K28276L07460L21890L34916
$$ plain form
9729 8405276 8774865 9154884 9603412 10023858 10554198 11131165 11741354 12366659 13120214 13952688
9719 13952688 14734109 15677795 16660260 17774879 19057008 20402901 21943319 23775057 25584043
9710 25584043 27598592 29776588 32138163 34790356 37579219 40429653 43563812 47229724
9702 47229724 51485368 56582204 62734284 69845847 77902694 87021042 97278122 108411516
9694 108411516 119811452 130065740 138300427 145294210 150918862 154041791 153871251 150820399
9686 150820399 145891623 140024292 133274266 125686983 118083366 110935029 104313412 98803668
9678 98803668 94363051 90787361 87817483 85331058 83187535 81411513 80075380 79158595
9670 79158595 78750937 78950191 79841130 81769309 84776503 89167361 94925946 101851700 110098532
$$ packed form
9729H405276L69589L80019M48528M20446N30340N76967O10189O25305P53555Q32474
9719A3952688P81421R43686R82465J114619J282129J345893J540418J831738J808986
9710B5584043K014549K177996K361575K652193K788863K850434L134159L665912
9702D7229724M255644N096836O152080P111563Q056847R118348J0257080J1133394
9694A08411516J1399936J0254288Q234687O993783N624652L122929j70540l050852
9686A50820399m928776n867331o750026p587283p603617p148337o621617n509744
9678I8803668m440617l575690k969878k486425k143523j776022j336133r16785
9670G9158595m07658J99254Q90939J928179L007194M390858N758585O925754Q246832
$$ plain form
9661 110098532 119741588 130382826 141541846 151820318 159957529 166481133 171355233 173268606
9653 173268606 172300069 168796126 162665486 155423160 147174358 137595048 127747282 118280246
9645 118280246 109227890 101244551 94380493 88204961 82436749 77076050 71994415 67180124
9637 67180124 62717776 58683506 54959824 51708371 48877371 46359671 44299550 42596083
9629 42596083 41237725 40171183 39178569 38174332 37303885 36410948 35500730 34448602 33303752
9620 33303752 32216220 31034775 29829692 28738722 27551155 26587175 25700258 24799766 23998678
9611 23998678 23299096 22608823 21899949 21251362 20690731 20037042 19510941 19114142 18649054
9602 18649054 18274987 18045373 17955600 18035485 18233349 18458600 18866998 19358782 19939543 20511445
$$ packed form
9661A10098532R643056J0641238J1159020J0278472Q137211O523604M874100J913373
9653A73268606r68537l503943o130640p242326q248802r579310r847766r467036
9645A18280246r052356p983339o864058o175532n768212n360699n081635m814291
9637F7180124m462348m034270l723682l251453k831000k517700k060121j703467
9629D2596083j358358j066542r92614j004237q70447q92937r10218j052128j144850
9620C3303752j087532j181445j205083j090970j187567r63980q86917r00492q01088
9611B3998678o99582o90273p08874o48587n60631o53689n26101l96799m65088
9602A8649054l74067k29614q9773P9885J97864K25251M08398M91784N80761N71902
$$ plain form
9592 20511445 20944326 21244912 21362524 21370777 21264028 20934282 20486755 19760387 19039757 18257244
9582 18257244 17372740 16652570 15871587 15135712 14614510 14102138 13657688 13204690 12770087
9573 12770087 12377736 12047743 11791251 11458590 11105788 10857097 10532305 10181701 9963308
9564 9963308 9779770 9495618 9280327 9159769 8891109 8647430 8438829 8223422 8043069 7846256
9554 7846256 7626541 7425333 7216644 7043108 6811311 6695132 6565454 6366170 6213368 6019374
9544 6019374 5903989 5781765 5641598 5555191 5462154 5320978 5344409 5322853 5279654 5133076
9534 5133076 5077002 5038094 4960943 4884519 4903382 4951276 4976808 4939416 4890244 4843609 4758773
9523 4758773 4792464 4847269 4824855 4790245 4661519 4572810 4496340 4443062 4360446 4239936 4204247
$$ packed form
9592B0511445M32881L00586J17612Q253j06749l29746m47527p26368p20630p82513
9582A8257244q84504p20170p80983p35875n21202n12372m44450m52998m34603
9573A2770087l92351l29993k56492l32661l52802k48691l24792l50604k18393
9564I963308j83538k84152k15291j20558k68660k43679k08601k15407j80353j96813
9554G846256k19715k01208k08689j73536k31797j16179j29678j99284j52802j93994
9544F019374j15385j22224j40167q6407r3037j41176K3431k1556m3199j46578
9534E133076n6074l8908p7151p6424J8863M7894K5532l7392m9172m6635q4836
9523D758773L3691N4805k2414l4610j28726q8709p6470n3278q2616j20510l5689
$$ plain form
9512 4204247 4096914 4036455 3928304 3831540 3767285 3804460 3790401 3743882 3605084 3571557 3510589
9501 3510589 3576143 3595063 3596539 3589502 3603793 3629886 3599578 3568259 3503332 3581048 3687215 3719120
9489 3719120 3795786 3823722 3821826 3772601 3753399 3757817 3769633 3733404 3622390 3573994 3552186 3531663
9477 3531663 3344330 3263930 3245435 3278875 3268994 3204833 3167893 3136948 3046941 3029238 3121135
9466 3121135 3132513 3167578 3237513 3193354 3212305 3213442 3136383 3228055 3249582 3147974 3080340
9455 3080340 3045854 2980101 2944995 2833156 2782188 2643834 2638208 2655772 2656915 2707706 2617795
9444 2617795 2583418 2635681 2545066 2518504 2505037 2403835 2439900 2486021 2426062 2484947 2523556
9433 2523556 2520369 2586433 2611405 2665694 2655720 2717137 2728976 2643216 2574370 2605542 2590028 2607860
$$ packed form
9512D204247j07333o0459j08151r6764o4255L7175j4059m6519j38798l3527o0968
9501C510589O5554J8920J476p037J4291K6093l0308l1319o4927P7716J06167L1905
9489C719120P6666K7936j896m9225j9202M418J1816l6229j11014m8396k1808k0523
9477C531663j87333q0400j8495L3440r881o4161l6940l0945r0007j7703R1897
9466C121135J1378L5065O9935m4159J8951J137p7059R1672K1527j01608o7634
9455C080340l4486o5753l5106j11839n0968j38354n626J7564J143N0791q9911
9444B617795l4377N2263r0615k6562j3467j01202L6065M6121n9959N8885L8609
9433B523556l187O6064K4972N4289r974O1417J1839q5760o8846L1172j5514J7832
$$ plain form
9421 2607860 2636686 2626542 2592151 2529598 2466940 2457249 2459228 2478745 2466816 2511450 2490215 2403243
9409 2403243 2341913 2279075 2259459 2218200 2251113 2221721 2183965 2294140 2413381 2346226 2320622
9398 2320622 2333151 2369796 2413628 2504763 2451839 2377965 2430409 2410533 2449353 2375697 2368631 2388547
9386 2388547 2327355 2327492 2307011 2293676 2348204 2351236 2377973 2317786 2331438 2374741 2415189 2368580
9374 2368580 2392198 2456160 2476448 2437854 2518470 2574078 2500626 2480279 2530043 2518089 2567906
9363 2567906 2583082 2541605 2466014 2429612 2493996 2502752 2566860 2696670 2737275 2761290 2790783
9352 2790783 2800060 2850398 2895264 2919616 2992109 3088136 3147811 3228962 3262916 3339394 3436391 3554002
9340 3554002 3691658 3825425 3942198 4010746 4067302 4211764 4238228 4251345 4306937 4287238 4328112
$$ packed form
9421B607860K8826j0144l4391o2553o2658r691J979J9517j1929M4634k1235q6972
9409B403243o1330o2838j9616m1259L2913k9392l7756J10175J19241o7155k5604
9398B320622J2529L6645M3832R1135n2924p3874N2444j9876L8820p3656p066J9916
9386B388547o1192J37k0481j3335N4528L032K6737o0187J3652M3303M0448m6609
9374B368580K3618O3962K0288l8594Q0616N5608p3452k0347M9764j1954M9817
9363B567906J5176m1477p5591l6402O4384Q756O4108J29810M0605K4015K9493
9352B790783R277N0338M4866K4352P2493R6027N9675Q1151L3954P6478R6997J17611
9340C554002J37656J33767J16773O8548N6556J44462K6464J3117N5592j9699M0874
$$ plain form
9329 4328112 4350880 4345504 4432470 4501133 4508030 4432265 4384710 4264930 4241359 4315613 4253873 4130012
9317 4130012 4128480 4119610 4135213 4083435 4048051 4028389 4078482 4085757 4113257 4122140 4201070 4188152
9305 4188152 4195261 4231208 4229798 4286677 4371927 4404475 4401512 4480805 4519954 4522169 4577661 4716882
9293 4716882 4769792 4848779 4845883 4872390 4850428 4820271 4872043 4930260 4969658 4939362 4877123 4933022
9281 4933022 4929082 4899646 4934768 4945949 4919866 4912795 4962210 4986892 5050773 5031671 5001597 5085787
9269 5085787 5113012 5146437 5151160 5167885 5123622 5144447 5183619 5219934 5251392 5245138 5331328 5402890
9257 5402890 5397882 5466680 5451698 5485114 5558445 5614256 5682152 5753834 5867270 5876465 5942616 6044876
9245 6044876 6083311 6243394 6366691 6372498 6458062 6470235 6520989 6584074 6623013 6692324 6759802
$$ packed form
9329D328112K2768n376Q6966O8663O897p5765m7555j19780k3571P4254o1740j23861
9317D130012j532q870J5603n1778l5384j9662N0093P275K7500Q883P8930j2918
9305D188152P109L5947j410N6879Q5250L2548k963P9293L9149K215N5492J39221
9293D716882N2910P8987k896K6507k1962l0157N1772N8217L9398l0296o2239N5899
9281D933022l940k9436L5122J1181k6083p071M9415K4682O3881j9102l0074Q4190
9269E085787K7225L3425M723J6725m4263K0825L9172L6315L1458o254Q6190P1562
9257E402890n008O8798j4982L3416P3331N5811O7896P1682J13436R195O6151J02260
9245F044876L8435J60083J23297N807Q5564J2173N0754O3085L8939O9311O7478
$$ plain form
9234 6759802 6906792 6954387 6872602 6955961 7041997 7177527 7252102 7254428 7435787 7574993 7597348
9223 7597348 7584524 7690827 7767377 7898677 8018784 8130094 8217373 8324723 8564201 8727274
9213 8727274 8880755 9055942 9249593 9470589 9706066 9839561 10148515 10375243 10635373 10931819
9203 10931819 11270628 11583702 11868127 12237538 12678387 12978011 13438083 13932607 14336383
9194 14336383 14839913 15405996 16018070 16713531 17462682 18228422 19164379 20082558 21048800
9185 21048800 22077661 23263179 24603797 26194958 27918868 29782788 31968294 34241060
9177 34241060 36845826 39617980 42509174 45585924 48628926 51665065 54727213 57802037
9169 57802037 60797629 63762579 66511442 69181042 71446161 73004856 73795471 74094924
$$ packed form
9234F759802J46990M7595q1785Q3359Q6036J35530P4575K326J81359J39206K2355
9223G597348j2824J06303P6550J31300J20107J11310Q7279J07350K39478J63073
9213H727274J53481J75187J93651K20996K35477J33495L08954K26728K60130K96446
9203A0931819L38809L13074K84425L69411M40849K99624M60072M94524M03776
9194A4336383N03530N66083O12074O95461P49151P65740R35957R18179R66242
9185B1048800J028861J185518J340618J591161J723910J863920K185506K272766
9177C4241060K604766K772154K891194L076750L043002L036139L062148L074824
9169E7802037K995592K964950K748863K669600K265119J558695P90615K99453
$$ plain form
9161 74094924 73685450 72766354 71905344 71274177 71148256 71829683 73205916 75174171 77536026
9152 77536026 80210375 83471970 87237577 91560108 96494771 102338921 109159629 117076578
9144 117076578 126507478 137916844 151382722 166056978 182256828 200033599 219159851
9137 219159851 239238869 259167690 277899637 294956180 310950344 325541020 338343825
9130 338343825 350098517 359313212 363312670 361772188 355670397 346288019 334196382 317673917
9122 317673917 297419354 276192741 255860860 238226006 223755642 211557628 200927153
9115 200927153 191235861 182365661 174477087 167468546 161421300 156702856 153543594 152120821
9107 152120821 152853776 155704462 160014251 165490943 172232174 179720530 187754809 194131412
$$ packed form
9161G4094924m09474r19096q61010o31167j25921O81427J376233J968255K361855
9152G7536026K674349L261595L765607M322531M934663N844150O820708P916949
9144A17076578R430900J1409366J3465878J4674256J6199850J7776771J9126252
9137B19159851K0079018J9928821J8731947J7056543J5994164J4590676J2802805
9130C38343825J1754692R214695L999458j540482o101791r382378j2091637j6522465
9122C17673917k0254563k1226613k0331881j7634854j4470364j2198014j0630475
9115B00927153r691292q870200p888574p008541o047246m718444l159262j422773
9107A52120821P32955K850686M309789N476692O741231P488356Q034279O376603
$$ plain form
9099 194131412 196174733 195027620 192061185 188154621 184435706 179000878 170490802 160543988
9091 160543988 150027348 140040983 131700661 124651126 118400173 112573308 106703478 100839524
9083 100839524 95221194 90261142 85928327 82060313 78529157 75336988 72726251 70620485
9075 70620485 68988651 67848594 67205243 67093156 67685717 68956535 71012185 73524014 76520171
9066 76520171 79680681 83106806 86669584 89755424 91311674 91614257 91192204 90310338 89421119
9057 89421119 88023797 85441509 82016732 78104054 73943787 70040923 66510175 63255587
9049 63255587 60138927 57094669 54172431 51198953 48440668 46027568 43824638 41810288
9041 41810288 39960524 38200080 36737670 35426199 34278141 33327204 32482856 31810797 31386821
$$ packed form
9099A94131412K043321j147113k966435l906564l718915n434828q510076r946814
9091A60543988j0516640r986365q340322p049535o250953n826865n869830n863954
9083A00839524n618330m960052m332815l868014l531156l192169k610737k105766
9075G0620485j631834j140057o43351j12087N92561J270818K055650K511829K996157
9066G6520171L160510L426125L562778L085840J556250L02583m22053q81866q89219
9057H9421119j397322k582288l424777l912678m160267l902864l530748l254588
9049F3255587l116660l044258k922238k973478k758285k413100k202930k014350
9041D1810288j849764j760444j462410j311471j148058r50937q44348o72059m23976
$$ plain form
9032 31386821 31112533 31019141 31031487 31216755 31557953 31978614 32367607 32629673 32653288 32402236
9022 32402236 32074862 31703626 31332956 30732143 29944036 29006609 28078837 27171451 26415011
9013 26415011 25688650 25033211 24308749 23686963 23058471 22551823 22092833 21689980 21304070
9004 21304070 20971064 20745708 20488616 20261859 20195887 20185571 20267699 20339914 20518712 20768166
8994 20768166 21053600 21408542 21841664 22358734 22927034 23422550 23876168 24399584 24738923
8985 24738923 25034721 25333268 25596930 25779217 25828646 25670348 25450031 25347790 25381135 25444746
8975 25444746 25604061 25904768 26307162 26792094 27355095 28075877 28881352 29764868 30707250
8966 30707250 31760861 32966712 34368865 35782553 37126989 38482118 39851842 41349651
$$ packed form
9032C1386821k74288r3392J2346J85268L41198M20661L88993K62066K3615k51052
9022C2402236l27374l71236l70670o00813p88107r37427r27772r07386p56440
9013B6415011p26361o55439p24462o21786o28492n06648m58990m02853l85910
9004B1304070l33006k25356k57092k26757o5972j0316Q2128P2215J78798K49454
8994B0768166K85434L54942M33122N17070N68300M95516M53618N23416L39339
8985B4738923K95798K98547K63662J82287M9429j58298k20317j02241L3345O3611
8975B5444746J59315L00707M02394M84932N63001P20782Q05475Q83516R42382
8966C0707250J053611J205851J402153J413688J344436J355129J369724J497809
$$ plain form
8958 41349651 43023075 45032928 47521629 50430538 53974678 58261353 63350371 69324414
8950 69324414 75648933 82015414 88616671 94967931 100848724 105625225 108187672 109137700
8942 109137700 109614909 110104751 111459586 113623875 115738403 117432662 116818214 113804618
8934 113804618 109760472 105802356 103049149 101896337 102279038 104047480 106837684 109804376
8926 109804376 113268382 117814139 122785206 128482266 134043168 136883353 139104596 142518363
8918 142518363 147244836 153944216 161171060 167613082 173579970 179422272 185439239 192137663
8910 192137663 198811190 203795894 206987350 208360605 208903080 211194654 216079412 223468028
8902 223468028 232753517 241152028 247566331 252773351 256025121 257361711 256413782 251364669
$$ packed form
8958D1349651J673424K009853K488701K908909L544140M286675N089018N974043
8950F9324414O324519O366481O601257O351260N880793M776501K562447R50028
8942A09137700M77209M89842J354835K164289K114528J694259o14448l013596
8934A13804618m044146l958116k753207j152812L82701J768442K790204K966692
8926A09804376L464006M545757M971067N697060N560902K840185K221243L413767
8918A42518363M726473O699380P226844O442022N966888N842302O016967O698424
8910A92137663O673527M984704L191456J373255N42475K291574M884758P388616
8902B23468028R285489Q398511O414303N207020L251770J336590r47929n049113
$$ plain form
8894 251364669 241749452 229117735 215005081 200965929 188503423 178183967 170023790
8887 170023790 164102250 159300497 155144926 151748771 148739256 145853605 142821891 138926004
8879 138926004 133994791 128811598 123952383 120043213 116754903 113695849 110390566 105673924
8871 105673924 99566580 92943042 86472919 80730672 75915681 71774389 68212303 64846817
8863 64846817 61638196 58808624 56293880 53821783 51572794 49557409 47722068 45944065
8855 45944065 44437318 42987527 41632588 40408815 39330900 38471488 37618048 36669906 35564361
8846 35564361 34496801 33419112 32401451 31442204 30593665 29690995 28653461 27655988 26657537
8837 26657537 25648680 24778249 24040257 23361623 22730808 22086544 21396253 20753147 20187382
$$ packed form
8894B51364669r615217j2631717j4112654j4039152j2462506j0319456q160177
8887A70023790n921540m801753m155571l396155l009515k885651l031714l895887
8879A38926004m931213n183193m859215l909170l288310l059054l305283m716642
8871A05673924o107344o623538o470123n742247m814991m141292l562086l365486
8863F4846817l208621k829572k514744k472097k248989k015385j835341j778003
8855D5944065j506747j449791j354939j223773j077915q59412q53440r48142j105545
8846C5564361j067560j077689j017661r59247q48539r02670j037534r97473r98451
8837B6657537j008857q70431p37992o78634o30815o44264o90291o43106n65765
$$ plain form
8828 20187382 19749800 19350451 18994042 18545335 18318692 18107361 17817362 17696709 17630501 17466584
8818 17466584 17209004 16822592 16436933 16101606 15873416 15549429 15364573 15028230 14533765
8809 14533765 13970456 13370739 12914070 12525257 12167336 11866808 11684424 11422984 11243718
8800 11243718 11045101 10761389 10484894 10303848 10111048 9881447 9686816 9415619 9225267
8791 9225267 8995916 8720408 8557458 8376187 8177022 8015657 7816010 7697656 7649968 7416304
8781 7416304 7286658 7119272 6989592 6940995 6917268 6880939 6857571 6749523 6690953 6603271 6613273
8770 6613273 6654361 6508718 6442726 6466627 6455647 6366662 6292596 6257363 6181828 6141257 6045572
8759 6045572 6037016 5957221 5831540 5709091 5689060 5675168 5601652 5447228 5319836 5202383 5039544
$$ packed form
8828B0187382m37582l99349l56409m48707k26643k11331k89999j20653o6208j63917
8818A7466584k57580l86412l85659l35327k28190l23987j84856l36343m94465
8809A4533765n63309n99717m56669l88813l57921l00528j82384k61440j79266
8800A1243718j98617k83712k76495j81046j92800k29601j94631k71197j90352
8791I225267k29351k75508j62950j81271j99165j61365j99647j18354m7688k33664
8781G416304j29646j67386j29680m8597k3727l6329k3368j08048n8570q7682J0002
8770F613273M1088j45643o5992K3901j0980q8985p4066l5233p5535m0571r5685
8759F045572q556p9795j25681j22449k0031j3892p3516j54424j27392j17453j62839
$$ plain form
8748 5039544 5026801 5028153 5003314 4962738 4901866 4901661 4856049 4785868 4823322 4721406 4717755 4647789
8736 4647789 4680206 4733997 4736785 4669538 4495576 4383616 4286592 4212890 4208150 4132471 4124068 4101137
8724 4101137 4010401 4040432 4061223 4009406 3936126 3936222 3934305 3856828 3870852 3841194 3723390 3562553
8712 3562553 3461605 3410698 3363093 3227408 3093162 3022922 3053604 3041963 2969113 2961559 2923750
8701 2923750 2928096 2892811 2771250 2753664 2692369 2682481 2663115 2621862 2567398 2500203 2495033 2520387
8689 2520387 2477478 2424611 2486251 2408793 2499347 2604382 2577190 2472728 2340422 2386610 2429823
8678 2429823 2403107 2281801 2246643 2197535 2068455 1991905 1993809 2019505 1865870 1821665 1834465
8667 1834465 1747491 1675181 1656714 1652147 1659432 1624825 1621661 1630935 1628486 1558308 1516778 1410729
$$ packed form
8748E039544j2743J352k4839m0576o0872k05m5612p0181L7454j01916l651o9966
8736D647789L2417N3791K788o7247j73962j11960r7024p3702m740p5679q403k2931
8724D101137r0736L0031K0791n1817p3280R6j917p7477J4024k9658j17804j60837
8712C562553j00948n0907m7605j35685j34246p0240L0682j1641p2850p554l7809
8701B923750M346l5285j21561j7586o1295r888j9366m1253n4464o7195n170K5354
8689B520387m2909n2867O1640p7458R0554J05035k7192j04462j32306M6188M3213
8678B429823k6716j21306l5158m9108j29080p6550J904K5696j53635m4205J2800
8667A834465q6974p2310j8467m567P285l4607l164R274k449p0178m1530j06049
$$ plain form
8655 1410729 1360347 1383736 1438274 1428754 1375748 1361369 1367966 1355113 1284956 1281534 1253738 1203237
8643 1203237 1315022 1316689 1209503 1202107 1132873 1100551 1035620 1062283 1021594 1108560 1092613
8632 1092613 1040166 1084230 1001196 966789 972635 973607 857805 868833 1007740 1004184 955286 900025
8620 900025 940433 967100 867803 853766 860419 818461 756615 861923 913720 869284 852800 800202
8608 800202 814167 889483 926486 883273 822698 792368 772424 775153 808123 880919 838664 876728
8596 876728 867685 904044 796761 852325 860723 864577 879796 913805 938881 836612 886682 1001312
8584 1001312 1074618 985373 998022 928412 972793 939686 977552 981493 944511 940895 1030619 1002899
8572 1002899 975119 969261 1016719 1003415 996270 961790 869359 899511 905760 927360 903811 938083
$$ packed form
8655A410729n0382K3389N4538r520n3006j4379O597j2853p0157l422k7796n0501
8643A203237J11785J667j07186p396o9234l2322o4931K6663m0689Q6966j5947
8632A092613n2447M4064q3034l4407N846R72j15802J1028J38907l556m8898n5261
8620I00025M0408K6667r9297j4037O653m1958o1846J05308N1797m4436j6484n2598
8608H00202J3965P5316L7003m3213o0575l0330j9944K729L2970P2796m2255L8064
8596H76728r043L6359j07283N5564Q398L854J5219L4009K5076j02269N0070J14630
8584A001312P3306q9245J2649o9610M4381l3107L7866L941l6982l616Q9724k7720
8572A002899k7780n858M7458j3304p145l4480r2431L0152O249K1600k3549L4272
$$ plain form
8560 938083 948434 976634 983009 1052881 1118762 1075208 1051124 1120906 1069846 1115346 1136984 1138143
8548 1138143 1167508 1208635 1128006 1128328 1155917 1179331 1184626 1170628 1183327 1145493 1136190 1000499
8536 1000499 1005876 1077903 1062796 1054716 1033413 956792 926982 940860 918284 876632 883758 861676
8524 861676 892331 892644 886457 872332 918061 995369 1014424 919586 887253 982822 980682 938129
8512 938129 1004190 1095077 1075208 1074283 1063030 1094892 1108463 1104598 1111949 1078332 1046454 1128042
8500 1128042 1229046 1307226 1398234 1450596 1496353 1434522 1536190 1732033 1830584 2004882 2171880
8489 2171880 2191235 2283756 2394325 2495152 2762454 2997205 3248371 3468190 3674161 4011466
8479 4011466 4430525 4989771 5596389 6351541 7239727 8183336 9165247 10181636 11097770
$$ packed form
8560I38083J0351K8200O375O9872O5881m3554k4084O9782n1060M5500K1638J159
8548A138143K9365M1127q0629L22K7589K3414N295j3998J2699l7834r303j35691
8536A000499N377P2027j5107q080k1303p6621k9810J3878k2576m1652P126k2082
8524H61676L0655L13o187j4125M5729P7308J9055r4838l2333R5569k140m2553
8512I38129O6061R0887j9869r25j1253L1862J3571l865P351l3617l1878Q1588
8500A128042J01004P8180R1008N2362M5757o1831J01668J95843R8551J74298J66998
8489B171880J9355R2521J10569J00827K67302K34751K51166K19819K05971L37305
8479D011466M19059N59246O06618P55152Q88186R43609R81911J016389R16134
$$ plain form
8470 11097770 11843759 12292009 12363486 11907951 11160764 10331368 9449428 8614150 7806278 7207421
8460 7207421 6708775 6230666 5844881 5532547 5268957 4869399 4587884 4346707 4075329 3834785
8450 3834785 3524236 3177537 2945700 2786471 2644917 2475531 2286408 2178004 2039532 1914641
8440 1914641 1796268 1723046 1577631 1370622 1292075 1232227 1174059 1164754 1114813 960088 860990
8429 860990 930350 808763 757343 724784 707074 695137 732492 688200 668836 652308 581485
8418 581485 539669 512152 521606 517184 462401 411812 373055 357228 362529 298509 308594 313577
8406 313577 360047 319791 284172 309247 273424 239493 229810 225615 156573 170421 249583 272612
8394 272612 264810 210043 248832 241230 157379 192385 202491 176670 186258 159157 143148 85815
$$ packed form
8470A1097770P45989M48250P1477m55535p47187q29396q81940q35278q07872n98857
8460G207421m98646m78109l85785l12334k63590l99558k81515k41177k71378k40544
8450C834785l10549l46699k31837j59229j41554j69386j89123j08404j38472j24891
8440A914641j18373p3222j45415k07009p8547n9848n8168r305m9941j54725r9098
8429H60990O9360j21587n1420l2559j7710j1937L7355m4292j9364j6528p0823
8418E81485m1816k7517R454m422n4783n0589l8757j5827N301o4020J0085M983
8406C13577M6470m0256l5619K5075l5823l3931r683m195o9042J3848P9162K3029
8394B72612p802n4767L8789p602q3851L5006J0106k5821R588k7101j6009n7333
$$ plain form
8382 85815 71039 35471 78199 116712 140574 165783 196554 180926 179418 152106 79123 98263
8370 98263 90885 127552 100628 124313 6572 -12074 66203 -10319 30928 76253 56352 -4048
8358 -4048 -83666 -26702 -1350 454 31275 56109 34346 -18864 -39628 4735 3467 95926
8346 95926 56005 -32791 -59973 8913 83604 97931 105630 148076 175626 162100 164707 134856
8334 134856 105894 159970 212603 311405 291500 314052 346923 343134 295335 293708 310554 207978
8322 207978 205136 193618 166868 173792 84376 51949 160982 114906 140073 88302 110015 86002
8310 86002 1849 -53149 44826 -7430 1125 46712 -12505 -58603 -25361 -20697 -13362 -72370
8298 -72370 -171124 -211702 -278796 -176182 -116050 -88447 -137464 -215776 -188335 -276677 -257759 -198256
$$ packed form
8382H5815j4776l5568M2728L8513K3862K5209L0771j5628j508k7312p2983J9140
8370I8263p378L6667k6924K3685j17741j8646P8277p6522M1247M5325j9901o0400
8358d048p9618N6964K5352J804L0821K4834k1763n3210k0764M4363j268R2459
8346I5926l9921q8796k7182O8886P4691J4327P699M2446K7550j3526K607k9851
8334A34856k8962N4076N2633R8802j9905K2552L2871l789m7799j627J6846j02576
8322B07978k842j1518k6750O924q9416l2427J09033m6076K5167n1771K1713k4013
8310H6002q4153n4998R7975n2256Q555M5587n9217m6098L3242M664P335n9008
8298g2370r8754m0578o7094J02614O0132K7603m9017p8312K7441q8342J8918N9503
$$ plain form
8286 -198256 -156796 -102846 -35402 -79162 -69012 -60089 -114551 -95688 -81168 -105083 -158714 -193750
8274 -193750 -182406 -155700 -233385 -152309 -121612 -229287 -182232 -149300 -169822 -180097 -155076
8263 -155076 -181645 -165898 -195706 -227780 -172104 -194793 -167546 -179868 -173383 -200240 -257802 -232888
8251 -232888 -180811 -198905 -240442 -224389 -235394 -224134 -207213 -263519 -271662 -273485 -189879 -157166
8239 -157166 -280891 -252210 -270683 -233997 -192602 -304095 -266136 -194632 -196347 -292502 -257557
8228 -257557 -361855 -281573 -227224 -236782 -255663 -255950 -205961 -248528 -230901 -216972 -200602 -249674
8216 -249674 -197923 -169533 -223800 -244767 -284567 -217532 -162953 -238047 -295579 -272559 -272798 -284441
8204 -284441 -246497 -301456 -334086 -320459 -226016 -264995 -368430 -261990 -232711 -77899 -74821
$$ packed form
8286a98256M1460N3950O7444m3760J0150Q923n4462J8863J4520k3915n3631l5036
8274a93750J1344K6706p7685Q1076L0697j07675M7055L2932k0522j0275K5021
8263a55076k6569J5747k9808l2074N5676k2689K7247j2322O485k6857n7562K4914
8251b32888N2077j8094m1537J6053j1005J1260J6921n6306q143j823Q3606L2713
8239a57166j23725K8681j8473L6686M1395j11493L7959P1504j715r6155L4945
8228b57557j04298Q0282N4349r558j8881k87M9989m2567J7627J3929J6370m9072
8216b49674N1751K8390n4267k0967l9800O7035N4579p5094n7532K3020k39j1643
8204b84441L7944n4959l2630J3627R4443l8979j03435J06440K9279J54812L078
$$ plain form
8193 -74821 87700 -100578 -485458 -245951 -273338 -215341 -257153 -284415 -409469 -382671 -315684
8182 -315684 -295018 -303564 -318975 -280549 -256328 -269472 -392842 -429621 -360837 -264702 -357857 -330029
8170 -330029 -280406 -324514 -323022 -278844 -258355 -273267 -268206 -270768 -365304 -364935 -366551 -263558 -226673
8157 -226673 -263233 -317474 -318589 -252569 -210757 -262151 -269648 -294502 -262258 -282568 -289726 -290224 -326442
8144 -326442 -294901 -321140 -266537 -278062 -321934 -310125 -251098 -240894 -214144 -233743 -259820 -276571
8132 -276571 -296846 -267132 -241609 -295033 -318647 -278144 -282208 -329568 -305369 -349153 -394529 -357725
8120 -357725 -306619 -289578 -315105 -267415 -289501 -309043 -287759 -189504 -273576 -281232 -217632 -219402
8108 -219402 -279055 -227238 -196749 -262842 -238196 -237423 -326309 -323332 -242595 -161616 -186408 -246230
$$ packed form
8193g4821J62521j88278l84880K39507k7387N7997m1812k7262j25054K6798O6987
8182c15684K0666q546j5411L8426K4221j3144j23370l6779O8784R6135r3155K7828
8170c30029M9623m4108J492M4178K0489j4912N061k562r4536L69j616J02993L6885
8157b26673l6560n4241j115O6020M1812n1394p497k4854L2244k0310p158m98l6218
8144c26442L1541k6239N4603j1525m3872J1809N9027J0204K6750j9599k6077j6751
8132b76571k0275K9714K5523n3424k3614M0503m064m7360K4199m3784m5376L6804
8120c57725N1106J7041k5527M7690k2086j9542K1284R8255q4072p656O3600j770
8108b19402n9653N1817L0489o6093K4646P73q8886K977Q0737Q0979k4792n9822
$$ plain form
8096 -246230 -246361 -229150 -203506 -294608 -250227 -318186 -361194 -330962 -319488 -292350 -299172 -285092
8084 -285092 -281314 -286983 -235363 -199735 -253566 -304860 -319151 -306666 -323246 -355726 -343904 -296249
8072 -296249 -287820 -289530 -342111 -343859 -292372 -346627 -316788 -264537 -252830 -246671 -234442 -279790
8060 -279790 -319626 -306069 -272238 -298360 -265388 -227642 -257106 -253054 -270785 -277684 -257198 -333505
8048 -333505 -319565 -281329 -186389 -159278 -237329 -228651 -193524 -213884 -241654 -307538 -185223 -237174
8036 -237174 -271774 -238891 -285320 -285012 -204420 -165284 -95106 -85822 -114643 -61747 -105557 -232448
8024 -232448 -249533 -177727 -221162 -208285 -222938 -308111 -258824 -226916 -274377 -300936 -275466 -175851
8012 -175851 -230065 -263820 -280818 -284550 -278815 -277446 -346078 -324263 -280336 -243086 -259995 -272917
$$ packed form
8096b46230j31J7211K5644r1102M4381o7959m3008L0232J1474K7138o822J4080
8084b85092L778n669N1620L5628n3831n1294j4291J2485j6580l2480J1822M7655
8072b96249Q429j710n2581j748N1487n4255K9839N2251J1707O159J2229m5348
8060b79790l9836J3557L3831k6122L2972L7746k9464M052j7731o899K0486p6307
8048c33505J3940L8236R4940K7111p8051Q678L5127k0360k7770o5884J22315n1951
8036b37174l4600L2883m6429L08Q0592L9136P0178R284k8821N2896m3810j26891
8024b32448j7085P1806m3435J2877j4653q5173M9287L1908m7461k6559K5470R9615
8012a75851n4214l3755j6998l732N735J369o8632K1815M3927L7250j6909j2922
$$ plain form
8000 -272917 -337074 -331523 -260775 -244923 -258536 -318816 -353180 -305072 -291226 -304210 -426995 -424532
7988 -424532 -268131 -299647 -384787 -381880 -352927 -353724 -306185 -210180 -169400 -255611 -191038 -191784
7976 -191784 -265645 -201132 -252521 -247613 -343741 -294636 -279230 -316056 -290036 -294852 -344503 -271723
7964 -271723 -344581 -364117 -292613 -284985 -298180 -294299 -278187 -288255 -229741 -249306 -315800 -275558
7952 -275558 -234566 -361445 -353513 -383437 -309257 -236698 -216124 -256757 -252934 -274400 -242453 -254887
7940 -254887 -227243 -289144 -240352 -239360 -249709 -311573 -363684 -275123 -267246 -297293 -314868 -308994
7928 -308994 -351248 -243513 -230216 -307724 -330931 -239000 -249129 -249052 -298345 -310699 -293640 -192552
7916 -192552 -181301 -219922 -261458 -276008 -324380 -268203 -185852 -221909 -250312 -228228 -246567 -294646
$$ packed form
8000b72917o4157N551P0748J5852j3613o0280l4364M8108J3846j2984j22785K463
7988d24532J56401l1516q5140K907K8953p97M7539R6005M0780q6211O4573p46
7976a91784p3861O4513n1389M908r6128M9105J5406l6826K6020m816m9651P2780
7964b71723p2858j9536P1504P628j3195L881J6112j0068N8514j9565o6494M0242
7952b75558M0992j26879P932k9924P4180P2559K0574m0633L823k1466L1947j2434
7940b54887K7644o1901M8792R92j0349o1864n2111Q8561P877l0047j7575N874
7928c08994m2254J07735J3297p7508k3207R1931j0129P7m9293j2354J7059J01088
7916a92552J1251l8621m1536j4550m8372N6177Q2351l6057k8403K2084j8339m8079
$$ plain form
7904 -294646 -248847 -219076 -201595 -219912 -273532 -271255 -269106 -244756 -158576 -195389 -224007 -194923
7892 -194923 -151364 -176160 -170399 -134588 -229254 -235022 -141537 -85501 -82693 -80214 -48847 -125699
7880 -125699 -219178 -179298 -111162 -170435 -133388 -44519 13921 -13443 -54640 -29228 -41942 -21151
7868 -21151 -35991 -34680 5594 -22824 -58033 -58055 -86876 -110058 -54390 -8018 -54811 -96253 -94066
7855 -94066 -53458 -28669 -74352 -31229 -9790 -50182 -102159 -78275 -92588 7242 12625 -52218
7843 -52218 -45819 52244 2076 -40831 -64673 -35576 -75496 -177206 -172744 -220144 -246363 -189743
7831 -189743 -201347 -208748 -115718 -125460 -165919 -142016 -104654 -92374 -119477 -167071 -181823 -165902
7819 -165902 -133814 -105343 -49492 -108195 -160296 -190886 -183153 -108561 -82071 -98458 -112449 -101743
$$ packed form
7904b94646M5799K9771J7481j8317n3620K277K149K4350Q6180l6813k8618K9084
7892a94923M3559k4796N761L5811r4666n768R3485N6036K808K479L1367p6852
7880a25699r3479L9880O8136n9273L7047Q8869N8440k7364m1197K5412j2714K0791
7868b1151j4840J311M0274k8418l5209k2k8821k3182N5668M6372m6793m1442K187
7855i4066M0608K4789m5683M3123K1439m0392n1977K3884j4313R9830N383o4843
7843e2218O399R8063n0168m2907k3842K9097l9920j01710M462m7400k6219N6620
7831a89743j1604p401R3030r742m0459K3903L7362J2280k7103m7594j4752J5921
7819a65902L2088K8471N5851n8703n2101l0590P733P4592K6490j6387j3991J0706
$$ plain form
7807 -101743 -173870 -185102 -170647 -210846 -248160 -204372 -183866 -305689 -132140 -69882 -110403
7796 -110403 -98133 -157063 -175538 -175119 -154791 -66009 25834 6980 -80452 -134081 -152989 -111463
7784 -111463 -146591 -203282 -90876 -76509 -109691 -138688 -207502 -227315 -200387 -115757 -96385
7773 -96385 -144159 -183769 -97591 -26332 -39255 -59595 -83614 -50931 -90348 -67646 -108774 -100501
7761 -100501 -86589 -65723 -44298 -61091 12944 -116228 -87315 -114909 -118519 -91618 -94382 -122244
7749 -122244 -78532 -54622 -48188 -69872 -48044 -11222 27898 31460 -39584 -58829 -43467 37779
7737 37779 49284 68227 77980 46782 80670 41460 -14974 43596 69671 90940 117712 42251
7725 42251 24758 62768 102333 146082 86818 87439 140050 189527 277515 202075 267262 242944
$$ packed form
7807a01743p2127j1232J4455m0199l7314M3788K0506j21823J73549O2258m0521
7796a10403J2270n8930j8475M19K0328Q8782R1843j8854q7432n3629j8908M1526
7784a11463l5128n6691J12406J4367l3182k8997o8814j9813K6928Q4630J9372
7773i6385m7774l9610Q6178P1259j2923k0340k4019L2683l9417K2702m1128Q273
7761a00501J3912K0866K1425j6793P4035j29172K8913k7594l610K6901k764k7862
7749a22244M3712K3910O434k1684K1828L6822L9120L562p1044j9245J5362Q1246
7737C7779J1505J8943R753l1198L3888l9210n6434N8570K6075K1269K6772p5461
7725D2251j7493L8010L9565M3749n9264O21N2611M9477Q7988p5440O5187k4318
$$ plain form
7713 242944 142274 196795 167369 208658 262460 319607 349025 362073 363201 388532 490800
7702 490800 573545 604069 711797 861877 930566 968945 1056680 1142527 1253284 1308977 1381017
7691 1381017 1386170 1448265 1405229 1483115 1457343 1362309 1338644 1303955 1231226 1114897 1070653
7680 1070653 1006814 928102 856300 843064 845306 839101 753838 752723 731038 601314 533300 547293
7668 547293 606390 556423 467316 374009 381949 433675 451093 406912 407825 349002 340466 312670
7656 312670 358766 317121 333241 402269 339302 313873 306654 372102 342512 275307 290282 332299
7644 332299 367652 363126 324626 345480 313927 342065 346854 406672 411201 415683 532543 525383
7632 525383 569033 621704 600031 581923 485612 558614 509808 504188 491818 443629 501495 517351
$$ packed form
7713B42944j00670N4521k9426M1289N3802N7147K9418J3048J128K5331J02268
7702D90800Q2745L0524J07728J50080O8689L8379Q7735Q5847J10757N5693P2040
7691A381017N153O2095m3036P7886k5772r5034k3665l4689p2729j16329m4244
7680A070653o3839p8712p1802j3236K242o205q5263j115k1685j29724o8014J3993
7668E47293N9097m9967q9107r3307P940N1726J7418m4181R13n8823q536k7796
7656C12670M6096m1645J6120O9028o2967k5429p219O5448k9590o7205J4975M2017
7644C32299L5353m526l8500K0854l1553K8138M789N9818M529M482J16860p160
7632E25383M3650N2671k1673j8108r6311P3002m8806n620j2370m8189N7866J5856
$$ plain form
7620 517351 580978 630533 541419 442801 418904 485110 576743 591133 588378 586879 539555 626105
7608 626105 641426 650585 613033 519589 587837 630743 625343 661998 616798 672659 708397 739798
7596 739798 751553 761503 801359 762069 754945 725285 814497 810428 797775 747517 769541 815091
7584 815091 839729 882317 888356 862495 890228 914217 920628 869408 869247 938205 918385 927271 979673
7571 979673 986071 1038329 1010131 956944 1047461 981796 1013961 1035918 956002 972678 960956 946361
7559 946361 951544 1013573 1016544 947982 962027 973300 977570 1039110 1089926 1022648 1003338 1095653
7547 1095653 1137582 1083799 1040854 1008976 1034269 1080524 1110926 1188038 1244785 1252301 1224243 1246579
7535 1246579 1252881 1328894 1367295 1439603 1428729 1359081 1394126 1400225 1455919 1424805 1382861 1423471
$$ packed form
7620E17351O3627M9555q9114r8618k3897O6206R1633J4390k755j499m7324Q6550
7608F26105J5321R159l7552r3444O8248M2906n400L6655m5200N5861L5738L1401
7596G39798J1755R950L9856l9290p124k9660Q9212m069j2653n0258K2024M5550
7584H15091K4638M2588O039k5861K7733K3989O411n1220j61O8958j9820Q886N2402
7571I79673O398N2258k8198n3187R0517o5665L2165K1957p9916J6676j1722j4595
7559I46361N183O2029K971o8562J4045J1273M270O1540N0816o7278j9310R2315
7547A095653M1929n3783m2945l1878K5293M6255L0402P7112N6747P516k8058K2336
7535A246579O302P6013L8401P2308j0874o9648L5045O099N5694l1114m1944M0610
$$ plain form
7523 1423471 1472432 1532507 1481978 1521002 1613381 1687321 1701980 1618967 1609555 1623205 1640111 1653224
7511 1653224 1732242 1737791 1757093 1874245 1847498 1774687 1802664 1869454 1982594 1993759 1979494
7500 1979494 2039768 2090639 2071672 2092828 2050855 2134313 2258766 2338826 2450933 2468310 2481997
7489 2481997 2469196 2469078 2478812 2479946 2546844 2591816 2623986 2768328 2731425 2778877 2818049 2789481
7477 2789481 2862137 2940367 2940125 2958021 2944536 2986941 3044261 3087771 3215666 3205196 3269987 3393219
7465 3393219 3413738 3438935 3500001 3583975 3687806 3893560 4009366 3977676 4049621 4180647 4276077
7454 4276077 4409251 4486077 4559327 4791460 4851141 4886582 4955587 5112117 5259692 5356814 5537206
7443 5537206 5693122 5834249 6068490 6249961 6427933 6587051 6722878 7039775 7331395 7589992
$$ packed form
7523A423471M8961O0075n0529L9024R2379P3940J4659q3013r412J3650J6906J3113
7511A653224P9018N549J9302J17152k6747p2811K7977O6790J13140J1165j4265
7500A979494O0274N0871j8967K1156m1973Q3458J24453Q0060J12107J7377J3687
7489B481997j2801j18R734J134O6898M4972L2170J44342l6903M7452L9172k8568
7477B789481P2656P8230k42J7896j3485M2405N7320M3510J27895j0470O4791J23232
7465C393219K0519K5197O1066Q3974J03831K05754J15806l1690P1945J31026R5430
7454D276077J33174P6826P3250K32133N9681L5441O9005J56530J47575R7122J80392
7443E537206J55916J41127K34241J81471J77972J59118J35827L16897K91620K58597
$$ plain form
7433 7589992 7836367 8058140 8370777 8703212 8961713 9334523 9658594 10052596 10495536 10906234
7423 10906234 11399339 11847587 12365014 12954431 13559779 14219456 14993955 15867068 16712293
7414 16712293 17609765 18586793 19540529 20716954 21951182 23245126 24683375 26204806 27753380
7405 27753380 29618404 31617351 33823188 36246811 38834261 41725728 44876764 48448953
7397 48448953 52467267 56981288 62076613 67908336 74662028 82290083 90649333 99931882
7389 99931882 110025003 121194338 133902208 148508758 165056637 183433097 202610284
7382 202610284 222181745 241417932 259054877 273842725 284450080 290203832 290975625
7375 290975625 286550533 277244961 264518255 249733491 234346028 219274893 205085904
$$ packed form
7433G589992K46375K21773L12637L32435K58501L72810L24071L94002M42940M10698
7423A0906234M93105M48248N17427N89417O05348O59677P74499Q73113Q45225
7414A6712293Q97472R77028R53736J176425J234228J293944J438249J521431J548574
7405B7753380J865024J998947K205837K423623K587450K891467L151036L572189
7397D8448953M018314M514021N095325N831723O753692P628055Q359250R282549
7389I9931882J0093121J1169335J2707870J4606550J6547879J8376460J9177187
7382B02610284J9571461J9236187J7636945J4787848J0607355N753752P71793
7375B90975625m425092r305572j2726706j4784764j5387463j5071135j4188989
$$ plain form
7368 205085904 191989203 179881007 168700596 158463682 148738330 139092720 129820085
7361 129820085 120700600 111844023 103197093 94959060 87245353 80122242 73588817 67708497
7353 67708497 62640880 58092893 54119702 50666929 47632720 44875546 42436173 40193753
7345 40193753 38287319 36537275 34872436 33326559 31957273 30744754 29711433 28818020
7337 28818020 27960704 27271693 26709248 26312954 25971935 25752855 25695899 25722998 25888805 26240798
7327 26240798 26849549 27461096 28159303 28871928 29619257 30221328 30647513 30959373 30872480 30445864
7317 30445864 29865380 28989332 27838342 26558622 25190683 24027698 22896247 21814004
7309 21814004 20785962 19845843 18970839 18068023 17229570 16422923 15614483 14827868 14038717
$$ packed form
7368B05085904j3096701j2108196j1180411j0236914r725352r645610r272635
7361A29820085r119485q856577q646930q238033p713707p123111o533425n880320
7353F7708497n067617m547987l973191l452773l034209k757174k439373k242420
7345D0193753j906434j750044j664839j545877j369286j212519j033321q93413
7337B8818020q57316o89011n62445l96294l41019k19080n6956K7099J65807L51993
7327B6240798O08751O11547O98207P12625P47329O02071M26185L11860q6893m26616
7317C0445864n80484q76048j150990j279720j367939j162985j131451j082243
7309B1814004j028042r40119q75004r02816q38453q06647q08440p86615p89151
$$ plain form
7300 14038717 13419911 12801382 12100546 11379574 10811119 10373484 9870586 9503036 9130718
7291 9130718 8764452 8485013 8251779 7928942 7601184 7345149 7130190 7033786 6839027 6556500
7281 6556500 6414288 6231829 6067543 5896812 5752268 5571710 5379441 5256307 5145143 4934066
7271 4934066 4764168 4667744 4607519 4451051 4322343 4275809 4100840 3977226 3925549 3898921
7261 3898921 3825497 3754031 3672974 3529202 3506308 3543663 3465923 3340599 3244221 3218108 3182234
7250 3182234 3140881 3080718 3092544 3095143 3082906 3030706 2981880 2981013 2970426 2949292 2893425 2836986
7238 2836986 2901222 2882700 2899220 2822817 2716593 2750617 2655098 2549081 2420126 2378691 2300822
7227 2300822 2239519 2236362 2148369 2127518 2080968 2085047 2004704 1952581 1910416 1803669 1736900 1663156
$$ packed form
7300A4038717o18806o18529p00836p20972n68455m37635n02898l67550l72318
7291I130718l66266k79439k33234l22837l27758k56035k14959r6404j94759k82527
7281F556500j42212j82459j64286j70731j44544j80558j92269j23134j11164k11077
7271D934066j69898r6424o0225j56468j28708m6534j74969j23614n1677k6628
7261C898921p3424p1466q1057j43772k2894L7355p7740j25324r6378k6113l5874
7250C182234m1353o0163J1826K599j2237n2200m8826q67j0587k1134n5867n6439
7238B836986O4236j8522J6520p6403j06224L4024r5519j06017j28955m1435p7869
7227B300822o1303l157q7993k0851m6550M079q0343n2123m2165j06747o6769p3744
$$ plain form
7215 1663156 1577858 1444914 1469217 1496154 1529094 1556610 1535019 1440624 1387136 1362191 1289926
7204 1289926 1261218 1250125 1218119 1146737 1174658 1194259 1154205 1181015 1179678 1016138 956284
7193 956284 876819 881064 812738 771166 821249 790478 832402 739739 728235 750154 736457 664264
7181 664264 645526 737245 751230 690279 621341 558067 560938 564970 601007 605140 634236 632902
7169 632902 609692 601640 495112 522839 482106 474644 485356 460615 501588 519156 475461 433022
7157 433022 457336 476780 510235 460519 456512 519261 517975 476244 443621 519894 565604 489970
7145 489970 452882 405656 427935 452128 471663 449624 414232 391693 332237 366379 329909 284426
7133 284426 239224 296272 436098 377990 309276 317241 188541 136038 178507 246823 247525 255764
$$ packed form
7215A663156q5298j32944K4303K6937L2940K7516k1591r4395n3488k4945p2265
7204A289926k8708j1093l2006p1382K7921J9601m0054K6810j337j63540n9854
7193I56284p9465M245o8326m1572N0083l0771M1924r2663j1504K1919j3697p2193
7181F64264j8738R1719J3985o0951o8938o3274K871M032L6037M133K9096j334
7169F32902k3210q052j06528K7727m0733p462J0712k4741M0973J7568m3695m2439
7157D33022K4314J9444L3455m9716m007O2749j286m1731l2623P6273M5710p5634
7145D89970l7088m7226K2279K4193J9535k2039l5392k2539n9456L4142l6470m5483
7133B84426m5202N7048J39826n8108o8714P965j28700n2503M2469O8316P02Q239
$$ plain form
7121 255764 309644 414251 432848 408870 330508 239619 297902 298511 274393 225029 286973 381191
7109 381191 338057 319388 260005 266122 276744 237883 241572 204030 207676 236527 245399 273117
7097 273117 341581 291395 307508 345204 347634 321088 341635 422369 476488 471105 540786 497140
7085 497140 496445 494081 513330 653260 773208 806985 890107 1029051 1056803 1065068 1126675 1245826
7073 1245826 1352214 1377228 1388821 1475886 1564069 1600400 1658544 1700661 1713231 1680996 1720429
7062 1720429 1765509 1835878 1865431 1758396 1747469 1674562 1602264 1531097 1484787 1349506 1243521
7051 1243521 1126065 1070456 943253 808147 894834 884653 809146 712343 652594 604186 544392
7040 544392 503850 434151 423703 422820 363468 333630 295820 250988 225434 163770 199139 187191
$$ packed form
7121B55764N3880J04607J8597k3978p8362r0889N8283O09k4118m9364O1944R4218
7109C81191m3134j8669n9383O117J0622l8861L689l7542L646K8851Q872K7718
7097B73117O8464n0186J6113L7696K430k6546K0547Q0734N4119n383O9681m3646
7085D97140o95k364J9249J39930J19948L3777Q3122J38944K7752Q265O1607J19151
7073A245826J06388K5014J1593Q7065Q8183L6331N8144M2117J2570l2235L9433
7062A720429M5080P0369K9553j07035j0927p2907p2298p1167m6310j35281j05985
7051A243521j17456n5609j27203j35106Q6687j0181p5507r6803n9749m8408n9794
7040E44392m0542o9699j0448q83n9352k9838l7810m4832k5554o1664L5369j1948
$$ plain form
7028 187191 163434 126526 101260 194835 241214 244526 67585 83150 211107 81902 7771
7017 7771 27404 131550 109847 163791 124572 80725 121647 166868 212076 294250 238427 167693
7005 167693 172689 206600 202248 191279 203856 113752 131870 94213 121050 136736 132602 170886
6993 170886 120442 70606 78630 44037 69891 106710 115797 40364 -37290 -64463 -72824 -89534
6981 -89534 -99710 -147231 -188815 -192368 -123323 -68849 -14759 -19716 2668 -60224 -58699 -21343
6969 -21343 -54108 -25476 -46459 3656 -84768 -70621 -100052 -129680 -51864 -83846 -48060 -106755
6957 -106755 -180430 -87126 -55537 -101073 -82448 -108810 -41151 -75134 -98180 -69445 -86878 -88318
6945 -88318 -90419 -50778 -92639 -50443 -50860 -156040 -85806 43209 23102 32109 137813 143716
$$ packed form
7028A87191k3757l6908k5266R3575M6379L312j76941J5565J27957j29205p4131
7017G771J9633J04146k1703N3944l9219m3847M0922M5221M5208Q2174n5823p0734
7005A67693M996L3911m352j0969J2577r0104J8118l7657K6837J5686m134L8284
6993A70886n0444m9836Q024l4593K5854L6819R087p5433p7654k7173q361j6710
6981h9534j0176m7521m1584l553O9045N4474N4090m957K2384o2892J525L7356
6969b1343l2765K8632k0983N0115q8424J4147k9431k9628P7816l1982L5786n8695
6957a06755p3675R3304L1589m5536J8625k6362O7659l3983k3046K8735j7433j440
6945h8318k101L9641m1861M2196m17j05180P0234J29015k0107R007J05704N903
$$ plain form
6933 143716 140462 235399 212846 250726 298182 274246 231966 277544 266657 262116 260640 199630
6921 199630 134443 69534 55739 49363 18556 -60742 -107057 -12970 28980 -45679 -64645 -88287
6909 -88287 -132711 -54570 -102725 -90574 -99824 -127768 -87296 -133107 -123750 -144752 -121425 -130795
6897 -130795 -111564 -129846 -127886 -166612 -238248 -317635 -289152 -269153 -225272 -196870 -189700 -240513
6885 -240513 -190956 -161724 -215201 -176270 -122305 -161993 -188730 -196635 -148841 -103054 -196761 -253395
6873 -253395 -198750 -214423 -219206 -199396 -177229 -188489 -195877 -211922 -257912 -240595 -327943 -309291
6861 -309291 -216570 -192370 -219155 -222485 -210752 -151544 -145660 -166561 -75197 -69453 -63835 -70839 -107192
6848 -107192 -100330 -127819 -44214 -88305 -91093 -101190 -104654 -118143 -58046 -77106 -90606 -57251
$$ packed form
6933A43716l254R4937k2553L7880M7456k3936m2280M5578j0887m541j476o1010
6921A99630o5187o4909j3795o376l0807p9298m6315R4087M1950p4659j8966k3642
6909h8287m4424P8141m8155J2151r250k7944M0472m5811R357k1002K3327r370
6897a30795J9231j8282J960l8726p1636p9387K8483J9999M3881K8402P170n0813
6885b40513M9557K9232n3477L8931N3965l9688k6737p905M7794M5787r3707n6634
6873b53395N4645j5673m783J9810K2167j1260p388j6045m5990J7317q7348J8652
6861c09291R2721K4200k6785l330J1733N9208N884k0901R1364N744N618p004l6353
6848a07192O862k7489Q3605m4091k788j0097l464j3489O0097j9060j3500L3355
$$ plain form
6836 -57251 15543 30128 75469 91803 70611 97678 99336 138813 189182 251912 174815 190984
6824 190984 234374 265445 345113 308871 257534 147976 121830 71128 2010 132149 126676
6813 126676 136091 155000 124078 69695 8415 -2530 82198 -13534 -54374 -151719 -208992 -113105
6801 -113105 -105318 -162714 -100551 -140119 -160966 -115298 -76018 -75668 -194969 -202331 -146904 -160345
6789 -160345 -100905 -29242 -80465 -108328 -166041 -101769 -80705 -131732 -123673 -2130 5011 -27088
6777 -27088 -75772 -58622 -86470 -103683 -184672 -185529 -156711 -115726 -148597 -83720 -60860 -64625
6765 -64625 -46660 -86208 -53744 -166728 -177114 -181173 -161811 -98048 -80206 -53930 55733 153254
6753 153254 118319 148713 91277 101315 202302 174282 143505 71058 98319 31267 305
$$ packed form
6836e7251P2794J4585M5341J6334k1192K7067J658L9477N0369O2730p7097J6169
6824A90984M3390L1071P9668l6242n1337j09558k6146n0702o9118J30139n473
6813A26676R415J8909l0922n4383o1280j0945Q4728r5732m0840r7345n7273R5887
6801a13105P787n7396O2163l9568k0847M5668L9280L50j19301p362N5427j3441
6789a60345N9440P1663n1223k7863n7713O4272K1064n1027Q059J21543P141l2099
6777b7088m8684J7150k7848j7213q0989q57K8818M0985l2871O4877K2860l765
6765f4625J7965l9548L2464j12984j0386m059J9362O3763J7842K6276J09663R7521
6753A53254l4935L0394n7436J0038J00987k8020l0777p2447K7261o7052l0962
$$ plain form
6742 305 -5264 -22141 -33581 -3192 -37508 -21024 29279 73020 76006 55597 29079 40781 6184
6729 6184 -7224 -1263 -14709 -23289 -74638 -117732 -171417 -182710 -91022 -71056 -77404 -72878 -103805
6716 -103805 -84691 -67837 -49533 -70708 -132183 -109778 -107635 -65686 -93336 -40175 -12315 -77689
6704 -77689 -39902 -14214 -131081 -180012 -116046 -87774 -62016 -29567 -74997 -81267 -16736 -130875
6692 -130875 -177763 -169611 -153880 -114306 -46930 -54786 -68863 -151157 -113782 -94049 -85347 -12035
6680 -12035 -46941 -101346 -61159 21872 12868 -18655 -54285 10007 3457 -75953 -43751 -37882
6668 -37882 -27182 -73638 -105451 -81214 -126673 -75432 -100018 -117961 4678 -89235 -135478 -110386
6656 -110386 -17628 -65095 -81877 23746 36168 20331 -41910 -51536 -96990 -108301 -50515 2996
$$ packed form
6742C05n569j6877j1440L0389l4316J6484N0303M3741K986k0409k6518J1702l4597
6729F184j3408N961j3446q580n1349m3094n3685j1293R1688J9966o348M526l0927
6716a03805J9114J6854J8304k1175o1475K2405K143M1949k7650N3161K7860o5374
6704g7689L7787K5688j16867m8931O3966K8272K5758L2449m5430o270O4531j14139
6692a30875m6888Q152J5731L9574O7376p856j4077q2294L7375J9733Q702P3312
6680a2035l4906n4405M0187Q3031r004l1523l5630O4292o550p9410L2202N869
6668c7882J0700m6456l1813K4237m5459N1241k4586j7943J22639r3913m6243K5092
6656a10386R2758m7467j6782J05623J2422j5837o2241r626m5454j1311N7786N3511
$$ plain form
6644 2996 -8144 -36264 -41842 -118109 -110948 -185918 -138882 -32253 13933 12535 -77063 -53174
6632 -53174 -30769 -13559 -37034 -109423 -61333 -73514 -97151 -12725 42482 6073 -84603 -74521
6620 -74521 -56111 -55006 -38183 -39525 61645 83847 -47802 32726 87973 166436 125090 79784
6608 79784 107688 1285 -4121 40363 75543 62519 107673 75261 5330 55779 76501 -71610
6596 -71610 -76033 14033 104930 94248 46701 16294 96643 122856 82025 114026 93529 121389
6584 121389 156772 156244 115813 67423 146436 148566 102860 123673 82415 55627 51176 129543
6572 129543 149488 177534 126257 131061 124737 137142 155061 254204 240278 234645 261036 357885
6560 357885 256824 259053 269268 255683 289033 342952 379768 397554 308391 330983 302865 314744
$$ packed form
6644B996j1140k8120n578p6267P161p4970M7036J06629M6186j398q9598K3889
6632e3174K2405J7210k3475p2389M8090j2181k3637Q4426N5207l6409r0676J0082
6620g4521J8410J105J6823j342J01170K2202j31649Q0528N5247P8463m1346m5306
6608G9784K7904j06403n406M4484L5180j3024M5154l2412o9931N0449K0722j48111
6596g1610m423R0066R0897j0682m7547l0407Q0349K6213m0831L2001k0497K7860
6584A21389L5383n28m0431m8390P9013K130m5706K0813m1258k6788m451P8367
6572A29543J9945K8046n1277M804o324J2405J7919R9143j3926n633K6391R6849
6560C57885j01061K229J0215j3585L3350N3919L6816J7786q9163K2592k8118J1879
$$ plain form
6548 314744 375900 457321 522716 527204 518408 536149 555111 603930 636413 564044 649261 703120
6536 703120 738942 700851 676670 597011 604959 639076 679390 657362 739242 757425 781227 825782
6524 825782 963262 905789 908421 924994 939138 912482 990703 1032393 1043815 1118286 1052945 1015347
6512 1015347 1104286 1049254 987073 977250 1085471 1128770 1066099 996518 975551 995383 1013305
6501 1013305 1031420 1026086 1072699 1033643 970761 947213 996591 982167 935752 926712 849505 893096
6489 893096 866983 870597 812607 861070 914027 896003 828744 726383 773007 688881 671685 624033
6477 624033 658713 639952 651142 667028 626573 592674 642370 516354 555884 588477 560922
6466 560922 650977 690599 606394 534204 549497 590013 574733 520293 503548 602946 661203 605153
$$ packed form
6548C14744O1156Q1421O5395M488q796J7741J8962M8819L2483p2369Q5217N3859
6536G03120L5822l8091k4181p9659P948L4117M0314k2028Q1880J8183K3802M4555
6524H25782J37480n7473K632J6573J4144k6656P8221M1690J1422P4471o5341l7598
6512A015347Q8939n5032o2181r823J08221M3299o2671o9581k0967J9832J7922
6501A013305J8115n334M6613l9056o2882k3548M9378j4424m6415r040p7207M3591
6489H93096k6113L614n7990M8463N2957j8024o7259j02361M6624q4126j7196m7652
6477F24033L4680j8761J1190J5886m0455l3899M9696j26016L9530L2593k7555
6466E60922R0055L9622q4205p2190J5293M0516j5280n4440j6745R9398N8257n6050
$$ plain form
6454 605153 586506 556220 575749 623306 577582 506703 554929 539618 561417 607882 595719 685163
6442 685163 645976 636099 622641 599197 591737 612031 647886 690489 725125 766285 814066 823731
6430 823731 810462 775158 806976 846741 784922 766748 894015 895970 885394 822066 785745 860209
6418 860209 909976 907206 916332 928362 903633 902384 971987 1000104 980159 1000984 1001657 1052109 1010212
6405 1010212 1061662 1071724 1036433 1053205 1040053 1079999 1074119 1089429 1111580 1179528 1305417
6394 1305417 1305444 1274211 1274117 1291703 1331014 1316731 1318958 1298500 1333167 1356465 1369775 1356910 1396915
6381 1396915 1445060 1399658 1378571 1381753 1358165 1392571 1354578 1360558 1349292 1372658 1371374 1399574
6369 1399574 1471601 1420126 1475054 1502395 1500676 1476561 1509687 1506948 1493740 1552464 1571047 1585370
$$ packed form
6454F05153j8647l0286J9529M7557m5724p0879M8226j5311K1799M6465j2163Q9444
6442F85163l9187r877j3458k3444p460K0294L5855M2603L4636M1160M7781R665
6430H23731j3269l5304L1818L9765o1819j8174J27267J955j0576o3328l6321P4464
6418H60209M9767k770R126J2030k4729j249O9603K8117j9945K0825O73N0452m1897
6405A010212N1450J0062l5291J6772j3152L9946n880J5310K2151O7948J25889
6394A305417K7l1233r4J7586L9311j4283K227k0458L4667K3298J3310j2865M0005
6381A396915M8145m5402k1087L182k3588L4406l7993N980j1266K3366j284K8200
6369A399574P2027n1475N4928K7341j719k4115L3126k739j3208N8724J8583J4323
$$ plain form
6357 1585370 1637034 1560410 1560372 1642360 1633169 1634160 1717013 1818329 1790905 1854703 1809517 1790740
6345 1790740 1806716 1863756 1856973 1858444 1906614 1904948 1907750 1895359 1915107 1970422 1978137 1998175
6333 1998175 1979581 2012507 2115154 2214836 2291395 2290289 2233025 2278433 2340859 2370718 2332043
6322 2332043 2380534 2409163 2418958 2489630 2585114 2527064 2549188 2556551 2674702 2793524 2809459
6311 2809459 2871987 2939454 3043433 3030873 3115878 3106599 3099300 3134496 3167094 3216785 3288837 3228240
6299 3228240 3352203 3380132 3441992 3477170 3474191 3548960 3566816 3610823 3659018 3637333 3714019
6288 3714019 3795605 3893498 4056601 4112154 4136928 4252017 4368840 4503905 4566678 4638026 4758278
6277 4758278 4908665 4996752 5083672 5182994 5319291 5445464 5654090 5747037 5921617 6098375
$$ packed form
6357A585370N1664p6624l8Q1988r191R91Q2853J01316k7424O3798m5186j8777
6345A790740J5976N7040o783J471M8170j666K802j2391J9748N5315P715K0038
6333A998175j8594L2926J02647R9682P6559j106n7264M5408O2426K9859l8675
6322B332043M8491K8629R795P0672R5484n8050K2124P363J18151J18822J5935
6311B809459O2528O7467J03979j2560Q5005r279p299L5196L2598M9691P2052o0597
6299C228240J23963K7929O1860L5178k979P4769J7856M4007M8195k1685P6686
6288C714019Q1586R7893J63103N5553K4774J15089J16823J35065O2773P1348J20252
6277D758278J50387Q8087Q6920R9322J36297J26173K08626R2947J74580J76758
$$ plain form
6267 6098375 6314452 6549446 6671166 6828398 7057621 7367861 7726500 8009532 8308647 8654344
6257 8654344 8944895 9313351 9672720 10084790 10493152 10945464 11492630 12001030 12541637 13084867
6247 13084867 13763647 14580673 15421863 16249956 17155535 18196317 19232331 20455560 21734487
6238 21734487 23214684 24852344 26599931 28681961 31059753 33757301 36810768 40171351
6230 40171351 43957082 48124507 52576428 57203955 61998536 66948733 71916300 76796986
6222 76796986 81454650 85567998 88930487 91307200 92755360 93385483 93547558 93452132 93610958
6213 93610958 94270880 95457600 97123162 99367491 102290290 106000295 110361173 115314196
6205 115314196 120617721 126250252 132230665 138163217 143952232 149142675 153270257 156018938
$$ packed form
6267F098375K16077K34994J21720J57232K29223L10240L58639K83032K99115L45697
6257H654344K90551L68456L59369M12070M08362M52312N47166N08400N40607N43230
6247A3084867O78780Q17026Q41190Q28093R05579J040782J036014J223229J278927
6238B1734487J480197J637660J747587K082030K377792K697548L053467L360583
6230D0171351L785731M167425M451921M627527M794581M950197M967567M880686
6222G6796986M657664M113348L362489K376713J448160O30123J62075r5426J58826
6213I3610958O59922J186720J665562K244329K922799L710005M360878M953023
6205A15314196N303525N632531N980413N932552N789015N190443M127582K748681
$$ plain form
6197 156018938 157168690 156849921 155184358 152546240 149117118 145044036 140822149 136775407
6189 136775407 132903046 129402049 126620780 124456890 122955969 121955466 121278489 121023951
6181 121023951 120980604 121039374 121288571 121340478 121248651 120698141 119415434 117310569 114002224
6172 114002224 109675211 104659462 99331522 94037249 88953377 84177138 79625132 75300798
6164 75300798 71098077 67088522 63430093 59855244 56432766 53132943 49905236 46777621
6156 46777621 43878091 41039418 38256526 35681982 33244084 30999520 28926895 27037349
6148 27037349 25436587 23927442 22575649 21259569 20097332 19034768 18205418 17463174
6140 17463174 16652403 15960114 15245120 14679811 14090355 13501145 12913183 12363161 11947636
$$ packed form
6197A56018938J149752l18769j665563k638118l429122m073082m221887m046742
6189A36775407l872361l500997k781269k163890j500921j000503o76977k54538
6181A21023951m3347N8770K49197N1907r1827n50510j282707k104865l308345
6172A14002224m327013n015749n327940n294273n083872m776239m552006m324334
6164G5300798m202721m009555l658429l574849l422478l299823l227707l127615
6156D6777621k899530k838673k782892k574544k437898k244564k072625j889546
6148B7037349j600762j509145j351793j316080j162237j062564q29350p42244
6140A7463174q10771o92289p14994n65309n89456n89210n87962n50022m15525
$$ plain form
6131 11947636 11528609 11124135 10754099 10433317 10085620 9730469 9449701 9224583 8943266
6122 8943266 8629344 8349726 8083435 7846715 7710247 7531575 7329472 7114041 6849163 6653023
6112 6653023 6525798 6497512 6267650 6076091 5968422 5870668 5701151 5585609 5463451 5387388
6102 5387388 5231871 5108176 5057483 4949552 4826088 4709754 4622632 4535893 4498347 4423412
6092 4423412 4344964 4251739 4183113 4092268 4041529 4042049 3969327 3903614 3816638 3743015 3648084 3621301
6080 3621301 3518280 3464998 3394236 3307568 3269018 3293593 3178596 3050804 2882841 2911980 2917416
6069 2917416 2906319 2938982 2811541 2753023 2698685 2607883 2564274 2543575 2498986 2446403 2413448
6058 2413448 2461023 2326062 2216742 2226124 2184033 2115213 2130038 2117995 2060196 1971626 1981079
$$ packed form
6131A1947636m19027m04474l70036l20782l47697l55151k80768k25118k81317
6122H943266l13922k79618k66291k36720j36468j78672k02103k15431k64878j96140
6112F653023j27225k8286k29862j91559j07669r7754j69517j15542j22158p6063
6102E387388j55517j23695n0693j07931j23464j16334q7122q6739l7546p4935
6092D423412p8448r3225o8626r0845n0739N20p2722o5713q6976p3623r4931k6783
6080C621301j03021n3282p0762q6668l8550K4575j14997j27792j67963K9139N436
6069B917416j1097L2663j27441n8518n4338r0802m3609k0699m4589n2583l2955
6058B413448M7575j34961j09320R382m2091o8820J4825j2043n7799q8570R453
$$ plain form
6047 1981079 1925383 1978212 2009243 1898176 1854282 1939661 1948829 1937425 1934335 1854912 1910654 1884373
$$ packed form
6047A981079n5696N2829L1031j11067m3894Q5379R168j1404l090p9423N5742k6281
$$ [...]
##END NTUPLES=NMR SPECTRUM
##END=
