##TITLE=1H_TG-2388
 200.13MHz, CDCl3,
 8 sc
 
 12.8.2025
##JCAMPDX= 6.0         $$ Bruker NMR JCAMP-DX V2.0
##DATA TYPE= NMR SPECTRUM
##DATA CLASS= NTUPLES
##ORIGIN= UXNMR, Bruker Analytische Messtechnik GmbH
##OWNER= pz
$$ XWIN-NMR		Version 3.5
$$ Tue Aug 12 13:59:48 2025 Russian Standard Time (UT+4h)  she@DPX200
##.OBSERVE FREQUENCY= 200.1313
##.OBSERVE NUCLEUS= ^1H
##.ACQUISITION MODE= SIMULTANEOUS
##.ACQUISITION SCHEME= undefined
##.AVERAGES= 8
##.DIGITISER RES= 18
##SPECTROMETER/DATA SYSTEM= spect
##.PULSE SEQUENCE= zg30
##.SOLVENT NAME= CDCl3
##.SHIFT REFERENCE= (INTERNAL, CDCl3, 0, 15.4769)
##AUDIT TRAIL= $$ (NUMBER, WHEN, WHO, WHERE, WHAT)
$$ ##TITLE= Audit trail, XWIN-NMR		Version 3.5
$$ ##JCAMPDX= 5.01
$$ ##ORIGIN= Bruker BioSpin GmbH
$$ ##OWNER= she
$$ F:/spectra/data/she/nmr/H-C/1/pdata/1/auditp.txt
$$ ##AUDIT TRAIL=  $$ (NUMBER, WHEN, WHO, WHERE, WHAT)
(   1,<2025-08-12 13:58:18.06 +0400>,<she>,<DPX200>,
      <created by zg, POWCHK disabled, PULCHK disabled
       configuration hash MD5:
       00 E9 B6 7A A2 85 ED C7 34 08 36 98 17 FE 4E 26
       data hash MD5: 16K
       EC B8 B0 DC 2D 5A 7B 7F 89 DD F3 EE 15 7C 5A BC>)
(   2,<2025-08-12 13:58:20.89 +0400>,<she>,<DPX200>,
      <Start of raw data processing
       efp BC_mod = 2 LB = 0.25 FT_mod = 6 PKNL = 1 PHC0 = -1559.214 PHC1 = 8.79229 SI = 16K 
       data hash MD5: 16K
       AC A4 D6 AF 5E A4 2F 6D 64 63 83 1C 67 7F 99 3E>)
(   3,<2025-08-12 13:58:46.03 +0400>,<she>,<DPX200>,
      <pk PHC0 = -0.352452 PHC1 = 3.8 
       data hash MD5: 16K
       7C D0 9B 35 F6 1E B0 8F 84 DB 32 95 A4 F3 8C 66>)
(   4,<2025-08-12 13:58:50.87 +0400>,<she>,<DPX200>,
      <abs ABSG = 5 
       data hash MD5: 16K
       A8 45 93 7D B5 C4 65 63 D9 14 84 B7 0F 13 7F 89>)
$$ ##END=
$$ 
$$ hash MD5
$$ 8D 1B B6 F7 F8 12 24 2D E5 C7 1D B9 BE D0 22 91
##$RELAX= 
##$RELAX= 
##$RELAX= 
##$RELAX= 
##$RELAX= 
##$RELAX= 
$$ Bruker specific parameters
$$ --------------------------
##$DU= <F:/spectra>
##$EXPNO= 1
##$NAME= <H-C>
##$PROCNO= 1
##$TYPE= <nmr>
##$USER= <she>
##$AMP= (0..31)
100 100 100 100 100 100 100 100 100 100 100 100 100 100 100 100 100 100 
100 100 100 100 100 100 100 100 100 100 100 100 100 100 
##$AQSEQ= 0
##$AQ_mod= 1
##$AUNM= <au_zg>
##$AUTOPOS= <>
##$BF1= 200.13
##$BF2= 200.13
##$BF3= 200.13
##$BF4= 200.13
##$BF5= 200.13
##$BF6= 200.13
##$BF7= 200.13
##$BF8= 200.13
##$BYTORDA= 1
##$CFDGTYP= 0
##$CFRGTYP= 5
##$CHEMSTR= <none>
##$CNST= (0..31)
1 1 145 1 1 1 1 1 1 1 1 1 1 1 1 1 1 1 1 1 1 1 1 1 1 1 1 1 1 1 1 1 
##$CPDPRG= <>
##$CPDPRG1= <>
##$CPDPRG2= <>
##$CPDPRG3= <>
##$CPDPRG4= <mlev>
##$CPDPRG5= <mlev>
##$CPDPRG6= <mlev>
##$CPDPRG7= <mlev>
##$CPDPRG8= <mlev>
##$CPDPRGB= <>
##$CPDPRGT= <>
##$D= (0..31)
0 0.7 0 0 0 0 0 0 0 0 0 0.03 0 0 0 0 0 0 0 0 0 0 0 0 0 0 0 0 0 0 0 0 
##$DATE= 1754992697
##$DBL= (0..7)
120 120 120 120 120 120 120 120 
##$DBP= (0..7)
150 150 150 150 150 150 150 150 
##$DBP07= 0
##$DBPNAM0= <>
##$DBPNAM1= <>
##$DBPNAM2= <>
##$DBPNAM3= <>
##$DBPNAM4= <>
##$DBPNAM5= <>
$$ [...]
##$SUBNAM3= <"">
##$SUBNAM4= <"">
##$SUBNAM5= <"">
##$SUBNAM6= <"">
##$SUBNAM7= <"">
##$SUBNAM8= <"">
##$SUBNAM9= <"">
##$SW= 18.0517328524113
##$SWIBOX= (0..15)
0 0 2 0 0 0 0 0 0 0 0 0 0 0 0 0 
##$SW_h= 3612.71676300578
##$TD= 16384
##$TD0= 1
##$TE= 0
##$TE2= 300
##$TE3= 300
##$TEG= 300
##$TL= (0..7)
0 120 120 120 120 120 120 120 
##$TP= (0..7)
150 150 150 150 150 150 150 150 
##$TP07= 0
##$TPNAME0= <>
##$TPNAME1= <>
##$TPNAME2= <>
##$TPNAME3= <>
##$TPNAME4= <>
##$TPNAME5= <>
##$TPNAME6= <>
##$TPNAME7= <>
##$TPOAL= (0..7)
0.5 0.5 0.5 0.5 0.5 0.5 0.5 0.5 
##$TPOFFS= (0..7)
0 0 0 0 0 0 0 0 
##$TUNHIN= 0
##$TUNHOUT= 0
##$TUNXOUT= 0
##$USERA1= <user>
##$USERA2= <user>
##$USERA3= <user>
##$USERA4= <user>
##$USERA5= <user>
##$V9= 5
##$VALIST= <valist>
##$VCLIST= <CCCCCCCCCCCCCCC>
##$VD= 0
##$VDLIST= <DDDDDDDDDDDDDDD>
##$VPLIST= <PPPPPPPPPPPPPPP>
##$VTLIST= <TTTTTTTTTTTTTTT>
##$WBST= 1024
##$WBSW= 4
##$XGAIN= (0..3)
0 0 0 0 
##$XL= 0
##$YL= 0
##$YMAX_a= 156921
##$YMIN_a= -170825
##$ZGOPTNS= <>
##$ZL1= 120
##$ZL2= 120
##$ZL3= 120
##$ZL4= 120
##$ABSF1= 15.05716
##$ABSF2= -2.994681
##$ABSG= 5
##$ABSL= 3
##$ALPHA= 0
##$AQORDER= 0
##$ASSFAC= 0
##$ASSFACI= 0
##$ASSFACX= 0
##$ASSWID= 0
##$AUNMP= <proc_1d>
##$AZFE= 0.1
##$AZFW= 0.1
##$BCFW= 0
##$BC_mod= 2
##$BYTORDP= 0
##$COROFFS= 0
##$CY= -3
##$DATMOD= 1
##$DC= 0
##$DFILT= <>
##$DTYPP= 0
##$F1P= 0
##$F2P= 0
##$FCOR= 1
##$FTSIZE= 16384
##$FT_mod= 6
##$GAMMA= 0
##$GB= 0
##$INTBC= 1
##$INTSCL= 3.241238e-09
##$ISEN= 128
##$LB= 0.25
##$LEV0= 0
##$LPBIN= 0
##$MAXI= 10000
##$MC2= 0
##$MEAN= 0
##$ME_mod= 0
##$MI= 1.114404
##$NCOEF= 0
##$NC_proc= -8
##$NLEV= 6
##$NOISF1= 3.799351
##$NOISF2= 2.8
##$NSP= 0
##$NTH_PI= 0
##$NZP= 0
##$OFFSET= 15.47695
##$PC= 1
##$PHC0= -1559.566
##$PHC1= 12.59229
##$PH_mod= 1
##$PKNL= yes
##$PPARMOD= 0
##$PSCAL= 0
##$PSIGN= 0
##$REVERSE= no
##$SF= 200.130008956446
##$SI= 16384
##$SIGF1= 3
##$SIGF2= 2
##$SINO= 0.751879
##$SIOLD= 32768
##$SREGLST= <19F.Aceton>
##$SSB= 0
##$STSI= 16384
##$STSR= 0
##$SW_p= 3612.71676300578
##$SYMM= 0
##$S_DEV= 0
##$TDeff= 16384
##$TDoff= 0
##$TI= <>
##$TILT= no
##$TM1= 0
##$TM2= 0
##$TOPLEV= 0
##$USERP1= <user>
##$USERP2= <user>
##$USERP3= <user>
##$USERP4= <user>
##$USERP5= <user>
##$WDW= 1
##$XDIM= 16384
##$YMAX_p= 327832279
##$YMIN_p= -2121666
$$ End of Bruker specific parameters
$$ ---------------------------------
##NTUPLES= NMR SPECTRUM
##VAR_NAME=  FREQUENCY,     SPECTRUM/REAL,   SPECTRUM/IMAG
##SYMBOL=    X,             R,               I
##VAR_TYPE=  INDEPENDENT,   DEPENDENT,       DEPENDENT
##VAR_FORM=  AFFN,          ASDF,            ASDF
##VAR_DIM=   16384,         16384,           16384
##UNITS=     HZ,            ARBITRARY UNITS, ARBITRARY UNITS
##FACTOR=    0.220516191357247, 1,           1
##FIRST=     3097.40208043289, 0,            0
##LAST=      -515.314682572893, 0,           0
##MIN=       -515.314682572893, -2121666,    0
##MAX=       3097.40208043289, 327832279,    0
$$ Real data points
##PAGE= N=1
##DATA TABLE= (X++(R..R)), XYDATA
$$ [...]
12592b31552m57411K83081r7526l95944P55749J034981n06214l09338K3572J93528
12582B92926n45223K28400M48317m24364K18921P2670k17358M256j46583N6236
12572a1802L37027Q3673J3825l19129r0796m1784O0061j85164m51143j01434R62298
12561B55632P9253N70512l58042N54006n13239m23666m70011l61044k90826L28981
12551f28444l29060Q18311M06939k22555j87583L1469J49586o31557O54180J82237
12541B43523m98860k6178K53447n8426j32903l72178M43862n1035n03206k90398
12531i92352N20713K7252m8697J36552J67457n58565O49685M97246j18573p173
12521B73545N9524j97006l48440k61629J95292N559j4799k66011O31588q46480
$$ plain form
12592 -231552 -688963 -405882 -503408 -899352 -143603 891378 385164 75826 99398 292926
12582 292926 -252297 -23897 424420 56 218977 291647 74289 78545 -68038 -11802
12572 -11802 325225 408898 422723 103594 12798 -28986 31075 -154089 -605232 -706666 255632
12561 255632 334885 905397 547355 1101361 588122 164456 -305555 -666599 -957425 -628444
12551 -628444 -957504 -139193 267746 45191 -142392 -110923 38663 -592894 61286 243523
12541 243523 -255337 -281515 -28068 -86494 -219397 -591575 -147713 -198748 -701954 -992352
12531 -992352 -471639 -444387 -493084 -356532 -189075 -747640 -97955 399291 280718 273545
12521 273545 333069 136063 -212377 -474006 -278714 -273155 -287954 -553965 77623 -768857
12511g68857K50223K98018j99237K52612o6910Q7963K53456L83983K71316k17344
12501E45223n28582o5835j52975N6432L67036M36094k86366N2615o3878n81467
12491b21703m11286M68091m66145R3673M7444N97267M01455J96680k53903p72107
12481c20534m07657K53417P60728l78393M8594j3180J30100l5202k78829k28349
12471d69305l14819L07446l41839n20245j4086J32274P15134k2571O52815m01822
12461b77018Q87492K09470l90881l86700P578l6825l34691J68867l9939L06227
12451A13580j57042k55031J39422L45403p02632L28597L1330l56852P8940l51895
12441g86180M78060M75953L62584m43179r6110k35354J16131J40708k31042r348
$$ plain form
12511 -768857 -518634 -220616 -419853 -167241 -234151 -146188 107268 491251 762567 545223
12501 545223 16641 -49194 -202169 -145737 221299 657393 371027 423642 359764 -221703
12491 -221703 -632989 -164898 -631043 -537370 -489926 107341 508796 705476 451573 -320534
12481 -320534 -728191 -474774 285954 -92439 -43845 -57025 73075 37873 -240956 -469305
12471 -469305 -784124 -476678 -818517 -1338762 -1352848 -1220574 -505440 -528011 124804 -277018
12461 -277018 610474 819944 429063 42363 49941 13116 -321575 -152708 -192647 113580
12451 113580 -43462 -298493 -159071 186332 -516300 -187703 -156373 -513225 -434285 -786180
12441 -786180 -308120 167833 530417 87238 -8872 -244226 -128095 12613 -218429 -227777
12431b27777L50945k91095k8986L94148J0444m32292k95816K43350N90578M742
12421C18241p94185j3354k04513K03553K7762P1035K757n86920R3499N38855n74730
12410i18000L63910M47268P69730n4954p85467j77652L50103K64983l0230k14176
12400A5515k78456k87534K91722j61255P59810k30860k11827k35963M03952l77715
12390c12611P5811K86154J77435o415l91650L98744o0242J87941k5165l78571
12380d8569l91794J68687N51191k24923k05297o02418J32813N11108O9181K80808
12370B40787k20354K81337N0273M7441N43539m33169o16125j43753k75801m15393
12360i41218P01061P34325K59796m42143n64731j01546K96835J69736k58350J30431
$$ plain form
12431 -227777 123168 -167927 -196913 197235 207679 -224613 -520429 -277079 313499 318241
12421 318241 -475944 -489298 -693811 -490258 -462496 -391461 -388704 -975624 -882125 -343270 -918000
12410 -918000 -554090 -106822 662908 607954 -177513 -355165 -5062 259921 229691 15515
12400 15515 -262941 -550475 -258753 -420008 339802 108942 -102885 -338848 65104 -312611
12390 -312611 -236800 49354 226789 220374 -171276 227468 167226 355167 330002 -48569
12380 -48569 -440363 -271676 279515 54592 -150705 -753123 -620310 -109202 -40021 240787
12370 240787 20433 301770 352043 399484 943023 509854 -106271 -250024 -525825 -941218
12360 -941218 -240157 494168 753964 311821 -252910 -354456 -57621 112115 -146235 -15804
12350a5804J7160k02660n15047N39203K80693k46155L51507m06135l75103m20688
12340i93029Q8097N04496j47539K43131o2338l78599k52250L51829O45845N42461
12330E42104L01879k60522p53574J25747K36934N55610l20219n29174J68031L54036
12320D20852p9560n00063N8099k09454j70281P83520p74912L87640j85189r1582
12310c60930k23024L53290l2655j58324J66921M39932l13320o738K89671J66958
12300C21781L58678l67688n07489l38149k85107m32719N8712N37619o9078l05487
12290a028927N83671J03937J44250m26379M57517K70808m16901L69009M16586
12281D73571p16152L638n25213k10191M2899Q62622L08869j18153k11128j93229
$$ plain form
12350 -15804 1356 -201304 -716351 -177148 103545 -142610 208897 -197238 -572341 -993029
12340 -993029 -904932 -400436 -547975 -304844 -367182 -745781 -998031 -646202 -357 542104
12330 542104 843983 583461 -170113 -44366 192568 748178 427959 -101215 66816 420852
12320 420852 341292 -158771 -100672 -310126 -480407 303113 -471799 -84159 -269348 -360930
12310 -360930 -583954 -230664 -263319 -421643 -254722 185210 -128110 -134848 154823 321781
12300 321781 680459 312771 -194718 -532867 -817974 -1250693 -1191981 -654362 -723440 -1028927
12290 -1028927 -445256 -341319 -197069 -623448 -165931 104877 -312024 56985 473571
12281 473571 -242581 -238943 -764156 -974347 -931448 -68826 240043 121890 -89238 -282467
12271b82467O46671l59080M27172j22063q12255p4799Q66827j4428L1453J89266
12261D96297o1664j85351K38492k23149o94007j73334J38950L13688l67164K67240
12251b50002m32623N0624M55413m35966K72792J06330k78935M95728J57101J22327
12241B62789l68309k66709N16154k17394l72303M34572k85794R0585J87744L01554
12231B82889K55072k81141J18982J61173k73630n63274l15958K36512L20439M26989
12221C68053q1515j06580j46428M8059j5418l07696q9137k51392M71701K68240
12211A57887k17905m33407o4441k21825J73159L75851K41807L65592j64375o11487
12201c99144L90433K77794q1369l31481K35545j33498n689P92120k60494p99424
$$ plain form
12271 -282467 364204 5124 432296 310233 -502022 -576821 290006 275578 307031 496297
12261 496297 434633 249282 487774 264625 -429382 -602716 -463766 -150078 -517242 -250002
12251 -250002 -682625 -632001 -176588 -612554 -339762 -233432 -512367 -16639 140462 262789
12241 262789 -105520 -372229 143925 -73469 -445772 -11200 -296994 -206409 -18665 282889
12231 282889 537961 256820 375802 536975 263345 -299929 -615887 -379375 -58936 368053
12221 368053 286538 179958 33530 81589 66171 -241525 -330662 -582054 -110353 157887
12211 157887 -60018 -493425 -557866 -779691 -606532 -230681 11126 376718 212343 -399144
12201 -399144 -8711 269083 187714 -143767 91778 -41720 -47409 744711 484217 -315207
12191c15207p30544O10837O88368J28529n73392O9185O72299J41909J89891o85266
12181A96609K09295M61998o38246o9096m2687j12775p09631O2k60336K82116M09991
12170b72700j78976L13670Q8007k40174J84996P79720q1866l77134J73602P0999
12160D60144l71646l56760n12652k23071P6329Q27086M97077l75486m0481J22375
12150A02915K83m27466n9815K01366J4726k48737l48228L79816J13100M68759
12140A96719o61445J10892Q68830L46363m42337j84675k19774r480M38978m01576
12130D2495j8040K35535q547m71636L20810K30666j29701j39917L19650M6975
12120D28290K86050m85644J73409O2964J4991L48329o14106l69459o1876J20266
$$ plain form
12191 -315207 -1045751 -434914 253454 381983 -191409 -122224 550075 691984 881875 196609
12181 196609 405904 867902 229656 160560 117873 5098 -704533 -704471 -964807 -682691 -272700
12170 -272700 -451676 -138006 -49999 -290173 -105177 674543 592677 215543 389145 460144
12160 460144 88498 -268262 -780914 -1003985 -927656 -100570 396507 21021 -19460 102915
12150 102915 103198 -324268 -384083 -182717 -167991 -416728 -764956 -385140 -272040 196719
12140 196719 -464726 -353834 514996 861359 419022 234347 14573 5093 444071 42495
12130 42495 24455 259990 251443 -220193 100617 331283 201582 61665 381315 428290
12120 428290 714340 228696 402105 465069 480060 828389 214283 -155176 -217052 -96786
12110i6786K88503k53017Q8049K11997l20141K65256k89406j40844K35008K24396
12100B13015N15133O7050J83508n42271R8973j57358l47347J16202n10129K5911
12090c37313J53153J25334J88552k72629l56259o6054j036304j7594J034057k96999
12080h82056Q38876J03390K8574m68180K71819N23130J43750n6066n05669J48407
12070A45975K1996k13359P381J67039j34892l5460n18766L79485K47630k21504
12060a54475r3401k41729N40969J34690r7019p57821p30493N59001M164J06985
12050g29129M98449N39917P8716j67067L69088n22052j15413P2980j77619L74422
12040B22292p4873J49539j22142l10849M68384J25787r67748M95667n39796j33912
$$ plain form
12110 -96786 191717 -61300 26749 238746 -81395 183861 -105545 -246389 -11381 213015
12100 213015 728148 795198 978706 436435 535408 378050 30703 146905 -363224 -337313
12090 -337313 -184160 -58826 129726 -142903 -499162 -565216 -1601520 -1619114 -585057 -882056
12080 -882056 -43180 60210 88784 -379396 -107577 415553 559303 503237 -2432 145975
12070 145975 167971 -45388 -38007 129032 -5860 -41320 -560086 -180601 67029 -154475
12060 -154475 -247876 -489605 51364 186054 89035 -668786 -1399279 -840278 -836114 -729129
12050 -729129 -230680 309237 387953 220886 589974 67922 -47491 25489 -152130 222292
12040 222292 147419 296958 174816 -136033 332351 458138 -509610 -13943 -553739 -687651
12030f87651O58497M35931q89331M28514L41304J05898K22641k68102o75243q5389
12020d12931L69251R11825q95100l26292j10482l3928L36460J43969k42393j92721
12010d52342L67272j88271l67676j65374j32811q1168K33305k23987k76826O98480
12000e89398N18862J22814j18634M69761m9996k35371J198l51647J4929L26662
11990A09180m1410R3622j1496L49363O9029q46922P2076r4139R83348m12086M26249
11979F96814k12718j42584J5637k01453K42531j21257M72948o29983r38819L39822
11969d79062q6385M23846J78817R9444J51404p1418J69376J04381q59676N54795
11959A85522l85227l74457Q3266P7487L74680L272K31291n13509k06681L30888
$$ plain form
12030 -687651 -29154 406777 -482554 -54040 287264 393162 615803 347701 -327542 -412931
12020 -412931 -43680 868145 -26955 -353247 -463729 -497657 -161197 -17228 -259621 -452342
12010 -452342 -85070 -273341 -641017 -806391 -939202 -1020370 -787065 -1011052 -1287878 -589398
12000 -589398 -70536 52278 -66356 403405 353409 118038 119236 -232411 -217482 109180
11990 109180 67770 161392 149896 499259 568288 -278634 -206558 -300697 682651 270565 696814
11979 696814 484096 341512 357149 155696 398227 276970 749918 119935 -818884 -479062
11969 -479062 -565447 -141601 37216 136660 288064 216646 386022 490403 -369273 185522
11959 185522 -199705 -574162 -490896 -413409 -38729 -35457 195834 -317675 -524356 -193468
11949a93468O23756J6346l16733j35619J70349N19278k26387m60988K44999J19950
11939C61483o30855K11240n40736K20352K35592m36264M34168p42101k49399M9820
11929a086700K20992O47835J04146l21007k92403L94774m03193J483J95207P22525
11919A83659o31611L1567j0065m55402j15966l5843P29058K21280l15435K49783
11909a48975j42886n8910Q13602m3456R8724K81398l11301M9900o41182n1894
11899a54980K48051L31881j99334r7367K9787J21637o33948k10651L70402K51400
11889E6878N6094m71466L20616O28485K6099p24050j84699J36524L64656l16903
11879a07766m6073j25124R05245k08868o82030M1429J71785l71526k14786k21059
$$ plain form
11949 -193468 430288 446634 129901 -5718 164631 683909 457522 -3466 241533 361483
11939 361483 -269372 -58132 -598868 -378516 -142924 -579188 -145020 -887121 -1136520 -1086700
11929 -1086700 -865708 -217873 -113727 -434734 -727137 -332363 -735556 -734073 -538866 183659
11919 183659 -447952 -416385 -426450 -881852 -997818 -1033661 -304603 -83323 -398758 -148975
11909 -148975 -291861 -350771 462831 419375 518099 799497 488196 538096 -103086 -154980
11899 -154980 93071 424952 225618 128251 158038 279675 -354273 -564924 -194522 56878
11889 56878 112972 -358494 -37878 590607 616706 -107344 -292043 -155519 209137 -107766
11879 -107766 -153839 -278963 626282 417414 -264616 -223187 -51402 -422928 -637714 -858773
11869h58773J89814K23058N95912l01392L17150k23268Q8202m52907P3646O85554
11859C36996k35688k89227n6229o84225K23786J150384m19067k05584N94658l58746
11849E7058r3273k91052n58203P36288M60574l74587K10703j39462L96081L08400
11839G12527o12035j93730k08847p8886j56808k82497J42244R12496n97870L85209
11829B1803K10518m5026J2939m82336p1853j36056r4430q85642O07912L20186
11819e41985L6279K55033K75688p8500M68877m529k81927M98861m41205j56473
11809C0119M75288J2552m339o72207r914Q36646m43028k46195J01529O13113m90230
11798B03334k63014L48733m2258M6907j12383L21963n69901J80749j92289k24013
$$ plain form
11869 -858773 -668959 -445901 150011 -151381 165769 -57499 30703 -422204 -348558 336996
11859 336996 101308 -187919 -244148 -928373 -704587 445797 26730 -178854 415804 57058
11849 57058 -36215 -327267 -885470 -149182 311392 -63195 147508 8046 404127 712527
11839 712527 100492 -93238 -302085 -380971 -537779 -820276 -678032 234464 -363406 21803
11829 21803 232321 187295 200234 -282102 -353955 -490011 -584441 -1470083 -862171 -541985
11819 -541985 -505706 -250673 25015 -53485 415392 410863 128936 627797 186592 30119
11809 30119 505407 517959 513620 -158587 -168501 668145 225117 -21078 80451 693564 203334
11798 203334 -59680 289053 246795 293702 181319 503282 -66619 114130 -78159 -302172
11788c02172l46938O91248J91280o45073n97335K05815J067153L82040o62590
11779a6572l25351P10757l34975o57422j85660J34069J93422M80678r5569L11973
11769B15350j59365l35538O790m98988J55735P44892r3464J92929k42617o5245
11759g9521j24524L19056N33799m00783o6263k19644n72300k00798j04951K05426
11749g10503M17095J12349j71613N49949n14770m71872M15470N73096m07634M1112
11739a67321J33602N08035j40608p53000j74048N44596K02985M46895Q2719J58131
11729H41986m89581l44973M42393L30415k15180L38175l74559o15043M3539L37146
11719B94318j41650n12382K54892N37477M598J98312m13502m34175N63327n43094
$$ plain form
11788 -302172 -649110 42138 233418 -411655 -1008990 -803175 263978 646018 -16572
11779 -16572 -341923 368834 33859 -623563 -809223 -675154 -481732 -1054 -96623 215350
11769 215350 55985 -279553 -272763 -771751 -616016 128876 35412 228341 -14276 -79521
11759 -79521 -204045 115011 648810 248027 181764 -37880 -610180 -810978 -915929 -710503
11749 -710503 -293408 -181059 -352672 197277 -317493 -789365 -373895 199201 -208433 -167321
11739 -167321 -33719 474316 333708 -419292 -593340 -48744 154241 601136 683855 841986
11729 841986 352405 7432 449825 780240 565060 903235 528676 -86367 -42828 294318
11719 294318 152668 -359714 -104822 432655 437253 635565 222063 -212112 351215 -191879
11709a91879k77451Q03096L35799k23367j66376k03700k84992N92292L18069j139939
11699d38448k98109N85758k0301l07282q1449L16237L71887K24497k24536n33218
11689d04964j79481L48772Q05700N4447q13503j25038L77514q17123J57507M24182
11679a71987N5433l01422O7105N45939L5618k88774L62220M6564L0368P2318l53909
11668I9473j06630l30573k75528L67903O29370k61493m33305M46169j43451M7345
11658C9280q8796J72760O95256L50731o92109m50932j73432N47463l97453L64046
11648C66814K27042m59024j85886j05901N49671K8462l88401L41552L04318M158
11638F82805l79816j85685m8008L95452q481L24889l41790K59749m0113n19678
$$ plain form
11709 -191879 -469330 333766 669565 446198 279822 76122 -208870 383422 701491 -438448
11699 -438448 -736557 -150799 -171100 -478382 -559831 -243594 128293 352790 128254 -404964
11689 -404964 -584445 -235673 570027 624474 -189029 -314067 63447 -753676 -596169 -171987
11679 -171987 -116554 -417976 -350871 195068 230686 -58088 304132 350696 381064 453382 99473
11668 99473 -7157 -337730 -613258 -245355 384015 122522 -310783 135386 -8065 39280
11658 39280 -49516 123244 818500 1169231 477122 26190 -147242 400221 2768 366814
11648 366814 593856 134832 -51054 -156955 392716 421178 32777 374329 678647 682805
11638 682805 302989 117304 69296 464748 456267 781156 439366 699115 659002 139324
11628A39324L36645L00506o68390k77240N91811k1888j8610j3903k36709N9788
11618A91334O43886R3349m27849q59059J18451J75042Q83531m25147o25135m51830
11608f83427M62568J23624m461l05679J6184N67580j21989n00499l03043P35979
11598a3163M31161l1134j49301L18596k76464K4698J81324l624Q1404q88000m98505
11587h23008O81123N7991k03479R0882K14110N3758R2193K03877J70100j13619
11577D23928L7092K7064n96819j02012N75064j46891k4529n52612O0306J24348
11567a75061K34113L0370Q5404M33441k82501J45351q20719l90523j0985j98559
11557i49669P56423L47237j7820J45726k3917j66885p9093j1545O76039m851n74840
$$ plain form
11628 139324 475969 776475 108085 -169155 422656 400768 382158 368255 131546 191334
11618 191334 835220 928569 500720 -358339 -239888 -64846 818685 393538 -231597 -683427
11608 -683427 -220859 -97235 -101696 -407375 -391191 176389 54400 -446099 -749142 -13163
11598 -13163 417998 386864 237563 556159 279695 304393 485717 482093 563497 -324503 -823008
11587 -823008 -141885 -83894 -287373 -196491 17619 71377 163570 367447 537547 423928
11577 423928 461020 488084 -108735 -210747 364317 217426 192897 -359715 -299409 -175061
11567 -175061 59052 89422 174826 608267 325766 471117 -349602 -740125 -751110 -949669
11557 -949669 -193246 153991 136171 281897 257980 91095 12002 457 676496 671645 96805
11546I6805J36460Q64949l97057q37787k16452r6406K66465j83284M01215L08769
11536C43677k98936l81867M88370J52409k01877k46274K58895M74932P2363o06257
11526E5435n1733k32730M41078J77440l49971J79172o6964o23619N74818J20605
11516B23531l3478j63734j38561M27821K26268j010539J72651J7832l6423J27031
11506a87601j091522j5498O58040M17997N9261q08583L45746M87092M77766k20904
11496A21794o36829l65736K51099K04525p74978J082709J86170m37525j34913
11487e03684J81563P09438k87164k96714J08587J1089J100383n77007r19639M52979
11477b0169j78761q43610L18171N90149J7261l55353l14552Q01183m40092O93005
$$ plain form
11546 96805 233265 1098214 701157 -136630 -353082 -449488 -183023 -366307 34908 343677
11536 343677 44741 -337126 151244 303653 101776 -144498 114397 589329 661692 55435
11526 55435 3702 -229028 212050 389490 39519 218691 151727 -471892 102926 223531
11516 223531 190053 26319 -112242 315579 541847 -468692 -296041 -278209 -314632 -187601
11506 -187601 -1279123 -1294621 -636581 -218584 -159323 -967906 -622160 -135068 342698 121794
11496 121794 -515035 -880771 -629672 -425147 -1200125 -117416 68754 -368771 -503684
11487 -503684 -322121 387317 100153 -196561 -87974 -76885 1023498 446491 -473148 -20169
11477 -20169 -198930 -1042540 -724369 -134220 -116959 -472312 -786864 14319 -425773 267232
11467B67232r2986l72552Q36832P0536l04436o1411J96895j84153Q6275r7617
11457C44615l95826k70389O97187N6013J08702l48629O3396L21046J86630o3557
11447F99188j05111n08916j51338j392J75769M43305K41430L447j32178q76055
11437b11851N204L84273j84794J26057n1628j74412k60550m89823J57314N07183
11427a93027M91954k57364l97705N61339N70566m79253l23252O17759l84725K2064
11417B28356M722m21174K82436j05307J51020P7220n420L42813n22406j37352
11407a05092q1771j1858L39028M18917J8326q19361k39574L46410J06488p1412
11397i9899n6114n40152K00326j8727j10610K83912P26418l88686j06096n09382
$$ plain form
11467 267232 174246 -198306 638526 709062 404626 343215 540110 355957 442232 344615
11457 344615 -51211 -321600 375587 431600 540302 191673 255069 576115 762745 699188
11447 699188 594077 85161 -66177 -67569 108200 551505 792935 796382 664204 -211851
11437 -211851 -206647 177626 -7168 118889 67261 -107151 -367701 -857524 -700210 -193027
11427 -193027 298927 41563 -356142 205197 775763 296510 -26742 591017 206292 228356
11417 228356 233078 -188096 94340 -10967 140053 217273 211853 554666 32260 -105092
11407 -105092 -186863 -198721 140307 559224 577550 -241811 -481385 -134975 -28487 -99899
11397 -99899 -156013 -696165 -495839 -514566 -625176 -341264 385154 -3532 -109628 -619010
11387f19010J23805l28366L74300L13243J7017R21161l78580P24J64583R9797
11377F88674m76236k01664M36250o11404K30666j78731p030k02834J71667K87607
11367A36965n25155N11525j31107j79109j4355L42242K67333O59728r99872o26459
11357e58264M20825j27460r1225J331084O3915q79827K24042j76212n63362R52219
11347E95735l14643j0798k51421r6034J46604O37929p53272J04191J48643l75712
11337a68778K0301m44192N24152J99208l28262k77633J99237K04922m87283q7623
11327f45951m9729K47457M67844p0784m25276J74380R0520l96494O31829k69159
11317b45363K95954J0095j62063j53161M23959j005985j14897L92461J163572
$$ plain form
11387 -619010 -495205 -823571 -449271 -136028 -119011 802150 423570 424294 588877 688674
11377 688674 212438 10774 447024 -164380 66286 -112445 -119475 -322309 -150642 136965
11367 136965 -388190 123335 -7772 -186881 -201236 141006 408339 1068067 68195 -558264
11357 -558264 -137439 -264899 -356124 974960 1038875 159048 383090 206878 -356484 595735
11347 595735 281092 270294 18873 -77161 69443 707372 -45900 58291 206934 -168778
11337 -168778 -148477 -592669 -68517 130691 -197571 -475204 -275967 -71045 -558328 -645951
11327 -645951 -695680 -448223 19621 -51163 -476439 -302059 -211539 -608033 23796 -245363
11317 -245363 50591 60686 -101377 -254538 169421 -836564 -951461 -559000 604572
11308F04572k22818L58466j01946m63950m45841L46122N95982p6108k51430j81281
11298A61768L97813m12545m3988k46982J77513l24790L96082m014k11719k33209
11288c44071Q086q75K08627k71076N23184p41404L93186J81110j26858O2486O7414
11277d0191N32292r94431m71092J2857L04603L97370j21650L41644l01137l29012
11267f68747j86073K50168Q30745l37691r6544o47785M12235L49136K48081O16460
11257G69985l29104m30739k75290M43885q0987J95872L15715O7468k29558k16762
11247B30485k87424q5088P315j9747k54976Q0821N94235K11881k39992p40870
11237e03360L15682M26341o9326j72473o84171M68957Q7652J79847k32724O16039
$$ plain form
11308 604572 381754 740220 638274 174324 -271517 74605 670587 594479 343049 161768
11298 161768 559581 147036 103048 -143934 33579 -291211 104871 100857 -110862 -344071
11288 -344071 -335985 -336860 -128233 -399309 123875 -617529 -224343 -43233 -170091 -107605 -40191
11277 -40191 492101 -502330 -973422 -960565 -655962 -258592 -380242 -38598 -339735 -668747
11267 -668747 -854820 -604652 226093 -111598 -208142 -855927 -443692 -94556 153525 769985
11257 769985 440881 10142 -265148 178737 97750 293622 609337 676805 447247 230485
11247 230485 -56939 -142027 -134712 -154459 -409435 -328614 265621 477502 237510 -503360
11237 -503360 -187678 238663 169337 -3136 -687307 -218350 -130698 49149 -183575 432464
11227D32464l3453n39373j44872M84495K45171r07607o33917J23489K12100J42955
11217f18548M12447J95114p1898k16343k04196k65980M79673K790l6069J59218
11207a63792J96458o81155P94659L24657K39313k69619o83115m50758L79752l73750
11197f87350J1145M14730K12405n7618k75964n59289P55946P34429J00802m81360
11187A67876j09900k9153L15000J05985J86750o8022j70741m52012P08162k62296
11177C91649M2311R5706r75444k75299k53331M95705J43784M25126N0371k38118
11167i7540m61952J700L08342J16357m02590j30501k03080k40359L57945K68146
11157d83532k18493O1239L89723M48145o60105K92474K35718n05337K93269l0644
$$ plain form
11227 432464 399011 -140362 -285234 199261 444432 -463175 -1097092 -973603 -761503 -618548
11217 -618548 -206101 -10987 -82885 -299228 -503424 -769404 -289731 -286941 -323010 -163792
11207 -163792 32666 -648489 146170 470827 710140 440521 -242594 -693352 -313600 -687350
11197 -687350 -676205 -261475 -49070 -106688 -382652 -941941 -185995 548434 649236 167876
11187 167876 57976 28823 343823 449808 636558 568536 397795 -54217 653945 391649
11177 391649 433960 529666 -445778 -721077 -974408 -478703 -334919 90207 140578 -97540
11167 -97540 -559492 -557792 -249450 -133093 -535683 -666184 -869264 -1109623 -751678 -483532
11157 -483532 -702025 -640786 -251063 197082 -463023 -170549 65169 -440168 -146899 -177543
11147a77543j89941m37400L20664K55136k91983M76349O85737J29437n00365L30584
11137F00675l5664Q0049m22225J71807n7140l90959j24259K64245m1538K91708
11127C36699J16257j194276j76459Q30852L25358m70953L54803L44835r4625l05788
11117F6703l93697j11852j65968L10888J77049l02565L99232O69508l79993j27407
11107A41898k77168P83217m87741q25508M12809N15873k95454j30300K83476k02906
11097h1804o92072J07447K98282L64253K40642j1738q7319Q8683R5150l60685
11087c9161K02967m3788m55923M94505m6136o28923N48556O24920q24575n80561
11077g48119M19663R9249J20642M91170m98329L36718j12210l63926Q8457m69716
$$ plain form
11147 -177543 -367484 -804884 -484220 -229084 -521067 -44718 641019 770456 270091 600675
11137 600675 565011 645060 222835 394642 337502 -53457 -177716 86529 44991 336699
11127 336699 452956 -741320 -917779 -86927 238431 -232522 122281 467116 372491 66703
11117 66703 -326994 -438846 -604814 -293926 -116877 -419442 -20210 649298 269305 141898
11107 141898 -135270 647947 160206 -665302 -252493 263380 -32074 -162374 121102 -81804
11097 -81804 -773876 -666429 -368147 -3894 236748 225010 137691 226374 321524 -39161
11087 -39161 163806 120018 -335905 158600 112464 -516459 32097 657017 -167558 -748119
11077 -748119 -328456 -229207 -108565 382605 -115724 220994 108784 -255142 -166685 -636401
11067f36401k62403L17973J35438j83012l48K21275O18469P8672L68680k01354
11057D56989Q6045j63205l3648k91583N13418o30926m94149K38991R84472N2792
11047G19196j34295J72821K99165J07311l61069m65949l86631L50283j49297n6808
11037I4727r0137J77531k40144j18411o58j81056M45275j2344k85030R9431j09242
11026b20058R0106k2860J40026J73047k65364l77789L67728J27567q0366Q23513
11016G55550l35578l3888n40938K11862K19682J66556j01859j088918N56046k36080
11006d27565J01808L71474L91473L63176l94212n49054j33581L69373j42653N8028
10996H267J34810L71259n40655j07060j69199J13633K31826K57159M4241k97618
$$ plain form
11067 -636401 -898804 -580831 -445393 -628405 -628753 -407478 210991 289663 658343 456989
11057 456989 543034 379829 346181 54598 568016 -62910 -557059 -318068 666404 719196
11047 719196 584901 757722 1056887 1164198 803129 337180 -49451 300832 151535 94727
11037 94727 4590 182121 -58023 -176434 -177092 -358148 87127 74783 -210247 -110816 -220058
11026 -220058 -129952 -152812 -12786 160261 -105103 -482892 -115164 12403 -67963 755550
11016 755550 419972 386084 -154854 57008 276690 443246 341387 -747531 -191485 -427565
11006 -427565 -325757 45717 437190 800366 406154 -142900 -276481 92892 -49761 8267
10996 8267 143077 514336 -26319 -133379 -302578 -188945 42881 300040 344281 46663
10986D6663m63391J8312P23296m99896K68637j79825J41911J58733k69480j15494
10976a70534J65217N03442l31643j63691j06010k48004Q80556K13160o65258m47913
10966c70678j08676M10403l15203O9206l26012N69967N54922k54011J21148n89041
10956b37975l91466J71362L35113O83108J78426J45323k44763k73823o2266o07584
10946c04545O23640o16908k3177Q84346j16328k59170o0785M7854l75838m29491
10936f30402K13836k17460M39946N7242J10046k13685j72790K42375L81446l62602
10926a52048m93590l63944J010098L57115l42735o38719n03566N17453M07440
10917b02496J214354n45633o51547j51126m482J25007q5945j06076k30048M17204
$$ plain form
10986 46663 -416728 -398416 324880 -175016 93621 -86204 55707 214440 -55040 -170534
10976 -170534 -5317 498125 166482 2791 -103219 -351223 529333 742493 77235 -370678
10966 -370678 -479354 -68951 -384154 -314948 -640960 -70993 483929 229918 351066 -237975
10956 -237975 -629441 -458079 -122966 560142 738568 883891 639128 365305 303039 -304545
10946 -304545 319095 -297813 -320990 563356 447028 187858 127073 174927 -200911 -630402
10936 -630402 -416566 -634026 -194080 -136838 -26792 -240477 -413267 -170892 210554 -152048
10926 -152048 -645638 -1009582 516 357631 14896 -623823 -1127389 -609936 -202496
10917 -202496 1011858 466225 -185322 -336448 -340930 -215923 -301868 -407944 -637992 -220788
10907b20788M23790K58751m21767J25237K61041j12547J37031k25359j16645k07012
10897i8268O6020j60477M80651J650l29007k49432k63167N45325K39474n77624
10887c44855k86379K19737Q62966m1609o2842k89169j76147J27740O10832k72948
10877C47326l19076l72580k19089M86348n33344P3261K01141k18173J70623K94917
10867h8646R906p4477O31819m15848k76221K67081K57431m78580p6525K30233
10857a3827L90147n94593l81083M37270j36200J58557k6243R8528m7550m03084
10847e18078k17910K66926r0773M4030R63714L28328k1632M62863o93198P3702
10837E97972r3471Q638q53070R7562L086j07946M10339L2115L06826n12344J1148
$$ plain form
10907 -220788 203002 461753 39986 165223 426264 313717 450748 225389 108744 -98268
10897 -98268 -32248 -192725 287926 289576 -39431 -288863 -552030 -6705 232769 -344855
10887 -344855 -631234 -411497 451469 409860 347018 57849 -118298 9442 620274 347326
10877 347326 28250 -344330 -563419 -77071 -610415 -537154 -336013 -554186 -383563 -88646
10867 -88646 -78740 -153217 478602 62754 -213467 53614 311045 -167535 -244060 -13827
10857 -13827 376320 -218273 -599356 -162086 -298286 -139729 -165972 -67444 -114994 -518078
10847 -518078 -735988 -469062 -559835 -515805 447909 776237 754605 1217468 524270 597972
10837 597972 504501 513139 -339931 -242369 -239283 -347229 63110 95225 402051 -110293 -99145
10826i9145M35238K77830J65560m87773m16006j99333K00529k63338N30140L64306
10816E08008j52272R6146J67190k61706j69955j45538l06576K00051L36406L39998
10806F11752j88803j78776m6123M42664K64034k39997p72491m89974M17238k37782
10796d18258l24816N1691M41420k057N17989p7184j89803M0491l09571k18458
10786d88556L07943L81575j70343L0537j63067p25645J07040L18054J10694K6844
10776b64924j8798K55061o2366j56132m88248J044904j25976j72832k67148q18911
10766a075370J13463K19878N10513O38726n84877k75790k79587q1154N42250O13542
10756C41594l69495k18617Q52730l35906m25210N01608N16837l76322j02205n45337
$$ plain form
10826 -99145 336093 613923 779483 291710 -124296 -323629 -123100 -386438 143702 508008
10816 508008 355736 451882 619072 357366 187411 41873 -264703 -64652 271754 611752
10806 611752 422949 244173 198050 640714 904748 664751 -107740 -597714 -180476 -418258
10796 -418258 -743074 -691383 -249963 -252020 265969 188785 -1018 39473 -270098 -488556
10786 -488556 -180613 200962 30619 61156 -101911 -827556 -720516 -402462 -291768 -264924
10776 -264924 -283722 -28661 -91027 -247159 -735407 309497 183521 10689 -256459 -1075370
10766 -1075370 -961907 -742029 -231516 407210 -177667 -453457 -733044 -814198 -271948 341594
10756 341594 -27901 -246518 606212 270306 -154904 346704 863541 487219 385014 -160323
10746a60323m52746m7690r807m464R97780J20548m09459J70364J25600M03380
10736G33183q99827L70414j16029L92882n912o60409l03655R36520M30784q67431
10726A0520K76919m68353j74187J37039K09797r7741L86036l62424r9510j34395
10716c16299M33027K97056P012K98746o53930L45801k72760l31693n01976K3792
10706f71224L14045J31975j47200k01406k57595O76528k02587K12003q7376J54457
10696g8380J56568K0161j93999k87880J66982K13713M74898k15645l46200J25691
10686C5909k23809j26987M13777j3749K02940o56437N98230q06797J26019J069687
10676F18783m04957N9072l47727l73183R45533Q5348j87231o07705k49630J01311
$$ plain form
10746 -160323 -613069 -660759 -670566 -675030 322750 443298 33839 204203 329803 733183
10736 733183 -166644 203770 87741 480623 474711 -185698 -489353 447167 877951 10520
10726 10520 287439 -180914 -355101 -218062 -8265 -106006 280030 -82394 -181904 -316299
10716 -316299 116728 413784 420796 719542 65612 411413 138653 -193040 -695016 -671224
10706 -671224 -357179 -225204 -372404 -573810 -831405 -154877 -357464 -145461 -232837 -78380
10696 -78380 78188 98349 -95650 -383530 -216548 -2835 472063 256418 -89782 35909
10686 35909 -187900 -314887 98890 85141 288081 -368356 229874 -576923 -450904 618783
10676 618783 213826 272898 -74829 -448012 497521 582869 395638 -212067 -461697 -360386
10666c60386o3359N04382l17547k94267L96251R06401n5549n0963j021927k11788
10656e68752j438L34571O36890o56998k15531j9728K72646J24588K0148Q1577
10646G973M16707m52098l91729O97610P17755o80619r764n09915K55095N4324
10636A05339l76900L15325L42405M02242j61955l78805j84006j70083n01025K4003
10626e83460O98923R5653r5524K33266k92150m97007M07295L16808r26693M20292
10616b22597N30294O2455p66643r4470O86437j6233M81502j50543m79959L7887
10606F8130L31772J54447j44999o63747P2557L47449M39208M3894K23238q19988
10596E1961o60621j54023O5748o3598M16579L87114J70126L28294k07575J17962
$$ plain form
10666 -360386 -423745 80637 -236910 -531177 -134926 771475 715926 664963 -356964 -568752
10656 -568752 -570190 -235619 401271 -255727 -471258 -490986 -218340 -93752 -73604 7973
10646 7973 424680 -27418 -419147 278463 996218 315599 305835 -204080 51015 105339
10636 105339 -271561 43764 386169 788411 626456 247651 63645 -106438 -607463 -583460
10626 -583460 115463 211116 115592 348858 56708 -440299 -33004 283804 -642889 -222597
10616 -222597 307697 370152 -396491 -490961 195476 179243 660745 510202 30243 68130
10606 68130 399902 554349 409350 -254397 -181840 165609 604817 648711 871949 51961
10596 51961 -608660 -762683 -696935 -760533 -343954 43160 213286 541580 334005 451967
10586D51967o33652k90842N22089P98772j51394o95190j96126L79798K93672l91265
10576H7829k74666N18504k62211k62067L89807L74034n73678p86182l1474K96210
10566e23894M75748P54924m40748k1837k06378r7748k0465K62283M6270o53336
10556d25181Q3183M43247J44048l19588q55817M24139O30903P0995J17628p90736
10546d77179k08002P48001N29334l16008l73542O5711M04862j17270o30532J20838
10536b53787Q4581k48598p7655M03474j7963o06164M60653K78421K20280m53815
10526b10573K34652R69694p33695j60759N3610n96579L14184L91152K91955j53309
10516D00332k03430j71979l91152J34390r874j23989M79252K59502r7720n4371
$$ plain form
10586 451967 -181685 -472527 49562 848334 696940 1750 -194376 185422 479094 87829
10576 87829 -186837 331667 69456 -192611 197196 571230 -2448 -788630 -820104 -523894
10566 -523894 -48146 706778 266030 244193 37815 -59933 -80398 181885 228155 -425181
10556 -425181 -341998 101249 245297 -74291 -930108 -505969 124934 195929 313557 -477179
10546 -477179 -685181 62820 592154 276146 -97396 -31685 373177 255907 -374625 -253787
10536 -253787 -169206 -417804 -495459 -91985 -109948 -716112 -255459 22962 243242 -210573
10526 -210573 24079 993773 260078 99319 152929 -443650 -129466 261686 553641 400332
10516 400332 196902 24923 -366229 -231839 -241713 -365702 113550 373052 275332 220961
10506B20961M61828n04875J992Q90459j65457l04209k42584K2506K58730j12433
10496E26918m25351J64498k84346M68206L96958j59517k53761n27608M6622k28161
10486b75542K16970K90169J83116l7455m68619L27072J88675l21304j8207K44967
10476C29842k99911M68473N2289m76182N4850J5232m83198J81400K20509J26522
10466A89826Q3949M35399k87627k60426k07410m86940R36291n6945l46528J75516
10456A75105J73650n99985K18981M3435K380k1536J04893m9315l08920m14258
10446f75570J45208M62336J93801M09845k41599j80440M56576M38118j071700
10437f3425K3701O56983K12284r80162l08573J45196K11469M30217o2748J57249
$$ plain form
10506 220961 682789 177914 179906 1070365 904908 600699 358115 380621 639351 526918
10496 526918 101567 266065 -18281 449925 846883 687366 433605 -94003 -47381 -275542
10486 -275542 -58572 231597 414713 377258 -91361 235711 424386 103082 84875 329842
10476 329842 29931 498404 550693 74511 129361 144593 -338605 -157205 63304 189826
10466 189826 273775 709174 421547 161121 -46289 -533229 403062 346117 -411 175105
10456 175105 348755 -251230 -32249 11186 13566 -7970 96923 47608 -261312 -675570
10446 -675570 -530362 -68026 125775 535620 294021 113581 570157 1008275 -63425
10437 -63425 -39724 617259 829543 -150619 -459192 -313996 -102527 327690 264942 422191
10427D22191K22901J53770K0203K57065p23987r1467N68087L03239k19251o01642
10417C11109m07725j38170L67701L57658K81965k57490n45940K32974O64100n43198
10407C22984l99714N59187L47678J76125j04411j175288m00040M22865L49588
10398I8974O48470m38147n72721L39032R0338K62311N71073K11339k14486n71279
10388D24904M17326J89799q2035n66086o43624k1307O57655J13913j08517j84522
10378A97506J9047p8733M02645q00816O4870M61410N21160J27406O52984o46704
10368I20775p36461j21407j9401N1291K94039l10613R9082M71831K62658j81926
10358G29868n33083L0741o10602o023J28105N70808L64714L07921k51532K0814
$$ plain form
10427 422191 645092 798862 819065 1076130 352143 260676 828763 1132002 912751 311109
10417 311109 -96616 -234786 132915 490573 772538 515048 -30892 202082 866182 322984
10407 322984 -76730 482457 830135 1006260 901849 -273439 -673479 -250614 98974
10398 98974 747444 309297 -263424 75608 165946 428257 999330 1210669 996183 424904
10388 424904 842230 1032029 949994 383908 -259716 -281023 376632 490545 382028 197506
10378 197506 216553 137820 540465 -260351 -195481 265929 787089 914495 1567479 920775
10368 920775 184314 62907 43506 94797 388836 78223 177305 649136 911794 729868
10358 729868 196785 227526 -383076 -389099 -260994 309814 674528 982449 730917 751731
10348G51731K6293j58906P09358n78550r06418Q49497l70073k68938M31214m89779
10338d571N4802K56926m21514M16790M90095k48840m73874M75582q31609J86346
10328i9867N60449K78058j6724m99967L61244J27909Q0339N8973r17078J80600
10318A13936K68379m5646j62872j10557M79690k14080j58473r38k46617J63185
10308H6007l19904P4693m13856J70209p7765N52718J67834q0678J67136k76919
10298D9475n02012J91591L22775L25476k81186K05397J13427j93023j20991m46664
10288c35735J004569M05821m66190k74281P63140k28410p92764l81J51625j42307
10278H5087q9712J02679k84709J60918R08169l48857j00725K6982K58409k85140
$$ plain form
10348 751731 778024 619118 1328476 749926 -156492 693005 322932 53994 485208 -4571
10338 -4571 50231 307157 -114357 302433 792528 543688 69814 545396 -286213 -99867
10328 -99867 460582 738640 721916 221949 583193 711102 791441 850414 -66664 113936
10318 113936 382315 336669 173797 63240 542930 328850 170377 169439 -77178 86007
10308 86007 -233897 -159204 -573060 -402851 -480616 72102 239936 159258 326394 49475
10298 49475 -452537 -260946 61829 387305 106119 311516 424943 231920 110929 -335735
10288 -335735 668834 1074655 608465 334184 1097324 868914 76150 75769 227394 85087
10278 85087 -4625 98054 -186655 -25737 882432 533575 432850 459832 718241 433101
10268D33101m91233K96016l4789K73623K60372o72525J73825j29629n46446O93491
10258B55806K27796j30813J32611l45077l17496J25975L66850O3144K21143R4058
10248F93997R2155l06247q4666L40156k7713j57419j91502O51853l4864l28099
10238F47651j7896M98774j42624j8239k74456l7859j6075l83706O06990K53758
10228A116318o3311k79745k11190J99617M85171j16883o91931j31951m04415L20622
10218B22302P81277l92672j18468K7336K5230n01951n0159J63607J63691l83174
10208f2981O71648P57833n6971n57349K0834L35274n19428k59666L91719M214
10198G25127K44764M96373l49590o05717k17918J68977K72984K16675o91071l60801
$$ plain form
10268 433101 -58132 237884 203095 476718 737090 64565 238390 108761 -437685 255806
10258 255806 483602 352789 485400 140323 -177173 -51198 315652 378796 599939 693997
10248 693997 786152 479905 395239 735395 707682 550263 358761 1010614 975750 647651
10238 647651 629755 1128529 985905 967666 693210 655351 639276 255570 862560 1116318
10228 1116318 1053007 773262 562072 761689 1246860 1129977 438046 306095 -98320 222302
10218 222302 1003579 610907 492439 519775 545005 43054 -7105 156502 320193 -62981
10208 -62981 608667 1366500 1309529 752180 773014 1108288 588860 329194 720913 725127
10198 725127 969891 1466264 1116674 510957 293039 462016 735000 951675 260604 -100197
10188a00197L01335J80351R4043m27120Q19828m60972q1568M07928L53172n32110
10178E54690M26775K0626o13096j49521N22669M08286k80775m3499k91010m82170
10168G2975N6614M03919Q3556P43276K71093m7409p08092m9148N12814j61458
10158A178140o41822k09506N1357k86011K59013P53958K35577j21059o56573m1462
10148E21612L4571O0637K83383J69214j82843M6456m47422j71177j62318j19508
10138C2605J61289R31892N48699p52758R750K08572m39712J025706j40875J67182
10128A752350M3184j030633O6713L50536m75820k25148M79354j24015J50403K74477
10118A261401n79263J35226J26399L4871J68507o99470m88175O04426N55299K02975
$$ plain form
10188 -100197 201138 381489 475532 48412 868240 407268 325700 733628 1086800 554690
10178 554690 981465 1002091 388995 239474 762143 1170429 889654 846155 555145 72975
10168 72975 129589 533508 617064 1360340 1631433 1584024 875932 826784 1339598 1178140
10158 1178140 536318 326812 378169 92158 351171 1105129 1340706 1219647 563074 521612
10148 521612 556183 616820 900203 1069417 886574 933030 485608 314431 152113 32605
10138 32605 193894 1125786 1674485 921727 931477 1140049 700337 1726043 1585168 1752350
10128 1752350 1795534 764901 831614 1182150 706330 481182 960536 836521 986924 1261401
10118 1261401 682138 817364 943763 978634 1147141 447671 -40504 563922 1119221 1322196
10108A322196n9311p18526k99907Q61056P43740k26364j67725k82976k1551m28133
10098G22499K13657j10182l03056M00158k19753j2285M60825N04012n30186k47806
10088H77883L59465r0706J51013r3154m13954L92772J55458n20404L32490K26594
10078A377457p1082L49405l49309K05466K03018K399K43624j5595r77590J07708
10068A075501M95742k72853Q64842r2445l20930M45362J16132l22165K36981k19686
10058B006481n33535P31282L81529O41586k54736J43299J19725n25272N61227
10049C271586O84827n72755j201749l68522j27105P19716L42718l88927K15478
10040B575267J29105K07295l11349o7603J36850K46751m38984j1691N53320L37537
$$ plain form
10108 1322196 1262885 544359 244452 1105508 1849248 1622884 1455159 1172183 1150632 722499
10098 722499 936156 825974 522918 923076 703323 691038 1151863 1655875 1125689 877883
10088 877883 1237348 1146642 1297655 1204501 790547 1183319 1338777 818373 1150863 1377457
10078 1377457 1306375 1655780 1306471 1511937 1714955 1717354 1960978 1945383 967793 1075501
10068 1075501 1571243 1298390 2163232 2070787 1749857 2195219 2311351 1989186 2226167 2006481
10058 2006481 1472946 2204228 2585757 3227343 2972607 3115906 3235631 2710359 3271586
10049 3271586 3956413 3383658 2181909 1813387 1686282 2405998 2748716 2359789 2575267
10040 2575267 2704372 2911667 2600318 2532715 2669565 2916316 2477332 2465641 3018961 3356498
10030C356498l3226j49952k1178K48386J40236l10549L07010k79122l21074k41967
10020B695062p4903K25833j79956j24347L24652p36342J50070O77907L50937m00278
10010B908635k70453n0487o7607k45237o91712k44768K06666J15620O00742r9601
10000B161798L2037Q75184J06243j136333L80342l91416l62104K00519O00127
9991B466397l45227l80666J99290M08538n91112n42699j35577N2727k50699M31218
9981A312190O51178p5045j70220J03756o58708p38314J121037L58628k34381n29457
9971A140664L05296j63218J59107o21958J03133K93290P202n3449L66334m08952
9961A127449j18776o3825N99685N85302j87355J51048n39335P61496k66169k1210
$$ plain form
10030 3356498 3323272 3173320 3152142 3400528 3540764 3230215 3537225 3258103 2937029 2695062
10020 2695062 2620159 2845992 2666036 2541689 2866341 2129999 2280069 2957976 3308913 2908635
10010 2908635 2638182 2587695 2520088 2274851 1583139 1338371 1545037 1660657 2261399 2161798
10000 2161798 2193835 3069019 3175262 2038929 2419271 2027855 1665751 1866270 2466397
9991 2466397 2121170 1740504 1939794 2348332 1757220 1214521 1078944 1131671 880972 1312190
9981 1312190 1963368 1888323 1718103 1821859 1163151 424837 1545874 1904502 1670121 1140664
9971 1140664 1445960 1282742 1441849 819891 923024 1216314 1223516 1170067 1536401 1127449
9961 1127449 1008673 944848 1544533 2129835 1942480 2093528 1554193 2315689 2049520 2028310
9951B028310K08791l7898K84400l26O1606k10714k96802k55746k55676M3408n5560
9940A513793R2047L93064j25570l12750L18078L59102N6934j08623n39359J58122
9930A804838M47012j14157K92655l96039N37668J76333l24608k06045l82446o957
9920A828254P99550M3544J0220R3073o91715j15209j40200J66953p7363J5440
9910A932547K91543J17436m72902M93853p8819j01646j04825M18511n090J54885
9900B645493l41877j04971J48107k95040n37890O75779J62605K74977q9519m36005
9890B101659k7403M78131j004445J8788M06469K99019L30538j68751k5902k91181
9880B116922j20984L22576l35090j12014J294936n55452q46717J26186J13853
$$ plain form
9951 2028310 2237101 2199203 2483603 2483277 2544883 2334169 2037367 1781621 1525945 1569353 1513793
9940 1513793 1605840 1998904 1873334 1560584 1878662 2237764 2294698 2186075 1646716 1804838
9930 1804838 2251850 2137693 2430348 2034309 2571977 2748310 2423702 2217657 1835211 1828254
9920 1828254 2627804 2671348 2681568 2774641 2082926 1967717 1827517 1994470 1917107 1932547
9910 1932547 2224090 2341526 1868624 2362477 2283658 2182012 2077187 2495698 2490608 2645493
9900 2645493 2303616 2198645 2346752 2051712 1513822 2189601 2352206 2627183 2537664 2101659
9890 2101659 2074256 2552387 1547942 1566730 1973199 2272218 2602756 2434005 2408103 2116922
9880 2116922 1995938 2318514 1983424 1871410 3166346 2610894 1764177 1890363 2004216
9871B004216J8772j9709k41475j5899N70498k36334j86225J329970K87403q05269
9861B705948J2075L8794P8709P42982k95829n22130l40450P78844N8441l81647
9851B875737N50m32474L64378N67199l35191p5233m13995L83193N13507o91958
9841B755713J02650P62191j58503l25356o9222k17439k51122K38087K58395N34833
9831C630227j64221l13410l85236K76777J14473N62520n24933L39178j30800q5868
9821C318707O93302j60636O437j43219N5812M70326j11003N9625R1202j78764
9811D101789o10385n7439P21449O20861p27978j44884J96977J48199K08757k17471
9801D239875K12689K37403L86810m3897l0630O5884K9009k76129m49434Q8867
$$ plain form
9871 2004216 2022988 2003279 1761804 1745905 2316403 2080069 1893844 3223814 3511217 2705948
9861 2705948 2718023 2756817 2835526 3578508 3282679 2760549 2420099 3198943 3257384 2875737
9851 2875737 2876287 2443813 2808191 3375390 3040199 2964966 2550971 2934164 3447671 2755713
9841 2755713 2858363 3620554 3462051 3136695 3067473 2850034 2598912 2836999 3095394 3630227
9831 3630227 3466006 3152596 2767360 3044137 3158610 3721130 3196197 3535375 3404575 3318707
9821 3318707 4012009 3851373 3857810 3714591 3770403 4240729 4129726 4189351 4280553 4101789
9811 4101789 3491404 3433965 4155414 4776275 4048297 3903413 4100390 4248589 4457346 4239875
9801 4239875 4452564 4689967 5076777 5032880 5002250 5068134 5097143 4821014 4371580 4460447
9791D460447O97542L66228M1840k44176J40667Q9755L50706R043m70315l53730
9781E088007O32382j58860l42352K37407N15101M8723l8826M40913M87935n98159
9771F312271K75074K39445K50666N01012O77851q4280l39302O57840N8965n11054
9761H038488J343200k93670L33542P31829k9170K71950L77534P74647j8366O16057
9751A2146041L87612p2204M76757O62958l16908L00266M95035R77120J33567J03115
9741A5293359O07420L88325M06935K41887P79769Q38079J81491O3351J050252
9732A9850868Q14823L50596J194310M51707J345232P29820O61469J078258J338397
9723B7815480J019190N84081J453580J596323J747884J268117K105158J697688
$$ plain form
9791 4460447 5157989 5524217 5566057 5321881 5462548 5552303 5903009 5912052 5441737 5088007
9781 5088007 5720389 5561529 5219177 5456584 5971685 6020408 5981582 6422495 6910430 6312271
9771 6312271 6587345 6826790 7077456 7578468 8256319 8172039 7832737 8490577 8549542 8038488
9761 8038488 9381688 9088018 9421560 10153389 10124219 10396169 10773703 11548350 11529984 12146041
9751 12146041 12533653 12461449 12938206 13601164 13284256 13584522 14079557 15056677 15190244 15293359
9741 15293359 15900779 16289104 16696039 16937926 17717695 18555774 18737265 18800616 19850868
9732 19850868 20665691 21016287 22210597 22662304 24007536 24737356 25398825 26477083 27815480
9723 27815480 28834670 29418751 30872331 32468654 34216538 35484655 37589813 39287501
9715C9287501K438309K479218K849377L732515L713766L415824M170448L642767
9707F5729725L783269M502566M161772M497275N080645M065551L211255L092060
9699I8124118K105164K804867K814256M425205N312596M798140N543579N472154
9691A31400079N304057P621777R815091J2753340J6128867J4149537J0558047
9684B07730795R236314M586766K778757K861689M379932O019545P466472M597819
9676B49658089L535480J582548l351253n523108n928595n790401o852544n839722
9668B21490494l337345j464482O03803L372645M544236N188065N719006P514865
9660B43631287Q475107J0414241J2527963J2968348J3359563J3014404Q965416
$$ plain form
9715 39287501 41725810 44205028 47054405 50786920 54500686 57916510 62086958 65729725
9707 65729725 69512994 74015560 78177332 82674607 87755252 91820803 95032058 98124118
9699 98124118 100229282 103034149 105848405 110273610 115586206 120384346 125927925 131400079
9691 131400079 136704136 144325913 154141004 166894344 183023211 197172748 207730795
9684 207730795 216967109 221553875 224332632 227194321 231574253 237593798 245060270 249658089
9676 249658089 253193569 254776117 251424864 245901756 239973161 234182760 227330216 221490494
9668 221490494 218153149 216688667 217292470 220665115 225209351 230397416 236116422 243631287
9660 243631287 252106394 262520635 275048598 288016946 301376509 314390913 323356329
9653C23356329M475950m11120l409238m010784l183319q81092N12494j211804
9645C15237416m972021j0535327j4732545j7840227j8591729j7231533j5217264
9638B16116770j3217542j2006385j1297410j0375506r876201q766799p345075
9631A43231852q463769o674370o661952o423965n949582o461818n189797n437589
9623I1969010m324238m658437l959478m193285m013106k831764l180599k859036
9615F1949067k294622k080889k515084j747932k483305k044519j566145j616465
9607D5600106j472712k333984j187456j513034j284599n48067j175887p92341
9599C5292026q52668n88318n24194p44337j99654k40953m89189m22151P4043k9142
$$ plain form
9653 323356329 327832279 327421159 324011921 320001137 316817818 315936726 316449220 315237416
9645 315237416 310265395 299730068 284997523 267157296 248565567 231334034 216116770
9638 216116770 202899228 190892843 179595433 169219927 159343726 150576927 143231852
9631 143231852 134768083 128093713 121431761 115007796 109058214 102596396 97406599 91969010
9623 91969010 87644772 82986335 79026857 74833572 70820466 67988702 64808103 61949067
9615 61949067 59654445 57573556 55058472 53310540 50827235 48782716 47216571 45600106
9607 45600106 44127394 41793410 40605954 39092920 37808321 37260254 36084367 35292026
9599 35292026 34439358 33851040 33326846 32582509 32382855 32141902 31652713 31230562 31304605 31275463
9589C1275463p68274M2951L85360q17943q10409j45271o21189K39552m58953r50028
9579B7371259L3249N5110j87151p08868o65761k56244l49195q25661o40423k46234
9569B3580081o16696o42550r04288l92949n37401j043472o07771o04586m17267
9560A7813101o99259k84267K43878r21714j313099J49079k10666l76324k7284
9551A4373445q25993o48953o25213p6486L85218l02213M58173r6873j065291j002183
9541A0573631k42422N97276N52444l03553n51130j78992j59725r9577j57730j26921
9531I903301n3388m00689J19614l70785O9342R1163J12507m06383q66914L36053
9521H533821L59319j113183m58115L44678j10614K35620j72129k47237m51251
$$ plain form
9589 31275463 30507189 30550140 30935500 30117557 29307148 29161877 28540688 28780240 28321287 27371259
9579 27371259 27404508 27459618 27272467 26563599 25897838 25641594 25292399 24466738 23826315 23580081
9569 23580081 22963385 22320835 21416547 21023598 20486197 19442725 18834954 18230368 17813101
9560 17813101 17113842 16829575 17073453 16151739 14838640 14987719 14777053 14400729 14373445
9551 14373445 13547452 12898499 12273286 12196800 12582018 12279805 12737978 12641105 11575814 10573631
9541 10573631 10331209 10928485 11480929 11177376 10626246 10447254 10287529 10187952 10030222 9903301
9531 9903301 9849913 9449224 9568838 9198053 9267395 9358558 9471065 9064682 8197768 8533821
9521 8533821 8893140 7779957 7321842 7666520 7555906 7791526 7619397 7372160 6920909
9512F920909J53036o02426L23392l22845n02091L91552J91549j69328J05695p5113
9502F414330J24288o22102j36454L75047k60074m1371p23714q08773K06307K96960
9492D824444P12318J25781m11091O42955J71402l59953q1750l1536j49789p99730
9482D643051r5735L22075j25334n82097J92824J22116K59687O390k74637N2533
9472D520873M84043o9667j035714N29956M81948j07830M23063j17095l57809j95783
9462D555985K99289j59886j58160k13030o30822P52414J0792Q4590M49619m7669
9452D943122j86195K15624L21367m44367n94882j94440P46461q7976m32689N13302
9442D799327l13994j6927N10835M07791o54553m71525l06864k55569j13553k53499
$$ plain form
9512 6920909 7073945 6471519 6794911 6472066 5969975 6361527 6553076 6383748 6489443 6414330
9502 6414330 6538618 5916516 5780062 6155109 5895035 5853664 5129950 4321177 4527484 4824444
9492 4824444 5536762 5662543 5251452 5894407 6065809 5705856 5624106 5592570 5442781 4643051
9482 4643051 4547316 4869391 4744057 4161960 4354784 4476900 4736587 4742977 4468340 4520873
9472 4520873 5004916 4935249 3899535 4429491 4911439 4803609 5226672 5109577 4751768 4555985
9462 4555985 4855274 4695388 4537228 4324198 3693376 4445790 4456582 4541172 4990791 4943122
9452 4943122 4756927 4972551 5293918 4849551 4254669 4060229 4806690 4718714 4286025 4799327
9442 4799327 4485333 4468406 4979241 5387032 4732479 4260954 3954090 3698521 3584968 3331469
9432C331469M17566O03647k87564j06631m36076N17612O37562k44980k2650K27804
9422D637759M67031N5690j55593o05960m74396O48005j36474n22416O6413M91618
9412D471677N91445n41657J82413k32431r47251M43661L46048J12556k46683n24918
9402C654860l28775J93812L15329N24242N31173k62399q78423O56797L91277O8620
9392D866513o59608L55342k3983K12498j61693P9679L19793o780o16321k85761
9382D079679M42916j0818l92782Q8733M00168k17972K76020J47374m57968K32288
9372D587638P84310n6234L16872k60638m0172L78238P01149o22808r89560J0166
9362D808961M38163R7421n16129J52108L07834L87022L96773k79284k27362N72937
$$ plain form
9432 3331469 3749035 4352682 4065118 3958487 3522411 4040023 4677585 4432605 4409955 4637759
9422 4637759 5104790 5160480 5004887 4398927 3924531 4572536 4436062 3913646 3980059 4471677
9412 4471677 5063122 4521465 4703878 4471447 3524196 3967857 4313905 4426461 4179778 3654860
9402 3654860 3326085 3519897 3835226 4359468 4890641 4628242 3749819 4406616 4797893 4866513
9392 4866513 4206905 4562247 4538264 4750762 4589069 4668748 4988541 4981761 4365440 4079679
9382 4079679 4522595 4511777 4118995 4207728 4607896 4389924 4665944 4813318 4355350 4587638
9372 4587638 5371948 5315714 5632586 5371948 5331776 5710014 6411163 5788355 4798795 4808961
9362 4808961 5247124 5344545 4828416 4980524 5288358 5675380 6072153 5792869 5565507 6138444
9352F138444L3752n49429j38472L97190K55084j79855N41742k16357p0588m71428
9342E740083K91469Q0398p64349J55865N23406L83310O11314J49930L80291k41363
9332G310354M49589m1641Q8800q07212K88147M63191L17862j43034o38178O00448
9322G888326l20276l29163P6340R6947R4463N51331L71496j61207K37530J58379
9312H664166l06526k29281m8153j49972k833j71788j14194K44594M77570k18834
9302H144749k31221j04955O4629L18099N84565J73317j65658l02648l7391K01897
9292H645383N52697j14603m25811L4991M38295m56533K1762M31141M52736r4955
9282I485103k19410K47738K51752j28822p722J096906J98414n2048m53315P5427
$$ plain form
9352 6138444 6172196 5622767 5484295 5881485 6136569 5956714 6498456 6282099 6211511 5740083
9342 5740083 6031552 6111950 5347601 5503466 6026872 6410182 7021496 7171426 7551717 7310354
9332 7310354 7759943 7718302 7807102 6999890 7288037 7751228 8069090 7926056 7287878 7888326
9322 7888326 7568050 7238887 7315227 7412174 7506637 8057968 8429464 8268257 8505787 8664166
9312 8664166 8357640 8128359 8080206 7930234 7927401 7755613 7641419 7886013 8363583 8144749
9302 8144749 7913528 7808573 7873202 8191301 8775866 8949183 8783525 8480877 8443486 8645383
9292 8645383 9198080 9083477 8657666 8692657 9130952 8674419 8696181 9127322 9580058 9485103
9282 9485103 9265693 9513431 9765183 9636361 9628639 10725545 10923959 10871911 10418596 10494023
9272A0494023P08126j2163K51982L48503l11517o75084j6536Q77197K94538L2963
9262A1992032j7841J00636l33985j76517j01696R91777N12480O09003R813o29861
9252A2955841J100668P66846K78854M92837J42548M96443J42679N73957P23864
9243A7674537J164135j53184J046829Q54913R17942Q31483Q49475N73567J900128
9234B5659825J475058J479584K098627J014758J214404K045856J619852K940421
9226C9548385K643332L392531L572070L889113L637280L560288M659350M293731
9218F9196080M530495M767231N124339O005340Q078546J0475296J1560648J5101038
9210A34839013J5941143N924998j771708l080666K11549K847744O308073R251414
$$ plain form
9272 10494023 11202149 11189986 11441968 11790471 11478954 10803870 10787334 11664531 11959069 11992032
9262 11992032 11974191 12074827 11740842 11564325 11462629 12454406 12966886 13575889 13585702 12955841
9252 12955841 14056509 14823355 15102209 15595046 15737594 16234037 16376716 16950673 17674537
9243 17674537 18838672 18685488 19732317 20587230 21505172 22336655 23186130 23759697 25659825
9234 25659825 27134883 28614467 30713094 31727852 32942256 34988112 36607964 39548385
9226 39548385 42191717 45584248 49156318 53045431 56682711 60242999 64902349 69196080
9218 69196080 73726575 78493806 83618145 89623485 97702031 108177327 119737975 134839013
9210 134839013 150780156 156705154 154933446 151852780 152064329 154912073 161220146 170471560
9202A70471560J3707574J2119358K408876k244456J80104L320357N459976N567017
9194B10990366J502377m212350o363566n934932k418582J262710L542970M588021
9186B02957014N124056M92524o917093q399294n344759l586028k266875j741653
9178A80317892j40694J654977J671787M429120Q454460J2093976J5017964J8677233
9170B42176715J1514168k628432p528526n000882j74456M232030Q867867J3516734
9162B64975218J5821136Q217170m312170n361293r54952K880600M483583K744703
9154B88493995n699178j3475514j3007554r140828m870948r57571J285842J646482
9146B44274726j768506j1234048j8608507j8803485j5361437j2388554j0855315
$$ plain form
9202 170471560 184179134 196298492 198707368 196462912 196643016 199963373 205423349 210990366
9194 210990366 212492743 208280393 201916827 195981895 193563313 194826023 198368993 202957014
9186 202957014 208081070 208573594 201656501 193257207 187912448 184326420 182059545 180317892
9178 180317892 180177198 181832175 183503962 187933082 196387542 208481518 223499482 242176715
9170 242176715 253690883 251062451 243533925 238533043 238358587 242590617 251458484 264975218
9162 264975218 280796354 289013524 284701354 279340061 278385109 281265709 285749292 288493995
9154 288493995 282794817 269319303 256311749 247170921 242299973 241342402 242628244 244274726
9146 244274726 242506220 231272172 212663665 193860180 178498743 166110189 155254874
9139A55254874j0436804q666961p236089p183121o506305o596363o728219m824596
9131I7076416m156007m527699m280949m436965l962644l141111l441454j698086
9123F7431501k574432k501554k041113k086079k700698j937594j361883j566382
9115E0661766j762729j013352o70518r18836m18358j260141j119066r87215p23261
9106D1788290o01933l95116o78384j420930l48422r57088o64792j233600j72334
9097C5315691j044097q10840o58959k82609j063973j488112j39112j065396j191503
9088B7571090r17277l73568q99518p35357n63643l11150j266284j4131o11182
9079B1878980r01180n02052l28582m85550k81958r2523l64336M8920o70674q51872
$$ plain form
9139 155254874 144818070 136151109 128915020 121731899 115225594 108629231 101901012 97076416
9131 97076416 92920409 88392710 84111761 79674796 75712152 72571041 69129587 67431501
9123 67431501 64857069 62355515 60314402 58228323 55527625 53590031 52228148 50661766
9115 50661766 48899037 47885685 47215167 46296331 45877973 44617832 43498766 42511551 41788290
9106 41788290 41186357 40791241 40112857 38691927 38343505 37386417 36721625 35488025 35315691
9097 35315691 34271594 33460754 32801795 32519186 31455213 29967101 29827989 28762593 27571090
9088 27571090 26653813 26280245 25380727 24645370 24081727 23770577 22504293 22490162 21878980
9079 21878980 20977800 20475748 20147166 19661616 19379658 19287135 18922799 18971719 18301045 17449173
9069A7449173m4563j74214k96481K45316p9424M0489k08472O1872r8709k03375
9059A6691612J10353k62031P18183r53812q605p35188M4106Q48555M9613M02341
9049A6905127k18511n71753j44823l82804J13362P77503k97637j98607O64541
9040A6646398j51720o55914Q17718P78587j30042j00655j40067K70118J79581
9031A7514004O28883N19257R22883J85082M53121O12580O41215J075866O82476
9022B3235367J099389J227331J109289J451438R12272J070803J698913J627327
9014C3432129J729573J948014K215494K040921K263719K678321K580005L673291
9006E2561467M131964M523451L562930M051972M843549M000550L785102L903774
$$ plain form
9069 17449173 17404610 17230396 16933915 17179231 17099807 17140296 16931824 16993696 16894987 16691612
9059 16691612 16801965 16539934 17258117 16304305 16295700 15560512 15604618 16453173 16502786 16905127
9049 16905127 16686616 16114863 15970040 15587236 15700598 16478101 16180464 15981857 16646398
9040 16646398 16494678 15838764 16656482 17435069 17305027 17204372 17064305 17334423 17514004
9031 17514004 18142887 18662144 19585027 19770109 20223230 20835810 21477025 22552891 23235367
9022 23235367 24334756 25562087 26671376 28122814 29035086 30105889 31804802 33432129
9014 33432129 35161702 37109716 39325210 41366131 43629850 46308171 48888176 52561467
9006 52561467 56693431 61216882 64779812 68831784 73675333 77675883 81460985 85364759
8998H5364759L985845K369388J147558K702454K720360L715398O234311P545704
8990A15785777R699116J2434678J5309734J9161067K0310666J5970245J1252954
8983B19924237L348109n612662r701718j1022653j0452620p218188m555835j629380
8975A73079290o02382J186681J635133L108484M821942M984495P457561Q549280
8967B04220484J0567674J2989283J4162591J5967261J6891239J6552071J2734339
8960C04084942N217874m045182j0991092j6865416j8260113j5336026j1065884
8953B32739103p807337o406193l604071O6947L351654N772500P756476Q570558
8945B40439637M573975J285549n265460j0355110j1581976j1527230r797567p983896
$$ plain form
8998 85364759 89350604 91719992 92867550 95570004 98290364 102005762 108240073 115785777
8990 115785777 125484893 137919571 153229305 172390372 192701038 208671283 219924237
8983 219924237 223272346 217659684 207957966 196935313 186482693 179264505 174708670 173079290
8975 173079290 172476908 173663589 175298722 178407206 183229148 188213643 195671204 204220484
8967 204220484 214788158 227777441 241940032 257907293 274798532 291350603 304084942
8960 304084942 309302816 305257634 294266542 277401126 259141013 243804987 232739103
8953 232739103 224931766 218525573 214921502 214988449 218340103 224112603 231869079 240439637
8945 240439637 245013612 246299161 241033701 230678591 219096615 207569385 197771818 189787922
8937A89787922n476803k430808k245931j113563N03492K260123M201582O172925
8929A91658939Q135974J0364545J2201158J3094681J2498865P585073N714026
8922B61253261N166983J224377p073353j4051568j8734704k0473434j8209207
8915A89102355j5226941j3466245j1743399r073898q146086p653196o540871o149336
8907A11102383n353043n325447n005406n183323n416942m449499l549084l919841
8899G2899798m387032l713208l136639l109016k835509k720023k396416k386945
8891D8215010k671532j604467q43106j569780k350907j440163j279558j170055
8883C5285442q18783o68224j863519k505000p23034m4743n62598r96514j180250
$$ plain form
8937 189787922 184311119 181880311 179634380 178520817 179024309 181284432 185486014 191658939
8929 191658939 199794913 210159458 222360616 235455297 247954162 255539235 261253261
8922 261253261 266420244 267644621 260571268 246519700 227784996 207311562 189102355
8915 189102355 173875414 160409169 148665770 139591872 131445786 123792590 117251719 111102383
8907 111102383 105749340 100423893 95418487 90235164 84818222 80368723 76819639 72899798
8899 72899798 68512766 64799558 61662919 58553903 55718394 52998371 50601955 48215010
8891 48215010 45543478 43939011 43095905 41526125 39175218 37735055 36455497 35285442
8883 35285442 34466659 33798435 31934916 29429916 28706882 28662139 28099541 27103027 25922777
8874B5922777q32501n50110n89216m10303p75989l34902l80028l6093j136740
8865B0876895o06699l53155k53488j94234o58800L33355j225927n43574l07199
8856A7067174r39407l84527K72900r1344j189583J54975m82255n17053n41600
8847A3349280O8770m07531j79934j67849n59208k80216j54293J77982K34368m88182
8837A1593187L05407o20702n86325K70343K84094q82682m79299M22868j8191K54473
8827A0543173O20320O2114L98138N68674r19486j76017L82123n0284M57356J128038
8817A3014149n80147J13222L8954j48664K86690l01147j4709j72397q50016q2566
8807A1303369j25595m76629L77117o28508m55772L66660k9765M55806N32530l55491
$$ plain form
8874 25922777 25090276 24540166 23950950 23540647 22764658 22429756 22049728 22013635 20876895
8865 20876895 20270196 19917041 19663553 19469319 18810519 19143874 17917947 17374373 17067174
8856 17067174 16127767 15743240 16016140 15924796 14735213 14890188 14407933 13890880 13349280
8847 13349280 13418050 13010519 12830585 12662736 12103528 11823312 11669019 11847001 12081369 11593187
8837 11593187 11898594 11277892 10691567 10961910 11246004 10363322 9884023 10306891 10288700 10543173
8827 10543173 11163493 11225607 11623745 12192419 11272933 11096916 11479039 11428755 11886111 13014149
8817 13014149 12434002 12547224 12586178 12437514 12724204 12423057 12408348 12235951 11385935 11303369
8807 11303369 11177774 10701145 11078262 10449754 9993982 10360642 10330877 10786683 11319213 10963722
8797A0963722l31124O31267M49743M40001l75995O6750R3392O3682K15606N27516
8787A2744560O69540M83625R44934P8099q12079m78513Q1432M54741p70876m67901
8777A2927562r0239l82302l37470j77162p04304K34514j300629n03202K43793
8768I910561r2565K36313m31217k42147r13587p159o74620N5855K67332N97877
8758H706643k95687o27714k59494M05090K69635n50236L55228P04669J45220r9346
8748H754008J9689j21622L97601R4970J68414o51863p37435k37809m01032j34187
8738G150734J80458l74494k96381L7885m86633m4420m21202p45781L59721m84516
8728D875371j16653k28193m98701j09486j46412O55215j34452n67543k40611J03909
$$ plain form
8797 10963722 10632598 11263865 11713608 12153609 11777614 11844364 11937756 12001438 12217044 12744560
8787 12744560 13414100 13897725 14842659 14920758 14108679 13630166 13711598 14166339 13395463 12927562
8777 12927562 12837323 12455021 12117551 11940389 11236085 11470599 10169970 9666768 9910561
8768 9910561 9817996 10054309 9623092 9380945 8467358 8460199 7785579 7841434 8108766 8706643
8758 8706643 8410956 7783242 7523748 7928838 8198473 7648237 8003465 8708134 8853354 8754008
8748 8754008 8773697 8652075 9049676 9144646 9313060 8661197 7923762 7685953 7284921 7150734
8738 7150734 7331192 6956698 6660317 6698202 6211569 6167149 5745947 5000166 5359887 4875371
8728 4875371 4758718 4530525 4031824 3922338 3775926 4431141 4296689 3729146 3488535 3592444
8718C592444K2481n7165j25626K05896j1290J88542l28584m31073L48954k43214
8708C161365q1697j56006J2691j94789p79599l92989M17826K17521O2564J20566
8698B387453l68930j13353N13250p6333J11736P4974p10113k92582q4580M85351
8688A926873K67489L4131K20862n79410L54318j37830l50403l59365j2877J99426
8678A563214l08414J34310k02867M65605l78450l51264Q45106K79189o061l22848
8668A717520r7189M42603m7213j62888k55949k03526j98127J93039K0416M28714
8658A837400N1588o86791N81080k71567j17011O06499n55535l31947j72465L18940
8648A260191k7107m05537K33694K72398K75929r2235l77258L96898M1007j7756
$$ plain form
8718 3592444 3614925 3557760 3432134 3638030 3626740 3815282 3486698 3055625 3404579 3161365
8708 3161365 3079668 2923662 2936353 2741564 1961965 1568976 1986802 2204323 2266887 2387453
8698 2387453 2018523 1905170 2418420 2342087 2453823 2528797 1818684 1526102 1441522 1926873
8688 1926873 2194362 2228493 2449355 1869945 2224263 2086433 1736030 1376665 1363788 1563214
8678 1563214 1254800 1389110 1186243 1651848 1273398 922134 1767240 2046429 2040368 1717520
8668 1717520 1620331 2062934 2015721 1852833 1596884 1393358 1195231 1388270 1408686 1837400
8658 1837400 1888988 1202197 1783277 1511710 1394699 2001198 1445663 1113716 941251 1260191
8648 1260191 1233084 827547 1061241 1333639 1609568 1517333 1140075 1536973 1577980 1560224
8638A560224m14524R85877m04608K9335J50138q34682N38356J81768m37884L80152
8628A734152l17355m7593N81432n90332l56553N19758j42281j88672M78354J07555
8618A778465k86359M06181K49397m31708M29362K76470l99972n12099J99019m26878
8608A281878L31821K32750l57175J84070J72860l90152K00321j94219M62846M18152
8598B343152o41725k27457M30053K38292p8905k6201m1474k8351j17245M48272
8588B298411J28140q3822n30093K17421n07936p68202N94716M48698L06150k16558
8578A886925m28884M33093m6744m2784l12630m11642r8450l53500N35105L15278
8568A475767j6338J373o168j9959P8447N9109j07095k32535K44901J8128o96991
$$ plain form
8638 1560224 1145700 2131577 1726969 1756304 1906442 1071760 1610116 1791884 1354000 1734152
8628 1734152 1416797 1369204 1950636 1360304 1003751 1523509 1381228 1192556 1670910 1778465
8618 1778465 1492106 1898287 2147684 1715976 2145338 2421808 2021836 1509737 1708756 1281878
8608 1281878 1613699 1846449 1489274 1673344 1846204 1456052 1656373 1462154 1925000 2343152
8598 2343152 1701427 1473970 1904023 2142315 2063410 2037209 1995735 1967384 1850139 2298411
8588 2298411 2426551 2342729 1812636 2030057 1522121 753919 1348635 1797333 2103483 1886925
8578 1886925 1458041 1891134 1844390 1801606 1488976 1077334 978884 625384 1160489 1475767
8568 1475767 1459429 1460802 1454634 1434675 1513122 1572231 1465136 1232601 1477502 1495630 798639
8557G98639N03559P40513j27246l59808j75408O77636r9961L47546j78451m02091
8547A724928l50350k58087l52155L67978k65939O112o22885J30866l00951N40368
8537F19885K20241r41022L46603N72246L32256p7758q3582o13154k35734p3477
8527F6504j65202L82637L37526q87654L53478M61193k18732J89942l54378k25136
8517e9822K449L66613j2991m4311L74318k79334J21821k03129Q9397M50303p7120
8506G28194p42733l27154Q74187K01008n91595K31004J86621m80412l1485J43860
8496A91495j81290K99443j7188j59727p75544j44462J77793L70540m9191L5544
8486b52587L33455K2855L97630m86289J49202k93142o86062K14496R1420Q96973
$$ plain form
8557 798639 1302198 2042711 1915465 1555657 1380249 2057885 1957924 2305470 2127019 1724928
8547 1724928 1374578 1116491 764336 1132314 866375 872487 249602 380468 79517 619885
8537 619885 840126 -100896 245707 817953 1150209 1072451 988869 375715 139981 66504
8527 66504 -98698 283939 621465 -266189 87289 548482 329750 519692 165314 -59822
8517 -59822 -57373 309240 296249 251938 626256 346922 468743 265614 355011 805314 728194
8506 728194 -14539 -341693 532494 733502 141907 372911 559532 79120 47635 191495
8496 191495 10205 309648 292460 132733 -642811 -787273 -609480 -238940 -288131 -252587
8486 -252587 80868 103723 501353 15064 164266 -128876 -814938 -600442 -509022 387951
8476C87951m59007L05288N79058k28886l11452j49346m74579P63907J40315J5993
8466E69242r2726K57771q12393N9901L69405k94617M84489K19063o11368J30374
8456B79141O87825n00307O38797n12362Q6290o12364n9950J37000L20596Q22070
8446A286736l25880o9270k52988l33290L94910L6020M6882J55594n49904r3568
8436B95242m5514m68777J42634k22393J89474j66849K63018J09281o9435K62400
8426B89081m14394K50372p39671l67458M27619N60839n67139J28360M19398K47010
8416B34017K55424l11625k86245J96958M46421k22937r26666n5189K95839M93801
8406A19798q4040L74279k07281q07083L93379K20868j4617J76155O09070n18238
$$ plain form
8476 387951 -71056 234232 813290 584404 272952 123606 -350973 412934 553249 569242
8466 569242 476516 734287 -78106 -18205 351200 56583 541072 760135 148767 279141
8456 279141 966966 466659 1105456 593094 679384 67020 7070 144070 464666 1286736
8446 1286736 960856 891586 638598 305308 700218 736238 783120 938714 388810 295242
8436 295242 249728 -219049 -76415 -298808 -109334 -276183 -13165 96116 26681 289081
8426 289081 -125313 125059 -614612 -982070 -554451 6388 -560751 -432391 -12993 234017
8416 234017 489441 177816 -108429 88529 534950 312013 -614653 -669842 -374003 119798
8406 119798 35758 410037 202756 -604327 -210948 9920 -4697 171458 780528 262290
8396B62290J29464M1012k4754l96394n67073K30320K81308k19041J02828l0058
8386a90098K89793k15792j28085M3176l16732J38442M75107n12116J44224M27063
8376A54982o35531L16785N50752O28056J36253r68773j22938N18961J47731q84813
8366a58535j96766k03091L23251O1523K30016J25303L18863k01077j50932k414
8356A46141K34660m61396k494l10045O50723j59231o85023L31607M11260m01632
8346b45430n33568M12963k67817K5975L69211M22183l76841j49280J33307J42082
8336f7215o1193Q7527l61563M42257K54334J1841k41708J87080p25056M01900
8326g1796r2930r2939L853K64936k08855j29084J86802L13234J67010J95963q806
$$ plain form
8396 262290 391754 432766 408012 11618 -555455 -325135 -43827 -262868 -160040 -190098
8386 -190098 99695 -116097 -244182 -201006 -517738 -379296 95811 -416305 -272081 154982
8376 154982 -480549 -163764 386988 1015044 1151297 182524 59586 578547 726278 -158535
8366 -158535 -355301 -558392 -235141 -173618 56398 181701 500564 299487 148555 146141
8356 146141 380801 -80595 -83089 -393134 257589 98358 -586665 -255058 156202 -245430
8346 -245430 -778998 -366035 -633852 -607877 -238666 183517 -193324 -342604 -209297 -67215
8336 -67215 -128408 -40881 -402444 39813 294147 305988 64280 251360 -473696 -71796
8326 -71796 -164726 -257665 -253812 11124 -197731 -326815 -140013 173221 340231 536194 527388
8315E27388m87161k98040L80297k83660O9019M81264J4754Q08774r03254o58596
8305c49215j27025J15181N53326l44572k71918l58202J88322J170502l04865k78759
8295g225J77066l76762K31453K45757m50039n1947M12465m94084n08386L78899
8285d42803M03229k30229l60885j04757P18611J15980K07866K25129l31797Q36416
8275A036760q43103j50827N1887l01190K53938k37272L03097l85203l35321K08790
8265c98444N24703K99061J00518r18462k07229O80163q7227M08919o1084n78556
8255b37638N90030l36323j85812M66206M72631p6168m68350l5296j28067K57224
8245C18437n50451J57286q1827l56511o8505R9945L55100j10622m16601N72439
$$ plain form
8315 527388 40227 -257813 122484 -161176 -92157 389107 403861 1212635 309381 -349215
8305 -349215 -476240 -361059 192267 -152305 -424223 -782425 -594103 576399 271534 -7225
8295 -7225 169841 -206921 24532 270289 -179750 -231697 180768 -313316 -821702 -442803
8285 -442803 -39574 -269803 -630688 -735445 -16834 99146 307012 532141 200344 1036760
8275 1036760 193657 42830 94717 -206473 47465 -189807 113290 -271913 -607234 -398444
8265 -398444 126259 425320 525838 -392624 -599853 80310 -6917 402002 340918 -237638
8255 -237638 352392 16069 -169743 296463 769094 692926 224576 189280 61213 318437
8245 318437 -232014 -74728 -156555 -513066 -581571 -481626 -126526 -237148 -653749 -81310
8235h1310J2822n91036M02594K65279m92766L26829M10358j63216j08948L14165
8225B94771q5734k20811j76064N7167L44703M0734l9089m66434J22186j56388
8215b84959J90555l57823j07484N20941O71222L5987m89904J07733o16167l03316
8205f33215K18447J53050P7330j40066M86857n93402p2695J82799M31629M1016
8195A51750P20928O1008J423990l63773l279000l22145L59918M84401k78775k60478
8185a302176l25968N63029j04552M2430K03557M55712j8140m82663k21848P28476
8175d62143M91441K47660j84411J65254m35710k74118Q0303j62583n9121N38751
8165e4677N4663m9650n3809n2044j77727P8142N42331r03038l84517O9167M19290
$$ plain form
8235 -81310 -68488 -659524 -256930 8349 -484417 -157588 252770 89554 -19394 294771
8225 294771 209037 -11774 -187838 -130671 214032 254766 215677 -250757 -128571 -284959
8215 -284959 -94404 -452227 -559711 -38770 632452 668439 178535 286268 -329899 -633215
8205 -633215 -414768 -261718 -184388 -324454 162403 -430999 -503694 -320895 110734 151750
8195 151750 872678 933686 2357676 1993903 -1285097 -1607242 -1247324 -762923 -1041698 -1302176
8185 -1302176 -1628144 -1065115 -1169667 -1127237 -923680 -467968 -486108 -968771 -1190619 -462143
8175 -462143 29298 276958 92547 257801 -177909 -452027 -371724 -534307 -593428 -54677
8165 -54677 -14 -49664 -103473 -155517 -333244 -255102 287229 -615809 -1000326 -931159 -511869
8154e11869R4620M1029m19975j4044j77973M05484K97314K37778k1106K13996
8144A45254j16131L5855J55279l64036n27224l64402J06524j10786J32293j06046
8134a013420J71876M33478K54183M2597R5661N16581n0488R9147n10896p78770
8124g40051j78197j4804L69046k39093N903Q1052K82677m05260P7419K39216J05543
8113d16549L12186L89237l16813j69463L03911m6374n32077L3001k76879k0348
8103g40168J33785P50155Q8988q0614L94796p97313k80652j92855J74331K81752
8093b67795P2379J52665N46695r29187r17001Q04907l7440l75258j94398O99013
8083d45420M87540L6970K75078l23755l42163q6689k56249J75344K62817M20022
$$ plain form
8154 -511869 -417249 -376220 -796195 -810239 -988212 -582728 -285414 -47636 -68742 145254
8144 145254 29123 64978 220257 -143779 -671003 -1035405 -928881 -1039667 -907374 -1013420
8134 -1013420 -841544 -408066 -153883 -111286 -15625 500956 450468 549615 38719 -740051
8124 -740051 -918248 -933052 -564006 -803099 -797196 -716144 -433467 -838727 -761308 -522092 -416549
8113 -416549 -104363 284874 -31939 -201402 102509 56135 -475942 -442941 -719820 -740168
8103 -740168 -606383 143772 232760 152146 546942 -250371 -531023 -723878 -549547 -267795
8093 -267795 -195416 -42751 503944 -425243 -1342244 -537337 -574777 -950035 -1144433 -445420
8083 -445420 42120 79090 354168 30413 -311750 -398439 -654688 -479344 -216527 203495
8073B03495J23076k29530O72719J4351L0662n44489j98693j55123p86127n9395
8063i29054J12408N8983N39742L9712o2112j54145K35476j62532P79941L06624
8053G65043n26211j12788j10595l60267k035r8234l81033M10563N53243L57980
8043D95666m72343l82260N28343L58046o49636K15763M47443p20265L50421m49131
8033b77953r97143q1158M77395N15113J87440o478r0800R539K13635m25123j84043
8022f59576l900K51134k29072r2684L41240n39321M43514L4442j3947Q18977j68485
8011A82322m39448j42499l56515N09437L43596l83089L42391k15283n1359J72274
8001c8173k85960M19588L00481J67977j38211o33102k31003L09040J54116l7826
$$ plain form
8073 203495 326571 97041 769760 784111 814773 270284 71591 -83532 -869659 -929054
8063 -929054 -816646 -757663 -217921 -178209 -240321 -394466 -158990 -321522 458419 765043
8053 765043 238832 126044 15449 -344818 -346853 -445087 -826120 -415557 137686 495666
8043 495666 23323 -358937 169406 527452 -122184 93579 541022 -179243 171178 -277953
8033 -277953 -1275096 -1356254 -878859 -363746 -176306 -182784 -273584 -264045 -50410 -475533 -659576
8022 -659576 -663476 -412342 -641414 -734098 -392858 -932179 -488665 -454223 -468170 350807 182322
8011 182322 -257126 -399625 -756140 -246703 96893 -286196 56195 -159088 -210447 -38173
8001 -38173 -324133 95455 395936 563913 425702 -207400 -438403 -129363 24753 -13073
7991a3073l09535q3117K04547m32206L11788L31371o27223n8808j26245O81326
7981a21175m1392K09030j53638J43812r3423l42977j565L92898M15677q78347
7971d71100m30186L76198J94986l91007P91682p6120K94864j10159o04600n39549
7961i64991J21763P88292n11954J26180o994n4433K91244j26242l01819K48992
7951c89962J11176n90804J17723M23481M15284K76600p44002q6609m11667k29514
7941a108294P31191j44292k86186L68112M29372m37567o84506J12704J71507j15661
7931i63620q489N91803J05687m63172N24054L65410o28218k18398J50026L84993
7921a59924j33372O0815m68827J60112R10150P9213j10152m48385j95886N40095
$$ plain form
7991 -13073 -322608 -405725 -201178 -633384 -321596 9775 -617448 -676256 -802501 -121175
7981 -121175 -162567 46463 -107175 36637 -56786 -399763 -401328 -8430 407247 -471100
7971 -471100 -901286 -525088 -330102 -721109 70573 -5547 289317 179158 -425442 -964991
7961 -964991 -843228 -54936 -566890 -440710 -447704 -502137 -210893 -337135 -638954 -389962
7951 -389962 -278786 -869590 -751867 -328386 86898 363498 -380504 -467113 -878780 -1108294
7941 -1108294 -377103 -521395 -807581 -439469 -10097 -447664 -1132170 -1019466 -847959 -963620
7931 -963620 -972109 -380306 -274619 -737791 -213737 151673 -476545 -694943 -544917 -159924
7921 -159924 -293296 -232481 -701308 -541196 368954 448167 338015 -110370 -306256 233839
7911B33839p41366O85850r43436o20894j4635M950P14162M8912l1175j69604n79505
7900a412902K46834M60520n1251O40661N46373m3697r92123k56979O0361L13015
7890d89188n39084M12800M50696m46933M39043q4115j38818K24986n7058l53600
7880e81271j71535K38191l83036J16764L25687k29057J63482N06831l56305L52306
7870a7943K1831k57354l24813j26730J62446n7175r482L42394k17965J72241P1793
7859b40757J03465j95763O92684o44906l47129L67551M80453k95499k04968K91375
7849F506M87334m82656p92350O27377J8711j78161j53623R5042q4272K65878J58930
7838c1284k6827L60508m71840l76214J46393K29906P3473o93948m49378p32392
$$ plain form
7911 233839 -507527 178323 -765113 -1386007 -1400642 -1395692 -681530 -632618 -663793 -833397 -1412902
7900 -1412902 -1166068 -705548 -756799 -116138 430235 386538 -605585 -862564 -802203 -489188
7890 -489188 -1028272 -615472 -164776 -611709 -172666 -256781 -395599 -170613 -227671 -581271
7880 -581271 -752806 -514615 -897651 -780887 -455200 -684257 -520775 -13944 -370249 -17943
7870 -17943 3888 -253466 -578279 -705009 -542563 -599738 -609220 -266826 -484791 -312550 -240757
7859 -240757 -137292 -333055 359629 -285277 -632406 -264855 215598 -79901 -284869 6506
7849 6506 493840 11184 -781166 -153789 -135078 -313239 -466862 -371820 -456092 -190214 -31284
7838 -31284 -58111 302397 -169443 -545657 -399264 -169358 -95885 -789833 -1239211 -1971603
7828a971603J107405M82681l1955k90667M16764K1406K03950J6094n77547L7017
7818e86455L2335M79278P2878o70793j43865M83503k71645M5565q059P27368j32030
7807B8080m38090L25483K05662K63368k1845k45944M52124m21230q05271o946
7797f64609O29418j98176j46714M04923k07243k4482K05975j53967o21919N78286
7787a98508L89579J41019j71185l93727j20190K52882l72380J16563j97290K87943
7777b65294L34245n05894L40915J59472k60033k26292K81677j75229K50447m15085
7767d81071j37333p0567M25241k38030k1998M5507J78847K10022q14534K94966
7757f08950M41745j41071j03126L31076K04314N3707J61205O2468l8141J46518
$$ plain form
7828 -1971603 -864198 -381517 -413472 -704139 -287375 -265969 -62019 -45925 -623472 -586455
7818 -586455 -554120 -74842 -1964 -672757 -816622 -333119 -604764 -559199 -567258 160110 28080
7807 28080 -410010 -84527 121135 384503 362658 116714 568838 147608 -657663 -664609
7797 -664609 -35191 -233367 -380081 24842 -182401 -206883 -908 -154875 -776794 -198508
7787 -198508 191071 332090 160905 -232822 -353012 -100130 -472510 -355947 -553237 -265294
7777 -265294 68951 -436943 -96028 63444 -196589 -422881 -141204 -316433 -65986 -481071
7767 -481071 -618404 -688971 -263730 -501760 -523758 -478251 -299404 -89382 -903916 -608950
7757 -608950 -167205 -308276 -411402 -80326 123988 177695 338900 401368 363227 509745
7747E09745k93046R2580l87633o84905k32578L35072p8477O64696M4515J37966
7737A07935k69632l25339L12396k21816k15682M75382J60111l16510M12144o89073
7727e70084n42760K60250M10998k58321p2287N63327K70090q2228k76960j01042
7717c99017L71811K56400n96650K64449N19213M91830o20791r89788O79959K82873
7707B60289n24214m37767M9319Q07686M05526m60690m26397l40012L77761N84979
7697B96480p02319k20791N127J87540M15907P8710r18864K00548k7665P12136
7687B6809M32817m35615K7121p66930j19363L52988k6099n4948J55061J38438
7677b69721p3005q1300l84901k68403O56597l4201O05414P55007r33711o30605
$$ plain form
7747 509745 216699 309279 -78354 -763259 -995837 -660765 -739242 -74546 -30031 107935
7737 107935 -161697 -487036 -174640 -396456 -612138 -136756 23355 -293155 118989 -570084
7727 -570084 -1112844 -852594 -441596 -699917 -772204 -208877 61213 -21015 -297975 -399017
7717 -399017 -27206 229194 -367456 -103007 416206 908036 287245 -702543 -22584 260289
7707 260289 -263925 -701692 -652373 155313 560839 100149 -326248 -666260 -288499 296480
7697 296480 -405839 -626630 -621503 -433963 -18056 60654 -858210 -657662 -685327 26809
7687 26809 459626 24011 51132 -715798 -835161 -482173 -508272 -563220 -408159 -269721
7677 -269721 -342726 -424026 -808927 -1077330 -420733 -454934 150480 905487 -28224 -658829
7667f58829P33965j96749m91765J3851J50414j43706L1563L11019L07721k21851
7657a64367L10653Q1450K16755l74197p73840K00743R82733o4322p56377M88690
7647A47921l14091J3252K8604L3727o96606O2811J38185k3358N56518L28247J9978
7636B95188l80323M06200n36997l47274j46574r0960K90450n57372J39654L25217
7626f02791n25438n8805K62090M06155l26386Q6453L70357q3655m67127L05979
7616f33168M20660k96190n20434M4697q4337N7584r3568M96977L43123L86412
7606A21756j30171o23886L0024K30722q0710M647M86220k71161k61482J00164
7596c93877m87454K87858K59586l82041P46500K51722k44818m69471n8655j08405
$$ plain form
7667 -658829 75136 -121613 -613378 -599527 -449113 -592819 -561256 -250237 57484 -164367
7657 -164367 146286 227736 444491 70294 -703546 -502803 479930 415608 -340769 147921
7647 147921 -166170 -152918 -124314 -90587 -787193 -724382 -586197 -609555 -53037 275210 295188
7636 295188 -85135 321065 -215932 -563206 -709780 -800740 -510290 -1067662 -928008 -602791
7626 -602791 -1128229 -1187034 -924944 -518789 -845175 -758722 -388365 -472020 -939147 -633168
7616 -633168 -212508 -508698 -1029132 -984435 -1068772 -1011188 -1104756 -607779 -264656 121756
7606 121756 -8415 -632301 -602277 -371555 -452265 -447618 38602 -232559 -494041 -393877
7596 -393877 -881331 -593473 -333887 -715928 30572 282294 37476 -431995 -490650 -599055
7586e99055J00513k31423J02919k04881r5713L35487q4640M96532O8781L47904
7576B36424k6492j97093n40712j27986j51382l6879L64998J51813J27374N1099
7566a48836L56262J12583l17923N92333q80269J73378m80815l419K39557k4675
7556c81824Q1739J94217l50226K70186M8602K42880J51355n92236J10501M00679
7546A75873L09969l19626L10673o3086m76181M411L66991l08521l28625K16232
7536a11890k27370n37962M79808n3533m19482m69624N29227k8652N08511j09090
7526d40057O19642o55459N08460K09430j80569m65367p62404L12546K84463N1026
7516e18289O5093q3833P46398j22056L78416n54395k08741k75147M66843K76590
$$ plain form
7586 -599055 -498542 -729965 -627046 -831927 -927640 -592153 -676793 -180261 -111480 236424
7576 236424 209932 12839 -527873 -655859 -807241 -844120 -479122 -327309 -199935 -148836
7566 -148836 207426 320009 2086 594419 -285850 -112472 -593287 -596706 -357149 -381824
7556 -381824 -300085 -105868 -456094 -185908 -137306 105574 256929 -335307 -224806 175873
7546 175873 485842 166216 476889 413803 -62378 -57967 309024 503 -328122 -111890
7536 -111890 -339260 -877222 -397414 -450947 -870429 -1340053 -810826 -839478 -330967 -440057
7526 -440057 179585 -475874 32586 242016 61447 -403920 -1166324 -853778 -569315 -518289
7516 -518289 -453196 -537029 209369 87313 465729 -88666 -297407 -572554 -105711 170879
7506A70879m13540k40979m36779J86732O72744M9002K1824K15667n13979J10816
7496a77613L12645n33675j10309Q4283M92387L1527J28716J3249o14263n4298
7486d27351J62300k57949m54463O02134M94040N58490o54895n23702J41947r182
7476c68631Q293j52734M61534n4527p98276M93059M39791k18857M66908M6854
7466C23414k81013L06496L50918l72442J37451L57751n63532p21153K7884M72098
7456C7872j92930n5187l09043N01903l1552n2601n54625J91339L97788K84942
7446B17906m00315L69879K21917M63490l12733l29203l37460o11266K41605J92260
7436b83920J06946K8589Q8723N74429J90097l68958r16681J79649K29832L70528
$$ plain form
7506 170879 -242661 -483640 -920419 -733687 -60943 -11941 9883 225550 -288429 -177613
7496 -177613 135032 -398643 -508952 -424669 67718 99245 227961 241210 -373053 -427351
7486 -427351 -265051 -523000 -977463 -375329 118711 677201 22306 -501396 -359449 -368631
7476 -368631 -360338 -513072 -51538 -106065 -904341 -411282 28509 -190348 276560 323414
7466 323414 42401 348897 699815 327373 464824 822575 259043 -462110 -434226 37872
7456 37872 -155058 -210245 -519288 -17385 -48937 -101538 -656163 -464824 -67036 217906
7446 217906 -182409 187470 409387 872877 560144 230941 -106519 -717785 -476180 -283920
7436 -283920 -176974 -148385 -59662 514767 704864 335906 -580775 -401126 -171294 199234
7426A99234J77959k67990L64235M68398j66897o94963O5985K65012o56757j57348
7416d03132j73463j45336j56907M63380m54366L23246L82030O52984k13657k94772
7406a9993L02219J89721p31870k5200K49667m98198K15033K1475n06405L90799
7396d12752J69245K74949M39100m85404J7341p9776q7979n30655Q29814J31486
7386B65369n46853l73351P87169M72848k65443o25757J20765J08126l38141N06172
7376A10904l1228j98632J80720n63035K70256l9924k98896L19211m64035l77646
7366a092305P54557k84157m3152j86472N24975L49936p6377J07655K78630l91468
7356e8178m68134m1817k59065L45000M0209p46373m43518L74978J32937j97687
$$ plain form
7426 199234 377193 109203 473438 941836 774939 79976 145961 410973 -245784 -403132
7416 -403132 -576595 -721931 -878838 -415458 -869824 -546578 -164548 488436 274779 -19993
7406 -19993 282226 471947 -259923 -285123 -35456 -533654 -318621 -297146 -803551 -412752
7396 -412752 -243507 31442 470542 -14862 2479 -77297 -165276 -695931 133883 265369
7386 265369 -281484 -654835 132334 605182 339739 -286018 -165253 -57127 -395268 110904
7376 110904 79676 -118956 61764 -501271 -231015 -270939 -569835 -250624 -714659 -1092305
7366 -1092305 -337748 -621905 -665057 -851529 -326554 23382 -52995 54660 333290 -58178
7356 -58178 -526312 -568129 -827194 -482194 -441985 -1188358 -1631876 -1256898 -1123961 -1321648
7346a321648L28354J47617K41150j65829m5726O36027K20830J57458r7365m77957
7336c77089j69840K2134N75543m50268L65148M59174j39314m91095j70207Q1732
7326b94082j68879M66850N3777j3404J36058J33608L94330j000379j55145N2213
7316c95053K82990L23691L46131j21919p17347k25934P11348l28346l76977K05817
7306b95599L89773m28226k51696L09774k02096J74630R9943l42910J86805j00070
7296d59672j52586N43107l03705N02983j12661l05582K59972l58756n45785O36671
7286b96014q09380o8622L71792R33737J26114o69690o376L82232N4788m14672
7276c96091N22384m12059l22581R9374l1421L94489J2741L27923l8875n9568n50732
$$ plain form
7346 -1321648 -993294 -845677 -604527 -770356 -816082 -180055 40775 198233 100868 -377089
7336 -377089 -546929 -524795 50748 -399520 -34372 424802 285488 -205607 -375814 -294082
7326 -294082 -462961 3889 57666 44262 180320 313928 708258 -292121 -447266 -395053
7316 -395053 -112063 211628 557759 435840 -281507 -507441 203907 -124439 -501416 -295599
7306 -295599 94174 -334052 -585748 -275974 -478070 -303440 -203497 -546407 -359602 -459672
7296 -459672 -612258 -69151 -372856 130127 17466 -288116 -28144 -386900 -932685 -296014
7286 -296014 -1105394 -1174016 -802224 131513 257627 -412063 -418439 -36207 18581 -396091
7276 -396091 126293 -285766 -608347 -508973 -540394 -145905 -133164 194759 155884 96316 -454416
7265d54416L63311k40236J62900j16612L12045K08226m14338J28230K25132n23149
7255c48907r9198K28936j48053N75488j09945J02597L2646k59806k07705K46694
7245A2747k3198q93054n6971J70321K81708l9888l76117q7402N47482P457l73291
7234h30206J96808J78012j06965j38680J72658N90871k58515k10748P58130q2387
7224B68978k83353P4898m39954n6073L01679M67632J25980m97607k74479J62054
7214a50245l48290k1591k37402N13598N76487n17055n3845R0630k8889k6903l93173
7203e96678j35389P05341L6534J59860j17332k67296l58094M61847j07601K64832
7193D6024N4736k65529j26948K58668J1876O7583o90325M0618M08848K55399N88970
$$ plain form
7265 -454416 -91105 -331341 -168441 -285053 26992 235218 -179120 -50890 174242 -348907
7255 -348907 -448105 -219169 -367222 208266 98321 200918 233564 -26242 -233947 12747
7245 12747 -10451 -903505 -960476 -790155 -508447 -548335 -924452 -1011854 -464372 -456915 -830206
7234 -830206 -633398 -455386 -562351 -701031 -528373 62498 -196017 -406765 351365 268978
7224 268978 -14375 60523 -379431 -435504 -133825 333807 459787 -37820 -312299 -150245
7214 -150245 -498535 -520126 -757528 -243930 332557 -184498 -238343 -147713 -176602 -203505 -596678
7203 -596678 -732067 -26726 9808 169668 52336 -214960 -573054 -111207 -218808 46024
7193 46024 100760 -164769 -291717 -33049 -21173 46410 -643915 -603297 -194449 60950 649920
7182F49920m13308p08334L47788M78857l91074K81075k33669p67431M64661J13072
7172a78443n657K65911m02844J32008L09724R2265m45020R7098L74480k33172
7162F350J32634m76853j99867L33811P0525K65708K06914q556k54908L32297O0826
7151D68881l93070M56317m03730m61669k51167N45257N26554j87550k87024m0645
7141b7846n81758l0146j39276l94262P66817K44790n40362J90031L94141R1972
7131b5899l72739l18675N97609K41219K64724q22804Q0810J27842j69961j60507
7121e58381L40764k85112J53998K90574L31332l13542l34220j12983K03887O61294
7111C77611J81154K76046L19256k58008q53617O5498l01264M27664K59461l45923
$$ plain form
7182 649920 236612 -471722 -123934 354923 -36151 244924 11255 -756176 -291515 -178443
7172 -178443 -184100 81811 -321033 -189025 120699 212964 -232056 -134958 239522 6350
7162 6350 138984 -337869 -537736 -203925 -133400 132308 339222 330666 75758 408055 468881
7151 468881 75811 532128 128398 -333271 -584438 -39181 487373 299823 12799 -27846
7141 -27846 -609604 -639750 -779026 -1173288 -406471 -161681 -702043 -512012 -117871 -25899
7131 -25899 -398638 -717313 -119704 121515 386239 -436565 -355755 -227913 -397874 -558381
7121 -558381 -217617 -502729 -348731 -58157 273175 -40367 -374587 -487570 -283683 377611
7111 377611 558765 834811 1154067 896059 42442 107940 -193324 234340 493801 147878
7101A47878j66030l46914M34294m31881k37866n85022K38093K67953K84452O76713
7091B81670q75631O1444J97241O7953r0405L79376L26934p7737o06052M2545m0102
7080c32764L59835r0571J55202p757K21207N01588r6519j53867O7147m90829o60613
7069e27941n7766l61262m5851K84511K92635K19738N10307J20264O08913o32513
7059D11035k50418k47021P06510K84395k93792K14326m18008q45948k63268k17074
7049i19263M64209J76503l60644K71980K69409l21325K05678K89552r13963K52128
7039e85736M45933P76999p23282M4466Q2389l50618Q0953J24384L59171M56600
7029G11259j7859J47091j18256m33978j43210L85778L0039l27523m3889K08090
$$ plain form
7101 147878 -18152 -365066 69228 -362653 -600519 -1185541 -947448 -679495 -395043 281670
7091 281670 -593961 -532517 -335276 -267323 -357728 21648 348582 270845 -335207 -292662 -332764
7080 -332764 27071 -63500 91702 83945 305152 806740 710221 556354 623501 132672 -527941
7069 -527941 -585707 -946969 -992820 -708309 -415674 -195936 314371 434635 1043548 411035
7059 411035 160617 -86404 620106 904501 610709 825035 407027 -438921 -702189 -919263
7049 -919263 -455054 -278551 -639195 -367215 -97806 -419131 -213453 76099 -837864 -585736
7039 -585736 -139803 637196 -86086 -41620 40769 -309849 -228896 -104512 254659 711259
7029 711259 693400 840491 722235 288257 145047 530825 560864 233341 189452 397542
7019C97542k42167m57845J87192N55440j46737o9002M53638n1977l69886K74504
7009E30702K04336p31972J89518l6541j78454L95736j43385J46955n29736k24591
6999c77432N63150j69854O0388n64623M51606L8597j67366N24642P68514n61739
6989E65883n61957J61603l6018L50340J22034j81145k04752K37071K35855l70631
6979C18283J69728l05200M80701l14381k75964N58005M66742k09584k0924M06777
6969A274183j86373m69105k90543N74316o70452m15543K57633L11315L02066m64098
6959B23399n67774P84551J08498k88921o15815M50614k7536L55527N13844n5378
6949H81009l63643l00172m72594L11185J94230J63226K59289p88463J78769N42598
$$ plain form
7019 397542 155375 -302470 -115278 440162 293425 224423 678061 626084 256198 530702
7009 530702 735038 3066 192584 156043 -22411 373325 229940 376895 -152841 -377432
6999 -377432 185718 15864 76252 -488371 -36765 1832 -165534 359108 1127622 565883
6989 565883 3926 165529 129511 479851 601885 420740 215988 453059 688914 318283
6979 318283 488011 182811 663512 349131 73167 631172 1097914 888330 867406 1274183
6969 1274183 1087810 618705 328162 902478 232026 -183517 74116 385431 687497 223399
6959 223399 -344375 440176 548674 259753 -356062 94552 67016 422543 936387 881009
6949 881009 517366 217194 -255400 55785 250015 413241 672530 -115933 62836 605434
6939F05434o5847k78173j1631P3616P80347L68106m71851n47727r2346R4713K46057
6928G00698K02098k3257l08217j48432k68006k49537J64632N9127L72923j42714
6918C59315l12852J18979L08417M55642m84598O13811l44392j33361K51491n40493
6908B91959l11142K28662O20664l52048o35664R78578k35855m37519l28432O6228
6898a14569L48902K28289k06077J74002N76229j32197p7993k79795n02451j90019
6888a75679L23603O13230J32144o02554R7663L40773k2238l16818P1000l43339
6878A17785K01347K2167J75819J58827q32807J02861L41338K56956j04022j78691
6868B61580j78361J1159K00268J83014N71545l95180j87971K00640J79349L78348
$$ plain form
6939 605434 539587 261414 249783 323399 1103746 1471852 1000001 452274 359928 454641 700698
6928 700698 902796 879539 571322 422890 154884 -94653 69979 129106 502029 359315
6918 359315 46463 165442 473859 929501 444903 1058714 714322 580961 832452 291959
6908 291959 -19183 209479 830143 478095 -157569 821009 585154 147635 -180797 -114569
6898 -114569 234333 462622 256545 430547 1006776 874579 796586 516791 14340 -175679
6888 -175679 147924 761154 893298 290744 388407 729180 706942 390124 461124 117785
6878 117785 319132 341299 517118 675945 -156862 -54001 287337 544293 440271 261580
6868 261580 83219 94378 294646 477660 1049205 654025 466054 666694 846043 1224391
6858A224391j34279K2619k52225o5945J37468L5011o80008m69051J92671n0596
6848c9944m2643q1272J039279L23072J28557j154009K40599J31813r4217R0208
6838E41443o5655j2331O48715k36502o8295O6882J5910O12910L6232n08473l50237
6827F80599K61694m8356m33451j99899L76402K08136l5352l78233r736q5861K37361
6816E73304N97983j13704Q8847L23475m74266k86438P80027j5295p50113J01038
6806H24858j25217K8663J55973j87784O19410p55747k66277N12033J07429K31545
6796A144886L09825k76899o28208k476L65288M04988k23259p35660n72769O48690
6786D34406J58605J7102K382k26660j07880J083358M29981q10186J83611M64069
$$ plain form
6858 1224391 1090112 1112731 860506 794561 932029 967040 287032 -182019 10652 -39944
6848 -39944 -82587 -163859 875420 1198492 1327049 173040 413639 545452 451235 541443
6838 541443 475788 463457 1112172 875670 807375 874257 890167 1503077 1539309 1030836 680599
6827 680599 942293 893937 460486 260587 636989 845125 809773 431540 421804 335943 573304
6816 573304 1171287 1057583 1146430 1469905 995639 709201 1489228 1473933 723820 824858
6806 824858 699641 728304 884277 696493 1315903 560156 293879 805912 913341 1144886
6796 1144886 1454711 1177812 549604 547128 912416 1317404 1094145 358485 -214284 434406
6786 434406 593011 610113 612495 385835 277955 1361313 1791294 981108 1164719 1628788
6776A628788l48575Q9381j06679L60874k53558M89242M72110p37462m46879J49918
$$ plain form
6776 1628788 1280213 1369594 1262915 1623789 1370231 1859473 2331583 1594121 1147242 1297160
$$ [...]
##END NTUPLES=NMR SPECTRUM
##END=
