##TITLE=1H_TG-2388-B
 200.13Hz, DMSO+CCl4.
 8 sc
 
 15.4.2026
##JCAMPDX= 6.0         $$ Bruker NMR JCAMP-DX V2.0
##DATA TYPE= NMR SPECTRUM
##DATA CLASS= NTUPLES
##ORIGIN= UXNMR, Bruker Analytische Messtechnik GmbH
##OWNER= pz
$$ XWIN-NMR		Version 3.5
$$ Wed Apr 15 13:34:22 2026 Russian Standard Time (UT+4h)  she@DPX200
##.OBSERVE FREQUENCY= 200.1313
##.OBSERVE NUCLEUS= ^1H
##.ACQUISITION MODE= SIMULTANEOUS
##.ACQUISITION SCHEME= undefined
##.AVERAGES= 8
##.DIGITISER RES= 18
##SPECTROMETER/DATA SYSTEM= spect
##.PULSE SEQUENCE= zg30
##.SOLVENT NAME= DMSO
##.SHIFT REFERENCE= (INTERNAL, DMSO, 0, 15.4836)
##AUDIT TRAIL= $$ (NUMBER, WHEN, WHO, WHERE, WHAT)
$$ ##TITLE= Audit trail, XWIN-NMR		Version 3.5
$$ ##JCAMPDX= 5.01
$$ ##ORIGIN= Bruker BioSpin GmbH
$$ ##OWNER= she
$$ F:/spectra/data/she/nmr/H-C/1/pdata/1/auditp.txt
$$ ##AUDIT TRAIL=  $$ (NUMBER, WHEN, WHO, WHERE, WHAT)
(   1,<2026-04-15 13:32:21.50 +0400>,<she>,<DPX200>,
      <created by zg, POWCHK disabled, PULCHK disabled
       configuration hash MD5:
       00 E9 B6 7A A2 85 ED C7 34 08 36 98 17 FE 4E 26
       data hash MD5: 16K
       F1 9C D6 B8 14 F0 E8 4F 1C 64 96 B1 9E C2 40 23>)
(   2,<2026-04-15 13:32:24.34 +0400>,<she>,<DPX200>,
      <Start of raw data processing
       efp BC_mod = 2 LB = 0.25 FT_mod = 6 PKNL = 1 PHC0 = -3871.882 PHC1 = 18.79231 SI = 16K 
       data hash MD5: 16K
       42 AA 43 6E 24 B5 AF FE 0C 68 3B DB 61 2F 28 CE>)
(   3,<2026-04-15 13:33:03.06 +0400>,<she>,<DPX200>,
      <pk PHC0 = 165.6509 PHC1 = -9.199999 
       data hash MD5: 16K
       FA 11 A7 BD D6 C1 91 54 E1 A9 F1 8F 45 9D 7F 9F>)
(   4,<2026-04-15 13:33:07.20 +0400>,<she>,<DPX200>,
      <abs ABSG = 5 
       data hash MD5: 16K
       10 52 DA DE E7 48 3E 29 91 F8 C3 0C AE 76 99 6A>)
$$ ##END=
$$ 
$$ hash MD5
$$ 7D 59 1B 18 B3 F7 12 3F B6 A8 2A D6 B8 7D AD F5
##$RELAX= 
##$RELAX= 
##$RELAX= 
##$RELAX= 
##$RELAX= 
##$RELAX= 
$$ Bruker specific parameters
$$ --------------------------
##$DU= <F:/spectra>
##$EXPNO= 1
##$NAME= <H-C>
##$PROCNO= 1
##$TYPE= <nmr>
##$USER= <she>
##$AMP= (0..31)
100 100 100 100 100 100 100 100 100 100 100 100 100 100 100 100 100 100 
100 100 100 100 100 100 100 100 100 100 100 100 100 100 
##$AQSEQ= 0
##$AQ_mod= 1
##$AUNM= <au_zg>
##$AUTOPOS= <>
##$BF1= 200.13
##$BF2= 200.13
##$BF3= 200.13
##$BF4= 200.13
##$BF5= 200.13
##$BF6= 200.13
##$BF7= 200.13
##$BF8= 200.13
##$BYTORDA= 1
##$CFDGTYP= 0
##$CFRGTYP= 5
##$CHEMSTR= <none>
##$CNST= (0..31)
1 1 145 1 1 1 1 1 1 1 1 1 1 1 1 1 1 1 1 1 1 1 1 1 1 1 1 1 1 1 1 1 
##$CPDPRG= <>
##$CPDPRG1= <>
##$CPDPRG2= <>
##$CPDPRG3= <>
##$CPDPRG4= <mlev>
##$CPDPRG5= <mlev>
##$CPDPRG6= <mlev>
##$CPDPRG7= <mlev>
##$CPDPRG8= <mlev>
##$CPDPRGB= <>
##$CPDPRGT= <>
##$D= (0..31)
0 0.7 0 0 0 0 0 0 0 0 0 0.03 0 0 0 0 0 0 0 0 0 0 0 0 0 0 0 0 0 0 0 0 
##$DATE= 1776245540
##$DBL= (0..7)
120 120 120 120 120 120 120 120 
##$DBP= (0..7)
150 150 150 150 150 150 150 150 
##$DBP07= 0
##$DBPNAM0= <>
##$DBPNAM1= <>
##$DBPNAM2= <>
##$DBPNAM3= <>
##$DBPNAM4= <>
$$ [...]
##$SUBNAM3= <"">
##$SUBNAM4= <"">
##$SUBNAM5= <"">
##$SUBNAM6= <"">
##$SUBNAM7= <"">
##$SUBNAM8= <"">
##$SUBNAM9= <"">
##$SW= 18.0517328524113
##$SWIBOX= (0..15)
0 0 2 0 0 0 0 0 0 0 0 0 0 0 0 0 
##$SW_h= 3612.71676300578
##$TD= 16384
##$TD0= 1
##$TE= 0
##$TE2= 300
##$TE3= 300
##$TEG= 300
##$TL= (0..7)
0 120 120 120 120 120 120 120 
##$TP= (0..7)
150 150 150 150 150 150 150 150 
##$TP07= 0
##$TPNAME0= <>
##$TPNAME1= <>
##$TPNAME2= <>
##$TPNAME3= <>
##$TPNAME4= <>
##$TPNAME5= <>
##$TPNAME6= <>
##$TPNAME7= <>
##$TPOAL= (0..7)
0.5 0.5 0.5 0.5 0.5 0.5 0.5 0.5 
##$TPOFFS= (0..7)
0 0 0 0 0 0 0 0 
##$TUNHIN= 0
##$TUNHOUT= 0
##$TUNXOUT= 0
##$USERA1= <user>
##$USERA2= <user>
##$USERA3= <user>
##$USERA4= <user>
##$USERA5= <user>
##$V9= 5
##$VALIST= <valist>
##$VCLIST= <CCCCCCCCCCCCCCC>
##$VD= 0
##$VDLIST= <DDDDDDDDDDDDDDD>
##$VPLIST= <PPPPPPPPPPPPPPP>
##$VTLIST= <TTTTTTTTTTTTTTT>
##$WBST= 1024
##$WBSW= 4
##$XGAIN= (0..3)
0 0 0 0 
##$XL= 0
##$YL= 0
##$YMAX_a= 172059
##$YMIN_a= -181787
##$ZGOPTNS= <>
##$ZL1= 120
##$ZL2= 120
##$ZL3= 120
##$ZL4= 120
##$ABSF1= 15.46593
##$ABSF2= -2.585919
##$ABSG= 5
##$ABSL= 3
##$ALPHA= 0
##$AQORDER= 0
##$ASSFAC= 0
##$ASSFACI= 0
##$ASSFACX= 0
##$ASSWID= 0
##$AUNMP= <proc_1d>
##$AZFE= 0.1
##$AZFW= 0.1
##$BCFW= 0
##$BC_mod= 2
##$BYTORDP= 0
##$COROFFS= 0
##$CY= -3
##$DATMOD= 1
##$DC= 0
##$DFILT= <>
##$DTYPP= 0
##$F1P= 0
##$F2P= 0
##$FCOR= 1
##$FTSIZE= 16384
##$FT_mod= 6
##$GAMMA= 0
##$GB= 0
##$INTBC= 1
##$INTSCL= 3.241238e-09
##$ISEN= 128
##$LB= 0.25
##$LEV0= 0
##$LPBIN= 0
##$MAXI= 10000
##$MC2= 0
##$MEAN= 0
##$ME_mod= 0
##$MI= 1.114404
##$NCOEF= 0
##$NC_proc= -6
##$NLEV= 6
##$NOISF1= 3.799351
##$NOISF2= 2.8
##$NSP= 0
##$NTH_PI= 0
##$NZP= 0
##$OFFSET= 15.48356
##$PC= 1
##$PHC0= -3706.231
##$PHC1= 9.592312
##$PH_mod= 1
##$PKNL= yes
##$PPARMOD= 0
##$PSCAL= 0
##$PSIGN= 0
##$REVERSE= no
##$SF= 200.130007634424
##$SI= 16384
##$SIGF1= 3
##$SIGF2= 2
##$SINO= 0.751879
##$SIOLD= 32768
##$SREGLST= <19F.Aceton>
##$SSB= 0
##$STSI= 16384
##$STSR= 0
##$SW_p= 3612.71676300578
##$SYMM= 0
##$S_DEV= 0
##$TDeff= 16384
##$TDoff= 0
##$TI= <>
##$TILT= no
##$TM1= 0
##$TM2= 0
##$TOPLEV= 0
##$USERP1= <user>
##$USERP2= <user>
##$USERP3= <user>
##$USERP4= <user>
##$USERP5= <user>
##$WDW= 1
##$XDIM= 16384
##$YMAX_p= 378710805
##$YMIN_p= -1744954
$$ End of Bruker specific parameters
$$ ---------------------------------
##NTUPLES= NMR SPECTRUM
##VAR_NAME=  FREQUENCY,     SPECTRUM/REAL,   SPECTRUM/IMAG
##SYMBOL=    X,             R,               I
##VAR_TYPE=  INDEPENDENT,   DEPENDENT,       DEPENDENT
##VAR_FORM=  AFFN,          ASDF,            ASDF
##VAR_DIM=   16384,         16384,           16384
##UNITS=     HZ,            ARBITRARY UNITS, ARBITRARY UNITS
##FACTOR=    0.220516191357247, 1,           1
##FIRST=     3098.72490264905, 0,            0
##LAST=      -513.991860356727, 0,           0
##MIN=       -513.991860356727, -1744954,    0
##MAX=       3098.72490264905, 378710805,    0
$$ Real data points
##PAGE= N=1
##DATA TABLE= (X++(R..R)), XYDATA
$$ [...]
12277A16994j18563K81404l3840j02428j87107J22983K0308k46417J12294J75787
12267A41415j10869l9854m2649N5180o649N8075P4974k18823J70724j91642J10476
12256C58J2938L4311J4666j1356O2508K6711O7721o1735o2269j67310N6761J79316
12244A52620j21631j16189J258J27993N0527l39546K10545q9447J76263M744P9606
12233A36743L1443o2653j00337K4794m8529K2462j25157L4369J01370o3201j60154
12222b08850K19574J13562m0667m9319R5236O8389l28814J31912J09284j26357
12212a6050j50693J51458n445j36989J01949m9078J60268n7401J14091O4904k59010
12201h1996K11414P4420j76627o670O4143j04483p3396O4955K27881o1543L4005
$$ plain form
12277 116994 -1569 279835 245995 143567 -43540 79443 99751 -146666 -34372 141415
12267 141415 30546 -9308 -51957 3223 -3426 54649 129623 -89200 81524 -110118 358
12256 358 13296 47607 62273 50917 113425 140136 207857 146122 83853 -83457 -26696 152620
12244 152620 30989 -85200 -83942 44051 94578 -244968 -34423 -123870 52393 57137 136743
12233 136743 168186 105533 5196 29990 -18539 3923 -121234 -86865 14505 -48696 -208850
12222 -208850 10724 124286 83619 34300 129536 197925 -130889 1023 110307 -16050
12212 -16050 -166743 -15285 -20730 -157719 -55770 -104848 55420 -1981 112110 177014 -81996
12201 -81996 129418 203838 27211 20541 84684 -19799 -93195 -28240 199641 138098 172103
12190A72103m0735N6191k75725N0127L2035M746j56455Q6486j52057O4917J63057
12179D690K0560j69660J98645q8707k9523J13457J18581j06481j27870J33379
12169F7071j89788k21184R2599M47887m9768j42713J32496J6698k31420J98733
12159A20611J43715j96144j26945J84052n7014l02454M109K4493J27206o1403
12149a39774J2982K45381j24840o4193L77560k46421j19656J31459k37831J02659
12139f2674j13196J14023p988P5297Q1068R8965k02270K14091j97764N0873J2088
12128F2513L7224j4026k58297J98486L7823k65488J06754N6655N8799M654l6017
12117a0920K9266j19345R1514k5436j50984J54547J05498n1197J3438m3803L05773
$$ plain form
12190 172103 131368 187559 -88166 -38039 -6004 -1258 -157713 -71227 -223284 -158367 4690
12179 4690 25250 -144410 54235 -34472 -63995 49462 168043 61562 -66308 67071
12169 67071 -122717 -343901 -251302 196585 146817 4104 136600 153298 -78122 120611
12159 120611 264326 68182 -58763 125289 68275 -234179 -230070 -205577 -78371 -139774
12149 -139774 -126792 118589 -6251 -70444 307116 60695 -58961 72498 -165333 -62674
12139 -62674 -175870 -61847 -69835 5462 86530 185495 -16775 197316 -448 50425 62513
12128 62513 99737 85711 -172586 25900 63723 -201765 -95011 -38356 20443 25097 -10920
12117 -10920 18346 -100999 -9485 -34921 -185905 -31358 74140 22943 36381 -7422 298351
12106B98351j82574j45415J48022m7395k15480K618J00459Q7450k77863J82318
12096d9509J13053K5694l5598j6314k0106j62204j53726K90912j72144J14741
12086f5201M4624J84498K4015j45101m4298J0539O2048n7754j83402M4361L3258
12075i2413j8260k4168j31035J01658J36856O5141K9695P7745j73310J55826j52072
12064b4337J61227j21430P3581j15238o8571R7300L0853q9903J69410q2597J74716
12053B05011k78826K17271n9561J4140j858j37881J49018O6782j6730j66788N1340
12042D1918O933k0485k03382M6167J92132q446j49582N2675j19970J96276k75900
12031b41664L50763n8305L0591o5711m6154r2160p4899K2608K84428j22395M0863
$$ plain form
12106 298351 115777 -29638 118384 70989 -144491 -141873 -41414 46036 -231827 -49509
12096 -49509 63544 89238 53640 37326 17220 -144984 -298710 -7798 -179942 -65201
12086 -65201 -20577 163921 187936 42835 -1463 9076 71124 13370 -170032 -125671 -92413
12075 -92413 -110673 -134841 -265876 -164218 -27362 37779 67474 145219 -28091 127735 -24337
12064 -24337 136890 15460 89041 -26197 -94768 2532 33385 -56518 112892 30295 205011
12053 205011 -73815 143456 83895 98035 96177 -41704 107314 174096 157366 -9422 41918
12042 41918 48851 28366 -175016 -128849 63283 54837 -94745 -42070 -162040 34236 -241664
12031 -241664 109099 50794 81385 15674 -30480 -122640 -197539 -174931 109497 -12898 27965
12020B7965k4963J66589M6853j12695J75161k6198j54704p5336J12122k48705
12010a13911Q8536J5670J31240k35332m6132J59808J1948m2978l1051o2733J70801
11999D5866k57311K34162n9979J28850j0325m550K5085p9601j24304R6835K9632
11988B4360p3771J5974j5599j27863J44975j57114J91016m2839k02735J60529
11978h3067Q1060m998j10109j1470O413Q5010j19939Q4614p7359L7629J04469
11967g747j3334p4889K25050j5528k2637k79160K51360j1567k27044J18207N6917
11956c72l2708K9029K1288J04292j25223n6019J35820q622j29062M6716r3350
11945a08211J98399j3567j11131K5058j65883k4967J27698j8351J98488j32646
$$ plain form
12020 27965 3002 169591 216444 103749 278910 252712 98008 22672 134794 -113911
12010 -113911 -25375 -9705 121535 -113797 -159929 -121 11827 -31151 -62202 -124935 45866
11999 45866 -211445 22717 -37262 91588 81263 76713 101798 22197 -102107 -5272 24360
11988 24360 -49411 -33437 -49036 -176899 -31924 -189038 1978 -40861 -243596 -83067
11978 -83067 -2007 -7005 -117114 -128584 -122171 -37161 -157100 -72486 -149845 -112216 -7747
11967 -7747 -21081 -95970 129080 113552 90915 -188245 63115 51548 -175496 -57289 -372
11956 -372 -33080 -4051 17237 121529 -3694 -59713 76107 67485 -61577 -14861 -108211
11945 -108211 90188 76621 -34510 -9452 -175335 -200302 -72604 -90955 107533 -25113
11935b5113n3030J42122J5731M4612j11693J56823j57365j6164P4167J5703j39199
11924e3406j16279J28403k1906j1810J14036j83291n2381J35322P3183M0460j81591
11913a29260J0599J27495k03739K03832Q9925j17223J2257J50874o2235j7330
11903F5195k23208K53654R9320k64385K08534j05897Q0497j44297j23485J47213
11893f859k57190J7014Q1434k5078J87462L429J7087K5619J01362j12715j69742
11882a38177M556J08690K7502N3822K6891m1121j05503O8000j55782K22775l0317
11871D1336m3159J3395P643j60042J55247Q4433q4564k9052j3839N1209N7355
11860G9962l3296P2613j57057K33194o5517k82454K65649K8816j97730k33113
$$ plain form
11935 -25113 -78143 63979 79710 124322 12629 169452 12087 -4077 70090 85793 -53406
11924 -53406 -169685 -41282 -63188 -74998 39038 -144253 -196634 -61312 11871 52331 -129260
11913 -129260 -118661 8834 -194905 8927 98852 -18371 -6114 144760 82525 65195
11903 65195 -158013 95641 194961 -69424 139110 33213 113710 -30587 -154072 -6859
11893 -6859 -264049 -247035 -165601 -190679 -3217 212 17299 42918 144280 31565 -138177
11882 -138177 -133621 -24931 2571 56393 83284 42163 -63340 4660 -151122 71653 41336
11871 41336 -1823 11572 19215 -140827 14420 98853 14289 -14763 -28602 22607 79962
11860 79962 46666 119279 -37778 195416 129899 -152555 113094 141910 -55820 -288933
11850b88933J14695J85458M3735m7649O1487l002k085P986K7870k42067J90661
11839D8156p3819k822j53235r136K49361j65275r2970J69674n2776j14324j21450
11828c18616J83189M3280J81326j10918R4169j01460J60185R6817j93127o713
11818B8132J52036J3790j46530j42105k6674m973K3578K7127K3596K4832p2020
11807i9211k5934o2788Q4194R2697p7361m724J70491N2698r2260p0686J3295O7014
11795D7425J0906k3097j34733j47531K56678n714j80386J30478K09618p8947j88313
11784a03616R3018J20429j82499r2348M2791J80808l8867o323J13554m7649O4628
11773A43926N863Q1p0759J02712L5379l29605k299L3145J43587k19741p6866k3290
$$ plain form
11850 -288933 -174238 11220 54955 7306 68793 65791 63706 71692 99562 -142505 48156
11839 48156 -25663 -28485 -181720 -190856 58505 -106770 -199740 -30066 -82842 -197166 -318616
11828 -318616 -135427 -92147 89179 -21739 72430 -29030 131155 227972 34845 28132
11818 28132 180168 193958 47428 -94677 -121351 -126324 -102746 -75619 -52023 -27191 -99211
11807 -99211 -125145 -187933 -103739 -11042 -88403 -93127 77364 130062 37802 -32884 -19589 47425
11795 47425 58331 35234 -99499 -247030 9648 3934 -176452 -45974 163644 84697 -103616
11784 -103616 -10598 109831 -72668 -165016 -122225 58583 19716 13393 126947 79298 143926
11773 143926 149789 149870 79111 181823 217202 -112403 -114702 -81557 62030 -157711 -234577 -257867
11761b57867Q8652K34728Q7505j02121j38089J17887K8038j49972l2893J26575
11751B443j6548j74205J48755J33581j32572k7852M5565l8803P0038P3556l997
11740G9961R251N788Q0766j94921L7l8433N3987J00567j22118k7816P8442L019
11728B8530J25876j48177L7258J99961p5811K5890k937j434k21092j31932J98892
11717C5024j75728j18610L0522l9K45652p6882k2274L19957j77321J3660J52264
11706B26225j19493M6784k03364K2381r7142J1892J75482p2018p3710J55941j17939
11695d4961L127J40350L3816p3762m0988m9087o2846n0148j19786J27511Q1770
11684e5004O1734l2501j28875R9130k653J05985n9755k2243O9206K3762k2318
$$ plain form
11761 -257867 -169215 65513 153018 50897 -87192 30695 58733 -91239 -124132 2443
11751 2443 -14105 -188310 -39555 94026 -38546 -66398 -20833 -59636 10402 83958 79961
11740 79961 89212 95000 175766 -19155 -19118 -57551 -3564 97003 -25115 -52931 25511 28530
11728 28530 154406 6229 43487 243448 167637 193527 190590 189156 -31936 -163868 35024
11717 35024 -140704 -259314 -228792 -228831 16821 -60061 -82335 237622 60301 73961 226225
11706 226225 106732 153516 -49848 -27467 -124609 -112717 62765 -9253 -82963 72978 -44961
11695 -44961 -41834 98516 132332 58570 17582 -31505 -94351 -144499 -264285 -136774 -55004
11684 -55004 6730 -25771 -154646 -55516 -58169 47816 -11939 -34182 35024 58786 36468
11673C6468q5735j254k1791J39908p2963j03472l4908j25161L20198k09402R2434
11662f5678K30743j64412J338l1618p4927K12547O1728k8202k2558r8536k1106
11651f81j64872l7263R0228N3419j8423j2611M0964L24664k79070J16842M1957
11640A55154j3691j66068k26619J07719l6526O4338j90471P6370J54063J7903
11630e7828J35779k17449Q3246J03321k24590n4924Q9398R6672p4072J01432P2924
11619E3909o0894L4458J574q5070j06825K30048P7625k10853L5755J3801J47875
11608A31403n4839m5964j4982j03825J89313l6100k12089m4747J46842J22817
11598G7829j18406J03854n8609J3429j49986N6105Q439j10519J43462j09421J17121
$$ plain form
11673 36468 -49267 -50521 -72312 67596 -5367 -108839 -143747 -268908 51290 -158112 -65678
11662 -65678 165065 653 1991 -29627 -104554 107993 169721 141519 118961 20425 -681
11651 -681 -165553 -202816 -112588 -59169 -77592 -90203 -49239 275425 -3645 113197 155154
11640 155154 141463 -24605 -251224 -143505 -180031 -115693 -306164 -229794 -75731 -57828
11630 -57828 77951 -139498 -56252 47069 -177521 -232445 -143047 -46375 -120447 -19015 53909
11619 53909 -6985 27473 29047 -56023 -162848 67200 144825 -66028 -30273 -16472 131403
11608 131403 76564 30600 15618 -88207 101106 65006 -147083 -191830 -44988 77829
11598 77829 -40577 63277 4668 18097 -131889 -75784 -67345 -177864 -34402 -143823 -26702
11587b6702o6624P4810j65675K20227r5240k748J23151Q3076L285j75478n3409
11576h1327K96323k52389j07153J49872l608N3204j41436J68402q3162L3254n3171
11565b1191O7183j2169q8864M0179o8063J25108l2888n6571N1576j52454j0546
11554a58700J15828J95990O30q0905j06858J15626k38903n643K00152P326k81569
11543b37026k6254K9325J42790N4449J0467O6565k03852J82724p8389o6772O4170
11532f1803r4698p1491K34353J5448L9164J7416R5450N858j02474N4092M4085
11521A75400k31424J55905o0846O1976k61635R8169J98585j22379j50663J13196
11511b3716p111k3400J35519m6326j9994k5181J96610k8914j96545k2498L8743
$$ plain form
11587 -26702 -93326 -18516 -184191 36036 -59204 -61952 61199 144275 147560 -27918 -81327
11576 -81327 214996 -37393 -144546 5326 1718 54922 -86514 81888 -1274 31980 -21191
11565 -21191 45992 33823 -55041 -14862 -82925 42183 9295 -47276 4300 -148154 -158700
11554 -158700 -42872 153118 153748 72843 -34015 81611 -157292 -162935 37217 44543 -237026
11543 -237026 -263280 -233955 -91165 -36716 -26249 40316 -163536 19188 -59201 -125973 -61803
11532 -61803 -156501 -227992 6361 21809 60973 78389 173839 179697 77223 131315 175400
11521 175400 -56024 99881 39035 101011 -160624 -62455 136130 13751 -136912 -23716
11511 -23716 -30827 -54227 81292 34966 14972 -10209 186401 157487 -39058 -61556 -22813
11500b2813j65910N3556J92434m3219k34631K22615J9889m9100N7174Q3617j2398
11489A01214Q5314p6860K7167l14040J30931R2585j49759R03K54239j54400L6704
11478C3998j34074q5138L25694j37131p1708j54486K34314J09566j65357l1084
11468g5406m743O7676K4691j16828R249J12468J53822j91352j0437J21297j58108
11457f7671N9280j06786n756Q5124k8204Q1710J7016K6628J06640j33003j36335
11446a01357L7792K3082N2613k9936o5683J0331j09300J58511j34440J33158J88719
11435A63490j37271j24800j51244J20025P6352j42366K70409K9896j60230J0302
11425d5437J8214m3202P3234q8095k4922k547l9310J39210j58540J7419Q7672
$$ plain form
11500 -22813 -188723 -135167 57267 14048 -220583 2032 21921 -27179 29995 113612 101214
11489 101214 186528 109668 136835 -177205 -46274 46311 -103448 -102545 151694 -2706 33998
11478 33998 -100076 -185214 140480 3349 -68359 -222845 11469 121035 -44322 -75406
11468 -75406 -80149 -12473 12218 -104610 -95361 17107 170929 -20423 -30860 90437 -67671
11457 -67671 -8391 -115177 -120933 -35809 -64013 17697 34713 61341 167981 34978 -101357
11446 -101357 -63565 -40483 12130 -17806 -83489 -73158 -182458 -23947 -158387 -25229 163490
11435 163490 26219 -98581 -249825 -129800 -53448 -195814 74595 104491 -55739 -45437
11425 -45437 -27223 -70425 2809 -85286 -110208 -112755 -152065 -12855 -171395 -153976 -66304
11414f6304L9771O4469j27417J24017K4241j24847J52377q5697r533k50390o20
11403b59933O5334l3765J53812L6827Q0131K0583K2861K6867j77691q1057M7443
11392i8588r0120j02968j8457J97092J40416o2804J4343K27385L2126p9275J46802
11381C05952j60961q3013k5129m7943m4678N578J89606j1544j97879J37143Q0453
11370A47585j02258l1787M9164J45496K8707k16243K29831j42888p9228l3606
11360e227j18496K61988j85610l8038J1618m9377J92379n1172N0363L9006m2882
11349F4552n9669O6485m2385R3538k28463N9110r0591O0674K4139k4970j11275
11338a88855Q7854O1432k1106K48256j30566K4641n6854j51434J44386l4627k2720
$$ plain form
11414 -66304 -26533 37936 -89481 34536 58777 -66070 86307 610 -8923 -259313 -259933
11403 -259933 -194599 -228364 -74552 -37725 42406 62989 85850 112717 -64974 -146031 -98588
11392 -98588 -188708 -291676 -310133 -113041 27375 -35429 -21086 206299 238425 159150 305952
11381 305952 144991 61978 36849 -11094 -55772 -50194 139412 127868 -70011 67132 147585
11370 147585 45327 13540 62704 208200 236907 20664 250495 107607 28379 -5227
11360 -5227 -123723 138265 -47345 -85383 -73765 -123142 69237 18065 68428 107434 64552
11349 64552 4883 71368 28983 122521 -105942 -46832 -137423 -76749 -52610 -77580 -188855
11338 -188855 -101001 -39569 -60675 187581 57015 81656 24802 -126632 17754 -16873 -39593
11327c9593J81565j21492j22576j01345J46432p2156j27484Q0729K20427J2152
11317E6659j98737K30751N7201r9919j71973j4302J60700O1487r6156J3882j83378
11306a83785n6625M5901k2172J61146o1262o5154j56755K28167J28115q2059J8623
11295d5860J13024q3279l8140q7061J06272Q8k8632J18126l914p8442R3527M8434
11283A14143p2127L1968O9215o2476j05029l8335n449k0305J1040Q0162p8950
11272g6143j50594J58867J29853o5592n3618J24339J40255p2357q7681m3655Q1853
11261H5527L1564k7567k8091K4162j3186l03666J08608N2486O6936j17597J27262
11250F438K59374j07686q2551p0798l8028p5842j17073p422Q5311Q2423O6524
$$ plain form
11327 -39593 141972 20480 -102096 -203441 -57009 -129165 -256649 -175920 44507 56659
11317 56659 -142078 88673 145874 45955 -126018 -140320 20380 81867 -14289 -407 -183785
11306 -183785 -240410 -194509 -216681 -55535 -116797 -181951 -338706 -110539 17576 -64483 -45860
11295 -45860 67164 -16115 -54255 -141316 -35044 -34956 -63588 54538 50624 -27818 65709 114143
11283 114143 42016 73984 143199 80723 -24306 -62641 -68090 -88395 -77355 2807 -76143
11272 -76143 -226737 -67870 61983 -3609 -57227 67112 207367 135010 47329 3674 85527
11261 85527 117091 89524 61433 85595 72409 -231257 -122649 -70163 -3227 -120824 6438
11250 6438 265812 158126 75575 4777 -33251 -109093 -226166 -233588 -148277 -65854 670
11239F70l8839j93781J61997R5394k61013J103K44173R9627p643l2417N2189j75552
11227e4092n5604n0828O8381q3621K31950K8566r5552j6711k0936J34952k565
11216H3940j31599P9594q8702J03092j03260j38422K93767p4357j0723j58335
11206a45005P1058K46360j25247l4091J91842j82386o4542J1820M710j9379M7917
11195C057q0080r5501L9262K35630k13413q5778K04327l1648j79518K51690J35060
11184A83088j89240k60216R8944K03682j16506j87287J79874r868j53841J37695
11174a13675O2318L6920q7378j18268J89579J1386Q7351O4172j57563q0680P8422
11163b7416n5698K18015j56908j58424K31983j23001P4836o8632p7399P6530j8898
$$ plain form
11239 670 -38169 -231950 -69953 25441 -235572 -234469 9704 109331 101688 69271 121460 -54092
11227 -54092 -109696 -160524 -92143 -175764 56186 84752 -10800 -27511 -48447 86505 83940
11216 83940 -47659 31935 -56767 46325 -56935 -195357 98410 24053 13330 -145005
11206 -145005 -73947 172413 47166 13075 204917 22531 -42011 -30191 -25481 -44860 3057
11195 3057 -77023 -172524 -133262 102368 -111045 -196823 7504 -24144 -203662 48028 183088
11184 183088 -6152 -266368 -167424 36258 -80248 -267535 -87661 -97529 -251370 -113675
11174 -113675 -51357 -14437 -101815 -220083 -30504 -19118 68233 132405 -25158 -105838 -27416
11163 -27416 -83114 134901 -22007 -180431 51552 -71449 3387 -65245 -142644 -66114 -85012
11152h5012r9402K12693l5027J03154j26673O7650j2481o1298J3999q7933n8576
11141a68906J90847l0687j45560K59306l1127k1145n9803R5004J18043j23848
11131H2124k99660J88602j19353J05479m648m3043L0863J08875P4306O821l4256
11120I6110j6046P7870j03102L7483L2651j55204k0692n2979l7700K1913Q4646
11109c5050m8096L7981j09271J14307P8361R9830m5442j46155O1948j19230j45231
11098b56048K15052m1925N6333k6924o8965J23601k51596J66997J71379J04779
11088A92683r9466m6949m6006L9145q9749J46386L5994r7432j20993N9095j29601
11077a56893o3522J65284P6365n3100j74718J41390R2761m0316j68535r3180K38821
$$ plain form
11152 -85012 -184414 28279 -6748 96406 -30267 37383 24902 -36396 -22397 -110330 -168906
11141 -168906 21941 -8746 -154306 105000 73873 52728 -7075 87929 205972 82124
11131 82124 -217536 -28934 -148287 -42808 -47456 -90499 -59636 49239 123545 130366 96110
11120 96110 80064 157934 54832 92315 124966 -30238 -50930 -103909 -141609 -119696 -35050
11109 -35050 -83146 -45165 -154436 -40129 38232 138062 92620 -53535 8413 -110817 -256048
11098 -256048 -40996 -82921 -26588 -53512 -122477 1124 -250472 -83475 87904 192683
11088 192683 93217 46268 262 39407 -50342 96044 132038 34606 -86387 -27292 -156893
11077 -156893 -220415 -55131 21234 -31866 -206584 -65194 27567 -12749 -181284 -274464 -35643
11066c5643m5240n6626n6298K2859J88407Q159k01234J30586J25762J21856o0032
11055A42556j09597O378l1680j23299k9624m5017J14335j7272M9255P9780j16255
11044h0440l3230j1250K09776j07667M5616k5275J00039k12245J66297P4494p8657
11033D7458q8508M0020K76859j83070k50082K2710J84912k0677J99j26523Q7602
11022i100m3837N1697m4618p9993J37943j23117L9092M8033o3443J21723o1085
11011b6705j16097J28650M7350J284k8768l0427L37653o1808j23600j8476r1932
11000A7124o0237M7403j78791J04705k9625n6770J18260P9418j2790N7278j90149
10989a04174P6720j25632J85986R8218j97291j35278J19047r3261j77473j3642
$$ plain form
11066 -35643 -80883 -137509 -193807 -170948 17459 25618 -175616 -45030 80732 202588 142556
11055 142556 32959 39337 7657 -115642 -145266 -190283 -75948 -93220 -43965 35815 -80440
11044 -80440 -113670 -124920 84856 -22811 22805 -2470 97569 -114676 51621 126115 47458
11033 47458 -41050 -1030 275829 92759 -157323 -134613 50299 29622 29821 -96702 -9100
11022 -9100 -52937 -1240 -45858 -125851 12092 -111025 -71933 -23900 -87343 34380 -26705
11011 -26705 -142802 -14152 33198 34482 5714 -24713 312940 251132 127532 109056 17124
11000 17124 -43113 4290 -174501 -69796 -99421 -156191 -37931 41487 28697 85975 -104174
10989 -104174 -27454 -153086 32900 131118 -66173 -201451 -82404 -175665 -353138 -366780
10979c66780K58674J02651j18821J23684R0460k0964j87005J29919K751J21138
10969A35707K9015J6858l09407j84877J71923j38643p0690J97622K3738J05956
10959b2798j81415L3874P7891L401o677J17570j42906k8268n911m1490n444K04765
10947B592l7020N6456k3520L3166p9696L4356J61430j32590r3686J61908m9786
10936C3610m5090J51921j59711J0046Q7080p9738Q0488k02044j087J19379k33153
10925b38299J54544O6250n6732j3921q7955J95375m8507n3229J22370j36233M4263
10914e2074n6104O4732k6194P0558j4940j9397O35K17488J7898k42024J12593
10903G3171m2485P1945k02731j3395J18898l4556L0090j05964O8142J78213j22085
$$ plain form
10979 -366780 -108106 -5455 -124276 -592 89868 68904 -118101 11818 14569 135707
10969 135707 164722 181580 -127827 -312704 -140781 -279424 -350114 -152492 -128754 -22798
10959 -22798 -204213 -170339 -92448 -89047 -95724 21846 -121060 -149328 -155239 -196729 -202173 2592
10947 2592 -34428 22028 -1492 31674 -48022 -13666 147764 15174 -78512 83396 33610
10936 33610 -11480 140441 -19270 -9224 77856 -1882 78606 -123438 -124525 -5146 -238299
10925 -238299 -83755 -17505 -74237 -88158 -176113 19262 -29245 -82474 39896 -96337 -52074
10914 -52074 -108178 -43446 -69640 918 -14022 -33419 -32784 184704 202602 -39422 73171
10903 73171 30686 102631 -100100 -113495 5403 -29153 937 -105027 -36885 141328 19243
10892A9243J62950k10227J01131J87542j47117j60223p6777q6567J04323M9638
10882e6084j68057J73018J90025J15479k00884n394K14493k023k80787p4433J27315
10871C2668k9573k70024l9326N0029J61315R2823k37520K09824O6827O847k88304
10860b44414K067K30944J2952o9219K0554J44382j25931j45740Q4454M9096r0803
10849a31658J88424j44765R4643k155J26539M9011o6768j28094O9185j6014J2942
10838E1290j53237r1674J15344N8196k48698j57573K71436K40600l09624n4752
10828b78692L78222J33031k48933j59272L16896l9972l76613o8785J86434M6442
10818a11242N8975j01204R5903J37877Q2518j6784j87673P9275K591k35309p2131
$$ plain form
10892 19243 182193 -28034 73097 260639 113522 -46701 -123478 -210045 -105722 -56084
10882 -56084 -224141 -51123 138902 254381 53497 48103 262596 260573 -20214 -94647 32668
10871 32668 3095 -266929 -306255 -256226 -94911 -2088 -239608 -29784 37043 43890 -244414
10860 -244414 -242347 -11403 1549 -67670 -47116 97266 -28665 -174405 -89951 -40855 -131658
10849 -131658 56766 -87999 6644 4489 131028 180039 113271 -14823 54362 38348 51290
10838 51290 -101947 -193621 -78277 -20081 -268779 -426352 -154916 85684 -223940 -278692
10828 -278692 99530 232561 -16372 -175644 141252 101280 -275333 -344118 -157684 -111242
10818 -111242 -52267 -153471 -57568 80309 162827 146043 -41630 37645 40236 -195073 -267204
10807b67204k6389K7491J03822R3981J004r8848M2684K45884o3416r0413j49773
10796a81177O153k7337k8883r1847J54097R119J33905J16297J25152J48273j09646
10785B54106p7586p7252K3216j96693j24463k6633J34111r7094n7546J96254l7848
10774h7428j3652J96572j24016o925l671L9859j55262n6932J22335J09700l15546
10763b94966J78892R9256J17110j90068J40461J6166L833k7556J03096r1140j71814
10752a16730L8182o6124k02574R3847J98232j1217K8125J19330k0072j99260J28487
10741i774L9748j80726j42244K16544l656o3477J2814L73918j45292j43050J11820
10730F6625K26559l00874j08374Q1986O6932j05018p7205q3337J02608k70935
$$ plain form
10807 -267204 -293593 -266102 -162280 -68299 -67295 -166143 -123459 122425 59009 -31404 -181177
10796 -181177 -175024 -202361 -231244 -323091 -168994 -159875 -25970 90327 215479 363752 254106
10785 254106 176520 99268 122484 -74209 -198672 -225305 -91194 -188288 -245834 -49580 -87428
10774 -87428 -101080 95492 -28524 -35449 -39120 739 -154523 -211455 -89120 20580 -294966
10763 -294966 -116074 -16818 100292 -89776 50685 66851 70684 43128 146224 55084 -116730
10752 -116730 -78548 -144672 -347246 -253399 -55167 -66384 -38259 81071 60999 -138261 -9774
10741 -9774 29974 -150752 -292996 -76452 -80108 -143585 -130771 243147 97855 -45195 66625
10730 66625 293184 -7690 -116064 -34078 32854 -72164 -149369 -232706 -130098 -401033
10720d01033n7223K09138j80642J84222L23671p051R202k14486J8004P1901j07053
10709a51350m5690J06877R3068L2690k13143O2928K3004q9394J24118j22107Q3605
10698i5394K53660j62160m7582J81729N1738q4559j93457J15996J96630j70447
10688D6154l85871J53928K09779j02571r3865J10911J37804n6133N722J87210
10678B13068p0166q4265J60759n9316m9040m7675j10478J00719j33755k9384J50175
10667D0642j8559J25343m8819J63241q2800k56474J06386O4872j53212m1948j39023
10656b40351P8599J24965l3266K6424k33371L1458K28124o9749j39077K48185
10646B1941j0325K557n5631J49952J4336j51145J46844O0615k06504r3365J25116
$$ plain form
10720 -401033 -458256 -249118 -429760 -245538 78133 71082 80284 -134202 -116198 -44297 -151350
10709 -151350 -197040 -90163 2905 35595 -177548 -114620 -91616 -181010 -56892 -178999 -95394
10698 -95394 158266 -3894 -51476 130253 181991 97432 -96025 19971 216601 46154
10688 46154 -339717 -185789 23990 -78581 -172446 -61535 76269 20136 25858 213068
10678 213068 142902 58637 219396 160080 111040 63365 -47113 53606 -80149 -109533 40642
10667 40642 22083 147426 98607 261848 179048 -77426 28960 93832 -59380 -101328 -240351
10656 -240351 -161752 -36787 -70053 -43629 -277000 -245542 -17418 -87167 -226244 21941
10646 21941 11616 14173 -41458 108494 122830 -28315 118529 179144 -27360 -120725 4391
10635D391j8560j06986P0050J02761o8667q9102O5043J06858J7601k2061j01250
10624c9922Q8821p8784k4067r5612m5335J62893r125k1502l4088Q5835J92530
10613A81644n3333O4491j21241j079l2421p2168o3225R3805k78354j56649K88993
10602a49537J51659j2290P1799J05059J45063l68547R8139J50970l74980p2444
10592b55109K22955P0416k56900m8505L82716K41458l18288P3116Q5911j78025
10582A9745k16163J77829l818J08799k10396K36412k14108k4836J07841M3859
10572B5164j40280j0027N9815J31781k28312j051J24369m949j38057J32019O1386
10561A1858k0738o1863N076K7138o2339J7544O9973o9081o46J61346p0743M1804
$$ plain form
10635 4391 -14169 -121155 -51105 51656 -17011 -106113 -41070 65788 83389 61328 -39922
10624 -39922 48899 -29885 -53952 -149564 -194899 -32006 -41131 -62633 -96721 -10886 181644
10613 181644 128311 192802 71561 70482 38061 -34107 -97332 -3527 -281881 -438530 -149537
10602 -149537 2122 -10168 61631 166690 311753 -56794 41345 192315 -182665 -255109
10592 -255109 -32154 38262 -218638 -267143 115573 357031 38743 111859 197770 19745
10582 19745 -196418 -18589 -22407 86392 -124004 112408 -101700 -126536 -18695 25164
10572 25164 -115116 -125143 -65328 66453 -161859 -162910 -38541 -43490 -181547 -49528 11858
10561 11858 -8880 -70743 -65667 -38529 -100868 -83324 -13351 -82432 -83078 78268 7525 49329
10549D9329J1374M472l541k21997J53603J10896k13971J27897o7282R231P6345
10538C6356n5679M2288l6397j131K42387k39140P6830j45576j4924Q1058j17313
10527a31241p7389M5198J51652j21209k84j436K39246p4887L0185Q1125j06849
10516C4111j55025j16072O3002J14031p4361q8042J23205l6270J3055P7340L0400
10505a4626k02182J71029m6660j0737Q9449k8551r0087J37973M2276p9518j81712
10494b13346J67324q2710r2030m5413K18967j47418j30848J21454K96345K8297
10484A20622q3651J90498m774j88470J9117k66239j32176j2214J30942o0589n4650
10473c41584J98986K20396j88902J19244J46063j26301j41534M334L0951o0915
$$ plain form
10549 49329 60703 65175 61634 -160363 -6760 104136 -109835 18062 -49220 -39989 36356
10538 36356 -19323 22965 -13432 -14563 227824 -11316 65514 -80062 -94986 -13928 -131241
10527 -131241 -208630 -163432 -11780 -132989 -133273 -134709 104537 29650 59835 140960 34111
10516 34111 -120914 -236986 -173984 -59953 -134314 -222356 -99151 -135421 -122366 -45026 -14626
10505 -14626 -216808 -45779 -92439 -103176 -13727 -42278 -132365 5608 47884 -31634 -213346
10494 -213346 -46022 -128732 -220762 -266175 -47208 -194626 -325474 -204020 92325 120622
10484 120622 36971 227469 222695 34225 53342 -212897 -345073 -357287 -226345 -286934 -341584
10473 -341584 -142598 77798 -111104 8140 154203 27902 -113632 -109298 -78347 -139262
10463a39262j51750J4054J17015k4138K22962j70616J65079j16462J89091l7705
10453F8268O5782j15460j11554j07263K13639j78949L1114P7720L03207j47465
10443I9039j00162N9528l2981j4407j68651K83266k54297r7012R1881P9190j56823
10432b11429J38332P1551l2992k35410K09457p92j82072J7705J90141j29710P9574
10421h5645m4620Q9257K4123n342K45400l26619L7095J06907k56542n1044J04635
10410a62395J72033o346q2190J22864M8845j093J37762j45652j87187J57554j89367
10399a35172J2957R8691k0934N0272j29601Q4878K45890j34138R2701m7408o595
10388A11541p2500J29966j6612l6608j07990j40172m2048j13430K36587J58303
$$ plain form
10463 -139262 -291012 -276958 -159943 -184081 38881 -131735 33344 -83118 105973 68268
10453 68268 134050 18590 -92964 -200227 13412 -165537 -134423 -56703 246504 99039
10443 99039 -1123 58405 25424 11017 -157634 125632 -128665 -225677 -133796 -54606 -211429
10432 -211429 -73097 -1546 -34538 -269948 -60491 -61283 -243355 -225650 -35509 -165219 -85645
10421 -85645 -130265 -41008 -16885 -22227 223173 -103446 -66351 40556 -215986 -267030 -162395
10410 -162395 9638 3292 -78898 43966 92811 91718 229480 83828 -103359 54195 -135172
10399 -135172 -122215 -23524 -44458 5814 -123787 -38909 206981 72843 165544 118136 111541
10388 111541 39041 169007 152395 115787 7797 -132375 -174423 -287853 -51266 107037
10378A07037k68452Q4991r4516q8837K6346N8098Q7832N9783P2371q8253n9528
10367a03128k7339J35095J6092m4597O9605N9037j51596m9094J30037L9880j69937
10356i5945j9790M4733O923Q0371O5693j34029p5373M5774j41002J04078O7914
10345e0653N7448p4901j87709J21216K03665p1447J45228k12988J75701p2707
10335C2853m0760j38688N1575j5314n0127l0486n6095J93772J2619k7838q0147
10324a48636M6625M0851L4749r2946M0379k9377K2413n0683r1179k7280M3798
10313b11286o9763J34336M9421N7338R3769j37185n7612N9110L5079J49293j66558
10302f4058R0859K02003J6151k56645K847n8582K6044j74716J39730j7754L592
$$ plain form
10378 107037 -161415 -76424 -170940 -259777 -233431 -175333 -87501 -27718 44653 -43600 -103128
10367 -103128 -130467 4628 20720 -23877 45728 104765 -46831 -95925 34112 73992 -95945
10356 -95945 -115735 -71002 -64079 16292 81985 -52044 -127417 -81643 -222645 -118567 -50653
10345 -50653 6795 -68106 -255815 -134599 69066 -2381 142847 -70141 105560 32853
10335 32853 -7907 -146595 -95020 -110334 -160461 -190947 -247042 -53270 -40651 -68489 -148636
10324 -148636 -102011 -61160 -26411 -119357 -78978 -108355 -85942 -136625 -227804 -255084 -211286
10313 -211286 -281049 -146713 -97292 -39954 53815 -83370 -140982 -81872 -46793 102500 -64058
10302 -64058 26801 228804 244955 -11690 -8843 -67425 -41381 -216097 -76367 -94121 -90529
10291i0529j0829J91211j12255J04366j03078j11887M4724N2991l4302j10776
10281a80364N650J59606J58665j80840K415J10252R0985j53842m9498m6519O4414
10270a9076k63303k416N319K22864Q1202k49889P2431J05495K2628r7269N4427
10259f7587M9016j93946K9771K9602P5053j1625J77349J66374q3254j29711J79985
10248B21027k53745P5087j24257O3779n6296J5506j7459J7845K2984Q7679r6675
10237d4525j9747J55029k04145L1P1154P0904o9369p1197p7656J39492o3862K6192
10225h7699k0019R9202J23249o109k73421R3769k2214N6010l7013q1741J45173
10214a0813O2631j46402J62602q6803j422j34616q593J28067n6095k00412K30672
$$ plain form
10291 -90529 -101358 89853 -22402 81964 -21114 -133001 -88277 -35286 -69588 -180364
10281 -180364 -174714 -15108 143557 -37283 -34868 75384 166369 12527 -36971 -83490 -19076
10270 -19076 -282379 -284795 -279476 -56612 24590 -225299 -152868 -47373 -24745 -122014 -67587
10259 -67587 -18571 -212517 -182746 -153144 -78091 -89716 87633 254007 170753 41042 221027
10248 221027 -32718 42369 -81888 -18109 -74405 -58899 -76358 -58513 -35529 52150 -44525
10237 -44525 -64272 90757 -113388 -113357 -42203 28701 -40668 -111865 -189521 -50029 -113891 -87699
10225 -87699 -107718 -8516 114733 108624 -164797 -71028 -93242 -37232 -74245 -155986 -10813
10214 -10813 51818 -94584 68018 -18785 -20207 -154823 -163416 -35349 -91444 -291856 -61184
10203f1184o3527j66859K68717L8343M6707O53o8994K10723l20330m8628K45802
10192H1423q3459J2672K403J53074r5449k19044J80133K27737k17743l924J24097
10181A61920j55461k70220P3381J44689R7719j92405K93205J08599l14206M7245
10171e534L05942p2139j21625k19719Q6673k4080m1824J04773J13539M5256Q2765
10160B54027R4391J72411j44832k32738O0169k2555J78712o0825n2033J47444
10150C94171l1504J34812K95780J62042M4531R3985n7321j1065n382P424j35799
10139H91674j88609k6554K61651l67352k3215J57121M0111p1298p6277n1117j75110
10128C71025j85385j16947K19556j99258n9280Q2022M9957O394N5084M6062J19200
$$ plain form
10203 -61184 -124711 -291570 -22853 15490 62197 62850 -6144 204579 -115751 -164379 81423
10192 81423 -2036 10636 13039 166113 70664 -148380 31753 259490 41747 37823 161920
10181 161920 6459 -263761 -190380 -45691 52028 -140377 152828 261427 -52779 -5534
10171 -5534 300408 228269 106644 -113075 -26402 -50482 -92306 12467 126006 171262 254027
10160 254027 348418 520829 375997 143259 203428 180873 359585 298760 246727 394171
10150 394171 362667 497479 793259 955301 999832 1093817 1036496 1025431 1020049 1027473 891674
10139 891674 703065 676511 938162 570810 547595 704716 744827 673529 597252 546135 371025
10128 371025 185640 68693 288249 88991 29711 111733 161690 168084 223168 269230 388430
10117C88430k95667l09L6384N7418j54192K8168M3596J49578j42526p0215J53670
10106A94335J94979n5411j07217o8748K41034k16015k02884J90470r5581j5747
10096E9215p0348n8985J18778p9932n1939N3317j48495J35502j78866p9481K03722
10085i7512J23295M6081J39666j47097K85285m32817Q8187m6848j78140M5672
10075a74228P0785m6630J92429k26529L13941j28658p1487J64924J88403o2046
10065B20904o0497n6242j91850J47289j50685N795j74054K12076m1401J00204
10055A1539J37452J19276k40624J81096k84255J6749N8040K2815j20588J90449
10045I1949J33420J75731M4217k9701j64104j09300n0304Q3601k01735K4080L866
$$ plain form
10117 388430 92763 92454 128838 186256 32064 60232 103828 253406 110880 40665 194335
10106 194335 389314 333903 226686 157938 398972 182957 -19927 170543 74962 59215
10096 59215 -11133 -70118 48660 -31272 -83211 -29894 -178389 -42887 -221753 -301234 -97512
10085 -97512 25783 71864 211530 64433 349718 -83099 5088 -41760 -219900 -174228
10075 -174228 -103443 -150073 42356 -184173 129768 1110 -70377 94547 282950 220904
10065 220904 160407 104165 -87685 59604 -91081 -85286 -259340 -47264 -88665 11539
10055 11539 148991 268267 27643 208739 -75516 -58767 -727 22088 -98500 91949
10045 91949 225369 401100 445317 415616 251512 142212 91908 175509 -26226 -2146 1720
10034A720O3334r9518k6172K33996K4689j44488O3956o7883j19319J13956P685
10023E1956j17394J32780Q9458n1391m2772j7804R4781j88592J09504J23960N970
10012A90456k41803J68775k5555k267j3416r86J54835q7542j1775J81891k23343
10001H9270K38240r1550j09862K6302j12330J51023k2627p3835K68066l7360p0193
9990B55144J57809o3403j25089N2624k4329P1050J7117q0808R3939k6630O2495
9979C89919J05276j3461k4803n8748J53745j31843j16556Q6368J0462p0820J22314
9968D51853M336k08465J95233j52370m577K85864L1704k9082k03922Q4167n7677
9957C97064j30322r8411J81800m547Q7766Q3750k4805J63238j87344j2348K08533
$$ plain form
10034 1720 65054 -34464 -60636 173360 198049 53561 117517 49634 -69685 44271 51956
10023 51956 -65438 67342 156800 105409 62637 44833 139614 -48978 60526 184486 190456
10012 190456 -51347 117428 91873 89606 76190 75204 230039 142497 130722 312613 89270
10001 89270 327510 235960 126098 152400 40070 191093 168466 94631 362697 325337 255144
9990 255144 412953 349550 224461 277085 252756 323806 340923 260115 354054 327424 389919
9979 389919 495195 481734 456931 398183 551928 420085 303529 389897 400359 329539 451853
9968 451853 456189 247724 442957 290587 286010 571874 603578 574496 370574 454741 397064
9957 397064 266742 168331 350131 345584 433350 517100 492295 655533 468189 455841 664374
9946F64374q3023R1032j56382k24908J87285j2593J45108o8162k9351J46851j20197
9935E40034J1196M8083K04969j37191R741J44190m2702k22254j34930K52456j45796
9924E27796j62319p2913K10237q5999j25960K77575J38026p8485J08420R1158
9914H27536Q0394j93590P9545l9572N6113k68045j23486J67599K33085o4400o8778
9903F86401J69013K39963k41903J27390K67147P0713j56697q058p8808q8083p5910
9892I11168K0668r4457k1432K07685k6920m4893J98931K31861P8589k03966K03018
9881A460252J85202n17959O6457J14974k2536p4215O8437Q1947j1854j05569P6185
9870A321321O9845k905o3611J92849L651K6329p5568J26832R3454n9462J6358
$$ plain form
9946 664374 581351 672383 516001 291093 478378 465785 610893 542731 513380 660231 540034
9935 540034 551230 599313 804282 667091 676832 821022 778320 556066 421136 673592 527796
9924 527796 365477 292564 502801 416802 290842 568417 706443 627958 736378 827536
9914 827536 907930 714340 793885 754313 810426 542381 418895 586494 819579 755179 686401
9903 686401 855414 1095377 853474 980864 1248011 1318724 1162027 1153969 1075161 987078 911168
9892 911168 931836 837379 815947 1023632 996712 951819 1150750 1382611 1461200 1257234 1460252
9881 1460252 1645454 1127495 1193952 1308926 1286390 1212175 1280612 1362559 1350705 1245136 1321321
9870 1321321 1391166 1388261 1324650 1517499 1521150 1547479 1471911 1598743 1692197 1632735 1649093
9859A649093r2455K3313J25552j32250J73515J21368p7604j47516J45640J27400
9849A916056K26925j30144J88052J44825r5140P1431j17285J96587J12311j33345
9839B380273L22307K25174j11J75307R7118J40836J11182k306K34516j41419J70455
9828C713332J14644L1334R3421R4629K14062K91658M323L50745J74134K33113
9818E315395J24480Q2885L03431L05604L68146J39031L19588L92685J27939K11611
9808G690795J87514J66817N38939L13907K72833R7696L06593M75725N79655N9023
9798A0689497P45084L90252O70951N97839P84347J111229Q45431J096272J346944
9789A8277846J166312J561739J732021K128858K567118K516130K998022L349302
$$ plain form
9859 1649093 1556638 1579951 1705503 1573253 1746768 1868136 1790532 1643016 1788656 1916056
9849 1916056 2142981 2012837 2200889 2345714 2250574 2322005 2204720 2401307 2513618 2380273
9839 2380273 2702580 2927754 2927643 3102950 3200068 3340904 3452086 3449780 3684296 3542877 3713332
9828 3713332 3827976 3859310 3952731 4047360 4261422 4553080 4557403 4908148 5082282 5315395
9818 5315395 5439875 5522760 5826191 6131795 6499941 6638972 6958560 7351245 7479184 7690795
9808 7690795 7878309 8045126 8584065 8897972 9170805 9268501 9575094 10050819 10630474 10689497
9798 10689497 11434581 11824833 12495784 13093623 13877970 14989199 15834630 16930902 18277846
9789 18277846 19444158 21005897 22737918 24866776 27433894 29950024 32948046 36297348
9781C6297348M227098N147584N922029P439387R410233J0994544J2596840J3437835
9773A05472898J3315655J3010767J2602442J2511609J1317923P966858M138217
9766A80336369J8729k992353n264488p152938r544386j1745887j3145238j3876512
9758A16633296j3563148j2727030j1569508j0190213q536825p269961o068806
9751D6707805n041152m205601l463542l000960k600136k062055j894269j478708
9743B2961382j659059j312550j067887j273991j051440r16983o60602p72456q90688
9734A3355726l81951n65288o07620m71429l99803l14701n07587n21969l15289
9725I270089l42538l01145k14202l05793k63207l16968j06611j85288l58408J4154
$$ plain form
9781 36297348 40524446 45672030 51594059 59033446 68443679 79438223 92035063 105472898
9773 105472898 118788553 131799320 144401762 156913371 168231294 176198152 180336369
9766 180336369 180355098 177362745 172098257 164945319 155400933 143655046 130509808 116633296
9758 116633296 103070148 90343118 78773610 68583397 60046572 52776611 46707805
9751 46707805 41666653 37461052 33997510 30996550 28396414 26334359 24440090 22961382
9743 22961382 21302323 19989773 18921886 17647895 16596455 15679472 15018870 14246414 13355726
9734 13355726 12973775 12408487 11800867 11329438 10929635 10614934 10107347 9585378 9270089
9725 9270089 8927551 8626406 8412204 8106411 7843204 7526236 7419625 7234337 6875929 6890083
9715F890083k83750k61769k89736l27708j84252k55601k57046o0701p0923j82115
9705D716482M9m1143R1520j75849j60686l3431j63070j03340j23785L370j85082
9694C825035j78135j5351n543j45117Q6864j37909r8972k03612J21674n0605j32407
9683C065922j01873k6211K283k99888P1268n389q7917j34627J5945K0013l2362
9672B487164j74612K09717r6654J27260J693J6144p1834J40505k13098j32974
9662B293311q0390J8893j63126n6486R9603p3043k24641J37914J71608J43711
9652B267354k06522K7915K1895k75383L0596K16570L619R9229K03204R5465M22981
9641B906923O11700M25096M69149J5522R2044k79565n77855j18256m76749l90445
$$ plain form
9715 6890083 6606333 6344564 6054828 5727120 5542868 5287267 5030221 4969520 4898597 4716482
9705 4716482 4716531 4675388 4766908 4591059 4430373 4396942 4233872 4130532 4006747 4010117 3825035
9694 3825035 3646900 3631549 3626006 3480889 3567753 3429844 3330872 3127260 3248934 3198329 3065922
9683 3065922 2964049 2937838 2940121 2640233 2711501 2706112 2618195 2483568 2499513 2519526 2487164
9672 2487164 2312552 2522269 2425615 2552875 2554568 2570712 2498878 2639383 2426285 2293311
9662 2293311 2212921 2231814 2068688 2012202 2111805 2038762 1814121 1952035 2123643 2267354
9652 2267354 2060832 2088747 2110642 1835259 1865855 2082425 2086044 2185273 2388477 2483942 2906923
9641 2906923 3518623 3943719 4412868 4428390 4520434 4240869 3663014 3544758 3068009 2677564
9631B677564k92068j09121j36718n5837j17157N7762k35030j21088J22239J480
9621A792026k10741l0687l6512m0893j76165R7256J14328k07941Q6931o8274j66419
9610A152909J16303K587k0627m0296J0330j39428Q1730K2823O4328k2589k38908
9599I89162J56930R3762j29095j34693k3043M9701j35111J72550P0920n2198o6751
9588I92134R4008J15549j01241O201O93J9225J37869j12898L3854k33947L3387
9577I84834r4333m5038P4186o4791p8055K2446R9057k78228j66123K71715R9171
9566H24841j64972M5955K51614r6959j04414K75273J0480K69467J1258M50955
9556A773498K37343P2301L90225K44648J45532K10439j52852k15390l34403k50962
$$ plain form
9631 2677564 2385496 2276375 2139657 2083820 1966663 2024425 1789395 1668307 1790546 1792026
9621 1792026 1581285 1550598 1514086 1473193 1297028 1394284 1508612 1300671 1387602 1319328 1152909
9610 1152909 1269212 1271799 1251172 1210876 1221206 1081778 1163508 1186331 1250659 1228070 989162
9599 989162 1146092 1239854 1110759 976066 953023 1002724 867613 1040163 1111083 1058885 992134
9588 992134 1086142 1201691 1100450 1106651 1107344 1126569 1264438 1151540 1185394 951447 984834
9577 984834 890501 845463 919649 854858 776803 799249 898306 620078 453955 725670 824841
9566 824841 659869 705824 957438 860479 756065 1031338 1041818 1311285 1322543 1773498
9556 1773498 2010841 2083142 2473367 2718015 2863547 3073986 2921134 2705744 2371341 2120379
9546B120379j49538k54829j69898r8507q7299K00817k0095j4606m3068j0010j88797
9535A284549o5342K0555q6259j62045O7038j4038J42811j2961J6306K0965k04582
9524A006997K84969j43816j37385k730J08909l77802j36589n623J72571l0105
9514G39396n2224M6549J58637N6096o1279K4816o7853q0209J34623K29453J7268
9503A145273Q6582l0595R5520J69209j50742K41469J16804K6654j97799j85136
9493A317239o284N4359j63536J33098P0762N9966j79043j90406J73856L9312k14316
9482A095007n0180m349j27156k15901j6583P5046n7872j79028J3165K60512j62938
9471F29723r0202O9070Q6871k36013M765J75159j2225P7621m794p4713J4364j75378
$$ plain form
9546 2120379 1970841 1716012 1546114 1447607 1360308 1561125 1541030 1526424 1483356 1473346 1284549
9535 1284549 1219207 1239762 1153503 991458 1058496 1044458 1187269 1174308 1190614 1211579 1006997
9524 1006997 1291966 1148150 1010765 1008035 1116944 739142 602553 596930 769501 739396
9514 739396 687172 733721 892358 948454 887175 911991 844138 763929 898552 1128005 1145273
9503 1145273 1231855 1201260 1296780 1465989 1315247 1556716 1673520 1700174 1502375 1317239
9493 1317239 1310955 1365314 1201778 1334876 1405638 1465604 1286561 1096155 1270011 1309323 1095007
9482 1095007 1044827 1040478 913322 697421 680838 755884 698012 518984 532149 792661 629723
9471 629723 539521 608591 695462 459449 464214 639373 627148 704769 699975 625262 639626 464248
9459D64248J04521j7190j39928J8749j83531J73628l0352K4806J48157K472j4124
9448E51456L5301J1055K5738j9938k03612K42398j25261L6194P875M6981k09111
9437C99076m4954J71143j05931L3459R3604J53538n5705m5078K6152j45281j47600
9426C32423J88719k8005j19318k5372N1398J31305k20127J59814P3714p9407j05940
9415C59204L49678o0275O1499l7461J22423k4629O377K3360J3619k55456m8193
9404E10146p7050K34282k3670k5723O4036P9319J68766J49503J13459O073Q120
9393A207261j99045L31189R0706j09888j48715K29429J2388k6066J51632J15239
9383A654130K821q9866o6810k30520m0924J550O480k24024j78422l995J26838
$$ plain form
9459 464248 568769 551579 411651 430400 246869 420497 390145 414951 563108 565580 551456
9448 551456 586757 597812 623550 603612 400000 642398 517137 553331 561206 608187 399076
9437 399076 354122 525265 419334 452793 546397 699935 644230 599152 625304 480023 332423
9426 332423 521142 493137 373819 348447 399845 531150 311023 470837 544551 465144 359204
9415 359204 708882 648607 710106 672645 795068 770439 776816 800176 813795 558339 510146
9404 510146 433096 667378 643708 617985 682021 761340 930106 1079609 1193068 1199141 1207261
9393 1207261 1008216 1339405 1430111 1320223 1171508 1400937 1413325 1387259 1538891 1654130
9383 1654130 1656951 1567085 1500275 1269755 1228831 1230381 1236861 1012837 834415 830420 957258
9372I57258m998J13820J78988l46787N3894k9543j0062k7742L2182J51414k0919
9361A047505j4663J15547k03215P3191J2932J97361J27437j02245J3265L50550
9351A617665j91606J66931p8697j0058J02484q1006k9466p932k19061J14156j29629
9340A253781Q2448J98134j34837j18110J2837n9592M3415j25919J95727O083j46704
9329A207263m0615K10844k54143K2481K2001N6737J12155o2433J01165k03289
9319A172166J7643P6380J44909j48363K18008j02231j1066R3004P3200J44445
9309A678095k8301m9990K77117l01360L71593J80746j74741K6433K09329r9662
9299B089259J24413k08485J19740O075j9787O0093p6669q4476J67929p1321j43891
$$ plain form
9372 957258 952260 1066080 1245068 898281 952175 922632 912570 884828 917010 1068424 1047505
9361 1047505 1032842 1148389 945174 1018365 1031297 1228658 1356095 1253850 1267115 1617665
9351 1617665 1426059 1592990 1514293 1504235 1606719 1525713 1496247 1488315 1269254 1383410 1253781
9340 1253781 1336229 1534363 1399526 1281416 1294253 1234661 1278076 1152157 1347884 1353967 1207263
9329 1207263 1166648 1377492 1123349 1145830 1167831 1224568 1336723 1274290 1375455 1172166
9319 1172166 1189809 1266189 1411098 1262735 1480743 1378512 1367446 1460450 1533650 1678095
9309 1678095 1649794 1599804 1876921 1575561 1947154 2127900 1953159 1979592 2188921 2089259
9299 2089259 2213672 2005187 2124927 2131002 2111215 2171308 2094639 2010163 2178092 2106771 1962880
9288A962880p8600j33046J14988j67991K87468o2433j65934M8246R7790r4041
9278A809327o8887O9890n484j08288Q4818O6149j26077q6140K28890J98187l5643
9267B026742J39559k553q6767j6706R55K3818L9821J34290m0789L6039K01441
9256B455850K39545j36832k8371K37864j20603J6529j7577J42960q2586j24048
9246B582731K88245o2659P3055J53370R8856j67803K27144J80264j70810M0816
9236C243209M8751K35736j07100K53065J55367q234L7584J70689o951K22380K09767
9225D454263j19221J1154O1487K17286j7792L6238K37123M25022N9548K82882
9215E647990J7617K49312K56884L48803J2936k2838K95588J70123R0902J85838
$$ plain form
9288 1962880 1884280 1751234 1866222 1698231 1985699 1923266 1757332 1805578 1903368 1809327
9278 1809327 1740440 1810330 1804846 1696558 1781376 1847525 1721448 1635308 1864198 2062385 2026742
9267 2026742 2166301 2163748 2076981 2060275 2061230 2085048 2124869 2259159 2218370 2254409 2455850
9256 2455850 2695395 2558563 2530192 2768056 2647453 2663982 2646405 2789365 2706779 2582731
9246 2582731 2870976 2808317 2881372 3034742 3133598 2965795 3192939 3373203 3202393 3243209
9236 3243209 3291960 3527696 3420596 3673661 3829028 3820794 3858378 4029067 4022116 4244496 4454263
9225 4454263 4335042 4346196 4407683 4624969 4607177 4643415 4880538 5305560 5365108 5647990
9215 5647990 5665607 5914919 6171803 6520606 6533542 6510704 6806292 6976415 7067317 7253155
9205G253155K88171O4663K67863K88210K09838L16103M16212L10186J20046K86109
9195I820556O79802L43928J04833M46755R15233N30140O24253P69835Q65537R77621
9185A6078493Q77257J075247R19748P44590Q17338N67535M35168L55827J70422
9176B2041625L37698N28754N95018P92763Q00664J048426J400555J529798J721704
9167C0797005K067908K162796K687794K686353L407833L497651M045144M606732
9159E5959216N170549O006583O723759Q077761R438459J1212403J3446274J6616603
9151A32651607K0940554K5756979L1039788L5981322L7349273L3743131K6138980
9144C43601634J8138397J1540227N430547j211142q856389j6678692k3612640
$$ plain form
9205 7253155 7541326 7605989 7873852 8162062 8371900 8688003 9104215 9414401 9534447 9820556
9195 9820556 10500358 10844286 10949119 11395874 12311107 12841247 13465500 14235335 15100872 16078493
9185 16078493 16955750 18030997 18950745 19695335 20512673 21080208 21515376 21871203 22041625
9176 22041625 22379323 22908077 23503095 24295858 25096522 26144948 27545503 29075301 30797005
9167 30797005 32864913 35027709 37715503 40401856 43809689 47307340 51352484 55959216
9159 55959216 61129765 67136348 73860107 81937868 91376327 102588730 116035004 132651607
9151 132651607 153592161 179349140 210388928 246370250 283719523 317462654 343601634
9144 343601634 361740031 373280258 378710805 377499663 368643274 351964582 328351942
9137C28351942k8735120l1098295l1133555k9557988k6940012k3522981k0145384
9130A37218607j6805033j4150079j1817091r671071p868069o666959n687735m661898
9122E9890672l961940l718573l294272k829737k520442k623152k094009k071456
9114C6777091j838311j877043j489149j484728j365863j335452r49813q71089
9106B5565643q43398n83047n99418m34554m01313l42330m17702l87701p07180
9097B0849000n83401r13572q50021r38984p79315p78616o43968o23806n67587
9088A4169730n54204n26366n12243l66176l61107l40750l82330j08108l22835
9079A0695611j94609j05587k11123l20572l14467O8196k54033j36935K3324m2220
$$ plain form
9137 328351942 299616822 268518527 237384972 207826984 180886972 157363991 137218607
9130 137218607 120413574 106263495 94446404 84775333 76907264 70240305 64552570 59890672
9122 59890672 55928732 52210159 48915887 46086150 43565708 40942556 38848547 36777091
9114 36777091 34938780 33061737 31572588 30087860 28721997 27386545 26436732 25565643
9106 25565643 24722245 24139198 23539780 23105226 22703913 22361583 21943881 21556180 20849000
9097 20849000 20265599 19352027 18502006 17563022 16783707 16005091 15361123 14737317 14169730
9088 14169730 13615526 13089160 12576917 12210741 11849634 11508884 11126554 11018446 10695611
9079 10695611 10501002 10395415 10184292 9863720 9549253 9617449 9363416 9226481 9249805 9207585
9069I207585l04440m8820o0620q9064j47297j2560k02956k76752j95069q4371
9059G785636k05786k00226L5647j53681j71760k0744J6178l71028l00467M7366
9049F461135m16265q4959j48013M4237j68593O8624o2173k47293j17883n0866
9039E277951j79084k10657R4352l00912j55538k57951O4997k33439j64528P294
9029C942485q9486k24415J29083m8010p1439j71496J67546j50967l10181J96071
9019C369191J2339r2334r517O8065r0207m7695J33318j53632j78649j8720L9938
9008C032097j31219j02197Q5528j24248r8838j3056m8819p4673o7349j11995j41479
8997B203752n5197M9283O999k57604r163K31547L8833j72850L4826K7090P3464
$$ plain form
9069 9207585 8903145 8854325 8793705 8704641 8557344 8544784 8341828 8065076 7870007 7785636
9059 7785636 7579850 7379624 7415271 7261590 7089830 7069086 7085264 6714236 6413769 6461135
9049 6461135 6044870 5959911 5811898 5856135 5687542 5756166 5693993 5446700 5328817 5277951
9039 5277951 5098867 4888210 4982562 4681650 4526112 4268161 4333158 4099719 3935191 3942485
9029 3942485 3852999 3628584 3757667 3709657 3638218 3466722 3634268 3483301 3173120 3369191
9019 3369191 3381530 3289196 3279679 3347744 3257537 3209842 3343160 3189528 3010879 2992159 3032097
9008 3032097 2900878 2798681 2884209 2759961 2661123 2648067 2599248 2524575 2457226 2345231 2203752
8997 2203752 2148555 2197838 2204837 1947233 1938070 2169617 2208450 2035600 2070426 2097516 2170980
8986B170980p5303p4312j08363q8593J40302j73796l2326n3218k72126J2630K5618
8975A471493n2126j00551j9595J38911J453j29500K33551q7812q2193j25524j68023
8964A080084j8140m8468Q4559j565N9656Q0726k725j93657J49326n2678J14536
8953A251654j50136q7850p2269r4581j69591J32401O8863j55150l2860n9044O1357
8942F92794p7040l90420J45971J32536j03944p9681J18024j5618k37235N4262
8932B39649L15760L9828l00276J12353J27218Q6023k91971L8030J31762k7527
8922D70849j47940P3255k4440K28912n2712j32573K48106J0619N2354j20153j31522
8911D74755P0842k04654p3807K6478j45626L46151J06885j25019k6771O5009J92383
$$ plain form
8986 2170980 2095677 2021365 1913002 1824409 1964711 1790915 1758589 1705371 1433245 1445875 1471493
8975 1471493 1419367 1318816 1299221 1438132 1439585 1310085 1543636 1455824 1373631 1248107 1080084
8964 1080084 1061944 1013476 1098035 1096470 1156126 1236852 1234127 1040470 1189796 1137118 1251654
8953 1251654 1101518 1013668 941399 846818 677227 809628 878491 723341 690481 631437 692794
8942 692794 615754 225334 371305 503841 399897 320216 438240 422622 185387 239649
8932 239649 555409 595237 294961 407314 534532 620555 328584 366614 498376 470849
8922 470849 322909 396164 371724 600636 547924 415351 663457 674076 726430 606277 474755
8911 474755 545597 340943 267136 293614 147988 494139 601024 476005 449234 514243 706626
8900G06626j71840j47711K17431j58412n4888M6807J22050j29728J64122j8468
8890E75989j25948q6279J65455M17k24451q9195K28837j6577j21655J14159J28812
8879E49564N0651J07238j0833p4085J0889Q7262j45665k17154J45177O5919j06556
8868D62407j80321o9390J84255K8306j05312J03016J0686Q2465j73558P476J74475
8857E24505R5395k24177j05059K14740O1092k07630R1344J8652j83220J32828
8847D18470J95785j56453j39903J79756K67857j76106P5462K11538P7619k54045
8837F99980Q213m370j96898j13071R8849k63927J65539l3583M3252o9391J00770
8826D35363J61180k23518k5963K76231j17262r0599K2967J43885P6715k55938
$$ plain form
8900 706626 534786 387075 604506 446094 391206 438013 560063 430335 594457 575989
8890 575989 450041 363762 529217 529634 305183 215988 444825 428248 306593 420752 549564
8879 549564 600215 707453 696620 622535 633424 720686 575021 357867 503044 568963 462407
8868 462407 282086 212696 396951 425257 319945 422961 433647 516112 342554 350030 524505
8857 524505 619900 395723 290664 505404 566496 358866 450210 468862 285642 418470
8847 418470 614255 457802 317899 497655 765512 589406 664868 876406 954025 699980
8837 699980 708193 703823 506925 393854 492703 228776 394315 360732 403984 334593 435363
8826 435363 596543 373025 347062 623293 506031 415432 438399 582284 658999 403061
8816D03061J12557J21597m6809Q5838j13513j47214K10878j18857M4704o1981
8806D90261k69921J17117K155J07461J25603j41727J22568J12120k1226k0440
8796F23971p905J74451J65490k14615J97677j17701M3994j2785P452J30166J18079
8785A108274j52746L02736j73131m7566l5372o2364o2865m6809k20743Q1577R6594
8774G87585l22167Q7187R4784j19389j14579r854K26463n5591j24096K94339q7723
8763F56959p6931j31920M2903J45902k7005Q7269R1084k9087l0054J02461j4513
8752H17068M4284n8459J10558L6718j52781J40582J16288J7969l18183q6639K44668
8741I12073j90371j71521p0462N9516K3565q9586O423j2783m0265K36677j03630
$$ plain form
8816 403061 515618 637215 590406 676244 562731 415517 626395 507538 552242 490261
8806 490261 220340 337457 339612 447073 572676 430949 553517 665637 644411 623971
8796 623971 616066 790517 956007 741392 939069 821368 865362 852577 860029 990195 1108274
8785 1108274 955528 1258264 1085133 1037567 1002195 939831 876966 830157 609414 690991 787585
8774 787585 465418 552605 647389 528000 413421 403567 630030 574439 450343 744682 656959
8763 656959 580028 448108 491011 636913 609908 697177 788261 759174 729120 831581 817068
8752 817068 861352 802893 913451 950169 797388 937970 1054258 1072227 754044 667405 912073
8741 912073 721702 550181 479719 539235 562800 473214 479637 466854 426589 663266 559636
8730E59636o0584J23116n5909L9891R0365k03593J4000j95292j30457M3460N7630
8719B82263K00653k88348J29518m6149L8736O6903J47150j65447l2192j70055
8709A63032J87494j40237j10337M9162o635k99483K1159K33443J23466r0856M8839
8698A79047J875R5326j69423P1784J69050j12843l0824m4871j35040J26330N1514
8687B01925J06099m31J1794P5001j01488j47574j3581L4511j81803L2199j35186
8676a18534O0806K6314j6951L2054K69785J01746o6932l07112J81046J20514J18438
8665D01174k62182K04155j85474j4411J8024L7808n2778K8175J44501n1291j62486
8654A05215Q3480j56819O7882l5764o876O4635j43104O5228L0850J0936j6367
$$ plain form
8730 559636 499052 622168 566259 606150 696515 492922 506922 311630 181173 224633 282263
8719 282263 482916 194568 324086 277937 316673 383576 530726 365279 333087 163032
8709 163032 350526 210289 99952 149114 142479 -157004 -135845 97598 221064 130208 179047
8698 179047 180922 276248 106825 178609 347659 234816 203992 159121 24081 150411 201925
8687 201925 308024 307593 319387 394388 292900 145326 131745 166256 -15547 16652 -118534
8676 -118534 -57728 -31414 -48365 -16311 253474 355220 288288 -18824 162222 282736 401174
8665 401174 138992 343147 157673 143262 161286 199094 146316 174491 318992 267701 105215
8654 105215 188695 31876 99758 63994 57118 121753 -21351 43877 74727 85663 69296
8643F9296K7453q915O7857o3548N6327o0094M48J29217Q8620l1099J03560j21552
8631B57570J01717p5256j31028J25280j08454O6788J8774j71338J09218L2252
8621B25523p5264j67520J43080L1070O4339M6629J41157K733L659o2165Q7821
8610D41062m8115J25370q6536O3933J29973J55159j84214o4524K44737K48175
8600A025020J46300Q7034L51794l2028j16358L96926L93822L76939N10436P43678
8590C883563Q63302Q03075O60464J03751l18521o27594l06753p53078n78775o64875
8580C064559m73298k92042m03846l57607k44682k75947O0040o0956j30702J30808
8570A016327j57378j0404K6036j02897j19854j70789j3562o3090k38737M0955
$$ plain form
8643 69296 96749 87834 155691 92143 148470 88376 88824 218041 306661 275562 379122 257570
8631 257570 359287 284031 153003 278283 169829 236617 255391 84053 193271 225523
8621 225523 150259 -17261 125819 156889 221228 267857 409014 411747 415406 353241 441062
8610 441062 392947 518317 431781 495714 625687 780846 596632 532108 776845 1025020
8600 1025020 1171320 1258354 1610148 1578120 1461762 1858688 2252510 2629449 3139885 3883563
8590 3883563 4746865 5549940 6210404 6314155 5995634 5368040 5061287 4308209 3729434 3064559
8580 3064559 2591261 2299219 1895373 1537766 1293084 1017137 1077177 1016221 885519 1016327
8570 1016327 858949 848545 874581 771684 651830 481041 467479 404389 165652 206607
8560B06607n7103j06974J26285j17394J83344J05731j09918j6298j61706K24678
8550B77252J779j45712m6492j7841J92967j0047j35020Q5811n1095K35702Q4899
8539D72203k38971M6467q5434n4796j953m2232j15322n4733Q973M3275j00396
8528a22919J82531K7893j37795J1671K87677J5709j95829p0256K27357j2267j87723
8517B6049k4151M8367J8943J91960p4664q0525k441J39191k18729p6118n9907
8506a12025P3802M0811j75115O2902L6291M9326J20636j71394L1526M4649j24168
8495a22759J91261p1739K22639O3006q0101o2018L343J47101J33138l48528J47311
8484B22654l2727j0860j98208l0732K46089k7093l49206O4011J2265J51449j68864
$$ plain form
8560 206607 149504 42530 168815 51421 234765 340496 230578 214280 52574 277252
8550 277252 279031 133319 86827 68986 261953 251906 116886 202697 151602 387304 472203
8539 472203 233232 279699 194265 139469 137516 95284 -20038 -74771 -65798 -22523 -122919
8528 -122919 59612 87505 -50290 -38619 249058 264767 68938 -1318 226039 213772 26049
8517 26049 1898 50265 69208 261168 186504 105979 103538 242729 24000 -52118 -112025
8506 -112025 -38223 2588 -172527 -109625 -73334 -24008 96628 -74766 -43240 1409 -122759
8495 -122759 68502 -3237 219402 282408 202307 140289 143632 290733 423871 75343 222654
8484 222654 189927 179067 -19141 -49873 196216 169123 -180083 -116072 -103807 47642 -121222
8473a21222l0680L65540k49374j08521n8970J21965j10379Q5600J40714L9989
8463G4662M2585j06420J4637J21206j00245j33085K55016j25625k27066O2780
8453a21555r2377J07775o4687M5464J55479o6642j44068J93461m8522k6620K5109
8442c7183m554O8845J8712K8796j46210J36548m9542o0938j63038J54075R5021
8431D0532K08614j04705P1639q2571Q2770j89625k3776J11851P5593j30288p0810
8420a0776p7097J9452r588j02608K0288K6481O4386p9035K00961Q0110K9371k0914
8408A41031n1909r2552M2503l9484J05292j60755J0922J10375R1256j48554p0431
8397f2306N7289P5769n5010m4938n2644N6230L075l134k8982o6233Q3924n8094
$$ plain form
8473 -121222 -151902 213638 -35736 -144257 -203227 -81262 -191641 -106041 34673 74662
8463 74662 117247 10827 25464 146670 46425 -86660 168356 42731 -184335 -121555
8453 -121555 -213932 -106157 -170844 -125380 30099 -36543 -180611 12850 -35672 -62292 -37183
8442 -37183 -41737 27108 45820 74616 -71594 64954 15412 -45526 -208564 -54489 40532
8431 40532 249146 144441 216080 133509 216279 26654 2878 114729 190322 60034 -10776
8420 -10776 -87873 -68421 -78009 -180617 -160329 -133848 -69462 -148497 52464 132574 161945 141031
8408 141031 89122 -3430 39073 -411 104881 -55874 -44952 65423 156679 8125 -62306
8397 -62306 -5017 70752 15742 -29196 -81840 -25610 -22535 -25669 -54651 -120884 -36960 -95054
8385i5054J6503Q1326k35327J8466Q639r0294J08669O0910J07838j16686q1045
8374b16055K02604P1847o4735J83656L2178k32281j41040J54017J5170k46309
8364b40948L348J82334k30734j25627J51339J45332J65639j92223N3518L6921
8354e1101J99293k08463P0835J82605m4596j99807j34492J83352M1628j97696
8344a58442J03584R2309R4103k56060o9706O2288j72714P9469M6491J03766j364
8333g6276K743J66371o6047j38721J15079j9642j10974j06508j31394J43233j11309
8322c33445J5795K04802L6432J60753k2112r6507J35610r703J55217k06217p7109
8311c6484q323L0939j92284j8834J78961k8218o9796J01788J8341J09367k24897
$$ plain form
8385 -95054 -78551 2775 -232552 -214086 -205447 -295741 -187072 -126162 -18324 -135010 -216055
8374 -216055 -13451 58396 -6339 177317 209495 -22786 -163826 -9809 5361 -240948
8364 -240948 -237600 -55266 -286000 -411627 -260288 -114956 50683 -141540 -88022 -51101
8354 -51101 148192 -60271 10564 193169 148573 -51234 -185726 -2374 39254 -158442
8344 -158442 -54858 37451 131554 -124506 -194212 -131924 -304638 -225169 -178678 -74912 -76276
8333 -76276 -73533 92838 26791 -111930 3149 -16493 -127467 -233975 -365369 -222136 -333445
8322 -333445 -317650 -112848 -76416 84337 62225 -34282 101328 91625 246842 40625 -36484
8311 -36484 -44807 -13868 -206152 -224986 -46025 -74243 -144039 -42251 -23910 85457 -139440
8300a39440L1699Q2489j37234m8196J5624L5430j02853N9941J11405Q2348k20279
8289b29066J32278J35878j75486k0944J07745J7763O55k34957L54815j81983J05569
8278A2267J6961r270j495L0220j34413O4260k62150J73255j12341R2297j49088
8267b79497J37078j04119J57676J1143P5318k51006l1324P6866R9041k0149J08554
8256b0419M2339j5320Q5609M5877n4144O3690k67693J03171K24199m37207J24386
8245a05512k53433J44486q1979J41287J84409K4169k63852L47267j25373p1235
8235e9766j83064J28918j00121k65915O29L14613j56324L0577O5238J04232J95340
8224G4357r9734L9142J16675N137O8135k33790j32754R8058R8368l77923j71259
$$ plain form
8300 -139440 -107741 -25252 -162486 -210682 -195058 -159628 -262481 -202540 -91135 -8787 -229066
8289 -229066 -96788 39090 -136396 -157340 -49595 -31832 -31177 -266134 88681 -93302 12267
8278 12267 29228 19958 18463 48683 -85730 -21470 -283620 -110365 -222706 -130409 -279497
8267 -279497 -142419 -246538 -88862 -77719 -2401 -253407 -284731 -207865 -108824 -128973 -20419
8256 -20419 21920 6600 92209 138086 83942 147632 -120061 -16890 207309 -229898 -105512
8245 -105512 -358945 -214459 -296438 -155151 29258 53427 -210425 136842 11469 -59766
8235 -59766 -242830 -113912 -214033 -479948 -479319 -164706 -321030 -290453 -225215 -120983 74357
8224 74357 -25377 13765 130440 135577 203712 -30078 -162832 -64774 33594 -344329 -515588
8213e15588M33829o4833j9850o1586Q9500K8610k44318J66353j2553j55955K05984
8202a50407J1092j67421J21212m01825J94739P4177l08603j23495j25741q68682
8192a744954K525793J322983p55878k19941q71085L04733j63687P4980l60254
8183A12690J74997K61558l20117k11672K41791j63736O1146n6978J16869j0475
8173B06073j28691j5807L5138j62003K66451j83621j55605N5401J10991j31238
8163a02911K7762j06446Q1660J08106J17970L1551k44781P7977K09681o3188j44217
8152f836J7537O9067j01080k60257N2253K29748j1009j08834R0246J3904J67307
8141A52046k93471J22348p4526j91694k257K8297n9154J42873j68421K85260K370
$$ plain form
8213 -515588 -81759 -146592 -166442 -228028 -138528 -109918 -354236 -187883 -200436 -356391 -150407
8202 -150407 -139315 -306736 -185524 -587349 -392610 -318433 -627036 -750531 -876272 -1744954
8192 -1744954 780839 2103822 1347944 1128003 256918 561651 397964 472944 112690
8183 112690 287687 549245 229128 17456 259247 95511 156657 99679 216548 206073
8173 206073 77382 61575 96713 -65290 201161 17540 -138065 -82664 28327 -102911
8163 -102911 -75149 -181595 -99935 8171 126141 157692 -87089 -9112 200569 137381 -6836
8152 -6836 10701 79768 -21312 -281569 -229316 432 -10577 -119411 -29165 -15261 152046
8141 152046 -141425 -19077 -93603 -285297 -287554 -259257 -318411 -175538 -343959 -58699 -56329
8130e6329Q4084K20855n476j64670l497N7636M3503j20503p5406N4027k1408j296
8118A1520p2325j3198l1217N200J546n4697p6178J22232j4937j71341J70278K86010
8106A62893j53249o3101N5814Q8711j26060j71542L2621O9384j46893r211J41134
8095a19499O3305p9493K6918J95630J36992k6295j64J11328j77322j64473r9280
8084a32353J210p1844q5362L4308J68535L3105K0924Q0023J10908j03435P365
8073F3384o530j692j22510Q2327O3846k22125P8810L8471L6877P7012j4585m7857
8061B5428j07899n4887J51205j52964J64376j10971K4083r6545N8975j3091N7435
8050e4855j57976l2956q5330J49136K25061j51522j9829J40207p0945J13659k78322
$$ plain form
8130 -56329 27755 248610 243134 78464 74967 132603 176106 55603 -19803 34224 12816 11520
8118 11520 -60805 -74003 -105220 -100020 -98474 -153171 -229349 -107117 -122054 -293395 -123117 162893
8106 162893 9644 -53457 2357 91068 -34992 -206534 -173913 -104529 -251422 -260633 -119499
8095 -119499 -56194 -135687 -108769 86861 223853 197558 197394 308722 131400 -33073 -132353
8084 -132353 -131143 -202987 -288349 -254041 -85506 -52401 -31477 48546 159454 56019 63384
8073 63384 56854 55162 -67348 14979 78825 -143300 -64490 -26019 10858 87870 73285 25428
8061 25428 -82471 -137358 13847 -139117 25259 -85712 -61629 -158174 -99199 -112290 -54855
8050 -54855 -212831 -245787 -331117 -181981 43080 -108442 -128271 11936 -59009 54650 -223672
8039b23672K70375l1721k05321L9106j07331L1442q4879L004J46194q3493O8037
8028a78259J62789n5179Q2145o1206K30734j19906m9428q2440J31112l69633K82000
8017b7271K61693o1418k01269Q6123L1567l2214j65653J32462J75343j95216j85056
8006a80909K26081k23787O5093J3383N6281j3534k06855J22420J71346r2180J3291
7995d9370j9525k9777j26870p3641J91635K18908j50267o192L30810q5038N7046
7984B57719k75018j3991q692j35971j38866K47552M4160J00906j83112K05524
7974A00211j51416J15621j610J8030l98017J20505p6096j72448N9207n5423P1482
7963c69954J87609J18106J68321K7342k8041K0195k08447J04957j45255l6676
$$ plain form
8039 -223672 46703 14982 -190339 -151233 -258564 -227122 -312001 -308997 -162803 -246296 -178259
8028 -178259 -15470 -70649 11496 -49710 181024 61118 11690 -70750 60362 -309271 -27271
8017 -27271 234422 173004 -28265 57858 89425 57211 -108442 24020 199363 4147 -180909
8006 -180909 45172 -178615 -113522 -100139 -43858 -57392 -264247 -141827 29519 -62661 -49370
7995 -49370 -68895 -98672 -225542 -299183 -107548 111360 -38907 -45099 285711 200673 257719
7984 257719 -17299 -31290 -39982 -175953 -314819 -67267 -23107 77799 -105313 100211
7974 100211 -51205 64416 62806 80836 -317181 -196676 -272772 -445220 -386013 -441436 -369954
7963 -369954 -182345 -64239 104082 131424 103383 123578 -84869 20088 -125167 -161843
7953a61843j94944O8069m4292J36430q5072M6088J46202J54554O037n7075j01253
7942h7099J82511j37580J07080K0396j01513j41325j53438l4993L5720K0263Q9232
7931b00746J82045n6817J16644N7386r2824J09533O0086m2134J00499k34161Q3433
7920H2944r8336q7911O7033j04806p9465P9324j60494L13269O3751j6701J221
7909E9829P0244j07550n8408j60947N1326q3690m396l8877O9684J18438j2336
7898i6683J3156J83888n1283J5331k3447k20361j8106j2087K6002o25J20363O912
7886e6940K5825r2023K23218j06463j42534l6707Q7877j77541J15738L2478j1454
7875a38526j57690J90649Q5960L6615k22058K24923P9976j18486p4987L4782n1253
$$ plain form
7953 -161843 -356787 -288718 -333010 -196580 -281652 -235564 -89362 65192 71229 14154 -87099
7942 -87099 95412 -42168 64912 85308 -16205 -157530 -310968 -345961 -310241 -289978 -200746
7931 -200746 -18701 -75518 41126 98512 5688 115221 175307 133173 233672 -489 82944
7920 82944 -15392 -103303 -36270 -141076 -220541 -141217 -301711 11558 75309 58608 59829
7909 59829 130073 22523 -35885 -196832 -145506 -229196 -233592 -272469 -202785 -84347 -96683
7898 -96683 -83527 100361 49078 64409 40962 -179399 -197505 -209592 -183590 -184215 -63852 -56940
7886 -56940 -31115 -123138 100080 -6383 -148917 -185624 -97747 -275288 -159550 -127072 -138526
7875 -138526 -296216 -105567 -19607 17008 -205050 19873 99849 -18637 -93624 -58842 -110095
7864a10095J52145q6631L5478O693Q6722j89302N3298M1578j31524K8993j23434
7853b36079k3166k0526k0370J38696L7245p9250J52100K25319p3730Q1004Q783
7842A90026k2284j90181j37308K9388o0307j02027N7555J05922J02308j21568
7832a48476J13718K14595K6746j32044r5076k06404n8762J98534k07609j48474
7822d43252R7056K64603k18284N9698J65217M05382k58001J59303j6502J50191
7812C65411k22315M594j46285m9417j67642J20912j47830J05839O8174L0045q4584
7801a23098N3553P5671K05249k32133r7188r0075K15403J4333j71261q8195Q1397
7790a56344K75553j31309K0907L03459J79124l22634M8568J31922k0336j97747
$$ plain form
7864 -110095 42050 -44581 -9103 -2410 84312 -104990 -51692 -10114 -141638 -112645 -236079
7853 -236079 -259245 -279771 -300141 -161445 -124200 -203450 -51350 173969 100239 181243 190026
7842 190026 167742 -22439 -159747 -130359 -190666 -292693 -235138 -129216 -26908 -148476
7832 -148476 -34758 179837 206583 74539 -20537 -226941 -285703 -87169 -294778 -443252
7822 -443252 -346196 -81593 -299877 -240179 -74962 330420 72419 231722 215220 365411
7812 365411 143096 147690 1405 -48012 -215654 -94742 -242572 -136733 -68559 -38514 -123098
7801 -123098 -69545 6126 211375 -20758 -117946 -208021 7382 21715 -149546 -237741 -156344
7790 -156344 119209 -12100 8807 312266 491390 168756 217324 349246 328910 131163
7780A31163m9057n2759N7620j20842J46884j58912J43615l3907K1058m7433P1539
7769A08969m708k46423j6086L60921k20118L7641J9777K04714K5288J47938L51860
7758G69773J6194j22166L41288J37607l40444M6209l2365l9588k22435K885j63265
7747C93693m4171k3061R4556k51419m2581P2393j16045j20883K10976j68296q3502
7736g8340O7840O2561k7031j6756K17723J65983n8675J43821K41758j10097J11272
7725G20059J91183J22652j89939n4367k9632j31410l14688K28387l71593j03018
7715F7634J91037j00058l8324k2495Q7175J69071l19987J29370k13692j55018
7705b05287J46416p0263j35577L58767J33496l9335J8250K5842K69246r5188m947
$$ plain form
7780 131163 82106 29347 86967 -33875 113009 -45903 97712 63805 84863 37430 108969
7769 108969 104261 -142162 -158248 202673 -17445 20196 39973 244687 269975 417913 769773
7758 769773 785967 663801 1005089 1142696 802252 848461 816096 776508 554073 556958 393693
7747 393693 349522 326461 421017 169598 127017 199410 83365 -37518 173458 5162 -78340
7736 -78340 -10500 52061 25030 8274 225997 391980 333305 477126 718884 608787 720059
7725 720059 911242 1033894 843955 789588 759956 628546 313858 542245 170652 67634
7715 67634 258671 158613 120289 97794 184969 354040 34053 163423 -50269 -205287
7705 -205287 -58871 -129134 -264711 94056 227552 188217 206467 232309 501555 406367 401420
7694D01420R2048k02989j15857M3630j23315L8365k51958J26946j2351N5311r2646
7683d1396J61346O25K8637j80078l6795N7059j60921r6491J25744L4266J28385
7672B0381k13857J65960J64727p4131r272M192R2462j35476j29659J35155J03693
7661A24175p6927k62668J84075o4981j11809l924q6683Q9160r3345l1912m2848
7650c77687J54751m3927P3778L3841R9139r98M5740J19935J48137o8287M814l27357
7638a38121M7226j57168O7886R4992m2700j40844K07332K7630J37481o4687n4507
7627a5480j29070P2749k51272j24175m3888K02227m9075n1794J63888M7986L8711
7616a39193J62974J0248J7585r242N4105k2681l3925k10710J33269J79010k69175
$$ plain form
7694 401420 493468 290479 174622 218252 94937 133302 -118656 8290 -4061 51250 -41396
7683 -41396 119950 120575 149212 -30866 -67661 -10602 -171523 -268014 -142270 -108004 20381
7672 20381 -193476 -27516 137211 63080 53808 58000 150462 14986 -114673 20482 124175
7661 124175 47248 -215420 -31345 -96326 -208135 -212059 -298742 -209582 -302927 -334839 -377687
7650 -377687 -222936 -266863 -193085 -159244 -60105 -61103 -15363 104572 252709 184422 189236 -138121
7638 -138121 -90895 -248063 -180177 -85185 -127885 -268729 -61397 -33767 103714 39027 -15480
7627 -15480 -144550 -71801 -323073 -447248 -491136 -288909 -337984 -389778 -225890 -177904 -139193
7616 -139193 23781 34029 51614 42372 96477 73796 39871 -170839 -37570 141440 -127735
7605a27735j35524K2764J15944N259J07463r0436N6875j02394j5028j5650J42409
7594c6053j74026k5153J296K54820k54468J8438N5067J56551l2310m7583p3733
7583a57154K98793j15601J41527N8076J00122j63388K5164k31402j41851j41760
7573c27474R0726L0694j38538K20431R9873j79934K1462M5023J9601L9776r4720
7562a73080o2684K0031l4205K03668j36870L8492J14520N0240J27770N4671j3317
7551A89236r3251q9343P4355k34867j01625J33275k28166m8320P9443J10700j99392
7540d07955J14827J10780J27248j92937K1794K767M8400j91558R4375Q4848j61273
7529c48684K38730J25892j28214L3512m762P4889j93910L9384J61572J19957o3865
$$ plain form
7605 -127735 -263259 -240495 -124551 -119292 -11829 -102265 -45390 -147784 -162812 -178462 -36053
7594 -36053 -210079 -235232 -233936 20884 -233584 -215146 -160079 -3528 -35838 -83421 -157154
7583 -157154 141639 26038 167565 225641 325763 162375 187539 -43863 -185714 -327474
7573 -327474 -236748 -206054 -344592 -124161 -24288 -204222 -182760 -137737 -118136 -78360 -173080
7562 -173080 -235764 -215733 -249938 -46270 -183140 -144648 -30128 20112 147882 202553 189236
7551 189236 95985 6642 80997 -153870 -255495 -122220 -350386 -398706 -319263 -208563 -407955
7540 -407955 -293128 -182348 -55100 -248037 -226243 -223476 -175076 -366634 -272259 -187411 -348684
7529 -348684 -109954 15938 -112276 -78764 -83526 -8637 -202547 -163163 -1591 118366 54501
7518E4501J31211j00898m7821m7195k13050N2935j20829o7530N7581j28918Q1160
7507c48853Q2372O2317r0978P2545J71325J77671n1249R121n4568r1388q0504
7496a42189m624l2237J66333l7193N989J02452j4531J56885q0142j63709O1886
7485A8920l1356p3828L4671j91636P7020n336j36410J02930J5294P4060J66591
7474E0920k56960J50080j7370R5227P3781j29276J44388n9694j43435J63228M6188
7463A17077k42731O0624j06076P6843q8894O4361j4251o4504m8038K29421j66982
7452a83150j8943J64009j28069l4653k14573K11846M1327N7266L3473L2828J18466
7441G9827L453q9720L157J34520K1070k30853l8093O3439L4688l46330l0652K38276
$$ plain form
7518 54501 185712 84814 36993 -10202 -223252 -170317 -291146 -358676 -301095 -430013 -348853
7507 -348853 -266481 -204164 -295142 -222597 -51272 126399 75150 84271 29703 -61685 -142189
7496 -142189 -146813 -179050 -12717 -49910 -43921 58531 44000 200885 120743 -42966 18920
7485 18920 -12436 -86264 -51593 -243229 -166209 -171545 -307955 -205025 -189731 -115671 50920
7474 50920 -206040 -55960 -73330 21897 95678 -33598 110790 51096 -92339 70889 117077
7463 117077 -125654 -65030 -171106 -94263 -183157 -118796 -133047 -197551 -245589 -16168 -183150
7452 -183150 -202093 -38084 -166153 -200806 -415379 -203533 -162206 -104940 -71467 -38639 79827
7441 79827 83280 -6440 -3283 131237 152307 -78546 -116639 -53200 -18512 -364842 -395494 -157218
7429a57218N5016j62225K62845N3692J9806Q60l1565k63546m0139O2683P0917
7418a28874j38017j5795J61919p341l430J01366K69173j11084P5287K11966k13864
7407B01306q4624J17643r8506k15746o2921K36839j66383Q493J28404J06744l70695
7396a99446L8037J33503N6426o7857j0146j05362N989L4818P2939r142K31558
7385A81317j78545p2140J61247j8926K4767k05001O829J01118k53897O2052J77863
7374a3316m7949j39203K78105J49836k43705j46720N2056J70408k82879o350M724
7363b24993m395j04635J61005L3955N4656q3688R306j38746K02399K44171r5103
7352E3932j51224L04114J2719m43380J07635J56199j51438k12615P2964L35127
$$ plain form
7429 -157218 -102202 -264427 -1582 52110 71916 72776 41211 -222335 -262474 -199791 -128874
7418 -128874 -266891 -282686 -120767 -128108 -131538 -30172 239001 127917 203204 415170 201306
7407 201306 116682 234325 135819 -79927 -142848 93991 -72392 -63899 64505 171249 -199446
7396 -199446 -161409 -27906 28520 -39337 -49483 -154845 -148856 -114038 -41099 -50241 181317
7385 181317 2772 -69368 91879 72953 97720 -107281 -100452 666 -253231 -191179 -13316
7374 -13316 -61265 -200468 77637 227473 -16232 -162952 -110896 59512 -223367 -229717 -224993
7363 -224993 -229388 -334023 -173018 -139063 -84407 -168095 -158789 -297535 -95136 149035 53932
7352 53932 -97292 206822 219541 -223839 -116204 39995 -111443 -324058 -251094 84033
7342H4033k54430p7426K74744J19377j84321J93727j03781J08827j69740L9981
7332C0991N8142j00587Q1568l4190M059K22066r6169J07402R9778k9757o1899
7321B81404j46711K24121l8350k23440m9052N7949j53862j68343O4268J31635
7311b0381N016L4805j07782R7153l2059J71460k75909l7762Q22o5820j26015K11056
7299a45416J92252k5146r2139J48537L42919m2117r6967J46238l26560r8588N3509
7288E6522J71681m3538l11603J44685r7608K6525M9979N5909j00490n3840J3635
7277h8143n368L8912j38392O5666P955L6403Q3173j71646R4272j92672K7405J6159
7265b26276L4664J91874l5645L1707J11836r1130M7077p1772j7531k9643j9713
$$ plain form
7342 84033 -170397 -247823 26921 146298 -38023 155704 51923 160750 -8990 30991
7332 30991 89133 -11454 70114 35924 39983 262049 165880 273282 373060 343303 281404
7321 281404 134693 358814 320464 97024 47972 105921 -47941 -216284 -152016 -20381
7311 -20381 -15365 19440 -88342 8811 -23248 148212 -127697 -165459 -164637 -230457 -356472 -145416
7299 -145416 46836 21690 -70449 78088 421007 378890 281923 428161 101601 3013 56522
7288 56522 228203 184665 -126938 17747 -79861 -53336 -3357 52552 -47938 -101778 -88143
7277 -88143 -93511 -54599 -192991 -127325 -119370 -82967 206 -171440 -77168 -269840 -242435 -226276
7265 -226276 -191612 262 -35383 -3676 108160 17030 64107 -7665 -25196 -54839 -74552
7254g4552r9868j79913j9353p3510J66805j16205K83318o7328J74475N6790o4172
7243a3513k8270O1985k38106J53009j36982J5868j14055J71434k9900J18494M2020
7232A984L0006o9252n331J22447j95281J46310j50372r4367q7748J24356L1970
7221a45278J07650j02288Q8913J59155j65330r1685N9813j62913n9263P5486m7478
7210b83218Q5560M7453R4130J01622Q5297k8362k25955R5950q027j13055l12203
7199d60808K23263J77496j12074k05714K50304K72691j82228p3965J78968j69583
7189a01650p7993p1964L0253M9812j44928P7502J62083j23411L33364J29038j500
7178B60606r0459k95258P0824j08306k3131J09394j17520P4089J2860l3677R2420
$$ plain form
7254 -74552 -174420 -354333 -373686 -447196 -280391 -396596 -113278 -180606 -6131 50659 -13513
7243 -13513 -41783 20202 -217904 -64895 -201877 -186009 -300064 -128630 -158530 -40036 1984
7232 1984 31990 -37262 -42593 79854 -115427 30883 -119489 -213856 -301604 -177248 -145278
7221 -145278 -37628 -139916 -51003 108152 -57178 -148863 -89050 -251963 -311226 -235740 -283218
7210 -283218 -197658 -150205 -56075 45547 130844 102482 -123473 -27523 -35550 -148605 -460808
7199 -460808 -237545 -60049 -172123 -377837 -127533 145158 -37070 -111035 67933 -101650
7189 -101650 -179643 -251607 -221354 -171542 -316470 -238968 -76885 -200296 133068 262106 260606
7178 260606 170147 -125111 -54287 -162593 -185724 -76330 -193850 -119761 -106901 -140578 -48158
7167d8158O3148l8058L4113p6931K5978j16714M3494j47509m675m7792K05457
7156a07647q093N3055n3863K5165L3980K1976J20565p1574R1794j759j28920r1128
7144a16449O3742M1804J04674k05981L06674m0327k3345J7761L1986p7917j3473
7133H9149P1612J87649k18978N5506P0994j27954r2329p9391N5437Q6465j09172
7122a1012R8865M2354j15239J82781L335q4947J23436L2870q4790J01035j25927
7111A62761r4218K3216j73514J02472o0834p4972K69745p5342j2287J18757m5798
7100A39986n5721p0334O2612J46705l27837J53858K0199j14932K26933j10662
7090G0807M49K10515k36831N3288j23880j76657L64409l88112p1951k5870j0531
$$ plain form
7167 -48158 14990 -23068 11045 -65886 -39908 -156622 -113128 -260637 -265312 -313104 -107647
7156 -107647 -115740 -62685 -116548 -91383 -57403 -35427 85138 13564 105358 103599 -25321 -116449
7144 -116449 -52707 -10903 93771 -112210 194464 154137 130792 148553 180539 102622 89149
7133 89149 160761 348410 129432 184938 255932 127978 35649 -43742 11695 98160 -11012
7122 -11012 87853 130207 14968 197749 201084 116137 239573 272443 187653 288688 162761
7111 162761 68543 91759 -81755 20717 -40117 -115089 154656 79314 67027 185784 139986
7100 139986 84265 13931 76543 223248 -104589 49269 69468 -45464 181469 70807
7090 70807 71256 281771 44940 98228 -25652 -202309 162100 -226012 -297963 -323833 -334364
7079c34364J77587R3627K96112P4858k65935J20230j81997j52244j3264j055J07673
7068g8772r8155m6767K71149r0805K7761J90784N5116j8432j58810P5204L8919
7057A67192l6374j8157j02316J36122J0241j08283Q2318P0926J46018j72429J12970
7046B88228j08043k08254M172J42320q5134k09804M3319K60553o619k11376J92555
7035A01917R5470k67678l3976J04993J34357j58901l1950L7563j30898O7909R2224
7024A1030m5862O1940J42193L8930k17336p7913J74387n9378j05842m1937J27005
7013G217J9985j43722J10092J28314j39225k2321J2782K52799j85908j17090K54214
7002A77137n4182k58177K4785K59143J50035k67828K4217n1577R5050j35257J98736
$$ plain form
7079 -334364 -156777 -63150 232962 307820 41885 162115 -19882 -172126 -185390 -186445 -78772
7068 -78772 -176927 -223694 47455 -43350 -15589 175195 230311 211879 53069 128273 167192
7057 167192 130818 112661 10345 146467 156708 48425 130743 201669 347687 175258 288228
7046 288228 180185 -28069 -23897 118423 33289 -176515 -133196 127357 120738 -90638 101917
7035 101917 197387 -70291 -104267 726 135083 -23818 -55768 -18205 -149103 -81194 11030
7024 11030 -34832 27108 169301 208231 -9105 -87018 87369 27991 -77851 -119788 7217
7013 7217 27202 -116520 -6428 121886 -17339 -39660 -26878 225921 40013 -77077 177137
7002 177137 122955 -135222 -110437 148706 298741 30913 55130 3553 98603 -36654 162082
6991A62082J74259k68086j17267J72332J41072p0686o2485K9850J40268j71763
6981A29576J79011J0414j6772Q0807j08287J4025K39860q4809N3887l35143L6258
6970A98827o757q9959n3729J6555j01209L36152l36205J27156L21861j08950o1334
6959B42408m4808j83919k00137n8269J54301O9462k99232P4416J24067J41338
6949A9627o5791j1475K05413N195j27605M3833j53854L1363o6679R0116r7097
6938a26954r0899J53689J49749p8373j2350P7031l3015j00505M8839L8643m6225
6927b0370K2909P827k10986l2115N4006J25423j6193j81779K13048Q3629k5052
6916B0347R9996k3745m9672p2964K9091O493J7277K0378Q4679K998P0558K6836
$$ plain form
6991 162082 336341 68255 -49012 123320 264392 193706 131221 161071 301339 129576
6981 129576 308587 319001 302229 383036 274749 288774 528634 443825 497712 162569 198827
6970 198827 192070 102111 48382 64937 -36272 299880 -36325 90831 412692 303742 242408
6959 242408 197600 13681 -186456 -244725 -90424 -20962 -320194 -245778 -121711 19627
6949 19627 -46164 -57639 147774 152969 25364 69197 -84657 -53294 -119973 -29857 -126954
6938 -126954 -217853 -64164 85585 7212 -5138 71893 38878 -61627 -12788 25855 -20370
6927 -20370 2539 10366 -200620 -232735 -178729 -53306 -69499 -251278 -38230 45399 20347
6916 20347 120343 96598 46926 -26038 3053 9546 26823 47201 131880 134878 205436 232272
6904B32272j5448J22281k75231L6198L10115k00912o5099j32021j79618n9885
6894b27348m7464K71572M2227k40100K46659M9752m9205K2113k1453K07177j33721
6883A20209l06100K43771n9942j62502N402J89764J37145j40039q1205K34011
6873A80514l4355j33067Q3947k7948l8313r1258k1275J05753l3656r5268K25953
6862A21027j96327j0757K17773K8240j7442k86m5965j391j8883N8788Q1865j74096
6850D2546R961N8642J49243K5824j25623R5219K7536k07084K16319q5598j84865
6839B2120R0345K6885J01215l05130j38329K84441n7219j50194J23398N1315L9412
6828H8259k9997o9363J45647p453l7041J72732j72330n3306p3084J58198R5744
$$ plain form
6904 232272 216824 339105 63874 100072 410187 209275 144176 12155 -167463 -227348
6894 -227348 -274812 -3240 38987 -201113 45546 95298 46093 68206 46753 253930 120209
6883 120209 -185891 57880 -2062 -164564 -159162 30602 167747 27708 -53497 180514
6873 180514 146159 13092 97039 69091 30778 -60480 -81755 23998 -9658 -104926 121027
6862 121027 -75300 -86057 131716 159956 142514 142228 96263 94872 75989 134777 216642 42546
6850 42546 52507 111149 260392 286216 160593 255812 283348 76264 292583 206985 22120
6839 22120 112465 139350 240565 -64565 -202894 81547 24328 -125866 -2468 48847 88259
6828 88259 58262 -11101 134546 127093 90052 262784 90454 37148 -35936 122262 218006
6817B18006j9721R7668J09652o1231j21967Q264K14576j50755k18772J09240j11727
6806G3233j45332n1640P6325K13555j79881J06516P6494O4426k1502P2141J11853
6795C96188j02715j01049J84203l4697j96607J42565q7199R3729j10021J80003
6785C64400P5139m1756m9792l7540p1445P4158n5062j20690J49562J56698q1321
6774C62351j48438M8419k7637j09612n471J8950M857K7566J77750K18512j25630
6763D41617J29801J35875k8137R6692q0817j42712k43216n902J98294q3348l4468
6752C83679R9207Q5027Q8944l3915K1092J21273k12689J70254o6409j39326r6604
6741D20533O9352J07613K18539j71588R2007K23414K27521j72928J24379j6741
$$ plain form
6817 218006 198285 295953 405605 344374 222407 230671 445247 294492 75720 184960 73233
6806 73233 -72099 -123739 -47414 166141 -13740 92776 169270 233696 212194 284335 396188
6795 396188 293473 192424 376627 341930 145323 287888 200689 294418 184397 364400
6785 364400 439539 397783 347991 310451 239006 313164 258102 137412 286974 443672 362351
6774 362351 213913 262332 234695 125083 119612 138562 143419 170985 348735 567247 441617
6763 441617 571418 707293 679156 775848 695031 552319 309103 303201 501495 418147 383679
6752 383679 482886 567913 656857 622942 644034 765307 552618 722872 656463 517137 420533
6741 420533 489885 597498 816037 644449 736456 959870 1187391 1014463 1138842 1122101
6731A122101M0500j04719P0567J6957j53810J96664q6107l453j03168K20258P7961
6720A293751P1N9487J18870j01004J08202O7333J08661m421O0267q4897Q928J22644
6708A757892K48288J29601Q7411R5148L76723O0331K72327j24788K38461J96367
6698C337761Q4552J95864M62776j6577K76015K84320L35137M65389L98380N77177
6688F400794N55468O07474J182602Q37258J096939J513039J533288J736671J924488
6679A7388021K275607K218791J609035J338862R38617L16937o091n37346l21229
6670B5221204k85925r4103N0498N01574N00082R02132K99998J24989n49864j022045
6660B5648540j303993j801057k122434j942920j771985j452993j508110j262396
$$ plain form
6731 1122101 1162601 1057882 1128449 1145406 991596 1188260 1102153 1098700 995532 1215790 1293751
6720 1293751 1293822 1353309 1472179 1371175 1479377 1546710 1655371 1650950 1711217 1626320 1635248 1757892
6708 1757892 2006180 2135781 2223192 2318340 2695063 2755394 3027721 2902933 3141394 3337761
6698 3337761 3422313 3618177 4080953 4064376 4340391 4624711 4959848 5425237 5823617 6400794
6688 6400794 6956262 7563736 8746338 9583596 10680535 12193574 13726862 15463533 17388021
6679 17388021 19663628 21882419 23491454 24830316 25768933 26085870 26079779 25542433 25221204
6670 25221204 24935279 24841176 24891674 25393248 25893330 26795462 27095460 27220449 26670585 25648540
6660 25648540 24344547 22543490 20421056 18478136 16706151 15253158 13745048 12482652
6652A2482652q39748q96461j044131o17867o22038m84461n09706k99655k60751
6643F907834m00439k33867j56328j50597o3466Q9527j44650k48788j18607J08716
6633E589335l0178k37422O3133M42399J60677J09501P9110L85654L00777J6473
6623F879459L40928K06880M58787N88371M08042Q81626Q40313Q40151J111970
6614A2556527J223949J431239J669932J608436K329793K506330K855128K978124
6606B9159458K752409K295040J876541R44478J99320k02028o21481l95321o87255
6597C5321161j61941J94430L50371P78538Q80367K47655k12115q94953j515747
6588C4987766k353917k765349k444340k555570k654677k363343j931886j814663
$$ plain form
6652 12482652 11642904 10746443 9702312 9084445 8462407 7977946 7468240 7168585 6907834
6643 6907834 6507395 6273528 6117200 5966603 5903137 5992664 5848014 5599226 5480619 5589335
6633 5589335 5559157 5321735 5384868 5827267 5987944 6097445 6176555 6562209 6862986 6879459
6623 6879459 7220387 7427267 7886054 8474425 8882467 9764093 10604406 11444557 12556527
6614 12556527 13780476 15211715 16881647 18490083 20819876 23326206 26181334 29159458
6606 29159458 31911867 34206907 36083448 37027926 37227246 37025218 36403737 36008416 35321161
6597 35321161 35159220 35353650 35704021 36482559 37362926 37610581 37398466 36503513 34987766
6588 34987766 32633849 29868500 27424160 24868590 22213913 19850570 17918684 16104021
6580A6104021j492933j360414j128380j040510r52978p25327o53339o51745n38622
6571G559773n96521m81508m53991l54394q6768m92414k99005L3247j62684l39469
6561D326266J7564k34460J0452l06000j04974j82298k49108k72116j75564r9992
6551B729770l7086n0706k5763J22187k34938K8129O6561o1815j55083j89703k7905
6540B163648J87462m12622j40938K25721n0141p419j3506J35420k6453j42365
6530A918807j18548K2021j44019P2634k9653j29146P4343n7945J3524j31262o0121
6519A430635K1764o8190j09074O178j53458P9387J34370l15189j13768K35044
6509A147699M8057m9910k00050K47564R6535j31134j19743o5191K31962q7765
$$ plain form
6580 16104021 14611088 13250674 12122294 11081784 10128806 9403479 8750140 8098395 7559773
6571 7559773 6963252 6481744 6027753 5673359 5586591 5094177 4795172 4828419 4665735 4326266
6561 4326266 4343830 4109370 4119822 3813822 3708848 3526550 3277442 3005326 2829762 2729770
6551 2729770 2692684 2641978 2616215 2738402 2503464 2531593 2598154 2536339 2381256 2191553 2163648
6540 2163648 2351110 1938488 1797550 2023271 1973130 1965711 1952205 2087625 2061172 1918807
6530 1918807 1800259 1822280 1678261 1750895 1721242 1592096 1666439 1608494 1622018 1490756 1430635
6519 1430635 1452399 1384209 1275135 1281313 1127855 1207242 1341612 1026423 912655 1147699
6509 1147699 1195756 1145846 945796 1193360 1289895 1158761 1039018 973827 1205789 1118024
6499A118024Q0348k94094m7640K13735j12991n1622L2375o2418k9042j70143k9789
6488F46743J65272j19554R3202j16098O4068J3887M1426j63433J61489k4122k5061
6477G37819j87101P0746J29355j37269M1254J36943j95502K41638R2515L3590
6467I63988k39366k8311P6687k6449k74696J63488O5955k32076n4105M0104j50389
6456C04830j4189J57291J18850k9239r9374J40407k8840p93J42105n9295k16090
6445D15663M0831n2413J75339j89291j7659J46053p4910N7484L2264j71322K91412
6434F53451j10476j10007K58153M1145r0357j2446l33733M9736O3982J05195J15151
6423F29794k48618P8945j5795J4660J82445Q9007k0061o1909m7914K32957o8331
$$ plain form
6499 1118024 1198372 904278 856638 1070373 957382 905760 938135 875717 846675 676532 646743
6488 646743 812015 692461 785663 669565 733633 747520 788946 625513 787002 762880 737819
6477 737819 550718 621464 750819 613550 654804 791747 596245 837883 930398 963988
6467 963988 724622 696311 772998 746549 471853 635341 701296 469220 415115 455219 304830
6456 304830 290641 447932 566782 537543 438169 578576 549736 548943 691048 631753 415663
6445 415663 456494 404081 579420 390129 372470 518523 443613 501097 533361 362039 653451
6434 653451 542975 432968 691121 732266 641909 629463 295730 345466 409448 514643 629794
6423 629794 381176 460121 444326 458986 641431 730438 710377 648468 600554 833511 765180
6412G65180j10359R5128j47002J26613n1709q3326Q2074p6752j73982K16572o0303
6401E82134m1097k4422K77811J38041j82151p0961K44954j04755j54505R2454
6391G57503Q7084j63166K61832J14643K2191R877K00505j11188p7996o3775K14774
6380A252284q1518p3109K10868j41710n4428K30600o162j7882L016K18186m932
6369A535213j96441K48867N2377j51933j20665J76053K32789j48368k1356L05368
6359A911904q4263r2632J9839J00838K9280j2925j42569R8534p2915K34131k9616
6348A959606m3999j10895K5723Q6743k438P3543O6359P5174J64448l15216Q6655
6337B065703J93247N6622q4282J06377J92723j09838J4096R7753N9750k02134
$$ plain form
6412 765180 654821 749949 602947 729560 677851 594525 676599 599847 425865 642437 582134
6401 582134 541037 516615 794426 932467 750316 679355 924309 819554 665049 757503
6391 757503 844587 681421 943253 1057896 1080087 1089964 1290469 1179281 1101285 1037510 1252284
6380 1252284 1170766 1097657 1308525 1166815 1112387 1342987 1336825 1318943 1321959 1540145 1535213
6369 1535213 1338772 1587639 1640016 1488083 1367418 1543471 1776260 1627892 1606536 1911904
6359 1911904 1827641 1735009 1754848 1855686 1884966 1872041 1729472 1828006 1755091 1989222 1959606
6348 1959606 1915607 1804712 1830435 1917178 1914740 1988283 2054642 2129816 2294264 1979048 2065703
6337 2065703 2258950 2315572 2231290 2337667 2530390 2420552 2434648 2532401 2592151 2390017
6327B390017L8610R5591O1056l5120K83694M9372N9678J44272L59446p7777P8832
6316C447671J88782L79347M2118K58525L26022K41441L41287L01481M61925L61141
6306F349740N49035N57090O97586P37233Q77005J147965J106366J304557J615088
6297A4941665K027055K076459K073503K689990K466723K239378J222160J038626
6289C0775559L9416o71907j340996j438178j921573j751657j717523j153015j340059
6280A9480067p94252r49134l32122k09001K14650M85204Q51693R95510J322216
6271B1064831J893851K124666K124862K052142J955627J499339L40900n34769
6263C2521449j336201j930853k212079k345244k235141k423890j882497j931383
$$ plain form
6327 2390017 2428627 2524218 2585274 2550154 2833848 2883220 2942898 3087170 3446616 3368839 3447671
6316 3447671 3636453 4015800 4057918 4316443 4642465 4883906 5225193 5526674 5988599 6349740
6306 6349740 6898775 7455865 8153451 8890684 9767689 10915654 12022020 13326577 14941665
6297 14941665 16968720 19045179 21118682 23808672 26275395 28514773 29736933 30775559
6289 30775559 30814975 30143068 28802072 27363894 25442321 23690664 21973141 20820126 19480067
6280 19480067 18685815 17736681 17404559 17195558 17410208 17895412 18747105 19742615 21064831
6271 21064831 22958682 25083348 27208210 29260352 31215979 32715318 33056218 32521449
6263 32521449 31185248 29254395 27042316 24697072 22461931 20038041 18155544 16224161
6255A6224161j532958j399478j032585j063913p66962p31622n29058n91091k42295
6246H334199m71590j66412l13013l5782p5027N474j07398q4543o4826N1796J04179
6235G177057J41361K40182M57398j17724N10447O06010N53380O01847J071728
6226A1241686J143250J117256J353121J664031J921311J571063J579038J292593
6218B2883349K53901k05886p19015j202148j434746j443312j085547j315833j047195
6209A4683568o94635o81818n52335j81489k9113O6280M42036N59780P29216R34949
6199A5276439J193589J583415J464583J765289J338947Q54269K19237o67118j035751
6190B1992899j712724j620252j676310j721412j600391j392237j411709j269761
$$ plain form
6255 16224161 14691203 13291725 12259140 11195227 10428265 9696643 9167585 8576494 8334199
6246 8334199 7862609 7696197 7383184 7347402 7272375 7277849 7170451 7085908 7021082 7072878 7177057
6235 7177057 7318418 7558600 8015998 7898274 8408721 9014731 9568111 10169958 11241686
6226 11241686 12384936 13502192 14855313 16519344 18440655 20011718 21590756 22883349
6218 22883349 23137250 22931364 22212349 21010201 19575455 18132143 17046596 15730763 14683568
6209 14683568 13988933 13307115 12754780 12573291 12544178 12610458 13052494 13612274 14341490 15276439
6199 15276439 16470028 18053443 19518026 21283315 22622262 23476531 23695768 23028650 21992899
6190 21992899 20280175 18659923 16983613 15262201 13661810 12269573 10857864 9588103
6182I588103r01041p54878o85860n79213n32936l36525m31276l98416k68345l61748
6172D337865p9668m29722j65589j5718k13440j41370k60298p0770j25218l46643
6162B489429j43147O5063m6993o6103k7341l43263K76284k64797K29302j03744
6152B064690M2133q4939k83201J17027j40429j49173j5892n219M1096n2102O4504
6141A598495j30188k0864L5657j23707N1487j60866l6745j43270J2769J03748
6131A186516k43868m5915R2554K7242j93124J26353J37028j72818R3610K0750
6121A028328n0004l24994J93431J07087k38398j54258J60404P8345j793L4942
6111H33090k9347j06117l5456J38675j30029j11649K7380k1896q0467P0434K98686
$$ plain form
6182 9588103 8687062 7932184 7246324 6667111 6134175 5797650 5366374 4967958 4699613 4337865
6172 4337865 4258197 3828475 3662886 3647168 3433728 3292358 3032060 2961290 2836072 2489429
6162 2489429 2346282 2411345 2364352 2298249 2270908 1927645 2203929 1939132 2168434 2064690
6152 2064690 2106823 2021884 1738683 1855710 1715281 1566108 1550216 1544997 1586093 1533991 1598495
6141 1598495 1468307 1447443 1483100 1359393 1410880 1250014 1213269 1069999 1082768 1186516
6131 1186516 942648 896733 989287 1016529 823405 949758 1086786 913968 1007578 1028328
6121 1028328 978324 653330 846761 953848 715450 561192 721596 799941 798148 833090
6111 833090 803743 697626 662170 800845 670816 559167 586547 564651 484184 554618 853304
6100H53304k50731o6654J04722M073k950N3495N1752r2906j62766J2059R2489
6089E95887j44008N5215j46876L8075L0856J8592o7323l3574J49839R2821j9107
6078E70397K925R5436k31861j04253N7634K1611j26479J43146r9476j76546j37781
6067A4753K67975L5869j72939k0726J68840n3486J42374j17114p9136q1013J5156
6056A20553l076j20205L7478L3089r1385L1279J38581m2891r2039Q0793J21104
6045B13281P3830Q7876p2596m2035r2608R0802k37687K0023K12627p1532j74540
6034G441N9125j3282J11320o7806K14784O2727j41740k20302K45449k74363k118
6023a8765j04458J0257Q1152N9148p7597l7376L8143K66161O7521j42336J31754
$$ plain form
6100 853304 602573 535919 640641 644714 641764 695259 747011 654105 491339 503398 595887
6089 595887 451879 507094 360218 398293 429149 447741 380418 346844 496683 589504 570397
6078 570397 573322 668758 436897 332644 390278 411889 285410 428556 329080 152534 14753
6067 14753 282728 318597 145658 124932 293772 240286 382660 265546 186410 105397 120553
6056 120553 117477 -2728 34750 67839 -23546 7733 146314 103423 11384 92177 213281
6045 213281 287111 374987 302391 260356 167748 258550 20863 40886 253513 181981 7441
6034 7441 66566 53284 164604 96798 311582 374309 232569 12267 257716 -16647 -18765
6023 -18765 -123223 -112966 -31814 27334 -50263 -87639 -49496 216665 284186 141850 273604
$$ [...]
##END NTUPLES=NMR SPECTRUM
##END=
