##TITLE=1H_TG-2388-1
 200.13MHz, CDCl3+DMSO,
 8 sc
 
 32.8.2025
##JCAMPDX= 6.0         $$ Bruker NMR JCAMP-DX V2.0
##DATA TYPE= NMR SPECTRUM
##DATA CLASS= NTUPLES
##ORIGIN= UXNMR, Bruker Analytische Messtechnik GmbH
##OWNER= pz
$$ XWIN-NMR		Version 3.5
$$ Wed Aug 13 14:06:10 2025 Russian Standard Time (UT+4h)  she@DPX200
##.OBSERVE FREQUENCY= 200.1313
##.OBSERVE NUCLEUS= ^1H
##.ACQUISITION MODE= SIMULTANEOUS
##.ACQUISITION SCHEME= undefined
##.AVERAGES= 8
##.DIGITISER RES= 18
##SPECTROMETER/DATA SYSTEM= spect
##.PULSE SEQUENCE= zg30
##.SOLVENT NAME= CDCl3
##.SHIFT REFERENCE= (INTERNAL, CDCl3, 0, 15.7656)
##AUDIT TRAIL= $$ (NUMBER, WHEN, WHO, WHERE, WHAT)
$$ ##TITLE= Audit trail, XWIN-NMR		Version 3.5
$$ ##JCAMPDX= 5.01
$$ ##ORIGIN= Bruker BioSpin GmbH
$$ ##OWNER= she
$$ F:/spectra/data/she/nmr/H-C/1/pdata/1/auditp.txt
$$ ##AUDIT TRAIL=  $$ (NUMBER, WHEN, WHO, WHERE, WHAT)
(   1,<2025-08-13 14:04:52.03 +0400>,<she>,<DPX200>,
      <created by zg, POWCHK disabled, PULCHK disabled
       configuration hash MD5:
       00 E9 B6 7A A2 85 ED C7 34 08 36 98 17 FE 4E 26
       data hash MD5: 16K
       B6 8E 8C 8F 32 5D D3 3F 20 04 5A 97 49 24 4B 2C>)
(   2,<2025-08-13 14:04:54.31 +0400>,<she>,<DPX200>,
      <Start of raw data processing
       efp BC_mod = 2 LB = 0.25 FT_mod = 6 PKNL = 1 PHC0 = -1719.523 PHC1 = 13.59228 SI = 16K 
       data hash MD5: 16K
       32 DF 85 74 2C 82 57 7F 53 78 1C A5 36 86 08 D7>)
(   3,<2025-08-13 14:05:20.23 +0400>,<she>,<DPX200>,
      <pk PHC0 = 1.8849 PHC1 = -4.8 
       data hash MD5: 16K
       DA 20 BF CD 36 1C 5C F4 D6 3A 72 D3 A0 D0 7E A4>)
(   4,<2025-08-13 14:05:24.10 +0400>,<she>,<DPX200>,
      <abs ABSG = 5 
       data hash MD5: 16K
       3E F3 5D FB C2 23 76 7B 56 E0 D1 E6 73 47 B2 35>)
$$ ##END=
$$ 
$$ hash MD5
$$ 6D 82 09 1F BE 33 4C 31 79 97 63 DE AC 6B 85 2A
##$RELAX= 
##$RELAX= 
##$RELAX= 
##$RELAX= 
##$RELAX= 
##$RELAX= 
$$ Bruker specific parameters
$$ --------------------------
##$DU= <F:/spectra>
##$EXPNO= 1
##$NAME= <H-C>
##$PROCNO= 1
##$TYPE= <nmr>
##$USER= <she>
##$AMP= (0..31)
100 100 100 100 100 100 100 100 100 100 100 100 100 100 100 100 100 100 
100 100 100 100 100 100 100 100 100 100 100 100 100 100 
##$AQSEQ= 0
##$AQ_mod= 1
##$AUNM= <au_zg>
##$AUTOPOS= <>
##$BF1= 200.13
##$BF2= 200.13
##$BF3= 200.13
##$BF4= 200.13
##$BF5= 200.13
##$BF6= 200.13
##$BF7= 200.13
##$BF8= 200.13
##$BYTORDA= 1
##$CFDGTYP= 0
##$CFRGTYP= 5
##$CHEMSTR= <none>
##$CNST= (0..31)
1 1 145 1 1 1 1 1 1 1 1 1 1 1 1 1 1 1 1 1 1 1 1 1 1 1 1 1 1 1 1 1 
##$CPDPRG= <>
##$CPDPRG1= <>
##$CPDPRG2= <>
##$CPDPRG3= <>
##$CPDPRG4= <mlev>
##$CPDPRG5= <mlev>
##$CPDPRG6= <mlev>
##$CPDPRG7= <mlev>
##$CPDPRG8= <mlev>
##$CPDPRGB= <>
##$CPDPRGT= <>
##$D= (0..31)
0 0.7 0 0 0 0 0 0 0 0 0 0.03 0 0 0 0 0 0 0 0 0 0 0 0 0 0 0 0 0 0 0 0 
##$DATE= 1755079491
##$DBL= (0..7)
120 120 120 120 120 120 120 120 
##$DBP= (0..7)
150 150 150 150 150 150 150 150 
##$DBP07= 0
##$DBPNAM0= <>
##$DBPNAM1= <>
##$DBPNAM2= <>
##$DBPNAM3= <>
##$DBPNAM4= <>
$$ [...]
##$SUBNAM3= <"">
##$SUBNAM4= <"">
##$SUBNAM5= <"">
##$SUBNAM6= <"">
##$SUBNAM7= <"">
##$SUBNAM8= <"">
##$SUBNAM9= <"">
##$SW= 18.0517328524113
##$SWIBOX= (0..15)
0 0 2 0 0 0 0 0 0 0 0 0 0 0 0 0 
##$SW_h= 3612.71676300578
##$TD= 16384
##$TD0= 1
##$TE= 0
##$TE2= 300
##$TE3= 300
##$TEG= 300
##$TL= (0..7)
0 120 120 120 120 120 120 120 
##$TP= (0..7)
150 150 150 150 150 150 150 150 
##$TP07= 0
##$TPNAME0= <>
##$TPNAME1= <>
##$TPNAME2= <>
##$TPNAME3= <>
##$TPNAME4= <>
##$TPNAME5= <>
##$TPNAME6= <>
##$TPNAME7= <>
##$TPOAL= (0..7)
0.5 0.5 0.5 0.5 0.5 0.5 0.5 0.5 
##$TPOFFS= (0..7)
0 0 0 0 0 0 0 0 
##$TUNHIN= 0
##$TUNHOUT= 0
##$TUNXOUT= 0
##$USERA1= <user>
##$USERA2= <user>
##$USERA3= <user>
##$USERA4= <user>
##$USERA5= <user>
##$V9= 5
##$VALIST= <valist>
##$VCLIST= <CCCCCCCCCCCCCCC>
##$VD= 0
##$VDLIST= <DDDDDDDDDDDDDDD>
##$VPLIST= <PPPPPPPPPPPPPPP>
##$VTLIST= <TTTTTTTTTTTTTTT>
##$WBST= 1024
##$WBSW= 4
##$XGAIN= (0..3)
0 0 0 0 
##$XL= 0
##$YL= 0
##$YMAX_a= 39845
##$YMIN_a= -34654
##$ZGOPTNS= <>
##$ZL1= 120
##$ZL2= 120
##$ZL3= 120
##$ZL4= 120
##$ABSF1= 15.52984
##$ABSF2= -2.522009
##$ABSG= 5
##$ABSL= 3
##$ALPHA= 0
##$AQORDER= 0
##$ASSFAC= 0
##$ASSFACI= 0
##$ASSFACX= 0
##$ASSWID= 0
##$AUNMP= <proc_1d>
##$AZFE= 0.1
##$AZFW= 0.1
##$BCFW= 0
##$BC_mod= 2
##$BYTORDP= 0
##$COROFFS= 0
##$CY= -3
##$DATMOD= 1
##$DC= 0
##$DFILT= <>
##$DTYPP= 0
##$F1P= 0
##$F2P= 0
##$FCOR= 1
##$FTSIZE= 16384
##$FT_mod= 6
##$GAMMA= 0
##$GB= 0
##$INTBC= 1
##$INTSCL= 3.241238e-09
##$ISEN= 128
##$LB= 0.25
##$LEV0= 0
##$LPBIN= 0
##$MAXI= 10000
##$MC2= 0
##$MEAN= 0
##$ME_mod= 0
##$MI= 1.114404
##$NCOEF= 0
##$NC_proc= -10
##$NLEV= 6
##$NOISF1= 3.799351
##$NOISF2= 2.8
##$NSP= 0
##$NTH_PI= 0
##$NZP= 0
##$OFFSET= 15.76562
##$PC= 1
##$PHC0= -1717.638
##$PHC1= 8.79228
##$PH_mod= 1
##$PKNL= yes
##$PPARMOD= 0
##$PSCAL= 0
##$PSIGN= 0
##$REVERSE= no
##$SF= 200.129951185701
##$SI= 16384
##$SIGF1= 3
##$SIGF2= 2
##$SINO= 0.751879
##$SIOLD= 32768
##$SREGLST= <19F.Aceton>
##$SSB= 0
##$STSI= 16384
##$STSR= 0
##$SW_p= 3612.71676300578
##$SYMM= 0
##$S_DEV= 0
##$TDeff= 16384
##$TDoff= 0
##$TI= <>
##$TILT= no
##$TM1= 0
##$TM2= 0
##$TOPLEV= 0
##$USERP1= <user>
##$USERP2= <user>
##$USERP3= <user>
##$USERP4= <user>
##$USERP5= <user>
##$WDW= 1
##$XDIM= 16384
##$YMAX_p= 349622998
##$YMIN_p= -2785511
$$ End of Bruker specific parameters
$$ ---------------------------------
##NTUPLES= NMR SPECTRUM
##VAR_NAME=  FREQUENCY,     SPECTRUM/REAL,   SPECTRUM/IMAG
##SYMBOL=    X,             R,               I
##VAR_TYPE=  INDEPENDENT,   DEPENDENT,       DEPENDENT
##VAR_FORM=  AFFN,          ASDF,            ASDF
##VAR_DIM=   16384,         16384,           16384
##UNITS=     HZ,            ARBITRARY UNITS, ARBITRARY UNITS
##FACTOR=    0.220516191357247, 1,           1
##FIRST=     3155.1728073681, 0,             0
##LAST=      -457.543955637685, 0,           0
##MIN=       -457.543955637685, -2785511,    0
##MAX=       3155.1728073681, 349622998,     0
$$ Real data points
##PAGE= N=1
##DATA TABLE= (X++(R..R)), XYDATA
$$ [...]
14686 -103536 -65134 -585136 -442317 -630483 -715665 -519768 -88292 -253237 -231341 -379816
14676 -379816 -1112231 -783393 481702 468484 400910 155362 -201559 309705 217031 -274619
14666 -274619 -630044 -794485 -820809 -4219 194434 -259550 -318407 -155209 54417 311997
14656 311997 181437 -71947 -359570 -54724 -68605 -207768 -616315 -588864 -143390 217433
14646 217433 49569 241269 684687 238505 491396 303888 73385 445153 355056 491473
14636 491473 1056244 831102 496272 -188000 -263070 444413 334081 351451 330064 671500
14626 671500 71788 -173434 92195 -129871 -83878 -115371 306336 262688 200587 397073
14616 397073 342527 -196214 -138955 84334 -262575 317298 829294 679991 182446 59496
14606 59496 -421753 85262 79401 -45012 15852 -550725 -115142 76951 412989 193390
14596 193390 728227 539222 205368 256886 -5925 509337 423331 277810 -199055 -206518
14586 -206518 95991 -63048 -507221 -157759 -370884 -578982 -506423 -67014 -113970 75480
14576 75480 19263 -285657 -58067 323017 231030 21972 -76852 32568 361078 243256
14566 243256 205790 -224786 -226806 -98497 -83430 447865 233499 147959 309958 278690 400864
14555 400864 -89427 239747 367412 367121 -789088 -382724 -312418 -383637 -338682 -562354
14545 -562354 -646934 -341122 27236 273656 -282941 -697823 -218541 -15139 44122 366095
14535 366095 76322 -633177 -413955 -7303 -572787 -777491 197694 -72059 -290952 75279
14525 75279 -20229 -196973 266309 77313 -494768 -572293 308049 -16897 -332833 -102947
14515 -102947 -801235 -286533 -81867 70204 -44659 225922 359190 460823 -47055 2437
14505 2437 117219 -247133 47295 -76329 -61842 -138938 -78481 389176 146577 -280203
14495 -280203 -89527 191799 357545 -123150 82808 -354591 -384153 103267 172502 207743
14485 207743 -294403 -282043 -104696 -565965 -179161 -870106 -879971 -642439 -886104 -558703
14475 -558703 -371527 -237387 -561999 -342404 -204842 241893 460563 169457 -144753 -104933
14465 -104933 320013 436632 409977 4809 129284 -39083 246018 34614 329577 170725
14455 170725 -421764 -191022 296302 208059 254377 -17534 167951 -191365 -521217 -712396
14445 -712396 -362503 -101062 60980 713667 374948 261290 -159637 -218500 -152052 122681
14435 122681 422828 -20153 -23260 -347675 -367133 -722961 -192520 363166 120862 -321251
14425 -321251 -949335 -201115 -414906 -690154 -523562 -153884 -515761 -219148 153219 322572
14415 322572 -182532 -334259 -175099 -91437 -295955 -618124 -676394 -280538 486861 3173
14405 3173 -250141 -376859 -897265 -653726 -480648 -189981 -81835 -318019 -181227 108915
14395 108915 184977 436636 775337 1269969 656235 659120 882007 344651 -103024 57624
14385 57624 134650 97551 85798 -54112 94167 -76847 -231891 -305505 -1013519 -793972
14375 -793972 -324377 -86253 -14539 160009 369633 674529 266045 -414342 -526297 -961045
14365 -961045 -1149419 -1095211 -631229 -124696 -3556 666627 423343 414544 387833 -211847
14355 -211847 -11599 -249644 -93526 -89784 -81138 379771 554123 431556 381552 -79818
14345 -79818 9074 -138324 16547 8651 291738 397525 465024 47916 234210 536173
14335 536173 450218 355692 147269 341096 295728 -309024 52492 414743 128163 -169725
14325 -169725 314898 595356 272490 1482 251866 221800 -369169 -87194 499178 258996
14315 258996 -199769 -372007 -323869 -248228 -476950 -265421 -53647 397159 312032 100668
14305 100668 197208 379986 -97792 3920 -112381 -340027 -90083 -55863 -874733 -570582
14295 -570582 -109849 106610 -228706 -282640 -29161 167584 150059 -108431 258838 556144
14285 556144 433808 -94084 205944 350340 -457795 -41419 -282238 190532 643804 -37339
14275 -37339 -78713 219054 439304 497453 463712 -131207 -826735 -615206 87534 246271
14265 246271 111812 335253 163213 59423 526950 416847 -182402 -440381 -198357 -18364
14255 -18364 587613 85252 235536 -54970 -298688 -458672 -764036 -705842 2541 70834
14245 70834 -109834 -199428 -443200 -671209 -248745 77482 -814205 -742288 218740 170157
14235 170157 -252423 -149705 -332620 -884128 -1085296 -870811 -506548 -474086 -359828 -239914
14225 -239914 -158826 -273217 -242626 -426022 -678203 -965045 -637526 -278819 -370449 236019
14215 236019 455898 324499 347835 284441 796946 638141 308589 -337048 -782590 -974007
14205 -974007 -888767 -440493 270878 668373 134300 177820 -31545 -354243 -49929 -101161
14195 -101161 -213818 72188 86617 -62726 -196668 72325 69995 144771 -45990 -538415
14185 -538415 -598632 -36660 -194172 -225468 -101214 24145 353271 -116045 -263949 -460005
14175 -460005 -358939 -280779 -399052 -502889 -173882 225774 158782 42272 819849 1042224
14165 1042224 525240 112963 -128158 200903 584869 1030553 423351 -324867 263123
14156 263123 354987 60617 128972 379766 323377 -185621 85822 290631 57741 -478458
14146 -478458 -470242 -321741 -355947 159384 725755 687471 547411 -584709 -550328 -87462
14136 -87462 306389 154614 151483 -204800 -155440 -196660 44224 -457877 -128265 -34504 258508
14125 258508 503085 489843 285460 475725 272350 225170 514694 353324 -247778 -123915
14115 -123915 140370 85209 213624 312651 507496 712893 749746 375979 104476 578509
14105 578509 763263 52892 -157122 -95258 101509 141306 293782 3846 369324 -14770
14095 -14770 136659 441588 441722 127265 -1033 -333594 222658 196644 384675 104635
14085 104635 -60898 -69703 -94154 -174395 145109 -194972 -372128 -114033 7849 -204259
14075 -204259 -318412 -466373 -240944 76540 180706 272540 523029 378563 -5247 14875
14065 14875 -13265 -299525 -306698 202571 -142897 -654086 558491 152265 -487642 163025
14055 163025 -68271 -620742 -272374 -615378 -496139 -459220 -598446 258127 634899 559031
14045 559031 74923 7072 -306763 -317525 -390666 144140 -7644 -532204 -431739 -99499
14035 -99499 478833 372696 -266670 111226 -130626 -119237 -106578 39933 465466 241946
14025 241946 -69807 -553364 -655530 -45531 -423002 39077 -130645 -174954 46662 -243753
14015 -243753 189505 713747 408742 144203 4560 -335613 -178070 -123897 -87341 473709
14005 473709 513882 211806 9653 -179626 -42764 -249019 -171072 123094 -124717 -499576
13995 -499576 -709345 -915943 -346164 -326153 -943543 -897978 -497878 -401197 -719214 -628933
13985 -628933 119817 -199270 -242964 -540622 -57436 22023 -21129 -17921 -316640 18130
13975 18130 -327102 -503411 -107749 -127155 -401533 -192526 -152315 59812 330760 223031
13965 223031 -172676 -399227 94546 462742 531029 272247 338560 652281 227011 -312380
13955 -312380 -544776 -528983 -494695 -452089 27409 251310 689715 463353 95338 130812
13945 130812 618407 202275 299850 152954 351382 517404 120637 125500 -657628 -765059
13935 -765059 -421562 -202967 -61743 110333 65817 104211 102575 301755 46221 265509
13925 265509 317068 208246 -92483 -94077 -376411 -383200 -26756 -195933 -1011066 -740053
13915 -740053 -234283 203781 44557 27823 -178282 -207250 -64378 125945 -64560 506545
13905 506545 512489 513980 6184 -327209 -251951 -132792 -46364 336497 38829 -495565 -41905
13894 -41905 119131 413406 -12074 94527 173699 -59879 -369966 -186579 -315959 -219884
13884 -219884 133920 78314 85043 -17576 -413630 -154870 332284 133458 -327408 -293659
13874 -293659 -227895 -104291 -228528 -200607 -262540 -817777 -559021 48397 -204629 140292
13864 140292 246748 338529 103183 100046 200224 -56215 -97685 -499379 -930474 -281745
13854 -281745 -82275 -169714 -2178 -466979 -440962 -195867 184393 269733 219684 495020
13844 495020 95462 -364650 320692 76996 -157259 -134754 10622 63587 103215 -401523
13834 -401523 -955670 -960584 -749263 -98804 281976 -45467 -124693 268141 -206339 -162144
13824 -162144 -436329 300660 521039 163113 -106587 145316 508934 42053 88923 106420
13814 106420 -23805 276221 214691 471478 305297 181376 280651 280121 158503 130922 1863
13803 1863 224531 490872 227212 506876 -35605 -543934 -295942 -278549 -228476 -100524
13793 -100524 213140 344269 411999 870207 568603 -530628 48115 571865 218227 -201372
13783 -201372 -24948 94071 48484 105012 651539 672345 328879 49559 -136749 -121171
13773 -121171 255396 483041 -5435 -216865 -455248 -348208 -111289 -35056 -416546 -454598
13763 -454598 114446 -10584 -631298 -632660 274701 353573 -106895 -67713 -319309 -230860
13753 -230860 -262911 -477993 -59832 -262895 -295810 51864 -300621 -580968 -640419 -357346
13743 -357346 -424379 -86564 -335566 -413176 -296460 173071 218024 290637 -435382 -447173
13733 -447173 -610407 -985753 -892671 -746304 -104765 193254 -408620 -395179 -110142 -617445
13723 -617445 -776907 -559167 169288 757311 34896 59281 -385376 -375527 9210 74025
13713 74025 -4819 555663 852108 645389 314766 178886 -219527 -223007 127993 -308080
13703 -308080 -230751 -105164 -98413 444682 716949 -145560 -28592 -465308 -808894 -743168
13693 -743168 -599209 -160159 142007 -190525 -322162 -199855 -61769 -115325 -185781 -327721
13683 -327721 242333 153773 25977 -30335 -235916 -391480 -714886 -740010 -308369 -55889
13673 -55889 -54240 -123564 206782 267358 410585 303935 -100648 210387 134806 430435 209303
13662 209303 -78849 -181078 -448636 -245320 13149 -22205 26179 8070 20016 248119
13652 248119 536905 666977 341708 -85031 489629 305969 142764 605197 409511 7015
13642 7015 96215 -44526 -32922 43836 -29137 72774 -206491 -271066 -217764 -69046 -10155
13631 -10155 497017 591967 578764 774232 618666 448976 238690 274473 595231 642277
13621 642277 324445 -270987 172761 264538 -309807 27948 61755 8275 -162268 -36271
13611 -36271 81323 -176180 -103433 -305904 -208488 -112271 54293 184077 834554 824733 492041
13600 492041 709098 734111 301565 451926 580098 -345634 -200293 197865 190686 266757
13590 266757 641279 647741 492097 354856 187326 9943 -118580 358871 117176 -31134
13580 -31134 90627 154855 62629 207654 259956 124478 54666 45125 -87732 81514 -39736
13569 -39736 -314852 -300461 198858 70936 69161 481075 -157499 -257045 61210 265144
13559 265144 706210 416797 -169657 -607524 -396956 -254745 -458838 -576606 -329222 -142079
13549 -142079 -726196 -496051 -616702 -527668 124985 -122500 -413815 -181546 311860 659880
13539 659880 606283 54917 -243582 -204714 -179989 107196 144051 354413 146965 48295
13529 48295 216479 17081 160080 -23607 -291500 -231635 144082 348877 360309 407420
13519 407420 90176 -233902 -349873 20678 127594 -436412 -438864 248118 66254 -65497
13509 -65497 176275 -204365 -62902 296469 16146 27527 149255 136742 409668 173238
13499 173238 -457213 -373642 -252314 -793134 -839068 92257 411822 229590 -152071 431539
13489 431539 242451 -643540 -854093 -688084 -683911 -337914 470379 635943 127790 445514
13479 445514 660106 638378 263847 -114877 -29405 225935 344059 325530 -361978 -514295
13469 -514295 -162124 46899 -464978 -317556 -578253 -802197 -765113 -304857 -137039 -401417
13459 -401417 -513210 -496784 136505 703342 231070 -119341 -172260 -216143 202626 610219
13449 610219 318711 341056 4905 -24270 237547 -194085 375335 762634 958935 438791
13439 438791 353058 360953 399620 -154887 -5459 -160850 -17995 236002 317571 194716
13429 194716 -412860 -577604 -313557 119371 207740 -579565 -153380 -159619 47415 -4236
13419 -4236 -259319 -475173 -567493 -155288 81043 1084817 535464 -5067 47786 700238
13409 700238 651080 -160422 157113 -184694 -122964 -28347 -84965 -169818 115330 -153749
13399 -153749 176203 143577 -28376 -342479 -15223 81282 -387597 -9544 495798 232534
13389 232534 35001 -57532 35585 44149 -254321 -242550 -140536 -117628 -95480 128369 81530
13378 81530 -16090 -112895 -418675 -252522 330039 -182300 -298807 -560630 259388 54140
13368 54140 -395273 50253 -444160 -340778 -282993 130600 628289 195551 -473855 -604648
13358 -604648 -287897 182830 443859 53035 153107 117147 -373175 -159299 -33555 -102612
13348 -102612 -4032 -318983 -114174 185047 186576 93481 21764 -380129 -142303 11338
13338 11338 -46930 110453 1039 125621 294298 733522 581873 210635 215094 -327870
13328 -327870 -72008 463897 161602 -162857 -367884 79275 193677 -284207 14643 125252
13318 125252 470938 178126 51238 324955 95839 -167334 367537 423507 85138 -36501
13308 -36501 219424 442329 343147 274563 255680 179515 -16336 -222194 -43183 425713
13298 425713 405984 346753 -107051 -48918 363840 231385 -94621 174730 -49073 -129908
13288 -129908 -67743 304005 544431 1035788 571687 182979 -59055 -785465 86682 422394
13278 422394 326157 84202 -208390 -297212 -260606 -91862 332709 118691 -349049 -120505
13268 -120505 -171492 -251842 -279666 -322846 -25431 -370085 -271563 -218164 -193130 132532 -430680
13257 -430680 182878 284862 -156001 625540 -56587 -60598 -53440 215419 49547 -433547
13247 -433547 -711108 69803 759083 1040079 807301 28964 194801 77182 57616 -66940
13237 -66940 -477384 -360913 -671091 -97269 -118730 -595558 -285559 180987 753188 728588
13227 728588 1135959 240837 67518 102255 -56945 77037 -132816 -683324 -243953 21604
13217 21604 296885 128167 462530 -206554 -185848 -161829 56150 528463 359013 1022418
13207 1022418 627644 526947 331285 422873 227786 -318851 -42338 212851 598069 105065
13197 105065 -167795 -66571 163449 -19428 34766 20620 -615437 -277145 -375 -49584
13187 -49584 160763 345216 502814 835152 691295 657272 139180 95640 362264 -1689
13177 -1689 -386046 -30501 293951 357102 421665 102047 -183932 -152933 -39174 193831
13167 193831 -116129 230357 155868 -204001 138299 212440 524461 223974 439959 -214953
13157 -214953 -351049 157877 -259277 -488283 -221197 -97553 -78283 162264 141171 -222598
13147 -222598 -73239 105160 484996 387303 -496008 -650874 -215046 -4763 133539 155749
13137 155749 -51600 351449 618146 616087 159607 -326554 -366251 -306406 306350 825066
13127 825066 400037 420446 -42565 -134601 -3330 -146862 -48030 103946 680447 71756
13117 71756 106456 172629 130362 374549 183352 -46133 417714 430096 318380 640618
13107 640618 330994 226690 106282 -131059 136516 181233 -438800 -510552 -156794 -132002
13097 -132002 -269761 283674 -349009 -494066 -540345 -323307 -334379 -206775 -313035 -313515
13087 -313515 217364 652139 503755 138282 396731 990388 561686 75453 317258 555761
13077 555761 300321 149057 195049 602165 741844 580226 254998 -89534 115055 585638
13067 585638 70757 -403851 -81443 -75752 -336573 -213616 67920 205895 293919 134735
13057 134735 325736 220294 9813 -21925 179111 200872 448942 763085 512841 -169789
13047 -169789 -449139 -263430 317016 -533354 -29800 -138049 155206 581087 224559 311363
13037 311363 303752 93968 32696 -299493 -163321 -233902 219288 359593 707923 1003668
13027 1003668 422579 27698 262 -442440 -72773 321674 82860 385698 378659 448702
13017 448702 -155264 -492561 -181319 306874 -4810 153618 256087 290849 159019 598626
13007 598626 501114 297110 291388 -101193 -478000 -230610 561400 78827 -616975 -716714
12997 -716714 -601232 -71971 -372936 -74475 -253100 -697122 -221713 -77507 -252425 110042
12987 110042 -327097 -101668 -54069 -293015 -442151 -64964 311030 -6921 -118378 -91503
12977 -91503 -177588 167638 565266 413997 261075 39384 166137 612036 762778 197326
12967 197326 494827 841002 401702 234327 808670 647179 612997 419296 196063 -239748
12957 -239748 -751131 -449212 -154606 226582 -103105 -447921 -499352 -568567 -87501 -389306
12947 -389306 -677631 -359401 -338179 -240521 -115057 -196972 -45530 -715515 -905728 -599503
12937 -599503 -760049 -618125 -346777 -108861 -755164 -497586 -74541 -598608 -976142 -876767
12927 -876767 -621677 -752914 -951845 -1214925 -368007 -262657 -371688 -240613 11809 785
12917 785 -89802 131262 781813 306527 218016 157182 -443997 -322814 -536663 -384523 -309154
12906 -309154 -264694 -515368 -657352 -146460 -411645 -88832 -385824 -755270 -45716 -288659
12896 -288659 -528779 -339117 -480346 -571264 -395034 -68019 469600 11476 262761 -59161
12886 -59161 -599725 -478365 -233286 155132 -304703 -502602 -927753 -358177 244555 -228600
12876 -228600 -387028 -554821 -246365 -58073 -67857 -311109 -276348 -495212 -649210 -158495
12866 -158495 -45167 249245 -263325 279396 608211 189143 -361374 -780602 -227332 -591857
12856 -591857 -166634 -140356 -323026 -299881 1102 132109 -165278 -316761 -303318 48139
12846 48139 21444 -299352 252621 -80661 130395 -64741 -596905 -498289 -213443 -228006
12836 -228006 -350798 -392375 -706594 -70940 121018 -275857 -320098 -43936 209493 -56791
12826 -56791 -218354 -124313 -149910 -30745 283716 397008 361125 110560 -68866 148795
12816 148795 317084 249939 198397 203666 359787 192259 -402494 -249499 -129686 -143586
12806 -143586 88994 -114911 -170314 -378024 -506093 -1155556 -1179558 -852812 -424002 99010
12796 99010 300058 200206 54671 43073 169488 391049 -103602 -339365 79747 113136
12786 113136 -83238 68178 141596 406454 209272 484880 157020 -93118 -321871 -250064
12776 -250064 72889 7382 79315 413478 303885 583535 831508 664244 219850 212995
12766 212995 30229 59774 541820 37818 154812 316673 420233 315990 205356 -16335
12756 -16335 120588 323100 -277857 -84061 -252064 -127641 -314152 31818 41491 -238708
12746 -238708 -29418 -16850 -120238 115392 24932 -52440 -56536 -35054 183621 391475 -139660
12735 -139660 -365867 -647479 -310507 -161757 -391878 -51900 -425586 -181889 -336240 -349190
12725 -349190 -304638 -259528 -183237 -92640 22750 -77155 184135 615565 -267799 -224923 236248
12714 236248 203938 143819 -199500 -131415 134501 257079 274162 -187812 1220 53283
12704 53283 246654 274237 519602 325956 -299175 -342654 344278 439718 -56946 -107483
12694 -107483 -258195 64493 -240276 -146189 355077 377362 128467 -405824 -433500 -309985
12684 -309985 -100981 -23306 95046 -8834 15816 223446 247646 -222128 -357039 -219940
12674 -219940 -768545 -470991 50832 159087 346873 508246 277759 215946 -174266 -586414
12664 -586414 -639149 -796390 -198111 94347 -54115 25591 14180 248278 -111988 -307942
12654 -307942 205665 517852 268356 77890 -338989 -410191 -173352 220978 92152 23165
12644 23165 244711 252655 30925 -192819 -1568 -232224 95944 398907 237590 -68589
12634 -68589 -288081 -166909 -15256 -283166 -128568 362622 561834 194880 -71979 342418
12624 342418 -136372 393782 262653 -124365 215158 22245 72210 -104082 96932 -87027
12614 -87027 -346459 -95116 -159776 -644480 -617078 -224538 -180768 -109812 195082 -305438
12604 -305438 -41356 655441 631131 -91549 -614763 -516473 -273680 -285366 -27488 304843
12594 304843 159505 -190491 -191120 -48634 153443 -301032 -466737 -195405 -509992 -194202
12584 -194202 114324 -202386 -222108 -185485 216730 53670 -556605 -154425 -192961 -657190
12574 -657190 -308371 -207749 -211581 222 -178038 -1012129 -747761 25020 -146327 -195517
12564 -195517 92358 119985 -163823 -713795 -395010 -187455 -681306 -69352 -419832 -451689
12554 -451689 -76676 127048 317622 229284 37257 320623 298616 84902 186440 -94850
12544 -94850 -259723 -187376 -362594 -10165 -74768 96594 -307202 -75234 -621862 -522389
12534 -522389 -575974 -728571 -366211 -498117 -328747 -630339 -857404 -371024 -127693 124715
12524 124715 236536 45651 244080 -42358 62363 263563 172653 -62787 -171896 -555528
12514 -555528 -692211 -460217 -59181 253927 592603 377549 284676 -302073 -439458 -178524
12504 -178524 337998 364085 542781 325763 445940 531026 199659 468132 413780 -44574
12494 -44574 492285 591341 417284 360589 125804 -295958 28373 300728 144824 125187
12484 125187 95073 819256 150831 310036 352759 -93367 -221695 -287530 -174652 -277855
12474 -277855 120701 524120 200250 159340 100793 118735 -72659 74544 -162585 109639
12464 109639 -5663 -113987 -76501 472353 464836 381034 -177576 -467410 -719475 -714324 -302854
12453 -302854 -211578 244994 -199781 212657 146674 -24050 135092 34686 -268960 -18249
12443 -18249 350666 567002 709998 602288 279093 -1294 -200618 102224 339922 552885
12433 552885 79189 458833 674311 148470 -103220 282039 -184070 408382 583110 151910
12423 151910 -176598 159262 245661 174383 54054 66221 547853 346351 -70645 -197632
12413 -197632 -119749 -334723 -308149 -154727 -133344 -367200 -191974 -111802 -222810 -214508 -162381
12402 -162381 -291129 -272072 -477027 -305137 -294508 -296302 453398 469335 155682 91574 -20898
12391 -20898 -325355 -339077 13230 162390 188570 145310 253745 187460 450835 596827
12381 596827 568177 201662 221369 98075 -234966 -51115 232162 292301 178692 -210872
12371 -210872 -347869 -402010 275333 191318 -87307 -17068 -117489 18923 -177941 77777
12361 77777 170186 -96555 -223945 -201954 90795 55129 -329068 -464619 346687 136885
12351 136885 -495389 -372805 25344 -526941 -94258 343637 285814 780452 487942 -105230
12341 -105230 -144529 -641185 -523471 -952913 -377078 277825 -369012 -51670 546089 599629
12331 599629 -102405 -243923 161320 90803 180076 -136143 -346492 -362875 -544805 172152
12321 172152 729579 461113 -531075 -220948 270489 -330458 -500254 -599071 -876250 -538107
12311 -538107 -609447 -439730 -283812 -415394 -690366 -409400 -118143 301781 5489 -168445
12301 -168445 404780 493666 -49517 -372489 -689096 -455353 -253153 -325654 -289937 -285493
12291 -285493 232269 432112 -69471 108805 180559 -158239 -624233 -577747 -85663 650468
12281 650468 432525 417848 -427151 -411388 -247446 38868 253079 500316 884329 486171
12271 486171 -254717 -348929 -464434 -213563 -373414 -440845 41 -448193 37291 -132620
12261 -132620 248794 -36320 -416624 -574447 -148043 -134511 -26582 -230780 -10441 238059
12251 238059 -32173 -230406 -235650 -325630 -396001 -82200 -24328 167790 862880 202939
12241 202939 58174 113546 -253982 -40013 -231541 -479119 70965 -730342 -581767 -486920
12231 -486920 -386371 -134100 -619417 -680757 -731515 -428708 -618488 -298500 -283497 -728413
12221 -728413 35859 111587 58200 337448 27459 4955 -297606 161742 374508 204507
12211 204507 -100769 257625 73199 362740 719578 438433 4669 -4356 122368 319322
12201 319322 358730 760221 534678 -75471 -457162 -544786 46857 58318 140592 115148
12191 115148 -139197 450459 135895 -436684 50990 -330221 -179281 -139367 -511208 -462581
12181 -462581 -331737 -643553 -378442 264560 719166 1118565 433363 217305 139821 449349
12171 449349 562243 602012 588304 -332804 -354516 137518 -34189 -36444 297350 56387
12161 56387 517385 395527 239462 215977 57457 -560328 -193114 67018 191769 1043311
12151 1043311 944990 540841 68099 -128149 -529626 123596 144889 -2964 -319894 -16073
12141 -16073 -559 -429586 -346994 -310862 -72042 -98672 312783 317451 24566 471950 696772
12130 696772 288482 427576 303976 328829 59187 -142440 413992 745379 366300 128348
12120 128348 265613 347935 -89776 -142322 -139841 12734 -245107 -263251 -26076 -331924
12110 -331924 -657799 -370384 -269958 -38288 232106 291684 277677 -87006 70594 -337508
12100 -337508 508998 547783 145290 -397880 -248935 307532 425995 398678 315105 224284
12090 224284 124851 353642 505703 797069 815875 549255 389833 368720 263326 135219
12080 135219 252145 607722 655330 545170 676734 624536 -247574 169897 743072 547774
12070 547774 648067 329509 570282 928456 946935 1134100 1035593 908179 850961 977626
12060 977626 581913 449972 532600 512714 907328 839289 462499 394226 -44192 297766
12050 297766 769900 1180133 1185213 1069084 968255 987439 617002 579045 933675 1024062
12040 1024062 1019235 1277867 1111609 864014 957331 1100896 1352178 661174 437141 891806
12030 891806 991880 805328 864417 1246468 1033506 1147133 1339730 1778344 1747294 1179663
12020 1179663 1550937 1208725 1249433 1264808 1382142 1500012 1554099 1279518 1569834 1899986
12010 1899986 1510802 1429900 2067037 2227542 2144385 2033565 2059877 2308814 2213001 2016897
12000 2016897 2042292 1831767 2099988 2147705 2630602 2881463 2716368 2736525 2649965 2325199
11990 2325199 2232928 2572032 3387463 3607517 3142345 3311724 3523534 3950455 3845923 3957319
11980 3957319 3925305 3843372 4054669 4694562 5081944 5470077 5687580 6124594 6169161 6018828
11970 6018828 5990619 6128819 6556862 7558142 7385753 7399663 8481044 8755006 9249239
11961 9249239 9801863 10278711 10606960 10701101 11314787 12465479 12939779 13257311 13676261
11952 13676261 14486689 14901600 15835481 16259823 16631152 17148766 17726774 18076374 17906428
11943 17906428 17964063 17628668 17593094 17908562 17585026 17448849 17100775 16811103 17141182 16811411
11933 16811411 16002159 15289626 15036435 14535747 13627473 13027328 12796960 11968964 11995210
11924 11995210 11353740 10679601 10401924 9979250 9708268 9284771 8832566 8430240 8113720
11915 8113720 8101555 8067511 7485338 7405206 6891116 6751779 6367095 6134210 5498776 5413986
11905 5413986 5474107 5269067 4855724 4627109 4144727 3839386 3783334 3452247 3515751 3658443
11895 3658443 4098761 3584960 3462614 3268550 3544873 3573295 3128464 2870839 2431345 2748789
11885 2748789 3318155 2733019 2682441 2870825 2850427 2917716 3270634 2284881 2042454 2406254
11875 2406254 2188042 1827965 1779872 2080431 1578800 2060873 2216624 1866039 1953517 1685672
11865 1685672 1989120 1954277 2088344 2356907 2108979 1430516 1288940 1383062 1639167 1726326
11855 1726326 1959452 1752703 1463770 1417695 1150622 1338998 1066858 669740 608296 1058077
11845 1058077 830860 854337 1320686 1472263 980325 985274 1325204 1068534 1214083 783626
11835 783626 680360 727664 800948 970997 762250 333285 114102 458804 609359 1140872
11825 1140872 1229216 989335 959011 1385643 1727706 1120990 713323 1494237 1142356 595195
11815 595195 435654 352636 567393 436594 61815 -162 674377 1027803 887621 659159
11805 659159 487896 513834 302599 339979 284002 224898 539423 618141 220383 694007
11795 694007 971228 982094 849447 305712 649828 575002 -25397 545087 1098491 558453
11785 558453 266192 679311 649677 278457 142112 687449 529248 387645 158151 226347
11775 226347 993262 984425 430713 436095 428964 329125 107259 343152 665402 887947 1194897
11764 1194897 714244 223145 101350 -12840 247750 332706 632832 482055 559674 798174
11754 798174 442359 397878 906543 865720 902204 621680 796656 1056390 806484 547453
11744 547453 811360 563545 193245 820385 274071 -21440 -12575 344472 172932 149429
11734 149429 425714 469595 72842 641507 495837 25784 318661 203821 281415 527260
11724 527260 566412 867259 986023 756820 458975 563809 566553 1020945 844841 1118705
11714 1118705 609915 218109 3959 372600 408866 288406 707325 644897 89470 -400413
11704 -400413 -553192 -282976 -51109 -1933 50985 189893 -136768 -344170 -122768 -207835
11694 -207835 -90658 7988 282163 214650 506636 715347 968394 1137546 613619 465726
11684 465726 891700 -182038 -363754 145713 101887 332074 308002 147478 171459 126856
11674 126856 -398567 243100 58206 -18299 321261 115548 559294 274590 -99505 -557192
11664 -557192 -154451 358082 235771 136831 189972 -221117 158297 -36656 125732 518604
11654 518604 78401 154430 261292 -48181 -221239 -508911 -447473 207014 113430 -90881
11644 -90881 -126544 102616 361794 102747 -167571 -297427 -57057 243551 -217 40601
11634 40601 276292 25942 -42818 -140648 -35263 -722550 -662265 -226965 -349097 -620349
11624 -620349 -664250 -449769 -313202 -342487 -245504 249942 501174 700692 590960 -2446
11614 -2446 -110327 -7612 -284257 -259236 -426819 587053 153044 -390999 350918 402059
11604 402059 301827 82432 -758126 -396984 117954 181312 381765 424720 205656 -67725
11594 -67725 -442689 67406 -275980 -723335 -213578 -638359 -386315 23435 123549 58232
11584 58232 238553 -47228 -85831 75198 311286 192360 -289401 -290212 -68986 -506321
11574 -506321 -352494 36143 97683 180213 129555 -115794 -676552 -399638 -1347 -66548
11564 -66548 -12179 259350 472867 62137 -106016 -71181 39073 -295804 -187364 4865
11554 4865 -107085 -391599 -74181 -77181 -4643 513643 321435 471424 748611 109320
11544 109320 82857 478293 32073 530895 510615 597672 173997 -97759 254897 471461
11534 471461 257992 -61134 65929 162167 157610 14060 55256 290325 485833 551311
11524 551311 478342 665162 1013107 554480 -351406 -702139 -211566 328408 -477156 -606834
11514 -606834 -380639 146822 132452 -213851 37402 168695 248479 505802 539754 298269
11504 298269 554399 223338 276977 238138 170651 162516 237204 330002 215100 338247 192453
11493 192453 304278 388677 565048 199851 -253953 431096 358023 -152571 -307268 -357334
11483 -357334 -50721 -111875 -194504 216590 13426 101763 568222 380845 51782 -88263
11473 -88263 -103318 -323478 -251649 146973 -90630 -256572 91426 -17133 75152 218601
11463 218601 24139 156814 -4229 193582 467682 295627 402592 -99118 -342295 -412100
11453 -412100 -497805 144994 323287 497008 172987 399260 282864 31906 -240768 69025
11443 69025 290531 80040 -265937 -293720 -377350 319664 304175 -362048 -106809 -276065
11433 -276065 -303259 -495429 -267437 -84602 342125 365582 22929 135472 1119979 1174063
11423 1174063 733645 594377 889868 329053 -328877 -353679 -497885 -332174 -497594 -726332
11413 -726332 -522941 -24322 107205 -71813 -18507 -645569 -947861 -832005 -281454 -363072
11403 -363072 -502874 -250601 -232995 -238041 -370474 -423403 586608 516414 571604 -24820
11393 -24820 -609242 -614652 -522482 276411 -30006 -322223 -121945 316964 175047 -356578
11383 -356578 -270397 -366778 -181588 -126279 134799 -60267 -501128 -708457 -143071 -310620
11373 -310620 326384 766309 300545 109934 -252263 -187792 73139 148301 -268074 -580678
11363 -580678 -914428 -455639 -677096 -348123 -54854 361358 -602978 -589344 25002 -177635
11353 -177635 -618905 -676984 -61307 412574 -143095 -28928 -123280 101212 201799 210707
11343 210707 36382 -98094 -141823 -57905 187632 581149 293417 226211 -666 -119704
11333 -119704 116449 21773 -467868 -176432 63945 -76520 -524275 -722840 -154553 -479274
11323 -479274 -500091 86357 705449 243548 21091 -88338 181012 -81663 75895 170605
11313 170605 423926 559753 567336 333259 301491 318154 -133251 -479926 -899211 -292191
11303 -292191 -244759 -227733 -227047 57141 401201 458552 -199057 -98001 -7841 -8363 -244594
11292 -244594 -696671 -761277 -661454 -154808 -21791 -223793 -287936 -148174 -580475 -862689
11282 -862689 -708330 -289048 52674 -303576 -340901 121862 -70017 -30329 244296 572268
11272 572268 272044 114179 -330789 -92540 -559539 -390734 -389793 -822463 -353178 -216614
11262 -216614 -185816 226141 -30589 -161905 -426601 -553451 -374388 -184912 -193497 -57355
11252 -57355 108025 199786 -103709 -59299 537551 468125 25775 -112224 -200466 -108253 -414336
11241 -414336 -136855 -481641 -739746 -226522 -255949 -397807 -266626 -588446 -802060 -738853
11231 -738853 -455833 -93224 -418720 -333418 -371834 -231029 -292196 -329123 -230786 108161
11221 108161 -307074 -307703 -84 -47376 -117562 -165355 -408722 -203923 -395219 206060 -15566
11210 -15566 -282193 -47898 -432652 -471737 -82031 -101973 -722732 -337581 -54348 367452
11200 367452 78822 145924 -140909 -118048 -202932 221117 448731 613804 210863 -162207
11190 -162207 33415 -13729 -199937 -219386 -231132 -347853 108352 -324413 43023 -111385
11180 -111385 438572 655368 336977 222741 160369 22202 168874 80770 9914 98997
11170 98997 223675 -68064 -400814 -572809 -846686 -292773 248137 613873 40835 -405932
11160 -405932 541846 179648 253703 -42098 -94175 -211337 322550 427292 150978 -17211
11150 -17211 36675 9594 -323092 210 120161 -132507 -621679 -443140 -674905 -316547
11140 -316547 -4257 254758 662271 528131 -394262 -80103 188935 -210822 -616570 -555116
11130 -555116 -606988 -162844 140099 -954710 -1140984 -582734 -527748 -815923 -461587 328402
11120 328402 -77022 -670386 -480065 -494033 -204228 -512832 -597854 -135078 401278 816909
11110 816909 -4943 -432121 -222010 295085 701230 286632 -95265 -129382 -345005 -183343
11100 -183343 389862 285720 196846 -927 -145955 -220811 -506326 -71783 -194632 -551579
11090 -551579 41527 189150 -346693 23498 395505 32333 -33528 -156354 -189013 -3844
11080 -3844 -268713 60718 -571875 -676932 -401386 -331148 -221182 -308288 -124376 -84278
11070 -84278 -385012 -207351 -527833 -125717 476675 -140726 -624111 -880754 -645875 -289138
11060 -289138 -155010 87081 217989 -126322 69653 -655058 -271066 156932 75061 -206483
11050 -206483 -604054 -18210 -2191 -100864 -184828 -116742 -229245 -113348 221760 -315183
11040 -315183 -414122 304320 316973 26516 178085 -136410 -691546 -332884 -376136 -554740
11030 -554740 -628568 -160809 622398 345515 308240 127470 -292852 -630038 -822433 -190363
11020 -190363 -194588 -31536 -37016 123001 184955 -542421 -133416 -335000 80005 15481 436892
11009 436892 273248 -73513 -230640 -67673 -86346 -210322 -290083 -98570 -274792 -343493
10999 -343493 115890 71822 -208915 -269524 -175961 -115218 15252 -241416 53247 -409323
10989 -409323 -454504 -360564 -81683 -514477 3683 -432132 -511469 -366184 -609989 -565450
10979 -565450 -48309 -116860 -191254 198775 39979 -117076 -1159 60961 86084 509287
10969 509287 444491 120703 -42370 -403474 -474804 -288314 50485 226371 -128780 -419678
10959 -419678 -722157 16547 -236251 -603893 -210698 -180503 -13390 206486 145545 342879
10949 342879 344934 516519 234375 -350252 -257270 -65127 -90299 63030 123912 -432765
10939 -432765 -661140 -573330 -579713 -98118 -192207 -168583 121656 333670 285998 -99609 -204580
10928 -204580 -203714 -203629 -362977 -516480 -506835 -326751 -150904 -197986 -207913 182160 217560 -8572
10916 -8572 -656939 -556490 -263342 41645 86429 405429 196898 259066 303055 132755
10906 132755 266999 46559 -257617 18469 540165 203275 -500715 -217337 108201 583347
10896 583347 422138 -55895 -88160 -610827 -280920 107753 273088 -364196 -98710 172987
10886 172987 169335 91280 -67146 -324679 -13830 -116560 -405848 -46939 412528 328929
10876 328929 163747 -12200 -236119 -84009 108966 -452722 -503739 -385212 -72012 -212161
10866 -212161 201226 752809 205316 -414341 -104688 118831 457120 4269 -138040 124757
10856 124757 215274 291517 -284825 -641114 -426624 -260344 -502127 -763093 -952256 -566350
10846 -566350 -180756 -420667 71901 648568 396694 437268 -14710 10346 145150 315400
10836 315400 295613 241566 209951 -45868 -256656 -340761 -374529 -286645 59226 -18740 -226246
10825 -226246 -141881 24019 -381194 -259275 85261 -367813 -208034 -550739 -492105 58767
10815 58767 607699 328131 116673 8719 169648 -519277 -1163635 -656861 -204618 -383759
10805 -383759 -438724 -215583 64549 262621 430837 252481 -143339 -863232 -802551 -412571
10795 -412571 -93546 96721 387385 237502 301280 145195 115948 201443 139921 -322693
10785 -322693 -800830 -695169 -246944 -384451 -483624 -219975 -404427 -378104 -552461 -712525
10775 -712525 -135086 -47464 -302250 274871 401188 -7790 464554 613632 316696 401007
10765 401007 -301040 -73606 -215563 -385960 -321809 77683 -26219 -448422 -283483 422288
10755 422288 511003 -85367 -186085 418080 751870 413960 256474 149592 -162756 -86051
10745 -86051 209641 286254 -136166 -142927 190260 113199 176965 170521 389941 276334 96648
10734 96648 545501 708906 -31178 -28293 24335 -346992 -586249 -973882 -247295 -253647 -658322
10723 -658322 -227296 -216703 88103 297985 -215392 36152 -137042 -185709 -95033 -131048
10713 -131048 -135341 -170795 -227744 -804506 -600356 -334526 -490117 6168 190998 16115
10703 16115 3306 268541 -635416 -340593 92969 206072 -112093 -79648 196575 -13820
10693 -13820 -320028 -398870 401103 273709 93166 -103513 -208530 446257 619650 242950
10683 242950 193708 11854 -39199 -44513 316891 -94914 -85457 222476 -56171 -69870 -64733
10672 -64733 -227166 -30037 -286204 -185923 139962 244664 158763 210678 183680 58450
10662 58450 -222969 -51097 -15408 -164896 66173 214721 607039 33973 -317082 -574827
10652 -574827 -683405 -258243 55549 -255702 -565964 -619549 -19480 -297844 -354777 -271357
10642 -271357 -234646 74632 -193517 -178174 253059 583290 382985 792187 -109038 -32897
10632 -32897 57153 150639 -156901 -317760 -333276 -481259 -181655 -79666 36197 -363914
10622 -363914 -346347 -83639 -169507 -462040 -840976 -1050132 -634925 -872342 -687592 -727706
10612 -727706 -544470 -354951 164213 189302 -566251 -143073 -90474 242016 433649 156541
10602 156541 168224 529948 782503 475701 785000 973220 163451 -317350 -410817 -490960
10592 -490960 -127996 256960 162458 -291471 -197616 -366104 -682860 -706631 -479221 -256276
10582 -256276 -233177 -92950 -473525 -261581 -10594 -737544 -368737 -84089 -19587 -315388
10572 -315388 -174068 356589 268503 -399545 -524271 -539994 -233929 -197965 -150 -222392
10562 -222392 -673598 -547797 -493498 -206037 14523 -576982 -750919 -236276 -711357 -908767
10552 -908767 -935364 -250531 23211 -503754 -382327 40284 -119414 -650069 -332323 -143258
10542 -143258 -234964 -457243 178045 123376 -117515 556274 -109254 -276282 -10765 35220
10532 35220 -699076 630851 426504 344994 130598 395276 123711 556 -263265 -248971
10522 -248971 -377133 -546028 75147 232895 266577 -21553 205912 -69002 -170575 -44807
10512 -44807 7240 -171512 -228602 -35802 45897 -70527 159523 36081 513344 708566
10502 708566 157832 72922 -287195 150320 470074 98306 -341643 -773080 -591731 -218213
10492 -218213 400334 3 -363505 -768458 -605428 -841707 -329770 80782 -425926 -705069
10482 -705069 -408274 42344 -105909 49414 -43596 -221047 -579520 -559260 -39251 -103427
10472 -103427 -235035 374422 812211 138391 -113552 -183427 -395344 -43803 64263 -84001
10462 -84001 39119 -205682 -58115 -275776 16832 -72668 -322938 177270 199456 -163971
10452 -163971 -191900 -675676 -607664 -681458 -204826 -143189 -369841 -223661 -32733 -114183
10442 -114183 145212 -504915 -875445 -246924 -699555 -281039 -101460 -28246 -758435 -671841
10432 -671841 -639397 -508740 -182854 32310 332840 186560 110930 -287140 -92576 92155
10422 92155 172910 66324 42463 -166837 -243260 -745899 -569444 -590368 -357814 -538096
10412 -538096 -654900 -57091 -55698 -37554 -488056 -182234 66712 -188423 -13080 -221631
10402 -221631 -434792 -155260 212705 129701 -684685 -780862 -354524 -422092 -616242 -706174
10392 -706174 -459341 -250502 -430216 -89103 -187744 -3837 509629 293838 -552731 -388990
10382 -388990 -45240 83719 -69873 210758 409020 621609 291341 201209 -152081 -408264
10372 -408264 -409079 84649 93431 -54544 704301 340387 -36833 -541634 -328140 -159636
10362 -159636 -779627 -123506 -50153 -737742 -667517 -413807 -443238 -56523 382872 111240
10352 111240 -229953 70957 138558 -99267 -96989 122091 -68946 -862449 -644690 -59325
10342 -59325 -345918 -101953 -224202 -294645 -153147 -547246 -214528 125536 112070 61587
10332 61587 -169039 250170 473943 -178757 55427 204560 204741 -40940 -59210 143744
10322 143744 -180760 -258919 -100700 -410963 -428704 -510203 -153400 -377282 -412073 175853
10312 175853 -65202 265649 397343 151575 131586 55116 -24520 -113483 33473 105207
10302 105207 -141306 -246398 -557146 -293074 -124451 -12626 147525 -75319 9913 331628
10292 331628 416927 -459430 -639520 -242893 -29815 242453 269346 253562 87915 -144810
10282 -144810 -89461 -592850 -748646 -689438 -276016 163311 -200063 -98961 193658 74232
10272 74232 -335433 -31859 -7198 409392 220665 -478733 -832651 -462650 -512042 -208604
10262 -208604 253865 -80887 -365210 -474619 -273424 -119135 298747 354712 405467 211557
10252 211557 -93352 -449252 -203029 -554927 -414087 -714597 -520386 -85468 -16184 314686
10242 314686 266729 -359135 -171736 568912 212478 127327 122018 -107775 -582340 -480009
10232 -480009 -381621 -455104 -415568 -141223 14364 207778 423660 553447 231626 41037
10222 41037 -429620 -490427 -139800 -236838 -156119 64296 13521 -224532 -68000 28852 2475
10211 2475 28719 294808 -101060 125200 106157 69320 -68631 -358571 273290 227639 -11338
10200 -11338 581396 496227 307570 734179 464237 148668 -206487 -522779 -200667 257971
10190 257971 -53751 262106 419241 385752 182998 2752 158486 184105 757175 319646
10180 319646 244397 -477953 -315527 -161061 8653 50720 -418916 -532667 -307338 135245
10170 135245 -698554 -579074 9954 110135 142093 42903 245290 224126 -283913 -173247
10160 -173247 8266 125260 -54979 -218598 124371 -35566 109575 -488980 -544464 -132558
10150 -132558 144730 -159157 -699667 -249341 216724 -47009 -45810 415553 307468 673906
10140 673906 324592 -122213 61021 412977 21763 -182261 -402659 -162456 529302 -480332
10130 -480332 -826410 -329573 -36662 -317369 -51130 378697 278560 -78568 315739 379894
10120 379894 -197067 62162 132302 331100 -115452 -109506 -489502 -41671 401233 -409022
10110 -409022 -432203 112326 239158 -64839 -52466 -295740 -193312 -99747 -260060 -109613
10100 -109613 268787 576021 177451 600681 -310052 -632070 -56448 517497 -94679 -331550
10090 -331550 -66014 386504 23179 183002 -442945 -90432 -122047 519026 498092 377440
10080 377440 152481 -207148 366708 -81867 -207616 -273102 -92064 -122385 -89677 -33479
10070 -33479 -213117 -349648 -564311 -500975 174705 523479 643101 233623 242968 -230612
10060 -230612 -14106 -35567 272284 206227 214110 -430746 -345362 -45627 375213 -300783
10050 -300783 101047 -192459 80635 56961 -55064 -94875 -154500 -92937 12519 378673
10040 378673 9619 -57800 122623 367009 279253 168832 12928 -84670 -537992 -498795
10030 -498795 -327377 -770913 -615642 -246733 -69889 35213 438440 315403 465182 350573
10020 350573 440803 663191 314616 466519 -28741 -211145 -532448 -232279 -484641 -550124
10010 -550124 -47070 32207 374824 88402 -571772 -816564 -180734 692449 538994 1713
10000 1713 389266 148065 -421205 -407897 -118024 411474 404622 -142984 141327 385652
9990 385652 -290344 -419254 -251346 194911 336511 1022179 740431 466656 51629 -13181
9980 -13181 440973 828842 514741 204456 -489739 -376974 -148523 -397619 -356668 -365132
9970 -365132 271206 688236 193961 -316821 33764 629190 409856 142912 -34062 426632
9960 426632 405866 77714 -119792 -298786 67478 413331 717264 212415 35470 69150
9950 69150 -69519 -365081 150188 456741 506638 -208375 -594806 -653874 -180466 -79871
9940 -79871 -80129 424444 904986 488366 -184104 -92957 -159222 25382 507558 174231 175161
9929 175161 -533515 -725720 -103786 48541 -26805 240438 338302 149054 438551 1040326
9919 1040326 1273735 297946 267801 200088 -344940 102592 -89562 -296743 73174 399577
9909 399577 860638 559945 125928 340091 548575 278079 267506 560828 337524 330792
9899 330792 147475 -652550 5463 195136 118479 436223 2885 96377 -174050 274999
9889 274999 512168 498878 358563 54638 164708 -27247 -182365 -262645 -26871 526839
9879 526839 427389 86790 566647 1220458 1185989 829993 368524 -133862 -550861 -718427
9869 -718427 -31684 437692 518354 505558 1336687 735364 861833 776079 319531 129596
9859 129596 55719 -65273 15543 -32602 83084 -98349 -159059 76411 369038 66698
9849 66698 122463 438793 801492 471840 994056 491403 119503 707953 571561 18628
9839 18628 226898 315119 -4504 75841 -155391 745316 1172215 711501 554153 258665
9829 258665 285153 224653 100743 431949 798874 735082 712184 1113579 883871 1082165
9819 1082165 574986 881949 965474 637501 477394 528753 768011 551800 502332 823613
9809 823613 386655 440628 638450 703013 789864 1357147 819636 1165801 1556203 1350520
9799 1350520 1155326 1523824 1957823 1735742 1900986 2142914 1883097 1967921 1654854 1461839
9789 1461839 1914830 1704902 1941267 2395153 2016574 1431811 1799554 1777261 1886115 1648085
9779 1648085 1187591 1736704 1667097 1317276 1271644 1019482 1037909 1209117 792282 972362
9769 972362 822793 685977 613796 335610 380491 424991 979321 1097005 679422 834225
9759 834225 827583 803833 672449 386198 200614 621972 629760 521537 -253936 -452396 -272451
9748 -272451 -177674 228869 633563 556657 839081 1124319 549241 -90590 -8803 80522
9738 80522 378655 572299 332322 151932 -142755 -342205 -701878 8169 679933 635921
9728 635921 722639 1070319 823938 729934 1130830 910856 187013 -160886 313116 385218
9718 385218 387348 501999 585563 787031 213947 167386 142872 651047 538538 435367 -60225
9707 -60225 257539 314737 98941 224885 884615 1124136 1152152 924015 842885 1243543
9697 1243543 1419095 1285038 757760 675926 574454 905530 781909 864070 663201 518244
9687 518244 966900 924909 1221326 1487298 1384463 1049304 739318 494766 855033 305447
9677 305447 665494 719959 409670 487830 777326 1296988 1036249 1346782 828334 774490
9667 774490 823076 625169 834759 820183 850646 1398551 1511673 1743546 1631267 1215294
9657 1215294 1301201 1070303 710269 766299 794771 1099386 1523644 1461724 1033210 969208
9647 969208 1137509 1691445 1591157 1591509 1328368 1316723 1545472 1137678 1107453 1048626 843536
9636 843536 436517 772595 1559060 1433536 1453818 1633268 1679848 2018501 1243136 1728982
9626 1728982 2072883 1568417 1130309 1150154 1690327 1729979 1035850 1273992 1528311 1507637
9616 1507637 1667660 1263059 1462619 2281398 1850026 1661623 1448337 1548406 1824689 1805300
9606 1805300 1702297 1981042 2164766 1927616 1680571 2010978 1810250 1981279 2539989 2578736
9596 2578736 2585795 2467118 2169158 2122462 2240152 2137895 1744397 2313715 2569723 2197577
9586 2197577 2207263 2272102 1602408 1800315 2038656 2251896 2851217 1764530 1610458 2251002
9576 2251002 2640187 2946878 2666163 2195545 2140850 2766359 3016767 2079797 2100095 2047487
9566 2047487 2239881 2570291 2837920 2011068 2356908 2840471 3235396 3793396 3750002 2897560
9556 2897560 2892614 2725882 2826436 3113647 3146098 3207071 3366136 3215849 2858662 2868602 3128769
9545 3128769 3140716 3228992 3300468 3367422 3345065 3327606 3074884 3650900 3334790 3686126 3452402
9534 3452402 3179162 3027064 3288235 3681443 3809441 4021550 3882315 3669391 4473627 4430281
9524 4430281 4444603 4166200 3721161 4056811 4019313 4364654 4199117 4678897 5056241 4565727
9514 4565727 4950099 5301741 5573883 5820601 5908485 5808314 6224127 6065586 5595851 5989467
9504 5989467 5858007 6137951 6528713 7007716 7171318 7282956 7370934 6963011 6749659 7431398
9494 7431398 7529166 7973212 8509682 9540165 9354985 9154968 9648499 10309163 10402828 10354091
9484 10354091 10636215 11082014 11445110 11880095 11892725 12447937 12692593 13636845 13693696 14050238
9474 14050238 14584925 15430722 15497704 15830036 16672133 17331338 17815487 18368698 19246356 19876957
9464 19876957 20411120 22138239 23449867 24600838 25406553 25681972 26837506 27678402 29229536
9455 29229536 30775428 32126431 33655140 36070059 37950383 39497362 41531743 43587472
9447 43587472 46447570 49496694 52814213 55635166 58886881 62277327 66921386 72084735
9439 72084735 77431423 84364812 92519671 101220143 111194493 122033217 134061485 147349980
9431 147349980 161142608 177358723 195396463 213665917 231829186 249188070 264441733
9424 264441733 278129249 291632603 304314387 316931833 329013727 338946888 345655982
9417 345655982 349038475 349622998 346913119 341749024 335110085 327005507 317646460 307168974
9409 307168974 295115440 282751661 269691811 256311903 241926819 227496816 214366252
9402 214366252 201882236 189826558 177572157 166164812 155778334 145438537 135218386
9395 135218386 126160389 117388914 109530851 102583869 95458125 89212796 83363811 78685270
9387 78685270 73804383 69737471 65865533 62481595 59205362 56239382 53974058 51810017
9379 51810017 49721820 47456649 45773051 44642489 43176014 42210858 40863716 39339147
9371 39339147 37906960 36952935 36104110 35279734 34079550 33286640 33086785 32444713 31724323
9362 31724323 31316770 30576730 29525671 28677722 28666983 27947606 27180252 26543850 26114685
9353 26114685 24874934 23940952 23672618 22676277 22351022 22081927 21450363 21274363 21135056
9344 21135056 20528026 20474806 20684441 20915124 20919317 20752032 20290245 20054935 20001529 20303094
9334 20303094 20468082 20626847 21122679 21014413 21323087 21920467 22249732 21776190 22298932
9325 22298932 23637985 23546044 22942897 22848042 22845725 22568903 21793448 21193776 20812421 20501413
9315 20501413 20232534 19358352 19434510 19029433 18101339 17757244 17068981 17276347 16197575
9306 16197575 15770214 15477546 14844093 14116521 13541358 13338481 12483402 12426766 12197270 11915314
9296 11915314 11150339 10744354 10254373 10146091 10201028 9683717 9134464 8744760 8220927 8011985
9286 8011985 7848821 7736999 7074996 7197504 7648604 6638648 5858924 6113801 6689016
9277 6689016 6575635 6662506 6359888 5763422 5990937 5964323 5896033 5802968 5855082 5477245
9267 5477245 5981569 5817347 5688237 5715219 4860232 5270562 5506438 5622332 5181543 4911259
9257 4911259 4944499 4851374 5185180 4257401 4309855 4604801 4636904 4382260 4218600 3764197
9247 3764197 4141150 3835913 3725278 3842219 4295061 4430557 4531759 4540587 4058869 4089696
9237 4089696 3353316 3080848 3682368 3857981 3640014 3218102 2963223 3588574 3582253 4149895
9227 4149895 3976060 3657333 3982185 3681634 3364105 3043882 2906743 2633266 2379916 2958598
9217 2958598 3303614 3433443 3251947 3476560 3506472 3182665 3452695 3533765 3252082 3052969
9207 3052969 2955178 2979652 2671168 2370723 2688082 3136612 2966805 3180411 3382880 3145968
9197 3145968 2970010 2921969 2909116 2829850 3006968 3095022 2934032 2514419 2582158 2358706
9187 2358706 3131018 2973293 2945690 2927080 2498844 2364363 2655118 2866885 2723336 2196199
9177 2196199 1980467 2467182 2478501 2328330 2711519 3126879 2802091 2139781 2377441 2649022
9167 2649022 2973313 2585824 2002884 2638231 3052706 2906953 2157746 2574471 2732879 3006011
9157 3006011 2933446 3130317 3113921 3187426 3021255 3253436 3248360 3450370 2807574 2619150
9147 2619150 3154401 3259118 3437839 3371515 3700125 3412606 3214478 3231524 2950682 2950387
9137 2950387 3068361 3344562 2468679 2238503 2481564 2466199 2762538 3147900 2943046 2632288
9127 2632288 2268789 2404734 2627203 3082981 3612520 3893555 3891685 3480467 3292316 3367842
9117 3367842 3597369 4072170 4475636 4392294 4605180 4381751 4346629 4224020 4228173 4578603
9107 4578603 4450525 4304901 4269510 4217323 4631994 4714214 4441504 4688225 4497140 4447578
9097 4447578 4149723 4200501 4527945 4718173 4445975 4068175 3927624 3987205 3956456 3924488
9087 3924488 4351668 4738107 4811821 4486271 4554277 4633651 4329555 4616146 4668310 4616913
9077 4616913 5015127 4328573 4673890 4906190 4598825 4515899 4645454 4639650 4880357 5073579
9067 5073579 5130298 4826712 5244819 5186464 4907981 5093076 4855509 4808410 4941707 5181254
9057 5181254 5360612 5656831 6027515 6526510 5994627 6490598 6359974 5859599 6590704 6506206
9047 6506206 6478047 6750123 6769572 6655509 7001267 7158067 6839029 6870057 7095287 6947677
9037 6947677 6812635 6698455 6895806 6490033 6562114 6563727 6653281 6440321 6605552 7024060
9027 7024060 6813250 6540669 6514365 6491828 6497618 6705799 6364590 6504293 6791274 6721753
9017 6721753 6216725 5873027 6231257 6185838 6768895 6835713 6514213 6431862 6670165 6709351
9007 6709351 6403948 6888369 6818931 6395816 7130091 7846301 7699134 6998809 7439841 7467428
8997 7467428 7661819 7908365 7871459 8167457 8438079 8376840 8492195 8500760 8148750 8108035
8987 8108035 8472509 9262116 8922609 8783045 8641776 9077285 9454492 9485187 10029399 10219655
8977 10219655 10547676 10983200 11387278 11410455 11403468 12398675 13349755 13714385 13881898 14420392
8967 14420392 14702913 15369927 15816874 16315653 17345227 17928050 18735541 19493032 20583857
8958 20583857 22071849 22952947 23600110 24713959 26004211 26986095 28639695 30772288 32355935
8949 32355935 35039937 37808152 40708649 44192910 47564723 50795791 53850829 58086865
8941 58086865 62766820 67382272 72926499 79099675 83503654 86351658 88893747 90998752
8933 90998752 94189462 98244341 101193337 105884694 111449546 116359323 120862096 125527772
8925 125527772 128755994 130173610 128586974 124951062 118213861 110812032 105564296 102068574
8917 102068574 99619427 97081340 94760302 92121248 89604353 87752960 86635548 86128994
8909 86128994 86656498 87983298 90354060 92565129 94353224 96569799 99987183 104586692
8901 104586692 110319357 116957100 123740662 129854367 133160441 134416578 134332366 134232548 136108172
8892 136108172 137955229 139082958 140681178 141659053 141132490 139851986 137110139 134338804
8884 134338804 131251909 128144507 125105594 121880553 120419383 119419879 119157548 119613377
8876 119613377 120156919 120670097 120130787 120368380 121707737 120984609 121373809 121544392 121804041
8867 121804041 121399199 120140875 118630766 117085207 116053822 114613843 113226825 112178986
8859 112178986 110497040 108741683 106445412 103262772 100196781 97480183 95115104 92417658
8851 92417658 90269209 88562276 87195055 86303626 85563528 84966717 85059212 84873564 86163214
8842 86163214 87347933 88491764 89863050 91642918 95017460 99541226 103664818 108380040
8834 108380040 112663211 117171058 120220890 123848099 127906974 131564189 134529555 136022795
8826 136022795 136525512 136541134 135978119 135048399 134301694 133277201 131672162 129427937 125939660
8817 125939660 121672205 117979677 114096527 109743352 105578798 101478442 97499120 94600726
8809 94600726 91671816 88783303 86541608 83911801 80886585 78049883 76227379 74538794
8801 74538794 73133436 71377682 70401819 70542745 70643922 70489928 71320656 73019591 75112441
8792 75112441 77376685 80609793 84535415 88860851 94419870 101027236 109180197 117750233
8784 117750233 127528603 138100281 149813130 161764567 172487508 181564846 188000215
8777 188000215 191396691 191791431 189994989 186912606 183337590 179384599 175378842 171191150
8769 171191150 165915896 159532158 152573212 145674441 138653201 131465498 123913691 117874402
8761 117874402 113061589 108140303 104197893 99953210 95875733 92334792 89000898 86903752
8753 86903752 84605481 82511741 81321425 81167323 82071532 83518483 86005520 89575283
8745 89575283 93210300 97211348 102153955 107731840 113213513 118245093 121175337 122696873
8737 122696873 122666531 121020051 118701884 115172554 111528768 107758595 103344059 99475710
8729 99475710 95410429 90905214 86379835 81967234 77333896 73011343 68963905 65176403
8721 65176403 61135048 57716137 54422512 51571124 48308631 45738112 43012807 40708406
8713 40708406 38762031 36013041 34700254 33498424 31932131 30564185 29056949 27744616
8705 27744616 26782678 25957401 25107400 23988500 23311646 22782878 22030122 21348503 20867027
8696 20867027 20405410 19977010 19311804 18999559 18963776 18604847 18778366 18350672 17950317 17705059
8686 17705059 17303188 16949985 17019747 16941252 16263288 16642079 17112369 17176817 16729829 16390475
8676 16390475 16158843 15903034 16239373 15737960 16535486 17003217 16503994 17062764 17312093
8667 17312093 17136029 17292284 18059960 18257053 17896672 18337406 18813988 19003500 19269660
8658 19269660 20085448 20661860 21674419 22613025 23282793 23704960 24422169 25553967 26430019
8649 26430019 27844160 29320704 31056566 32655462 34938977 38087185 41544307 44709862
8641 44709862 49519902 54039170 59660025 65654698 72279974 78609285 85096505 90471946
8633 90471946 93403225 94889825 94418389 92255960 88867948 84465899 80500610 76287516
8625 76287516 72253901 68827447 65649145 62261326 59178545 56421947 53591077 50752251
8617 50752251 48259245 45390603 43586739 42181032 40420741 39632730 39299328 38265850
8609 38265850 37498680 37475878 37539456 37306293 38232551 39924402 41564508 44054877 46752227
8600 46752227 49758527 53435306 57102527 62154851 66161865 69716874 72477366 74466234
8592 74466234 74526508 73205613 71235949 66844265 62355076 57087293 56182443 54558188 51856497
8583 51856497 48368330 45333279 42533791 39647516 37855449 35547634 32602158 30785391
8575 30785391 29478630 27641918 25508493 24705413 23552748 22113119 20378365 19819400
8567 19819400 19391572 18813914 17905378 17009277 16140787 15583082 16013697 15170964 14774234
8558 14774234 14451033 13881943 13461362 13177452 12244782 11881173 12115493 11934742 11007823
8549 11007823 10325947 10483101 10549608 10623483 10557377 9883034 9558002 8915263 8777655 8618238
8539 8618238 8191785 8362377 8108283 7088195 6870998 7194622 7157666 6945060 6999824 6946974
8529 6946974 6718453 6586373 6450407 6568391 6024428 5848345 5563249 5273789 5632845 5827509
8519 5827509 5719552 5727927 5957614 5773639 5446387 5314196 5268763 5394004 5095531 4837728
8509 4837728 5049138 4734502 4406697 3929079 3845892 4329154 4521211 3961596 4086088 4528813
8499 4528813 4201469 4116475 4215819 4334768 4096268 3715792 3537501 3483468 3148951 3588307
8489 3588307 4196252 3620753 3473091 3762665 3377218 3012565 2986043 3262712 3168790 3793844
8479 3793844 3493332 3080730 3450797 2997716 3307926 2956827 2880590 3258478 3034519 2516595
8469 2516595 2608513 2429875 2426877 2811646 2423012 2319590 2729700 2521192 2759466 2825737
8459 2825737 2437553 2115239 2825211 2879116 2074899 2085849 2152909 2222443 2304791 2127422
8449 2127422 2417120 2457650 1912089 1862563 1622169 1612749 2119106 2256041 2225015 2249224 2200839
8438 2200839 2420805 2430579 2214529 1972371 2131497 1464658 1175084 2002711 1837335 1809586
8428 1809586 2182254 2102188 1379086 1206723 1229913 1500219 1372505 1520344 1646888 2283909
8418 2283909 2587498 2165188 1597573 1625870 1902986 1824248 1678402 1897402 1978803 1692726
8408 1692726 1796707 1734497 1579081 1637970 2065490 1776988 1089052 1431301 1584922 1232969
8398 1232969 1668320 1436236 2052101 1837071 1499379 1439496 1471935 862134 935770 930647
8388 930647 1252355 1261071 1007484 975313 1026118 824525 983841 658725 911655 861611 681584
8377 681584 975802 972565 1139774 971950 1064216 1419779 1265891 1708353 1654110 925929
8367 925929 1394497 1219829 1031986 647003 1420430 1222793 1455158 1188447 889940 1215736
8357 1215736 1175164 1293081 1062077 1430652 931453 929512 991458 1107766 848491 515466
8347 515466 332564 282990 833902 486019 -69253 -109825 169835 271005 502713 929405
8337 929405 939777 963645 514141 379928 518143 90797 345392 593065 1293242 1247669
8327 1247669 650803 304620 327987 438136 546011 286573 254334 -124370 -254454 339921
8317 339921 634104 174817 407518 275058 457999 430397 109019 373192 284834 298022
8307 298022 -27002 199994 362691 121720 -26892 -240962 103020 308419 774515 370615
8297 370615 26123 29507 -56495 -21067 -51974 141714 322244 885639 937694 697591 703191
8286 703191 511595 -101858 -39094 -199878 24736 155772 452584 393220 660482 943024
8276 943024 681327 753657 572030 861720 418281 416014 667355 447601 194085 464469
8266 464469 505353 81660 898572 853293 362638 180198 509612 605235 145771 -164078
8256 -164078 -158467 215116 709102 126211 622617 538983 378553 588606 350312 456285
8246 456285 199041 -85687 60185 181630 262716 506298 -251947 -349150 -636785 116585
8236 116585 165988 106096 81122 -70266 -512127 172314 294713 -110674 42913 195641
8226 195641 392498 828702 1223415 300646 746393 664520 545373 -294712 -595855 -299681
8216 -299681 112965 -51831 356158 695425 -91193 -343851 252403 -288584 -310827 -132866
8206 -132866 250055 97789 -459561 -76946 -517914 -459764 -344989 -429876 -342093 -91648
8196 -91648 333065 -311953 -762172 -2785511 -2149145 3138917 2131652 764398 1607762
8187 1607762 1490697 1030879 1036454 555745 330673 -12787 119619 847661 1045468 1015645
8177 1015645 476185 102985 -172259 4142 178503 91351 654132 457385 187322 397402
8167 397402 239871 -164783 48687 898346 998919 967544 387398 -11423 -33617 34480
8157 34480 -119004 60766 275654 829219 351835 -218102 45824 241344 213765 -104329
8147 -104329 214335 195988 -19502 -528667 -837250 -19508 118408 45617 -271748 -212171
8137 -212171 -1942 -212133 -19521 -92455 178329 718881 -97309 -147385 445713 280529
8127 280529 -219160 208256 81405 313917 430482 129422 -16998 552078 345454 378140
8117 378140 911290 194960 -156912 -276217 -233200 29702 343204 -161648 117493 -265473
8107 -265473 -366808 100812 -95375 -5651 130960 -24366 -408245 -37313 103320 -548470
8097 -548470 -294234 100471 374313 27762 54103 -91951 369581 571939 323280 151995
8087 151995 48941 181749 464324 310862 -68759 25974 202478 349196 -380066 -480590
8077 -480590 -93606 210305 75116 -252977 127328 78886 -92182 -159555 195500 -214990
8067 -214990 -662084 -889457 -691386 -216587 -661928 -433854 42336 21942 297887 629546
8057 629546 147951 71568 374282 724077 -360400 -693521 -374020 -372049 -516482 -498866
8047 -498866 -132757 -587497 -566664 -775778 -530046 261964 308438 47910 168156 397093
8037 397093 675823 218059 431848 261411 139134 -379424 -238322 274646 -85601 -247014
8027 -247014 -60507 -153670 -517086 -719693 -591182 -4413 -562090 -490283 -263330 53527
8017 53527 -404743 -889027 -883087 -1112895 -324779 107351 -145427 175457 -109788 -470180
8007 -470180 -525259 -473409 -37087 -367305 -315858 28009 -177052 363462 383313 -29217
7997 -29217 -887 374357 158409 -271781 -2348 505526 -327854 -810694 -54649 171288
7987 171288 530018 350995 -265918 -39634 -403273 -442671 218432 -142315 -319006 -88207
7977 -88207 431790 -183752 -263573 -55920 -199425 42857 -305776 4185 304469 215173
7967 215173 -77661 43664 164528 -51783 143099 612138 590571 720930 480618 -141329
7957 -141329 -73493 118693 541663 209733 -361459 -539507 -649689 -657843 -437919 74856
7947 74856 -283614 -49652 276557 -591699 -17156 355401 -72284 -229194 -121560 310025
7937 310025 46670 -77716 -100574 -421542 -531853 -331872 -357317 37645 96430 -25925
7927 -25925 80488 -49486 -348624 6635 176869 356854 -32305 183327 43673 -28486
7917 -28486 149067 -97393 -223671 -287652 -351513 -633900 -525999 -415711 -538818 -547918 -521661
7906 -521661 -592343 -28560 96053 -111089 -221347 -669298 -692792 -96210 -279245 -270784
7896 -270784 -398672 -348727 -322321 -592176 -551575 -239143 86460 -266077 -754892 -988838
7886 -988838 -608358 -441036 -292745 17778 -2375 -190201 -625732 -484290 -501037 -358919
7876 -358919 2453 13100 66526 -275994 -770424 -279367 18825 355840 250825 377270
7866 377270 150047 192222 775532 388128 407687 448709 380138 552635 -97247 -351560
7856 -351560 -73320 300319 -92697 -342333 -316860 -236751 -523740 -584515 -305416 -109003
7846 -109003 -642561 -941352 -915454 -271833 -564886 -632118 -640105 -291885 -464135 -409444 -136122
7835 -136122 42399 524517 125829 -290931 -777596 -376648 -384216 133034 -107216 -56106
7825 -56106 -158509 -382129 -184324 -826080 -481169 -939178 -574925 120586 -345751 -585359
7815 -585359 -688656 -526 85741 93774 149866 142920 59501 391216 483300 186905 -591686
7804 -591686 -525042 -618195 292447 -166576 29112 176304 2808222 2143322 790164 1113183
7794 1113183 57230 215455 357876 408184 148655 227502 138903 -136178 -72079 151187
7784 151187 139096 508074 760199 879404 26501 -304970 -194133 39271 -228666 -121005
7774 -121005 58804 120420 656547 580118 -29132 4609 43553 7962 -137654 132092 -269315
7763 -269315 97047 309969 188493 -186945 -54499 91727 -299138 -591536 -136680 -102499
7753 -102499 195326 -8188 -282585 -237028 -32936 414524 27819 -132490 -334560 -527935
7743 -527935 -399721 157597 264643 -708 -128533 115402 -201504 -555435 -798249 -899144
7733 -899144 -413374 1613 -194124 -300544 9099 -30071 -147232 17936 -14123 -234053
7723 -234053 215229 580918 181926 581095 763719 416713 61575 -152233 -534223 -390374
7713 -390374 -266478 -130988 -88287 -36079 -292322 25973 304013 -7563 214187 25261
7703 25261 338158 617531 354162 715651 927286 1040722 1024460 783938 662828 242764
7693 242764 412415 353705 486281 307379 38721 64056 190837 113718 -46468 348920
7683 348920 255709 -559757 -710082 -508833 -237153 -200054 324458 434222 148289 388798
7673 388798 94869 -29845 -573216 -70674 -349476 -197587 189388 141462 -93782 353576
7663 353576 562545 134599 -174998 -128373 95895 -512010 -364217 -154407 -536931 -606937
7653 -606937 203663 833416 1153518 783899 563460 325462 -19453 -238329 62818 494162
7643 494162 502805 -272460 -48190 -87524 173304 -325345 -199672 -237291 -228855 -460697 -1106260
7632 -1106260 -849193 -510829 -671952 -771830 -563893 -772712 -77261 68865 -380152 67731
7622 67731 577132 563502 165101 -525690 -406717 -57071 176701 -342527 -279610 -791
7612 -791 60165 219684 56616 -567770 -318069 -813378 -233576 316401 -53763 -281297
7602 -281297 -53172 31943 -165424 238217 193725 26298 76406 300090 280813 -535263
7592 -535263 -251795 359669 615934 -28078 -383789 -449798 -14409 208945 509913 800090
7582 800090 392697 139753 74447 426343 9105 86066 -188748 267630 179080 293098
7572 293098 513930 350695 -33567 243246 751421 311058 363141 243137 -40028 205032
7562 205032 124631 -74182 -133346 300567 490838 418824 272096 32644 -84337 -114207
7552 -114207 102805 20873 -78580 -175089 -405849 55116 -199167 -369079 -431215 -666251
7542 -666251 -197191 -286369 -643462 -394359 55586 -40011 219467 239878 324179 29014
7532 29014 -448227 -580156 -553981 -518319 -297163 193051 99618 385569 262192 -39486
7522 -39486 -541991 38097 115470 39763 511661 -189950 -175657 53757 133205 100209 120965
7511 120965 -197851 -460738 -669274 -731492 -649671 -182461 -289428 -339843 -274583 -536101
7501 -536101 90529 279990 -99434 -293751 -119160 -16916 -93626 108793 -119167 -340789
7491 -340789 -242175 -208648 155801 -79090 212622 -147999 -629995 -379578 -623492 -384264
7481 -384264 -481030 30337 211583 -128198 -122663 -758710 -855879 -305600 -137058 -227005 -743829
7470 -743829 -505370 -550580 -479950 7547 187484 572514 325025 154111 -447630 164520
7460 164520 218814 159396 -153634 -672791 -273896 -141975 -544070 -684699 -525056 -1032800
7450 -1032800 -708736 -754088 -554497 -97544 80633 -165234 -292937 -425651 24621 205240
7440 205240 236520 138155 413271 -128705 -193500 -203610 135244 448785 -103704 228643
7430 228643 454158 -114662 -365042 -246195 102981 -315860 -367791 356639 -120850 -94837
7420 -94837 194419 -168602 -357678 -44635 -399363 -105186 8375 166974 272626 -89051
7410 -89051 -366417 -168521 -310694 -831813 -757395 -348345 234550 -37823 -234186 -322671
7400 -322671 -364979 -60866 -285421 -316124 -87576 -649798 -245341 174654 -284789 -516415
7390 -516415 -240026 -253093 -632126 -628952 -309919 206845 546472 489386 -329287 -666428
7380 -666428 -785590 -478655 -129795 15205 30235 -502402 -962894 -663375 -329487 -186087
7370 -186087 -328407 -91353 -376427 -319909 -198008 -73690 -124983 -187760 -247491 -329477 -305417
7359 -305417 -243919 -201886 -323693 -274618 4290 -442570 -383547 -94016 -106662 20246 603087
7348 603087 865831 86257 -201211 -150387 -213231 -103266 -374761 -683128 -467930 17080
7338 17080 -312240 143110 380624 492169 439867 -252813 -267706 -160772 -533003 -901351
7328 -901351 -268810 -60459 -413016 -220053 -351215 -211936 -248129 -224395 -267088 -409347
7318 -409347 -356712 -355793 -291247 -370466 -299375 172797 89010 -187492 194408 270758 367630
7307 367630 121897 631237 615059 415567 -93310 96164 484274 187881 337548 350765
7297 350765 -247661 -37019 -415539 249154 212354 -4985 -6704 -147903 -127949 -429482
7287 -429482 -423925 -72918 -264903 -646933 -120582 -162499 -224785 -54767 -20956 -6963 -55090
7276 -55090 101212 120029 -4402 -79018 -191707 -161207 334785 -14116 187810 126483 66623
7265 66623 55786 230231 462809 178960 174609 228404 200864 114099 247404 119639 481383
7254 481383 654974 654590 566186 449062 665184 716542 846271 634608 386796 -236764 -402721
7243 -402721 -441541 40553 563476 896293 391689 -66442 33928 -82677 -201363 -367814
7233 -367814 -118837 -281796 -220942 206711 480843 309775 174127 308973 77147 -273463
7223 -273463 51730 54637 475574 619355 415019 354746 -178628 -464331 127189 -48884
7213 -48884 132691 227583 403626 -205643 -736043 -796982 -647499 13037 110821 64544 -196885
7202 -196885 216394 346820 633861 919209 339784 395961 1078031 1012188 355270 694686
7192 694686 438992 -37025 -18110 434859 -15808 111341 -18040 1483 554453 934856
7182 934856 594564 281741 508613 817964 644788 386988 345404 178190 -355671 -416031
7172 -416031 -79137 177872 282318 442014 310506 287571 398159 97353 -190517 149323
7162 149323 580242 419065 485510 330141 149981 399169 769836 665365 660606 690121
7152 690121 946729 1013362 669545 315969 531376 479925 418901 633897 499986 425744
7142 425744 501989 512841 831019 752836 417308 210847 169314 573697 369963 -53149
7132 -53149 -398487 -411983 -309949 -184758 615814 257971 297388 141894 1047238 1335434
7122 1335434 1346009 1271273 815827 716185 562290 751174 686735 488306 926535 1397562
7112 1397562 988532 969580 927082 1420640 1319462 1169544 1047499 859744 1152181 1229192
7102 1229192 1008834 1749274 1765992 1832712 1662014 1525531 1616008 1400789 1122197 1043272
7092 1043272 1298048 1504265 1869870 1366596 1578014 1469235 1223541 1745332 1884348 1851682
7082 1851682 1972843 1983637 2117073 1973547 1436420 1701147 2424985 2184091 2021466 1878517
7072 1878517 2107778 2034848 2310055 2255670 2081539 1978845 1824967 1745849 2675345 2341863
7062 2341863 2142422 1988610 2205326 1682512 1818133 2368092 2336997 2358419 2034764 2305944
7052 2305944 2607498 2356386 1971937 2315054 2092670 2349395 2868115 2910514 2994386 3027992
7042 3027992 3082104 3386920 2686849 2706159 2848889 2982157 3339128 2954342 2858425 3421987
7032 3421987 3177715 3255891 3321214 3687982 4160626 4258162 4152618 4226532 4956279 4742493
7022 4742493 5078304 5164946 5189314 5546809 5802018 5870019 5855087 6393972 6877132 6783914
7012 6783914 7572912 8149373 7808811 8402624 8590203 8948387 9584156 10025082 9772136 10065250
7002 10065250 10556482 11092856 11723193 11815614 11658654 12594250 12783089 12784247 12887007 13326491
6992 13326491 13941915 14489831 14126037 14212247 14894165 14639231 14596234 14983016 14751178 14638743
6982 14638743 14887557 15407754 14919375 15388808 15303291 14991853 14900817 15007575 15107055 14649491
6972 14649491 14076280 14133736 14057775 13689124 13515982 13099999 13228145 13094904 12591883 11408770
6962 11408770 10685007 11032746 10241378 9865713 9443357 8811891 9393287 8827302 8473767
6953 8473767 8323486 8123325 7839896 8172311 7143736 6483178 6223506 6341361 6467117
6944 6467117 6614324 6382488 5930585 5105573 5175573 4801954 4627760 4242240 3425082 3902142
6934 3902142 4452104 4757308 4418615 3171928 3099715 3761831 3080733 2849496 3045173 2796562
6924 2796562 2914991 3018700 3198596 2540163 1670153 1956203 1529041 2037446 1781490 1546903
6914 1546903 1725692 1742938 1951177 1903019 2006785 2058206 2340444 1699308 1309194 1706772
6904 1706772 1853939 1358836 1800554 1662983 1819876 1797985 1632508 2115070 1657242 1633886
6894 1633886 1688450 1928972 2205536 1904993 1232921 1522771 1696948 1986252 1779586 1366737
6884 1366737 1214839 1367552 1654631 1459013 925283 1070354 1167407 940697 569962 798691
6874 798691 1459784 1391477 899725 497422 903645 819963 813581 705377 967436 1165734
6864 1165734 1453109 1447327 1263735 1360739 864359 1321254 1644648 976818 868007 1308847
6854 1308847 1365020 1452026 1536774 941671 1541577 1717602 1535184 1007874 897914 1646164
6844 1646164 1439407 1476903 1272794 717350 982036 1598011 1534933 784598 1351227 1735586
6834 1735586 974551 901667 1379034 1477486 1719457 1787260 1957872 1394629 721654 310144
6824 310144 751306 1124211 1133003 1172599 1479897 1394347 1383414 1181299 1081307 1580774 1667396
6813 1667396 1746673 1774374 1663494 1986773 2332892 1841331 1664995 1416204 1633016 1715366
6803 1715366 2088930 1448206 1211585 1436504 1356930 1183803 1329410 1152608 1286623 1088417
6793 1088417 1493323 1520365 1474146 1251472 663948 921219 1826367 1766096 1544696 1176406
6783 1176406 1265529 1172041 1544376 1495603 1456531 920227 429330 494167 889552 1213932
6773 1213932 618225 468812 635881 964020 1196031 768328 862740 1205358 1331898 1322727
6763 1322727 1196109 1097545 842742 1485984 1186102 1291400 994488 1558074 1317963 1096671
6753 1096671 1410625 1437990 1071821 1103012 1389928 1192757 847766 1148998 515913 347658
6743 347658 824377 929677 1155760 840805 892367 952395 831940 793799 837780 984813
6733 984813 1513291 1353656 1727199 1927298 1521907 1724367 1206490 1137035 1470426 1339480
6723 1339480 980475 1016454 703382 409835 478311 597969 849696 806331 823302 634894
6713 634894 854601 698360 317455 156165 -69490 603669 760134 70047 578209 689911
6703 689911 245965 590328 979917 886952 300857 998754 848907 239763 78926 2816
6693 2816 193978 999655 974466 591622 817806 738600 658632 358015 149288 328215 296425
6682 296425 276884 375240 290745 743661 1255727 1130527 734674 302353 492568 718949
6672 718949 428995 576576 165968 -197230 -129904 -48075 217882 661210 297717 -377904
6662 -377904 -30325 331340 148950 -58692 99576 -106126 239809 1063352 1117862 1041872
6652 1041872 744999 741814 43909 -417255 27819 677384 500653 555925 331563 342889
6642 342889 556476 574306 1082267 1096500 55710 -266836 -183404 -245856 -110689 9684
6632 9684 298584 371956 -19406 -427000 219241 760462 564316 636647 875059 582886
6622 582886 371220 364428 391477 404482 467178 523900 260251 270071 91391 156908 462112
6611 462112 888121 972118 1134164 1004242 589746 566190 509589 -24278 453157 1297740
6601 1297740 1445167 1355374 1436934 1498331 973595 934863 1116631 1473856 1142417 792411
6591 792411 720086 527893 1145573 1247363 878083 588135 240156 531183 717643 487421
6581 487421 520314 949842 1228282 1079853 1117462 1401519 1034794 1259051 1054256 800192
6571 800192 875537 913582 1216519 1467025 790382 702986 936563 769790 547280 603913
6561 603913 588658 577865 -2467 316180 810179 541493 474568 1068106 1206070 948766
6551 948766 471775 628324 918759 712025 783794 1157081 787363 406865 1075070 797123
6541 797123 729154 950670 1304552 923539 824037 1171028 1041590 1063700 1069439 945871 935894
6530 935894 858130 1107131 1058869 1056190 1193048 919428 1085770 1013378 848147 1044123 1321098
6519 1321098 860170 710819 1065743 1378618 1469421 825122 790060 1154711 1533970 1529912
6509 1529912 1464057 1194989 1190616 1195307 1070363 891556 768421 879062 537796 850425
6499 850425 1252434 1102935 1044087 1398244 1649848 1625596 1293540 1643289 1649501 2062818
6489 2062818 1851399 1438226 1690878 1480108 1911558 2040994 2382341 2213214 2075852 1809120
6479 1809120 1899836 1752674 1899468 1803220 1672610 1690285 1979237 2078569 1542382 1528549
6469 1528549 1718092 1708724 1638374 1803178 2546790 2004378 2181516 2074058 2189490 2299208
6459 2299208 2205791 1934847 2287017 1954052 2079333 1911628 2048854 2550564 2217614 1947086
6449 1947086 1851671 1927337 1288260 1867212 1914724 2346578 1976855 2136352 1812107 1681936
6439 1681936 1874143 1932582 2142343 2184760 1994396 2038537 2280548 1903428 1643495 2122609
6429 2122609 1947410 1946690 2470294 2772683 2719307 2588160 2569307 3181279 2934199 2898381 2952019
6418 2952019 3099154 3179688 2563909 2594255 2867759 3150646 3353882 3061432 3120040 3111201
6408 3111201 3094125 3473925 3457127 3339882 3395756 3954053 4338659 4096249 3878151 4602097
6398 4602097 4679381 5389665 5438188 5237119 5970014 6081823 6238830 6437064 6287377 6510192
6388 6510192 7387967 8360757 9381983 9179077 9652371 10371868 10757079 11397980 12446392
6379 12446392 13511107 15162880 16597149 18341552 19966182 22125799 24051577 25614925
6371 25614925 27510179 29617239 31090648 32084120 33314341 33421391 33785409 34525279 35322499
6362 35322499 36060743 37145384 37730208 38244499 38282346 37950934 37462470 35945506 34119280
6353 34119280 32709643 31225753 29401485 27825010 26396004 25061257 23743400 22380458
6345 22380458 21590520 20656215 19843203 18253997 17078859 16615379 16010074 15514911 14579484
6336 14579484 13938680 13771311 13343109 12664321 12633853 12478520 12237225 11379231 11209533 10943540
6326 10943540 10860054 11541174 11737245 11426023 11254685 12038746 11745648 12236114 12533625 12776880
6316 12776880 12843082 13485499 14184530 14910378 15901681 16263182 16732691 17985820 19881215
6307 19881215 21430484 22521906 24427856 26704396 29119550 31667332 34536489 37140331
6299 37140331 39992624 42241957 44131806 45885169 47392051 48378805 48792598 49646944 50354544
6290 50354544 51021524 51638900 52618867 53192884 53294281 53304570 53074219 51800207 49919691
6281 49919691 47768472 44997116 42262268 40156296 38092574 36184872 35039697 33227189
6273 33227189 30621774 28962750 27525430 25595528 24017459 22406458 20901049 19515890
6265 19515890 18442741 17515892 16544316 15799830 14783699 14546973 13826153 13696128 13202701
6256 13202701 12267100 11712385 11232769 10804895 10448906 10387909 9941088 9732940 9160496 8984089
6246 8984089 9279333 8780336 8545757 8442186 7848645 7519497 7007495 6924410 7319013 6869115
6236 6869115 6653451 6119596 6064210 5710708 5738717 5764416 5850439 5904390 5511911 5336455
6226 5336455 5107706 5312125 4726383 4417405 4332081 3973054 4432047 4692272 5140953 5252919
6216 5252919 4815521 4208128 4283054 4314973 4095401 4159219 4217044 4256806 4696078 4651827 3932288
6205 3932288 4376498 4886638 4688949 4759204 4742373 4424437 4494306 4712367 4963673 4719645
6195 4719645 4700242 4284559 4289523 4215080 4714230 5126475 4735131 4592338 4698875 4943430
6185 4943430 5199096 5348623 5373420 5608104 5106041 5307105 5758600 5363084 5321562 5351429
6175 5351429 5748667 6003708 5678572 5697294 6197184 6289925 6429846 6423420 6393737 7130353
6165 7130353 7406009 6849878 6969882 6843426 7247857 7740564 7468830 6856847 7527324 8077068
6155 8077068 8366438 8738511 8244795 8903638 9085577 9280004 9534792 10180265 9890035 9075357
6145 9075357 9677434 10371313 10545624 11025672 11018760 10942943 10545040 10703909 11341628 11669284
6135 11669284 12035998 11828678 11614366 12307938 12660595 12817664 12517338 12363281 12644396
6126 12644396 12719851 13467872 13840687 14044301 14103027 14559357 14728983 14667198 15070741 14466656
6116 14466656 14547681 15402365 15518966 15757738 16166945 16519666 16817899 17422377 17316974 17704647
6106 17704647 18165417 18602279 18808331 19000036 19631344 20725064 21245507 21679123 21819705
6097 21819705 22226266 23261606 24007544 25399588 26248232 27248044 27980757 28342801 29364113
6088 29364113 30165313 31076350 32280293 32399320 32632962 32889309 32825995 32734409 32400938 32124182
6078 32124182 31091073 30826448 30106813 29262292 29210435 28426893 27770060 27128877 25691678
6069 25691678 24922539 23835823 23401182 22522133 21419970 21229713 20887343 20862231 19956721
6060 19956721 19024877 18380695 18325279 18662935 18377208 17168303 17558533 17630620 16981317 17445427
6050 17445427 17011809 16811337 16705552 17351117 17168409 17368455 17512827 17370445 17880806
6041 17880806 17885758 18714096 18734785 19140988 19582826 20421114 21237100 22114526 23246233 24460441
6031 24460441 25324365 26305515 26923076 28248036 29254365 30396367 31371282 32166534 32982594
6022 32982594 33244580 33284667 33329810 33686258 33652171 33258920 32924752 32493935 31807218 31800916
6012 31800916 31754593 30997862 30303759 30287795 30171626 29448231 29177199 29210972 28806763 29081628
6002 29081628 29476156 29499365 29995518 30569542 30455285 30738349 31157432 31156305 31960945 32534012
5992 32534012 32705971 32860435 32852418 33036868 32733598 32919915 32837624 32813289 33206347 33113731
5982 33113731 32763509 32884832 33540588 33260188 33122269 33270003 34170350 35534841 35885554
5973 35885554 36956128 38072107 39601521 40985763 42516323 44445991 46828239 48313838
5965 48313838 49910950 51584279 52295450 52296366 51435337 50444149 50148191 50008823 49707126 49598868
5955 49598868 49903057 49896703 50494768 51449923 52235224 53164347 54537346 56070768 57614666
5946 57614666 59747883 61623986 63465048 65101114 66697177 68452678 70612447 71423883
5938 71423883 70950122 70483595 69635999 68064575 66222136 64190569 63231526 61856348 60699497
5929 60699497 59877132 59258717 58012512 56535440 55392328 54180868 52679697 51082850
5921 51082850 49903623 48528798 46812902 44948687 44223501 43428133 41215883 39263668
5913 39263668 38739163 37965644 37431318 36096782 34536624 33727816 32790217 32236690 32240044
5904 32240044 31341529 30929801 31460854 31735321 32041353 32691994 33415915 33954078 35254063
5895 35254063 36710435 37367024 38169759 39142017 39993477 39916397 39303064 38487049 38491956 37946860
5885 37946860 37370565 37943515 37417366 37239473 37563440 38019407 38866706 39266471 39166052
5876 39166052 40176949 40062705 40637184 41362383 41900904 42348818 42926698 43158964 43682739
5867 43682739 43586851 43108438 42376687 40584137 39908749 38506011 36876258 35434504 34448489
5858 34448489 33812485 32668772 31473268 30683136 29331218 27978632 26430027 25617267 23939650
5849 23939650 22305726 21578503 20467292 19372749 18559128 17398287 16361517 14913552
5841 14913552 14553840 14465801 13492826 13136999 12445578 12253958 12043981 11513569 10969798 10971336
5831 10971336 10683419 10470803 9698669 8900607 9315752 8871639 8476945 8575166 7511918
5822 7511918 7165757 6796320 6896753 7234713 7395226 7354695 7064872 7113110 6890999 6647999
5812 6647999 6632070 6255938 6092784 6174253 6184647 5917965 5413154 5160398 5338225 5455488
5802 5455488 5330973 5156232 5081407 5035421 4888146 4785562 4882788 4849161 4622991 4357585
5792 4357585 4003033 4264546 3990705 4386480 4204535 4172641 4082241 3924457 3907208 4200531
5782 4200531 4211018 4134497 3872785 3904356 3899708 3543053 3521744 3661129 3575702 4241701 3796581
5771 3796581 3635398 4091080 3537475 3510028 3497630 3615956 3572544 3714754 3962441 3370648
5761 3370648 3127832 4003329 3379713 3093431 3600951 3399731 3776115 3612384 3644107 3728074
5751 3728074 4134515 4166029 3886879 4063506 3679906 3919843 3258197 3334155 3114239 2945426
5741 2945426 2890398 3217523 3685181 3634444 3728031 3473878 3679864 3346746 2800726 3634325
5731 3634325 3382218 3221361 3435424 3837554 3538730 3687370 3718520 3946542 3721418 4195062
5721 4195062 4613282 4323841 3836985 2966733 3365540 3393322 3445111 3568029 3711701 3246378
5711 3246378 3212860 3118551 3557104 4173399 4237854 3498064 3023952 3142399 3584873 3570180
5701 3570180 3288307 2837886 2969505 2218890 2165863 2712285 2710672 2689647 2756628 3435809
5691 3435809 3383061 2857608 2982467 3138028 3008906 2853952 3305487 3476619 2685874 3311347
5681 3311347 3467501 3045820 2508819 2523114 2857055 3012450 2932131 2743279 2237100 2571320
5671 2571320 2721179 2663862 2547765 2682468 2479094 2231360 2473858 2382360 2899944 2892806
5661 2892806 2627070 2530461 2229565 2197004 2217741 2151854 2668459 2511168 2200433 2311496
5651 2311496 2418184 2324871 2078035 2134989 1901914 1779977 2453759 2539309 2537335 2321482
5641 2321482 2476280 2402891 2992382 2411010 2543965 3051168 2946057 2540528 2268496 2542544
5631 2542544 2318614 2628836 2257443 2435336 2720866 2710285 2355085 2255067 2358825 2495382
5621 2495382 2420515 2416426 2386283 2449370 2380213 2065925 2262617 1942844 2131968 2324429 2406093
5610 2406093 2278647 2190449 2281096 2160892 2141729 2239730 1941350 2310880 2231917 1821452
5600 1821452 1502292 1882313 2129394 2217114 2122931 1689769 2023533 1795584 1837819 1852316
5590 1852316 2239312 1665248 1311014 1713910 1495652 1842208 2068245 1265880 1384362 1755414
5580 1755414 2087441 1773154 1842420 1749446 1893320 2276500 1804821 1574590 1629849 2054097
5570 2054097 2707198 2614766 2646972 2393556 1833050 1488349 2068997 2626656 2693595 2479751
5560 2479751 2364564 2592660 1688305 1694128 2334133 2731881 2370411 2541022 2591830 2524188
5550 2524188 2532792 2116155 2247084 2002005 2080365 2904396 2871105 2499800 2764813 2778393
5540 2778393 2822440 2544013 3072407 3153423 2980001 2958081 3095443 3057122 2845944 3086471
5530 3086471 3341090 3239297 3807061 3906616 3704693 3266100 3156788 3598109 2939762 2401029
5520 2401029 3066866 3507090 3159017 3379587 3530947 3851730 3906752 3855953 3986938 3448925
5510 3448925 3029289 3414039 3080347 2965261 3421982 3730993 3672336 3882625 3638021 3491268
5500 3491268 3534075 3422498 3647179 3748940 3574858 3752252 3516792 3503686 3631359 3803757
5490 3803757 3995321 3949931 4197084 4197713 3751811 3707533 3573827 4352358 4153819 3904516
5480 3904516 3829445 4136796 4384662 4089923 4151634 3871507 3530222 3960955 4165488 3877601
5470 3877601 3426309 3535509 3568574 3588665 3948798 3966709 4331766 4271278 4147325 3891501
5460 3891501 3126402 3550494 3815725 3128054 2992355 3063461 3363053 3404662 3851371 4110035
5450 4110035 4217052 4092561 4149176 4225043 3900058 3636861 3875932 4112214 4304582 3624671
5440 3624671 3831648 3386201 3435767 3754252 4200721 4200897 3243220 3434473 4019938 4188324
5430 4188324 4014671 4343964 4712225 4599869 4239916 4193022 4653429 4809714 4557918 4630330
5420 4630330 4513993 4462116 4916947 5140043 4740476 4650328 4937121 5265226 5393529 5828940
5410 5828940 5632099 5120185 5220179 6079585 6472100 6179768 6195660 5756871 5822165 5929919
5400 5929919 5969874 6287750 6702865 6514619 6345355 6499284 6991020 6892797 6952159 7042004
5390 7042004 7112108 7083157 6656547 6968196 7897537 8662068 8107291 8339005 8757754 8732898
5380 8732898 8839855 8784443 9139331 9738976 9645251 9390379 8757506 8687167 8965043 8721704
5370 8721704 9261443 9778607 9023968 8621940 8596964 8617164 9071615 9123832 9330837 8847727
5360 8847727 9250442 9221956 8860131 8667894 8927219 9253381 9039711 9579266 9521858 9386024
5350 9386024 8947846 9092412 9901195 9880919 9914636 9766666 9483516 9636413 8807203 8568288
5340 8568288 8434209 8569600 8051818 8108610 8664532 8243803 8104598 8254329 7930938 7374829
5330 7374829 7184831 7945136 8542690 7687303 6848047 6942169 7304720 7077721 7164484 7571749
5320 7571749 7537828 7155208 7082088 7370159 7554997 7053848 6670578 6824253 6705646 6828499
5310 6828499 6280136 5863538 6552802 6983832 6668816 6396138 5964606 5931102 5726438 5114940
5300 5114940 5057190 5246400 5443737 5434605 5157390 5018641 5158490 4947026 4786750 4411159
5290 4411159 4111362 4424361 4791181 4759188 4408727 4340839 4501197 4295455 4186910 4321485
5280 4321485 4429940 4320322 4470672 5228403 5308332 5431863 5051686 4323753 4611082 4429398
5270 4429398 4741740 4231559 4083070 4200789 4431376 4404565 4047180 4449371 4588364 4369691
5260 4369691 4518580 4511242 4140092 3846936 3868981 4418220 3823243 3919325 3829630 4005757
5250 4005757 4498089 4574883 4575399 4164829 4174927 3832952 3401880 3913027 4603939 4204117
5240 4204117 4146218 4089543 4496871 4626446 4507731 4679187 5022833 4641841 3928506 4079985
5230 4079985 4463338 4561042 4207904 4673987 4749710 4167728 3747557 3789327 4264886 4180671
5220 4180671 4012652 4700839 4694099 4542220 4373206 4083384 3953570 4364090 4826610 4824203
5210 4824203 4698811 4824193 4574914 4261298 4724326 4737833 4700629 5123514 5242924 4762947
5200 4762947 4395221 4335778 4724998 4790019 4666487 4621325 4752597 4596691 5439884 5747585
5190 5747585 5607863 5410078 5318595 4960118 4739821 5024652 5257703 4920265 5141638 5465070
5180 5465070 5156776 5235196 5496949 5504722 5106130 4600174 4468297 5268504 5375043 5327719
5170 5327719 5490033 5255521 5175395 5318496 4499298 5490830 5478936 5802287 5881424 5795586
5160 5795586 6172666 5593894 5645701 5803961 6042402 6299421 6198074 5917901 5851454 6136336
5150 6136336 6551344 6428995 6426167 6436043 6265338 6848294 7392665 7547280 7817895 7758034
5140 7758034 7532455 8137342 7996349 8214322 8634997 8584234 9022883 9019788 9471755 9840329
5130 9840329 9637495 10107844 10196756 10616345 11304512 11494950 12199417 12102135 12547101 13241326
5120 13241326 13342046 13712594 14868448 15674881 16672408 17240233 17528662 18231308 19068207
5111 19068207 20209433 21324039 22275291 23690063 24595470 25200747 26480299 27935667 29453697
5102 29453697 30404613 31311555 32744496 34828072 36981169 38273986 39552750 40693989
5094 40693989 41863292 43093828 44231812 45498674 45947058 47175293 48727393 50326979
5086 50326979 51741814 52543706 53937165 54540762 55511821 56370419 57360722 58557181 58583866
5077 58583866 58790905 59577949 60505489 60814987 61083323 61529495 61789936 61470935 61598051
5068 61598051 61733564 61788860 61197708 60288366 60133646 59399450 58328578 57168769 56267037
5059 56267037 56040076 55571550 54994029 54687937 53612267 52194090 51023847 50402095 48625310
5050 48625310 46658406 45287444 44051524 43081675 41966545 40267399 39260411 38645908
5042 38645908 38055194 36684227 35072803 34566013 33108564 31963163 31022091 29871158 28241480
5033 28241480 27474977 27121211 26198656 25379828 24393332 23761274 23106789 22003487 21342566
5024 21342566 21169744 20594268 20530767 20360800 19660832 19449027 19028125 19107180 19029476 18898773
5014 18898773 19015319 18524977 18453356 17917611 17706254 17093972 16852364 17222633 16688892 16376287
5004 16376287 16695964 16677575 16957243 17091873 17233814 16934856 16776185 16461963 16743660 17645627
4994 17645627 17510828 17219947 17250511 17270744 17000327 17240805 17676004 17390569 17715389 17907581
4984 17907581 18282987 18606098 18194687 18399112 18738730 19294896 18760652 18617019 18335089
4975 18335089 18345433 18654846 19419354 19563257 19759748 20027047 20080364 20346313 20626027 20322393
4965 20322393 20742530 20508198 20899127 21737983 22139086 22222684 22187490 22482984 22748574 23012072
4955 23012072 23268666 23931887 24160204 24385702 24873685 24723694 24548373 25141555 26154594
4946 26154594 26949024 27698674 27674020 28163677 28185234 28420792 29091639 29540947 30006018 30542414
4936 30542414 31252034 31735286 32359211 33016868 33845301 34950245 35689736 35953355 36765851
4927 36765851 37340634 38031375 39094046 40111287 40839630 41917857 43358612 44824797 45267541
4918 45267541 46423045 47998769 49373841 50538516 51494392 52578377 54468928 55523704
4910 55523704 56807214 58626320 60208044 61153835 62890469 64891492 67070809 69026591
4902 69026591 71455850 73650595 76279517 77803442 80041761 82887544 85596426 88130603
4894 88130603 90920777 93600321 96871775 100460470 103461780 106125254 110509902 114299507
4886 114299507 118864182 123104532 126590385 130670208 135365460 140367283 144873327 149234948
4878 149234948 154323729 160045547 165148249 170599147 175283089 180919763 185536979 191334700
4870 191334700 196776263 202431641 208130985 213800362 218223497 222607560 227623515 231705973
4862 231705973 234971458 238379986 240883656 243339729 245519046 246312872 247288310 247556743
4854 247556743 246563639 246497065 244864300 242751350 240500736 237558067 233361652 229839227
4846 229839227 225594259 220561448 215708706 211008511 206021499 200551541 195540800 190431507
4838 190431507 184822514 179694697 174718934 169439462 164836791 159443319 154754401 150262031
4830 150262031 145322232 141187966 136800356 132338135 128175707 124585555 121067958 117668430
4822 117668430 114645804 111033678 107427699 104215028 101547652 98488758 95758708 92906098
4814 92906098 90317033 87665378 85496412 83425836 81427761 79604452 77230468 75239806
4806 75239806 73249545 72119272 70083003 68247302 66605477 65139832 64376688 62838451
4798 62838451 61452310 60066964 59129197 57741968 56812534 55558152 54736424 53722054 52574532
4789 52574532 52597793 51346088 50300620 49881961 49154080 48972129 48632763 48544486 47739887
4780 47739887 47578323 47972311 47917176 48227291 48907945 49660373 50561350 51657178 53265104
4771 53265104 54759994 56319418 58254313 60211371 62144918 64701944 67861024 70822355
4763 70822355 73036785 74445754 74429934 73310271 71023332 68272940 65431695 62707532
4755 62707532 60374508 57900021 56201556 55114774 54098732 53394732 52549675 50788337
4747 50788337 48872580 46740867 44775173 42617317 40652198 38562599 37288069 35518119
4739 35518119 33976631 32664427 31447006 30628002 29268306 28577963 27751184 27325649 26635496
4730 26635496 25250607 24434391 24087478 23840125 23459575 23082587 22856091 22520549 22480946
4721 22480946 21838387 21862021 20966320 20843230 21111903 20587289 20535384 20451860 20424966 19914603
4711 19914603 19658794 19471560 19376996 19778381 19354275 18960964 19169701 19148764 19335011 19134726
4701 19134726 19247943 19357195 19435776 19601651 19955248 20042923 19375932 20214493 20597314 20813377
4691 20813377 21512569 22360741 22529414 23330279 24237265 24641748 26336712 27943191 29166148
4682 29166148 31101874 33783565 35714686 38026977 40101386 42111068 44401168 47833980
4674 47833980 50760661 53780928 55277435 56097712 55705774 54368156 52494268 50768770
4666 50768770 48153772 46283951 44836812 43233870 42139293 41739942 41369027 40563884 40626927
4657 40626927 40455309 38808681 36986103 35911199 34297705 32998824 32065003 31569567 30895812
4648 30895812 29888952 29450505 28911925 28900256 29898438 30137760 30871022 31600490 32277421
4639 32277421 33276959 34690462 36238136 37874310 39433608 41031067 42809081 44955615
4631 44955615 46066314 46292110 46283257 46432637 46286054 46655811 46957650 47398033 48039703 49303792
4621 49303792 51059999 53538662 56054473 58929759 61390728 63328753 65633383 68050309
4613 68050309 69444487 70319451 69809849 69472787 67431732 65299540 63218969 61397912 60021481
4604 60021481 58786777 58199400 57880404 57784365 57601663 57748013 56810956 56965270 56741233
4595 56741233 56464256 55698481 55178781 54081526 52305025 50266716 47567064 44678579 42165997
4586 42165997 40014706 38354501 36048053 34437691 33304621 32364701 30987378 30196061
4578 30196061 28977604 27532655 25638413 24712734 23856157 21689710 20596446 19073008
4570 19073008 17151360 16638482 16505792 15710861 15135222 14785191 13693547 12817853 12914940
4561 12914940 12172725 11793141 11620309 11188385 10831169 10073377 9872823 9612197 9249481
4552 9249481 9029541 9127004 9671791 9767064 9187884 8582500 8511331 8264228 7105392 7443995
4542 7443995 7499018 7186167 7276033 7294518 7260675 6796825 5918733 5952220 6805076 6841259 6778671
4531 6778671 6763249 6328967 5510202 6439608 6783399 6662099 6199077 5964081 6067689 6093669
4521 6093669 6206066 6072809 6079656 5472348 5285951 5701071 5258673 5480530 5702277 5737086
4511 5737086 5860805 6066264 5402320 4842925 4938371 5581414 5513232 5479990 5887539 6095699
4501 6095699 5788911 5265952 5016052 5411231 5369989 5397272 5279998 4999303 4853546 4959827
4491 4959827 5311862 5310416 5766470 5863676 6193559 6261179 6099939 6052574 5819391 5523544
4481 5523544 5352056 5699042 6009945 6304125 6387230 6612550 6429585 6361212 7013912 6544831
4471 6544831 6936279 6814241 7018199 7228239 7308320 7079149 7633099 7985568 8086088 8212052
4461 8212052 7714078 8300948 8999698 9400569 9731261 10309297 10965019 11815198 12827791
4452 12827791 13913055 14410730 14733324 15200032 16023640 16714020 16508368 16612910 16712059
4443 16712059 16523430 16798357 16819113 17121303 18339271 19783810 20244976 20572646 21104086
4434 21104086 22101645 23739573 24264073 24787935 24908752 25284057 26109614 27518219 29017995
4425 29017995 30545343 31655351 31751607 32371963 32703408 33481262 34635825 35886484 36432407
4416 36432407 36627321 37654716 37727714 37304711 37092417 37376270 36867942 36775767 36943392 36448404
4406 36448404 35696329 34747686 33515853 32833897 31975118 30850107 29581892 28500812 27684964
4397 27684964 26895484 25735414 24520251 23869880 22469314 21688327 20455919 19263754 18523239
4388 18523239 17979853 17277842 16872500 15901066 15491850 14746009 14309822 14498715 14462303 14127849
4378 14127849 13583493 13351112 13054461 12821474 13440515 13188570 12652517 13039268 13493366
4369 13493366 13703343 13708122 13909662 14262046 15325350 15846414 16539428 17512023 18264139 18747982
$$ [...]
##END NTUPLES=NMR SPECTRUM
##END=
